##TITLE=	2012-07-22-mlt-28
##JCAMPDX=	6.0	$$ NMR Plug-in 1.3 of MestReNova 6.0.2-5475
##DATATYPE=	NMRSPECTRUM
##DATACLASS=	NTUPLES
##NUMDIM=	1
##ORIGIN=	Bruker BioSpin GmbH
##OWNER=	Administrator
##.OBSERVEFREQUENCY=	400.1300048828125
##.OBSERVENUCLEUS=	^1H
##.SOLVENTNAME=	4
##.PULSESEQUENCE=	zg30b
##.ACQUISITIONMODE=	SIMULTANEOUS (DQD)
##$ORIGINALFORMAT=	Bruker XWIN-NMR
##$PARAMETERFILE=	(acqus, ASCII, C:/Users/ben/Dropbox/PhD/NMR/Final%20NMR%20data%20Thesis/Vinyl%20ethers/ATRP%20(E%20Z)%20isomers/10/acqus, 0)
$$ ##TITLE= Parameter file, TOPSPIN		Version 2.1
$$ ##JCAMPDX= 5.0
$$ ##DATATYPE= Parameter Values
$$ ##NPOINTS= 1	$$ modification sequence number
$$ ##ORIGIN= Bruker BioSpin GmbH
$$ ##OWNER= Administrator
$$ $$ 2012-07-22 15:27:25.515 +0100  Administrator@B400
$$ $$ X:/bruk400data/2012/Jul/data/mlt/nmr/2012-07-22-mlt-28/10/acqus
$$ $$ process C:\Bruker\TOPSPIN\prog\mod\dirdata.exe
$$ ##$ACQT0= -2.10090720993156
$$ ##$AMP= (0..31)
$$ 100 100 100 100 100 100 100 100 100 100 100 100 100 100 100 100 100 100
$$ 100 100 100 100 100 100 100 100 100 100 100 100 100 100
$$ ##$ANAVPT= -1
$$ ##$AQSEQ= 0
$$ ##$AQ_mod= 3
$$ ##$AUNM= <au_zgmax>
$$ ##$AUTOPOS= <28 >
$$ ##$BF1= 400.13
$$ ##$BF2= 400.13
$$ ##$BF3= 400.13
$$ ##$BF4= 400.13
$$ ##$BF5= 400.13
$$ ##$BF6= 400.13
$$ ##$BF7= 400.13
$$ ##$BF8= 400.13
$$ ##$BYTORDA= 0
$$ ##$CFDGTYP= 0
$$ ##$CFRGTYP= 9
$$ ##$CHEMSTR= <none>
$$ ##$CNST= (0..63)
$$ 1 1 145 1 1 1 1 1 1 1 1 1 1 1 1 1 1 1 1 1 1 1 1 1 1 1 1 1 1 1 1 1 1 1 1
$$ 1 1 1 1 1 1 1 1 1 1 1 1 1 1 1 1 1 1 1 1 1 1 1 1 1 1 1 1 1
$$ ##$CPDPRG= <>
$$ ##$CPDPRG1= <>
$$ ##$CPDPRG2= <>
$$ ##$CPDPRG3= <>
$$ ##$CPDPRG4= <mlev>
$$ ##$CPDPRG5= <mlev>
$$ ##$CPDPRG6= <mlev>
$$ ##$CPDPRG7= <mlev>
$$ ##$CPDPRG8= <mlev>
$$ ##$CPDPRGB= <>
$$ ##$CPDPRGT= <>
$$ ##$D= (0..63)
$$ 0 1 0 0 0 0 0 0 0 0.06 0 0 0 0 0 0 0.0001 0 0 0 0 0 0 0 0 0 0 0 0 0 0 0
$$ 0 0 0 0 0 0 0 0 0 0 0 0 0 0 0 0 0 0 0 0 0 0 0 0 0 0 0 0 0 0 0 0
$$ ##$DATE= 1342967241
$$ ##$DBL= (0..7)
$$ 120 120 120 120 120 120 120 120
$$ ##$DBP= (0..7)
$$ 150 150 150 150 150 150 150 150
$$ ##$DBP07= 0
$$ ##$DBPNAM0= <>
$$ ##$DBPNAM1= <>
$$ ##$DBPNAM2= <>
$$ ##$DBPNAM3= <>
$$ ##$DBPNAM4= <>
$$ ##$DBPNAM5= <>
$$ ##$DBPNAM6= <>
$$ ##$DBPNAM7= <>
$$ ##$DBPOAL= (0..7)
$$ 0.5 0.5 0.5 0.5 0.5 0.5 0.5 0.5
$$ ##$DBPOFFS= (0..7)
$$ 0 0 0 0 0 0 0 0
$$ ##$DE= 9.399087
$$ ##$DECBNUC= <off>
$$ ##$DECIM= 2420
$$ ##$DECNUC= <off>
$$ ##$DECSTAT= 4
$$ ##$DIGMOD= 3
$$ ##$DIGTYP= 12
$$ ##$DL= (0..7)
$$ 0 120 120 120 120 120 120 120
$$ ##$DP= (0..7)
$$ 150 150 150 150 150 150 150 150
$$ ##$DP07= 0
$$ ##$DPNAME0= <>
$$ ##$DPNAME1= <>
$$ ##$DPNAME2= <>
$$ ##$DPNAME3= <>
$$ ##$DPNAME4= <>
$$ ##$DPNAME5= <>
$$ ##$DPNAME6= <>
$$ ##$DPNAME7= <>
$$ ##$DPOAL= (0..7)
$$ 0.5 0.5 0.5 0.5 0.5 0.5 0.5 0.5
$$ ##$DPOFFS= (0..7)
$$ 0 0 0 0 0 0 0 0
$$ ##$DQDMODE= 0
$$ ##$DR= 22
$$ ##$DS= 0
$$ ##$DSLIST= <SSSSSSSSSSSSSSS>
$$ ##$DSPFIRM= 4
$$ ##$DSPFVS= 21
$$ ##$DTYPA= 0
$$ ##$EXP= <mPROTON>
$$ ##$F1LIST= <111111111111111>
$$ [...]
$$ -1 -1 -1 -1 -1 -1 -1 -1 -1 -1 -1 -1 -1 -1 -1 -1 -1 -1 -1 -1 -1 -1 -1 -1
$$ -1 -1 -1 -1 -1 -1 -1 -1 -1 -1 -1 -1 -1 -1 -1 -1 -1 -1 -1 -1 -1 -1 -1 -1
$$ -1 -1 -1 -1 -1 -1 -1 -1 -1 -1 -1 -1 -1 -1 -1 -1 -1 -1 -1 -1 -1 -1 -1 -1
$$ -1 -1 -1 -1 -1 -1 -1 -1 -1 -1 -1 -1 -1 -1 -1 -1 -1 -1 -1 -1 -1 -1 -1 -1
$$ -1 -1 -1 -1 -1 -1 -1 -1 -1 -1 -1 -1 -1 -1 -1 -1 -1 -1 -1 -1 -1 -1 -1 -1
$$ -1 -1 -1 -1 -1 -1 -1 -1 -1 -1 -1 -1 -1 -1 -1 -1 -1 -1 -1 -1 -1 -1 -1 -1
$$ -1 -1 -1 -1 -1 -1 -1 -1 -1 -1 -1 -1 -1 -1 -1 -1 -1 -1 -1 -1 -1 -1 -1 -1
$$ -1 -1 -1 -1 -1 -1 -1 -1 -1 -1 -1 -1 -1 -1 -1 -1 -1 -1 -1 -1 -1 -1 -1 -1
$$ -1 -1 -1 -1 -1 -1 -1 -1 -1 -1 -1 -1 -1 -1 -1 -1
$$ ##$RG_tabA= (0..255)
$$ 0.25 0.28 0.32 0.35 0.4 0.44 0.5 0.56 0.64 0.7 0.8 0.89 1 1.12 1.28 1.4
$$ 1.6 1.78 2 2.25 2.56 2.8 3.2 3.56 4 4.5 5 5.6 6.35 7.12 8 9 10 11.3 12.7
$$ 14.2 16 18 20.2 22.6 25.4 28.5 32 36 40.3 45.2 50.8 57 64 71.8 80.6 90.5
$$ 101 114 128 144 161 181 203 228 256 287 322 362 406 456 512 575 645 724
$$ 812 912 1030 1150 1290 1440 1620 1820 2050 -1 -1 -1 -1 -1 -1 -1 -1 -1 -1
$$ -1 -1 -1 -1 -1 -1 -1 -1 -1 -1 -1 -1 -1 -1 -1 -1 -1 -1 -1 -1 -1 -1 -1 -1
$$ -1 -1 -1 -1 -1 -1 -1 -1 -1 -1 -1 -1 -1 -1 -1 -1 -1 -1 -1 -1 -1 -1 -1 -1
$$ -1 -1 -1 -1 -1 -1 -1 -1 -1 -1 -1 -1 -1 -1 -1 -1 -1 -1 -1 -1 -1 -1 -1 -1
$$ -1 -1 -1 -1 -1 -1 -1 -1 -1 -1 -1 -1 -1 -1 -1 -1 -1 -1 -1 -1 -1 -1 -1 -1
$$ -1 -1 -1 -1 -1 -1 -1 -1 -1 -1 -1 -1 -1 -1 -1 -1 -1 -1 -1 -1 -1 -1 -1 -1
$$ -1 -1 -1 -1 -1 -1 -1 -1 -1 -1 -1 -1 -1 -1 -1 -1 -1 -1 -1 -1 -1 -1 -1 -1
$$ -1 -1 -1 -1 -1 -1 -1 -1 -1 -1 -1 -1 -1 -1 -1 -1 -1 -1 -1 -1 -1 -1 -1
$$ ##$ROUT14= (0..7)
$$ 0 0 0 0 0 0 0 0
$$ ##$ROUTER= 3
$$ ##$RX22TY= <no>
$$ ##$RXFMAX= (0..7)
$$ 432.5 -1 -1 -1 -1 -1 -1 -1
$$ ##$RXFMIN= (0..7)
$$ 5 -1 -1 -1 -1 -1 -1 -1
$$ ##$RXINTLV= (0..7)
$$ 1 0 0 0 0 0 0 0
$$ ##$RXMSTY= <no>
$$ ##$SCMTY= <no>
$$ ##$SGUC1= (0..15)
$$ 18 19 0 0 0 0 0 0 0 0 0 0 0 0 0 0
$$ ##$SGUC2= (0..15)
$$ 33 256 0 0 0 0 0 0 0 0 0 0 0 0 0 0
$$ ##$SPECTR= 10
$$ ##$SY2FLAG= 0
$$ ##$TFXNUM= 0
$$ ##$TRIPLO2= 0
$$ ##$VTUTY= <tty05>
$$ ##$WBREFAM= (0..15)
$$ 286.5 105.5 100 100 100 100 100 100 100 100 100 100 100 100 100 100
$$ ##$WBREFPH= (0..15)
$$ 80.85 -73.64 0 0 0 0 0 0 0 0 0 0 0 0 0 0
$$ ##$XFAC= 2
$$ ##END=
$$ 
##$DECIM=	2420
##$DSPFVS=	21
##NTUPLES=	NMRSPECTRUM
##VARNAME=	FREQUENCY,	SPECTRUM/REAL,	SPECTRUM/IMAG,	PAGE NUMBER
##SYMBOL=	X,	R,	I,	N
##VARTYPE=	INDEPENDENT,	DEPENDENT,	DEPENDENT,	PAGE
##VARFORM=	AFFN,	ASDF,	ASDF,	AFFN
##VARDIM=	65536,	65536,	65536,	2
##UNITS=	HZ,	ARBITRARY UNITS,	ARBITRARY UNITS,
##FIRST=	6557.9827880859375,	-0.09110590815544128418,	11.340903282165527344,	1
##LAST=	-1706.4801025390625,	0.30754551291465759277,	11.19632720947265625,	2
##MIN=	-1706.4801025390625,	-4.1259827613830566406,	-21688.662109375,	1
##MAX=	6557.9827880859375,	46361.59765625,	25005.91796875,	1
##FACTOR=	-0.12610762021248186904,	0.57951997070312499805,	0.31257397460937502709,	1
##PAGE=	N=1
##DATATABLE=	(X++(R..R)), XYDATA
$$ [...]
##PAGE=	N=2
##DATATABLE=	(X++(I..I)), XYDATA
-18709f5l%%kk%k%jjj%%jklkJJ%kk%Jjllkllllj%%LPJ1J2J0PL%jlmkkkllk%kkjjjJ%kjkj%
-18644h9%jjjJLMJj%%%kkkk%%J%jkjjljj%%jJ%kj%%JJlk%lkJ%jKONK%%klkj%kkjj%j%Jjlj
-18576a16j%J%jk%%jkjjjkjJJKJ%J%k%jjljkjjjJK%%%%Jjk%%kj%JJj%JjjkkjJJj%k%%%jjk
-18509a47%j%jkJ%jkjjk%KjkJjllkJJJjJKjkkjJK%klkjj%%%J%jllljj%%jjkjj%jl%J%J%%J
-18442a91KMOL%%JJjkkjjkjjjkjj%kjk%j%lklk%jkj%JJkkkkkJK%jkkkjj%%K%jlkj%%jj%jk
-18375b34lmj%%Jjjkjjjkkj%Kkkjll%KL%lkjjljJJ%%%KKLJJKJjkkkmlk%%%jj%kkjklj%lkk
-18308b90lkjjlk%kj%%%jjjj%%kjkklkkl%%kl%kkkkkkk%jkJkkj%jkjkk%ljj%knlmkjkm%jk
-18241c91kjjjjlmkkkjkljjjjlljllkkljjkmklmljjjllmnkkkjkklnmmlj%kjlnmlnmllmlll
$$ plain form
-18709 -65 -68 -68 -68 -70 -72 -72 -74 -74 -75 -76 -77 -77 -77 -78 -80 -83 -85 -84 -83 -83 -85 -87 -87 -86 -87 -90 -93 -95 -98 -101 -104 -107 -108 -108 -108 -105 -98 -87 -75 -65 -58 -55 -55 -56 -59 -63 -65 -67 -69 -72 -75 -77 -77 -79 -81 -82 -83 -84 -83 -83 -85 -86 -88 -89 -89
-18644 -89 -89 -90 -91 -92 -91 -88 -84 -83 -84 -84 -84 -84 -86 -88 -90 -92 -92 -92 -91 -91 -92 -94 -95 -96 -99 -100 -101 -101 -101 -102 -101 -101 -103 -104 -104 -104 -103 -102 -105 -107 -107 -110 -112 -111 -111 -112 -110 -104 -99 -97 -97 -97 -99 -102 -104 -105 -105 -107 -109 -110 -111 -111 -112 -112 -111 -112 -115 -116
-18576 -116 -117 -117 -116 -116 -117 -119 -119 -119 -120 -122 -123 -124 -125 -127 -128 -127 -126 -124 -123 -123 -122 -122 -124 -124 -125 -126 -129 -130 -132 -133 -134 -135 -134 -132 -132 -132 -132 -132 -131 -132 -134 -134 -134 -136 -137 -137 -136 -135 -136 -136 -135 -136 -137 -139 -141 -142 -141 -140 -141 -141 -143 -143 -143 -143 -144 -145 -147
-18509 -147 -147 -148 -148 -149 -151 -150 -150 -151 -153 -154 -155 -157 -157 -155 -156 -158 -157 -158 -161 -164 -166 -165 -164 -163 -164 -163 -161 -162 -164 -166 -167 -166 -164 -164 -166 -169 -171 -172 -173 -173 -173 -173 -172 -172 -173 -176 -179 -182 -183 -184 -184 -184 -185 -186 -188 -189 -190 -190 -191 -194 -194 -193 -193 -192 -192 -192 -191
-18442 -191 -189 -185 -179 -176 -176 -176 -175 -174 -175 -177 -179 -180 -181 -183 -184 -185 -186 -188 -189 -190 -190 -192 -193 -195 -195 -196 -196 -199 -201 -204 -206 -206 -207 -209 -210 -210 -209 -208 -210 -212 -214 -216 -218 -217 -215 -215 -216 -218 -220 -222 -223 -224 -224 -224 -222 -222 -223 -226 -228 -229 -229 -229 -230 -231 -231 -232 -234
-18375 -234 -237 -241 -242 -242 -242 -241 -242 -243 -245 -246 -247 -248 -250 -252 -253 -253 -251 -253 -255 -256 -259 -262 -262 -260 -257 -257 -260 -262 -263 -264 -267 -268 -267 -266 -266 -266 -266 -264 -262 -259 -258 -257 -255 -254 -255 -257 -259 -261 -265 -268 -270 -270 -270 -270 -271 -272 -272 -274 -276 -277 -279 -282 -283 -283 -286 -288 -290
-18308 -290 -293 -295 -296 -297 -300 -302 -302 -304 -305 -305 -305 -305 -306 -307 -308 -309 -309 -309 -311 -312 -314 -316 -319 -321 -323 -326 -326 -326 -328 -331 -331 -333 -335 -337 -339 -341 -343 -345 -345 -346 -348 -347 -349 -351 -352 -352 -353 -355 -356 -358 -360 -360 -363 -364 -365 -365 -367 -372 -375 -379 -381 -382 -384 -388 -388 -389 -391
-18241 -391 -393 -394 -395 -396 -397 -400 -404 -406 -408 -410 -411 -413 -416 -417 -418 -419 -420 -423 -426 -427 -430 -433 -435 -437 -440 -441 -442 -444 -448 -450 -453 -457 -460 -461 -462 -463 -466 -469 -473 -478 -480 -482 -484 -485 -487 -489 -492 -497 -501 -505 -508 -509 -509 -511 -512 -515 -520 -524 -527 -532 -536 -539 -542 -546 -549 -552 -555
-18174e55klmmmllmnmmmnomlmmkllnpoomlmmlmponmmmmooomnnnprqonorqpoqqpqqprrpj0j0
-18108i12rqj0j2j2j0j1rqj1j3j1j3j5j3j4j5j2j3j6j4j5j6j6j6j8k0k1k3k2k2k4k6k8k9l3
-18072a490l4l4l3k9j9rJPOkj4k8l9m9n7o3o3n9n8o0o5p1p8r0j03j15j29j41j58j78k01k29
-18040c684k69l16l70m35n01n39m85k14L91J249K081K651K597J943J054J76l99o04o02n34
-18020C190m56l88l34k90k56k25j98j73j45j19r6q2p9p7q1q7r2r2r6j01j04j04j00r9r7r8
-17994h79j05j11j19j31j43j56j75k04k33k68l13l64m25m96n62n79m55l6P63J720K511K881
-17972B121K526J669P21q7n26o42o03n20m36l67l10k63k27k00j77j59j44j32j20j09r9r0p8
-17949A748o7o0n3n3n3n6n6n6n0l9l1k9k6k3k2k2k1k2k5k9l1l1l1l1k9k7k5k3k4k4k2k2k4
$$ plain form
-18174 -555 -557 -560 -564 -568 -572 -575 -578 -582 -587 -591 -595 -599 -604 -610 -614 -617 -621 -625 -627 -630 -633 -638 -645 -651 -657 -661 -664 -668 -672 -675 -679 -686 -692 -697 -701 -705 -709 -713 -719 -725 -731 -735 -740 -745 -750 -757 -766 -774 -780 -785 -791 -800 -808 -815 -821 -829 -837 -844 -852 -860 -867 -876 -885 -892 -902 -912
-18108 -912 -921 -929 -939 -951 -963 -973 -984 -993 -1001 -1012 -1025 -1036 -1049 -1064 -1077 -1091 -1106 -1118 -1131 -1147 -1161 -1176 -1192 -1208 -1224 -1242 -1262 -1283 -1306 -1328 -1350 -1374 -1400 -1428 -1457 -1490
-18072 -1490 -1524 -1558 -1591 -1620 -1639 -1648 -1647 -1640 -1634 -1636 -1650 -1678 -1717 -1766 -1823 -1886 -1949 -2008 -2066 -2126 -2191 -2262 -2340 -2430 -2533 -2648 -2777 -2918 -3076 -3254 -3455 -3684
-18040 -3684 -3953 -4269 -4639 -5074 -5575 -6114 -6599 -6813 -6422 -5173 -3092 -441 2156 4099 5153 5329 4930 4326 3724 3190
-18020 3190 2734 2346 2012 1722 1466 1241 1043 870 725 606 510 428 349 272 191 104 12 -80 -176 -277 -381 -485 -585 -684 -781 -879
-17994 -879 -984 -1095 -1214 -1345 -1488 -1644 -1819 -2023 -2256 -2524 -2837 -3201 -3626 -4122 -4684 -5263 -5718 -5754 -4991 -3271 -760 2121
-17972 2121 4647 6316 7037 6950 6424 5782 5179 4659 4223 3856 3546 3283 3056 2856 2679 2520 2376 2244 2124 2015 1916 1826 1748
-17949 1748 1681 1621 1568 1515 1462 1406 1350 1294 1244 1205 1174 1145 1119 1096 1074 1052 1031 1009 984 955 924 893 862 831 802 775 750 727 703 679 657 635 611
-17916F11k4k3k1j9j9j8j8j7j6j6j9k0j8j9j8j7j8j6j9k1k0j7j5j5j7j9j8j7j7j9j9k0k2k2
-17882b2k3k3k3k3k4k5k6k6k7l1l3l2l4l2l6l8m1m3m4m5m5m5m9n2n5o0o7q0r4j10j29j48j63
-17849a748j69j67j47j02l3O9J95L29M57N74O54O81O66O05M95L66K35J04j4r4j47j78j86j78
-17825B267j64j47j28j11r7q4p4o6o0n3m7m3m3m2m0l9l8l7l5l2l2l1l0l0k9k6k6k5k3k2k1
-17794E92k4k3k2k3k3k1k0k1k1j8k0k2k1k1k1k1k3k3k3k4k4k4k5k7k8k8l0l3l3l2l5l8l8m1
-17760b79m3m4m8n0n4n8o2o9p9q8j02j21j36j49j57j57j37r3l1O0J78L02M26N37O20O47O35
-17733A448N85M85L57K32J06oq4j36j67j77j71j54j35j19j02q9p8o7n9n4m9m4m0l7l5l5l5
-17706A340l1l0l0k9k5k6k4k3k3k2j8j7j6j8j6j4j7j6j2j1j4j4j1j0qrj0j1j0qrrj0rrqro
$$ plain form
-17916 611 587 564 543 524 505 487 469 452 436 420 401 381 363 344 326 309 291 275 256 235 215 198 183 168 151 132 114 97 80 61 42 22 0 -22
-17882 -22 -45 -68 -91 -114 -138 -163 -189 -215 -242 -273 -306 -338 -372 -404 -440 -478 -519 -562 -606 -651 -696 -741 -790 -842 -897 -957 -1024 -1104 -1198 -1308 -1437 -1585 -1748
-17849 -1748 -1917 -2084 -2231 -2333 -2366 -2297 -2102 -1773 -1316 -742 -88 593 1259 1864 2359 2725 2960 3064 3050 2956 2809 2631 2445 2267
-17825 2267 2103 1956 1828 1717 1620 1536 1462 1396 1336 1283 1236 1193 1150 1108 1068 1029 991 954 919 887 855 824 794 764 735 709 683 658 635 613 592
-17794 592 568 545 523 500 477 456 436 415 394 376 356 334 313 292 271 250 227 204 181 157 133 109 84 57 29 1 -29 -62 -95 -127 -162 -200 -238 -279
-17760 -279 -322 -366 -414 -464 -518 -576 -638 -707 -786 -874 -976 -1097 -1233 -1382 -1539 -1696 -1833 -1926 -1957 -1897 -1719 -1417 -991 -454 166 813 1448
-17733 1448 2033 2518 2875 3107 3213 3207 3123 2987 2820 2643 2472 2318 2183 2064 1962 1873 1795 1728 1669 1615 1566 1522 1482 1445 1410 1375 1340
-17706 1340 1309 1279 1249 1220 1195 1169 1145 1122 1099 1077 1059 1042 1026 1008 992 978 961 945 933 922 908 894 883 873 865 856 846 835 825 817 808 799 789 780 771 763 754 748
-17668G48nnmnqopqnpooponnmlnnoollmnlmpkknmllmnkklnomklmllmlkmk%lmnjjlkklklkl
-17601D81mkljjmllkkmlkmnjJ%mmk%%kkk%jkljjjlkkjjk%jjlkjllkJjkkkkjkkkj%Jkkkjkj
-17534C61lkjJ%kljjkj%j%%kkj%kl%Jjkjjkljjjkjkj%ljJ%jj%klljJ%ljjk%J%kjKklj%jjj
-17467B88%lj%Jjk%jljjk%J%J%jjjkjk%%kjkj%jm%j%%JJ%%lkkjj%jj%JjjJ%kkjj%%j%%%j%
-17400B39jjjklj%jJ%jkj%%j%J%jjmkkjKJJj%jk%%jklj%jJj%%j%jjjj%jkjlJkk%j%jJJjlk
-17333A86kJj%kllkjlkkjj%MJ0J0J0POKkjkmmllkkjJjlmjjJJ%kkjJkjjjkllkJKJ%kmlklkk
-17269A49JjjmljJPJ0J0RJ0N%jlmkjk%%lmkkjkkkklj%%jkkjJKLLMKjKLJJjjkjjJkkk%%jjk
-17205A55lkjj%J%kj%j%%JK%jj%%j%kjjllKKJ%%jk%%jjkJ%jjj%%%%%k%jJ%kmljJJ%%%lk%j
$$ plain form
-17668 748 743 738 734 729 721 715 708 700 695 688 682 676 669 663 658 653 649 646 641 636 630 624 621 618 614 609 606 602 595 593 591 586 582 579 576 572 567 565 563 560 555 549 545 543 540 536 533 530 526 523 521 517 515 515 512 508 503 502 501 498 496 494 491 489 486 484 481
-17601 481 477 475 472 471 470 466 463 460 458 456 452 449 447 443 438 437 438 438 434 430 428 428 428 426 424 422 422 421 419 416 415 414 413 410 408 406 405 404 402 402 401 400 397 395 394 391 388 386 387 386 384 382 380 378 377 375 373 371 370 370 371 369 367 365 364 362 361
-17534 361 358 356 355 356 356 354 351 350 349 347 346 346 345 345 345 343 341 340 340 338 335 335 336 335 333 332 331 329 326 325 324 323 321 320 318 317 317 314 313 314 314 313 312 312 310 307 304 303 304 304 301 300 299 297 297 298 298 296 295 297 295 292 291 291 290 289 288
-17467 288 288 285 284 284 285 284 282 282 281 278 277 276 274 274 275 275 276 276 275 274 273 271 270 268 268 268 266 265 263 262 262 261 257 257 256 256 256 257 258 258 258 255 253 251 250 249 249 248 247 247 248 247 246 247 247 245 243 242 241 241 241 240 240 240 240 239 239
-17400 239 238 237 236 234 231 230 230 229 230 230 229 227 226 226 226 225 225 226 226 225 224 220 218 216 215 217 218 219 218 218 217 215 215 215 214 212 209 208 208 207 208 207 207 207 206 206 205 204 203 202 202 201 199 198 195 196 194 192 192 191 191 190 191 192 191 188 186
-17333 186 184 185 184 184 182 179 176 174 173 170 168 166 165 164 164 168 178 188 198 205 211 213 211 210 208 204 200 197 194 192 190 189 190 189 186 182 181 180 181 182 182 180 178 177 178 176 175 174 173 171 168 165 163 164 166 167 167 165 161 158 156 153 151 149
-17269 149 150 149 148 144 141 140 141 148 158 168 177 187 192 192 191 188 184 182 181 179 179 179 176 172 170 168 167 165 163 161 159 156 155 155 155 154 152 150 149 150 152 155 158 162 164 163 165 168 169 170 169 168 166 165 164 165 163 161 159 159 159 158 157 155
-17205 155 152 150 149 148 148 149 149 147 146 146 145 145 145 146 148 148 147 146 146 146 145 145 143 142 141 138 135 137 139 140 140 140 139 137 137 137 136 135 133 134 134 133 132 131 131 131 131 131 131 129 129 128 129 129 127 123 120 119 120 121 121 121 121 118 116 116 115
-17138A15%jjj%%jJ%%ljjjLNLLKKLLJjkllk%JLJkljj%k%K%lk%jjJJJkjj%%jjJJ%km%%KJ%j
-17071A06%Jjkkj%jjJ%k%L%kllj%JJj%J%jj%JJjk%jjkjJ%jkjjLLkl%KJ%jJJJkljj%jjkj%J
-17004G7L%j%%kjj%jJKlljJLKKkljjkj%J%%%j%kj%%jJ%l%KKJJ%kjkJj%%kk%J%%JJ%jlk%%k
-16936E4JK%kKKlj%kkJj%%kj%%%%j%LJkljjJJ%Jjk%%%Jjlk%J%%j%JKjjkk%%%%KJ%kj%J%%%
-16868C7jj%%JJlkkj%J%kjjjjJK%j%j%%%ljJ%%%kmj%jJJjjk%%KKjK%klj%%%Jjkj%l%%%kkK
-16800CJlkjJjkkkmklk%K%JLOPQPNLNKkljjkljjkkkkjlkjJK%%%kk%K%kkmlk%j%l%jkJ%kkk
-16731b3jjJKJNPPNMMLjj%llklkjj%%%kk%kJlmKK%l%jjkJ%jj%kj%%jJjj%JjjjjJLJkj%%%j
-16663b6jjjjj%%jk%j%%%jk%%J%mkJKj%%kklJ%Jjj%kj%%%jJjJ%ll%%lKJj%J%jjjJJ%kkjjj
$$ plain form
-17138 115 115 114 113 112 112 112 111 112 112 112 109 108 107 106 109 114 117 120 122 124 127 130 131 130 128 125 122 120 120 121 124 125 123 120 119 118 118 116 116 118 118 115 113 113 112 111 112 113 114 112 111 110 110 110 109 108 109 110 110 108 104 104 104 106 107 107 106
-17071 106 106 107 106 104 102 101 101 100 99 100 100 98 98 101 101 99 96 93 92 92 93 94 93 93 94 94 93 92 92 93 94 93 91 91 90 89 87 86 87 87 86 84 83 82 85 88 86 83 83 85 86 86 85 86 87 88 86 83 82 81 81 80 79 77 76 76 77
-17004 77 80 80 79 79 79 77 76 75 75 74 75 77 74 71 70 71 74 76 78 76 73 72 71 69 68 68 69 69 69 69 68 68 66 65 65 65 64 65 65 62 62 64 66 67 68 68 66 65 63 64 63 63 63 61 59 59 60 60 60 61 62 62 61 58 56 56 56 54
-16936 54 55 57 57 55 57 59 56 55 55 53 51 52 51 51 51 49 48 48 48 48 48 47 47 50 51 49 46 45 44 45 46 46 47 46 44 44 44 44 45 44 41 39 39 40 40 40 39 39 40 42 41 40 38 36 36 36 36 36 38 39 39 37 36 36 37 37 37 37
-16868 37 36 35 35 35 36 37 34 32 30 29 29 30 30 28 27 26 25 24 25 27 27 26 26 25 25 25 25 22 21 22 22 22 22 20 16 15 15 14 15 16 15 14 12 12 12 14 16 15 17 17 15 12 11 11 11 11 12 11 9 8 8 5 5 5 5 3 1 3
-16800 3 4 1 -1 -2 -1 -2 -4 -6 -8 -12 -14 -17 -19 -19 -17 -17 -16 -13 -7 0 8 15 20 23 28 30 28 25 24 23 21 18 17 16 14 12 10 8 7 4 2 1 2 4 4 4 4 2 0 0 2 2 0 -2 -6 -9 -11 -11 -12 -12 -15 -15 -16 -18 -17 -17 -19 -21 -23
-16731 -23 -24 -25 -24 -22 -21 -16 -9 -2 3 7 11 14 13 12 12 9 6 4 1 -1 -2 -3 -3 -3 -3 -5 -7 -7 -9 -8 -11 -15 -13 -11 -11 -14 -14 -15 -16 -18 -17 -17 -18 -19 -19 -21 -22 -22 -22 -23 -22 -23 -24 -24 -23 -24 -25 -26 -27 -26 -23 -22 -24 -25 -25 -25 -25 -26
-16663 -26 -27 -28 -29 -30 -31 -31 -31 -32 -34 -34 -35 -35 -35 -35 -36 -38 -38 -38 -37 -37 -41 -43 -42 -40 -41 -41 -41 -43 -45 -48 -47 -47 -46 -47 -48 -48 -50 -51 -51 -51 -51 -52 -51 -52 -51 -51 -54 -57 -57 -57 -60 -58 -57 -58 -58 -57 -57 -58 -59 -60 -59 -58 -58 -60 -62 -63 -64 -65
-16595f5jjjk%J%J%kjj%Jjjjjkkjj%J%Jjj%J%jJkk%klkkjJJj%JJjjJJlkk%JJjjjlj%%j%%j
-16527a05%j%j%%jmljjj%KLjkl%%jjjkJ%jkkjlj%J%jjkJLJ%jkllj%%%jjk%jjjj%kj%ln%jj
-16460a62jJkjJk%kjjjj%kklk%Kj%%lkkjK%%Jkljjjkj%jkkkjk%j%jkkkkjkkj%%%kmmljJjj
-16393b37j%jkkkjjkmmkjjk%jkjklljjkk%jn%%%kmjmnlklkj%lk%kmkkmlnmkjjknlmkj%jjk
-16326c70kjllllmmklnmllkmoomnmknnmnmlmnoonmnnpooppppqrqpqojJLPJ2J4J3QOJnqj0j1
-16263e75j2j1j1j0j1j0j0j0porrrj0j1j1j0rrj1j2j3j2j2j1j2j4j4j3j4j4j3j4j6j8j9j8
-16226a010j8j9k1j9j7j4j1pnopj0j3j7k1k9l1l4l6l8m0m2m0m4m6n1n3n3n5n6n5n4n8o2o4
-16191b156p0q1r5j09j23j37j55j81k10k38k79l25l71m00l84k83r2J89N65R65J281J515J613
$$ plain form
-16595 -65 -66 -67 -68 -70 -70 -69 -69 -68 -68 -70 -71 -72 -72 -71 -72 -73 -74 -75 -77 -79 -80 -81 -81 -80 -80 -79 -80 -81 -81 -80 -80 -81 -80 -82 -84 -84 -86 -89 -91 -93 -94 -93 -92 -93 -93 -92 -91 -92 -93 -92 -91 -94 -96 -98 -98 -97 -96 -97 -98 -99 -102 -103 -103 -103 -104 -104 -104 -105
-16527 -105 -105 -106 -106 -107 -107 -107 -108 -112 -115 -116 -117 -118 -118 -116 -113 -114 -116 -119 -119 -119 -120 -121 -122 -124 -123 -123 -124 -126 -128 -129 -132 -133 -133 -132 -132 -133 -134 -136 -135 -132 -131 -131 -132 -134 -137 -140 -141 -141 -141 -141 -142 -143 -145 -145 -146 -147 -148 -149 -149 -151 -152 -152 -155 -160 -160 -161 -162
-16460 -162 -163 -162 -164 -165 -164 -166 -166 -168 -169 -170 -171 -172 -172 -174 -176 -179 -181 -181 -179 -180 -180 -180 -183 -185 -187 -188 -186 -186 -186 -185 -187 -190 -191 -192 -193 -195 -196 -196 -197 -199 -201 -203 -204 -206 -206 -207 -207 -208 -210 -212 -214 -216 -217 -219 -221 -222 -222 -222 -222 -224 -228 -232 -235 -236 -235 -236 -237
-16393 -237 -238 -238 -239 -241 -243 -245 -246 -247 -249 -253 -257 -259 -260 -261 -263 -263 -264 -266 -267 -269 -272 -275 -276 -277 -279 -281 -281 -282 -287 -287 -287 -287 -289 -293 -294 -298 -303 -306 -308 -311 -313 -314 -314 -317 -319 -319 -321 -325 -327 -329 -333 -336 -341 -345 -347 -348 -349 -351 -356 -359 -363 -365 -366 -366 -367 -368 -370
-16326 -370 -372 -373 -376 -379 -382 -385 -389 -393 -395 -398 -403 -407 -410 -413 -415 -419 -425 -431 -435 -440 -444 -446 -451 -456 -460 -465 -469 -472 -476 -481 -487 -493 -498 -502 -507 -512 -519 -525 -531 -538 -545 -552 -559 -567 -576 -584 -591 -599 -605 -606 -605 -602 -595 -583 -569 -556 -548 -542 -541 -546 -554 -564 -575
-16263 -575 -587 -598 -609 -619 -630 -640 -650 -660 -667 -673 -682 -691 -700 -710 -721 -732 -742 -751 -760 -771 -783 -796 -808 -820 -831 -843 -857 -871 -884 -898 -912 -925 -939 -955 -973 -992 -1010
-16226 -1010 -1028 -1047 -1068 -1087 -1104 -1118 -1129 -1136 -1141 -1147 -1154 -1164 -1177 -1194 -1215 -1244 -1275 -1309 -1345 -1383 -1423 -1465 -1505 -1549 -1595 -1646 -1699 -1752 -1807 -1863 -1918 -1972 -2030 -2092 -2156
-16191 -2156 -2226 -2307 -2402 -2511 -2634 -2771 -2926 -3107 -3317 -3555 -3834 -4159 -4530 -4930 -5314 -5597 -5689 -5500 -4935 -3970 -2689 -1174 439
-16168D39J488J217Q86M95J22j45l20m14m27l94l49l06k67k36k10j89j70j50j33j19j05r2
-16146F21q5q2q1q2q5q8r2r4r6r6j01j06j13j20j31j42j58j74j93k17k49k88l28l65l79l38
-16120c662k17j3K71O37R96J272J469J513J347J073P40L57K4k05l50m13m03l59l10k64k30
-16099C273k01j74j53j37j18j00q4o9n9m9m4m3m3m5m7m8m9n0m8m6m5m0l8l5l3l2k8k6k4k5
-16069A340k5k1k0k1k2k2j8j8k0j8j6j7j6j4j3j4j5j4j5j2j3j2j1j1rj0j1j2j1j0qj0rqrj0
-16033H25pqj0ronnpqoqqoppoqommlonnmlmpnmoomllnlnnppkjkmonmlnnmkjlmjklnonlkkl
-15967E07nmlkkmjllkkJjmmjjklkjklllkkk%lkmkjkljll%%klkklkjkjj%jkkkjj%jllkkmkk
-15900C70%Jjkjjjlkkkkj%lm%%jkjjjJJ%jkkkllk%jJkkl%JkkJjk%%%kkkj%%%kjlk%k%%jkj
$$ plain form
-16168 439 1927 3144 4030 4525 4647 4502 4182 3768 3341 2947 2598 2292 2025 1789 1579 1390 1220 1070 937 818 713 621
-16146 621 536 454 373 291 206 118 26 -68 -164 -260 -361 -467 -580 -700 -831 -973 -1131 -1305 -1498 -1715 -1964 -2252 -2580 -2945 -3324 -3662
-16120 -3662 -3879 -3892 -3621 -2984 -1988 -716 753 2266 3613 4686 5426 5783 5807 5602 5252 4839 4436 4077 3767 3503 3273
-16099 3273 3072 2898 2745 2608 2490 2390 2306 2237 2178 2129 2085 2042 1999 1954 1907 1859 1810 1760 1712 1666 1621 1581 1543 1508 1475 1443 1415 1389 1365 1340
-16069 1340 1315 1294 1274 1253 1231 1209 1191 1173 1153 1135 1119 1102 1086 1072 1059 1045 1030 1016 1001 989 976 964 953 942 933 923 912 900 889 879 871 861 852 844 835 825
-16033 825 818 810 800 791 785 780 775 768 760 754 746 738 732 725 718 712 704 698 694 690 687 681 676 671 667 664 660 653 648 644 638 632 628 625 622 617 614 609 604 597 590 588 587 585 581 575 570 566 563 558 553 549 547 546 543 539 538 536 533 528 522 517 514 512 510 507
-15967 507 502 498 495 493 491 487 486 483 480 478 476 477 476 472 468 467 466 464 461 459 458 456 453 450 447 445 443 441 441 438 436 432 430 429 427 424 423 420 417 417 417 415 412 410 408 405 403 402 400 399 398 398 397 395 393 391 390 389 389 388 385 382 380 378 374 372 370
-15900 370 370 371 370 368 367 366 365 362 360 358 356 354 353 353 350 346 346 346 345 343 342 341 340 341 342 342 341 339 337 335 332 329 327 327 326 327 325 323 320 320 321 319 317 318 317 315 315 315 315 313 311 309 308 308 308 308 306 305 302 300 300 298 298 298 297 295 294
-15833B94%%%%kll%%j%%lk%JJ%kkjklk%%jJJjkkJJj%%kKJjmkjJ%kk%jkJ%kjjjkj%j%kJJjl
-15766B42jJ%jk%%%%%kjjjJjk%K%%%kmk%JJklJLJJkjjkjJjjj%Jj%Jkkkk%%Jkj%j%%JK%kkj
-15699B08k%k%%j%%%kjJ%%j%%%kkJKjj%%j%J%ljJ%jJ%%%kmkj%%%jJ%jj%%j%JJJklljJJ%%J
-15632A79Jjmj%kj%JjJJl%JK%%jjjk%J%%J%%kljjJkkkKJkjjjjJLJjjll%KJj%jj%%j%JJ%kl
-15565A48jjljjkjkljkkkkLLMPPONOPK%jlmlkl%J%lljKjk%%jk%%j%jjJ%klklkJJjkkjkkjk
-15498A23l%%J%MPRRONLJJJjkkkmjklkJJjkk%jLJkjjjjj%Kjjlk%%jjJJ%kjjljJ%%jJ%jJK%
-15431A31%%jjkk%KJ%JjkjJKklkJJJJJK%kjJjkj%JkkjKJ%mkKKJ%kk%KK%kkjJJ%j%j%JK%lk
-15364A13kjj%%%KL%j%%k%kkKKJk%%k%%%jj%%%%%%Jk%J%jJjjjJJjk%jkJ%L%kj%KLJmj%%Jj
$$ plain form
-15833 294 294 294 294 294 292 289 286 286 286 285 285 285 282 280 280 281 282 282 280 278 277 275 272 270 270 270 269 270 271 270 268 266 267 268 267 267 267 265 267 268 267 263 261 260 261 261 259 257 257 256 254 255 255 253 252 251 250 248 247 247 246 246 244 245 246 245 242
-15766 242 241 242 242 241 239 239 239 239 239 239 237 236 235 234 235 234 232 232 234 234 234 234 232 228 226 226 227 228 226 223 224 227 228 229 227 226 225 223 222 223 222 221 220 220 221 220 220 221 219 217 215 213 213 213 214 212 211 211 210 210 210 211 213 213 211 209 208
-15699 208 206 206 204 204 204 203 203 203 203 201 200 201 201 201 200 200 200 200 198 196 197 199 198 197 197 197 196 196 197 197 194 193 194 194 193 194 194 194 194 192 188 186 185 185 185 185 184 185 185 184 183 183 183 182 182 183 184 185 183 180 177 176 177 178 178 178 179
-15632 179 180 179 175 174 174 172 171 171 172 171 172 173 170 170 171 173 173 173 172 171 170 168 168 169 169 169 170 170 170 168 165 164 163 164 162 160 158 160 161 159 158 157 156 155 156 159 160 159 158 155 152 152 154 155 154 154 153 152 152 152 151 151 152 153 153 151 148
-15565 148 147 146 143 142 141 139 138 136 133 132 130 128 126 124 127 130 134 141 148 154 159 165 172 174 174 173 170 166 163 161 158 158 159 159 156 153 152 154 153 151 151 151 150 148 148 148 147 147 146 145 146 146 144 141 139 136 134 135 136 135 133 131 130 128 126 125 123
-15498 123 120 120 120 121 121 125 132 141 150 156 161 164 165 166 167 166 164 162 160 156 155 153 150 148 149 150 149 147 145 145 144 147 148 146 145 144 143 142 141 141 143 142 141 138 136 136 136 135 134 135 136 136 134 133 132 129 128 129 129 129 128 129 129 128 129 131 131
-15431 131 131 131 130 129 127 125 125 127 128 128 129 128 126 125 126 128 126 123 121 122 123 124 125 126 128 128 126 125 126 125 123 122 122 123 121 119 118 120 121 121 117 115 117 119 120 120 118 116 116 118 120 120 118 116 115 116 117 117 116 116 115 115 116 118 118 115 113
-15364 113 111 110 109 109 109 109 111 114 114 113 113 113 111 111 109 107 109 111 112 110 110 110 108 108 108 108 107 106 106 106 106 106 106 106 107 105 105 106 106 105 106 105 104 103 104 105 104 102 102 101 99 100 100 103 103 101 100 100 102 105 106 102 101 101 101 102 101
-15297A01%KkkjKJjj%%%kJ%JjjJ%%%jkjJjjjlk%KL%%%j%J%%jkjjJ%%%j%%J%k%%J%j%jJKjj
-15230H6jjkjjkjkkJ%jkjmklkJNPJ1J1QPMLjkmlkjklk%JJJkklk%jJLjjJJkkjj%j%Jjk%J%%
-15164H5JJllJLJJ%jJJj%Jjkjk%kkJLj%%%J%kj%JJ%jj%%J%%kkJ%%%j%JJ%jjJ%lk%KJjkjj%
-15096G0K%k%J%%JjJJ%%k%J%%%%%jk%jj%JJk%KJj%j%%Jjkkj%%%JMj%JlljjKJJJj%J%jkj%K
-15028F3%%%%%%%%KK%klk%k%Kjj%LL%kjK%%%Jjjj%%%jJ%%Jjkj%%%j%%%k%JjjjJKKkkjjjJK
-14960E4%%jJ%JJ%jkJJJ%JjkkkkjJLJK%jj%J%jJJJjkkkJK%%k%%JKL%kk%jjJ%%jkj%KJ%Jjl
-14892D6k%KKKjkkk%LJjjkJKJk%LJ%%j%%mj%j%JJ%K%kjk%j%%JJ%%JJJklkjKL%%%jjkKKKJ%
-14824D5J%lkj%j%J%jjjjKJ%KKJjkkJ%j%%jjjJ%jj%%%J%kk%KKLJJkkjJJ%kjJJj%%l%J%%kk
$$ plain form
-15297 101 101 103 101 99 98 100 101 100 99 99 99 99 97 98 98 99 98 97 98 98 98 98 97 95 94 95 94 93 92 89 87 87 89 92 92 92 92 91 91 92 92 92 91 89 88 87 88 88 88 88 87 87 87 88 88 86 86 86 87 87 86 86 85 86 88 87 86
-15230 86 85 84 82 81 80 78 77 75 73 74 74 73 71 70 66 64 61 59 60 65 72 83 94 102 109 113 116 115 113 109 106 104 103 101 98 96 96 97 98 99 97 95 92 90 90 89 90 93 92 91 92 93 91 89 88 87 87 86 86 87 86 84 84 85 85 85
-15164 85 86 87 84 81 82 85 86 87 87 86 87 88 87 87 88 87 85 84 82 82 80 78 79 82 81 81 81 81 82 82 80 79 79 80 81 81 80 79 79 79 80 80 80 78 76 77 77 77 77 76 76 77 78 78 77 76 77 77 74 72 72 74 75 74 72 71 70 70
-15096 70 72 72 70 70 71 71 71 72 71 72 73 73 73 71 71 72 72 72 72 72 72 71 69 69 68 67 67 68 69 67 67 69 70 69 69 68 68 68 69 68 66 64 63 63 63 63 64 68 67 67 68 65 62 61 60 62 63 64 65 64 64 65 65 64 62 61 61 63
-15028 63 63 63 63 63 63 63 63 63 65 67 67 65 62 60 60 58 58 60 59 58 58 61 64 64 62 61 63 63 63 63 64 63 62 61 61 61 61 60 61 61 61 62 61 59 58 58 58 58 57 57 57 57 55 55 56 55 54 53 54 56 58 56 54 53 52 51 52 54
-14960 54 54 54 53 54 54 55 56 56 55 53 54 55 56 56 57 56 54 52 50 48 47 48 51 52 54 54 53 52 52 53 53 52 53 54 55 54 52 50 48 49 51 51 51 49 49 49 50 52 55 55 53 51 51 50 49 50 50 50 49 47 46 46 48 49 49 50 49 46
-14892 46 44 44 46 48 50 49 47 45 43 43 46 47 46 45 43 44 46 47 45 45 48 49 49 49 48 48 48 44 43 43 42 42 43 44 44 46 46 44 43 41 41 40 40 40 41 42 42 42 43 44 45 43 40 38 37 39 42 42 42 42 41 40 38 40 42 44 45 45
-14824 45 46 46 43 41 40 40 39 39 40 40 39 38 37 36 38 39 39 41 43 44 43 41 39 40 40 39 39 39 38 37 36 37 37 36 35 35 35 35 36 36 34 32 32 34 36 39 40 41 39 37 36 37 38 38 36 35 36 37 36 36 36 33 33 34 34 34 32 30
-14756C0JKkj%KK%kkjKj%%j%jJ%JLJ%j%%K%klkj%%%J%jjK%%%JK%%j%jj%Jjjk%JjjKKJkkj%
-14688B4JJKj%Jjlk%KjjK%%JJk%L%j%jkj%KJJK%mj%%%JJ%%%jkj%Jj%j%j%%J%JJJjk%jJ%j%
-14620A9%j%K%kj%Jk%%KJ%jjk%Jjkj%%K%JJ%j%%jKL%lj%j%JJ%%j%j%%kljKKJ%JJJ%j%J%J%
-14552A7%%jJJjJJj%%JjkljJJ%KjJJjlj%KJj%Jjj%J%%jJKJKjjjj%%jkjKJ%jJ%jljJKJjj%J
-14484A2jljk%JJJ%jjk%K%%JKJ%jj%j%J%jJ%kk%JJ%k%KJkkJJ%%J%kk%K%%%lj%%JJJJj%%%J
-14416D%%j%%JjJJJjkkJ%%JJ%k%JjjJJjjKL%j%jkkjj%KJJ%Jjjj%%jljJJJjJ%%jjJKjk%K%J
-14347a%jjJJ%%%jkjJ%j%%JjjkjJ%JJJjk%JjjKK%j%j%kKK%Kjl%JJjj%J%%kkk%JL%%JJ%jk%
-14278i%lkJKJKKJKj%jkJJ%jkjjJJJJJJk%jk%j%KJJjj%kjjJJkJ%jJ%%%%k%Jk%LJjj%j%J%j
$$ plain form
-14756 30 31 33 31 30 30 32 34 34 32 30 29 31 30 30 30 29 29 28 29 29 30 33 34 34 33 33 33 35 35 33 30 28 27 27 27 27 28 28 27 26 28 28 28 28 29 31 31 31 30 30 29 28 28 29 28 27 25 25 26 25 24 26 28 29 27 25 24 24
-14688 24 25 26 28 27 27 28 27 24 22 22 24 23 22 24 24 24 25 26 24 24 27 27 26 26 25 23 22 22 24 25 26 28 28 24 23 23 23 23 24 25 25 25 25 24 22 21 21 22 21 21 20 20 19 19 19 20 20 21 22 23 22 20 20 19 20 20 19 19
-14620 19 19 18 18 20 20 18 17 17 18 16 16 16 18 19 19 18 17 15 15 16 15 13 12 12 12 14 14 15 16 16 15 15 15 14 16 19 19 16 15 15 14 14 15 16 16 16 15 15 14 14 14 12 9 8 10 12 13 13 14 15 16 16 15 15 16 16 17 17
-14552 17 17 17 16 17 18 17 18 19 18 18 18 19 18 16 13 12 13 14 14 16 15 16 17 16 13 12 12 14 15 14 14 15 14 13 13 14 14 14 13 14 16 17 19 18 17 16 15 15 15 14 12 11 13 14 14 13 14 14 13 10 9 10 12 13 12 11 11 12
-14484 12 11 8 7 5 5 6 7 8 8 7 6 4 4 6 6 6 7 9 10 10 9 8 8 7 7 8 8 7 8 8 6 4 4 5 6 6 4 4 6 7 5 3 4 5 5 5 6 6 4 2 2 4 4 4 4 1 0 0 0 1 2 3 4 3 3 3 3 4
-14416 4 4 4 3 3 3 4 3 4 5 6 5 3 1 2 2 2 3 4 4 2 2 3 2 1 2 3 2 1 3 6 6 5 5 4 2 0 -1 -2 -2 0 1 2 2 3 2 1 0 0 0 -1 -4 -5 -4 -3 -2 -3 -2 -2 -2 -3 -4 -3 -1 -2 -4 -4 -2 -2 -1
-14347 -1 -1 -2 -3 -2 -1 -1 -1 -1 -2 -4 -5 -4 -4 -5 -5 -5 -4 -5 -6 -8 -9 -8 -8 -7 -6 -5 -6 -8 -8 -7 -8 -9 -7 -5 -5 -6 -6 -7 -7 -9 -7 -5 -5 -3 -4 -7 -7 -6 -5 -6 -7 -7 -6 -6 -6 -8 -10 -12 -12 -11 -8 -8 -8 -7 -6 -6 -7 -9 -9
-14278 -9 -9 -12 -14 -13 -11 -10 -8 -6 -5 -3 -4 -4 -5 -7 -6 -5 -5 -6 -8 -9 -10 -9 -8 -7 -6 -5 -4 -6 -6 -7 -9 -9 -10 -10 -8 -7 -6 -7 -8 -8 -10 -11 -12 -11 -10 -12 -11 -11 -12 -11 -11 -11 -11 -11 -13 -13 -12 -14 -14 -11 -10 -11 -12 -12 -13 -13 -12 -12 -13
-14209a3jjj%j%%JJJ%%J%jjk%KK%%j%%jj%j%Jkk%KL%lj%K%%jjJ%jj%%jJJj%J%%jj%JJ%%JJ
-14141a7J%jkj%%JJJjkj%J%%J%%%jjjJ%jjJJJJJJkk%%kJ%%%jj%%k%KJ%JKJj%%%kk%%%%%jJ
-14073b4JjlkJJ%KJkj%%%%%%J%jljKJJjjjjjJ%%JKjl%JJJjjJJKJ%%%KJkj%jjj%KJlkj%JJk
-14005c2%JJ%jkKJkk%J%JKJk%jjj%JjkJLj%JJJkk%KL%jj%JkjjjkkjKKj%JK%jjJ%JJ%%j%jj
-13937c6jKK%k%jkJ%%%j%KJ%Jjlj%jjj%j%KJj%jjJjJJJ%%jJ%%Jj%jj%J%%JJJjj%kj%JkljJ
-13869d7KJ%%JKkkjJ%JJ%jl%%%KkkKJJjkJKJkmj%%%KLK%%j%%J%%kkjj%j%%jJJk%KK%%j%jK
-13801d8%%jjJ%jk%%JJ%%%kk%Jjjkk%JJJ%%JkkJKJJ%j%K%%j%%jk%%jKJjj%j%JjjjjkjJKJ%
-13733f0%J%Jjj%k%J%jJ%jjJ%%j%KJjjk%JkkjjKK%%jkjJ%%%%JJJ%jk%%%jjj%J%JjJkl%LJj
$$ plain form
-14209 -13 -14 -15 -16 -16 -17 -17 -17 -16 -15 -14 -14 -14 -13 -13 -14 -15 -17 -17 -15 -13 -13 -13 -14 -14 -14 -15 -16 -16 -17 -17 -16 -18 -20 -20 -18 -15 -15 -18 -19 -19 -17 -17 -17 -18 -19 -18 -18 -19 -20 -20 -20 -21 -20 -19 -20 -20 -19 -19 -19 -20 -21 -21 -20 -19 -19 -19 -18 -17
-14141 -17 -16 -16 -17 -19 -20 -20 -20 -19 -18 -17 -18 -20 -21 -21 -20 -20 -20 -19 -19 -19 -19 -20 -21 -22 -21 -21 -22 -23 -22 -21 -20 -19 -18 -17 -19 -21 -21 -21 -23 -22 -22 -22 -22 -23 -24 -24 -24 -26 -26 -24 -23 -23 -22 -20 -19 -20 -20 -20 -20 -22 -24 -24 -24 -24 -24 -24 -25 -24
-14073 -24 -23 -24 -27 -29 -28 -27 -27 -25 -24 -26 -27 -27 -27 -27 -27 -27 -27 -26 -26 -27 -30 -31 -29 -28 -27 -28 -29 -30 -31 -32 -31 -31 -31 -30 -28 -29 -32 -32 -31 -30 -29 -30 -31 -30 -29 -27 -26 -26 -26 -26 -24 -23 -25 -26 -26 -27 -28 -29 -29 -27 -26 -29 -31 -32 -32 -31 -30 -32
-14005 -32 -32 -31 -30 -30 -31 -33 -31 -30 -32 -34 -34 -33 -33 -32 -30 -29 -31 -31 -32 -33 -34 -34 -33 -34 -36 -35 -32 -33 -33 -32 -31 -30 -32 -34 -34 -32 -29 -29 -30 -31 -31 -30 -32 -33 -34 -35 -37 -39 -40 -38 -36 -37 -37 -36 -34 -34 -35 -36 -35 -35 -34 -33 -33 -33 -34 -34 -35 -36
-13937 -36 -37 -35 -33 -33 -35 -35 -36 -38 -37 -37 -37 -37 -38 -38 -36 -35 -35 -34 -35 -38 -39 -39 -40 -41 -42 -42 -43 -43 -41 -40 -41 -41 -42 -43 -42 -43 -42 -41 -40 -40 -40 -41 -40 -40 -40 -39 -40 -40 -41 -42 -42 -41 -41 -41 -40 -39 -38 -39 -40 -40 -42 -43 -43 -42 -44 -47 -48 -47
-13869 -47 -45 -44 -44 -44 -43 -41 -43 -45 -46 -45 -45 -44 -43 -43 -44 -47 -47 -47 -47 -45 -47 -49 -47 -46 -45 -46 -48 -47 -45 -44 -46 -50 -51 -51 -51 -51 -49 -46 -44 -44 -44 -45 -45 -45 -44 -44 -44 -46 -48 -49 -50 -50 -51 -51 -51 -52 -51 -50 -52 -52 -50 -48 -48 -48 -49 -49 -50 -48
-13801 -48 -48 -48 -49 -50 -49 -49 -50 -52 -52 -52 -51 -50 -50 -50 -50 -52 -54 -54 -53 -54 -55 -57 -59 -59 -58 -57 -56 -56 -56 -55 -57 -59 -58 -56 -55 -54 -54 -55 -55 -53 -53 -53 -54 -54 -54 -55 -57 -57 -57 -58 -56 -55 -56 -57 -57 -58 -58 -57 -58 -59 -60 -61 -63 -64 -63 -61 -60 -60
-13733 -60 -60 -59 -59 -58 -59 -60 -60 -62 -62 -61 -61 -62 -61 -61 -62 -63 -62 -62 -62 -63 -63 -61 -60 -61 -62 -64 -64 -63 -65 -67 -68 -69 -67 -65 -65 -65 -66 -68 -69 -68 -68 -68 -68 -68 -67 -66 -65 -65 -66 -68 -68 -68 -68 -69 -70 -71 -71 -70 -70 -69 -70 -69 -71 -74 -74 -71 -70 -71
-13665g1llJJk%kj%KJK%kjj%kk%j%KJkjjj%%kljJ%%Jk%%ll%jjj%J%klnkk%kl%%jlkkkkmom
-13597a45lnpnnmnoqj1j4j5j7j7k0k6l6m4n1n1j7R4L19L78J59j5o3o0m8l7l1k6k1j6j5j2r
-13560H5rrqpoomnnmlmljklmkllJjmlk%J%kklk%%%jJ%jjkkjk%KK%kkmj%J%jjj%%%jJJj%%j
-13492d0%k%JKkmjjJ%j%JJ%%jj%JJjj%Jjk%j%%%%%jJJ%jJJJjjlkJLJ%jkkjJjk%jJJJJ%%kj
-13424e7J%jj%jK%jJJKJjkKJkljj%KK%kkj%%%%J%%KJ%jjjl%%%J%%kjj%Jjkj%j%KJ%jkjKJk
-13356g0jJ%J%K%kjk%K%%%KJ%Kkkkk%%%%jjjJK%jkj%J%J%KJJJKLJj%LKJjkj%jjkjjJJJjlj
-13288g1J%j%j%KJ%jj%%jjjk%%jJJ%ljKJj%%k%jjK%jkkLKJJJjjJ%jjj%J%JJjjjJKJk%J%j%
-13220g8%j%jj%L%jjJJkjJ%jJ%kkkJ%KLK%%j%k%%j%kjKJj%J%j%kj%%JJjljJJ%j%%K%J%jlK
$$ plain form
-13665 -71 -74 -77 -76 -75 -77 -77 -79 -80 -80 -78 -77 -75 -75 -77 -78 -79 -79 -81 -83 -83 -84 -84 -82 -81 -83 -84 -85 -86 -86 -86 -88 -91 -92 -91 -91 -91 -90 -92 -92 -92 -95 -98 -98 -99 -100 -101 -101 -100 -100 -102 -105 -110 -112 -114 -114 -116 -119 -119 -119 -120 -123 -125 -127 -129 -131 -135 -141 -145
-13597 -145 -148 -153 -160 -165 -170 -174 -179 -185 -193 -204 -218 -233 -250 -267 -287 -313 -349 -393 -444 -495 -512 -418 -99 279 438 423 360 300 252 215 184 158 137 121 106 94 85
-13560 85 76 67 59 52 46 40 36 31 26 22 19 15 12 11 9 6 2 0 -3 -6 -5 -6 -10 -13 -15 -15 -14 -14 -16 -18 -21 -23 -23 -23 -23 -24 -23 -23 -24 -25 -27 -29 -30 -32 -32 -30 -28 -28 -30 -32 -36 -37 -37 -36 -36 -37 -38 -39 -39 -39 -39 -40 -39 -38 -39 -39 -39 -40
-13492 -40 -40 -42 -42 -41 -39 -41 -45 -46 -47 -46 -46 -47 -47 -46 -45 -45 -45 -46 -47 -47 -46 -45 -46 -47 -47 -46 -47 -49 -49 -50 -50 -50 -50 -50 -50 -51 -50 -49 -49 -50 -49 -48 -47 -48 -49 -52 -54 -53 -50 -49 -49 -50 -52 -54 -55 -54 -55 -57 -57 -58 -57 -56 -55 -54 -54 -54 -56 -57
-13424 -57 -56 -56 -57 -58 -58 -59 -57 -57 -58 -57 -56 -54 -53 -54 -56 -54 -53 -55 -58 -59 -60 -60 -58 -56 -56 -58 -60 -61 -61 -61 -61 -61 -60 -60 -60 -58 -57 -57 -58 -59 -60 -63 -63 -63 -63 -62 -62 -62 -64 -65 -66 -66 -65 -66 -68 -69 -69 -70 -70 -68 -67 -67 -68 -70 -71 -69 -68 -70
-13356 -70 -71 -70 -70 -69 -69 -67 -67 -69 -70 -72 -72 -70 -70 -70 -70 -68 -67 -67 -65 -67 -69 -71 -73 -73 -73 -73 -73 -74 -75 -76 -75 -73 -73 -74 -76 -77 -77 -76 -76 -75 -75 -73 -72 -71 -70 -68 -65 -64 -65 -65 -62 -60 -59 -60 -62 -63 -63 -64 -65 -67 -68 -69 -68 -67 -66 -67 -70 -71
-13288 -71 -70 -70 -71 -71 -72 -72 -70 -69 -69 -70 -71 -71 -71 -72 -73 -74 -76 -76 -76 -77 -76 -75 -75 -78 -79 -77 -76 -77 -77 -77 -79 -79 -80 -81 -79 -79 -80 -82 -84 -81 -79 -78 -77 -76 -77 -78 -77 -77 -78 -79 -80 -80 -79 -79 -78 -77 -78 -79 -80 -79 -77 -76 -78 -78 -77 -77 -78 -78
-13220 -78 -78 -79 -79 -80 -81 -81 -78 -78 -79 -80 -79 -78 -80 -81 -80 -80 -81 -80 -80 -82 -84 -86 -85 -85 -83 -80 -78 -78 -78 -79 -79 -81 -81 -81 -82 -82 -84 -85 -83 -82 -83 -83 -82 -82 -83 -83 -85 -86 -86 -86 -85 -84 -85 -88 -89 -88 -87 -87 -88 -88 -88 -86 -86 -85 -85 -86 -89 -87
-13152h7K%jjjjJJ%j%%%%JKjnlKK%k%J%JJ%klJ%%J%%jj%%%jJjJK%%%jj%LJjkjj%Kjl%jJK%
-13084i5J%JJJjlk%%jj%JjJJkjKjk%kj%JKJJJJjjJk%JJjj%jjkJKKJkj%JJ%kj%j%%%j%J%j%
-13016a04J%JJ%kjj%jjJLNOJjk%%%jkjJJkljjk%jj%J%j%JKLK%j%kj%%jkkj%%jj%%jlk%JJJ
-12949a14NOM%kjjJklj%kjj%Jjjlllj%%jjJPJ2QMjmljJjjkjkjK%kkk%KJj%j%KJJJjj%jjjk
-12883a14k%j%J%k%%jk%%kkJMRJ1P%k%JJmm%jjjkkkjJJJ%kjj%jJJkJJKjjk%kl%jKK%j%Jkk
-12817a19jkljKMML%j%jllkJ%%KLJJjJ%j%llJJkjKJ%j%j%j%jjkJj%%J%kjK%kjjj%Kjjjj%j
-12750a35j%%Jkj%KKK%JKLJjjkkjjlk%jKJKKJ%%K%kljjljj%%jJ%%jjkkk%j%jkjjljkjlkjJ
-12683a67%jkj%lnmkmnmoj0j0oqj4j9j6j0J5O2J10J10O1Oj8k0j7j5j4j0rponnplllmllkkj
$$ plain form
-13152 -87 -85 -85 -86 -87 -88 -89 -88 -87 -87 -88 -88 -88 -88 -88 -87 -85 -86 -91 -94 -92 -90 -90 -92 -92 -91 -91 -90 -89 -89 -91 -94 -93 -93 -93 -92 -92 -92 -93 -94 -94 -94 -94 -95 -94 -95 -94 -92 -92 -92 -92 -93 -94 -94 -91 -90 -91 -93 -94 -95 -95 -93 -94 -97 -97 -98 -97 -95 -95
-13084 -95 -94 -94 -93 -92 -91 -92 -95 -97 -97 -97 -98 -99 -99 -98 -99 -98 -97 -99 -100 -98 -99 -101 -101 -103 -104 -104 -103 -101 -100 -99 -98 -97 -98 -99 -98 -100 -100 -99 -98 -99 -100 -100 -101 -102 -104 -103 -101 -99 -98 -100 -101 -101 -100 -99 -99 -101 -102 -102 -103 -103 -103 -103 -104 -104 -103 -103 -104 -104
-13016 -104 -103 -103 -102 -101 -101 -103 -104 -105 -105 -106 -107 -106 -103 -98 -92 -91 -92 -94 -94 -94 -94 -95 -97 -98 -97 -96 -98 -101 -102 -103 -105 -105 -106 -107 -107 -106 -106 -107 -107 -106 -104 -101 -99 -99 -100 -100 -102 -103 -103 -103 -104 -106 -108 -109 -109 -109 -110 -111 -111 -111 -112 -115 -117 -117 -116 -115 -114
-12949 -114 -109 -103 -99 -99 -101 -102 -103 -102 -104 -107 -108 -108 -110 -111 -112 -112 -111 -112 -113 -116 -119 -122 -123 -123 -123 -124 -125 -124 -117 -105 -97 -93 -94 -98 -101 -102 -101 -102 -103 -105 -106 -108 -109 -107 -107 -109 -111 -113 -113 -111 -110 -111 -111 -112 -112 -110 -109 -108 -107 -108 -109 -109 -110 -111 -112 -114
-12883 -114 -116 -116 -117 -117 -116 -116 -118 -118 -118 -119 -121 -121 -121 -123 -125 -124 -120 -111 -100 -93 -93 -95 -95 -94 -93 -97 -101 -101 -102 -103 -104 -106 -108 -110 -111 -110 -109 -108 -108 -110 -111 -112 -112 -113 -112 -111 -113 -112 -111 -109 -110 -111 -113 -113 -115 -118 -118 -119 -117 -115 -115 -116 -116 -115 -117 -119
-12817 -119 -120 -122 -125 -126 -124 -120 -116 -113 -113 -114 -114 -115 -118 -121 -123 -122 -122 -122 -120 -117 -116 -115 -116 -115 -115 -116 -116 -119 -122 -121 -120 -122 -123 -121 -120 -120 -121 -121 -122 -122 -123 -123 -124 -125 -127 -126 -127 -127 -127 -126 -126 -128 -129 -127 -127 -129 -130 -131 -132 -132 -130 -131 -132 -133 -134 -134 -135
-12750 -135 -136 -136 -136 -135 -137 -138 -138 -136 -134 -132 -132 -131 -129 -126 -125 -126 -127 -129 -131 -132 -133 -136 -138 -138 -139 -137 -136 -134 -132 -131 -131 -131 -129 -129 -131 -134 -135 -136 -139 -140 -141 -141 -141 -142 -141 -141 -141 -142 -143 -145 -147 -149 -149 -150 -150 -151 -153 -154 -155 -158 -159 -161 -162 -165 -167 -168 -167
-12683 -167 -167 -168 -170 -171 -171 -174 -179 -183 -185 -189 -194 -198 -204 -214 -224 -230 -238 -252 -271 -287 -297 -282 -220 -110 0 61 67 49 29 12 -3 -17 -27 -36 -43 -49 -54 -59 -66 -69 -72 -75 -79 -82 -85 -87 -89 -90
-12635i0jkjjj%ljkkkkK%jk%%j%%kljkk%KMMMJ%jjj%%kjJjjk%jjjk%j%LJjjjjJjk%%Jjjj%
-12567a24%JKJljjjJjJj%K%%%%k%JJ%%jkjjk%%%%kKJ%k%JK%kljjLKjJ%kJ%kjj%LJ%J%k%jm
-12500a38%jJLJjJjkjJ%jJJj%JJk%jJjkjKLJjjJ%%j%jkkj%KJj%%Jjkjj%%KK%jjJKJjjjk%%
-12433a44%J%jjjj%JKJJJjk%j%%jjJ%%%%kjjjJJJ%jlJK%%%%k%JjjJJLKkjjkk%JJJjJj%jk%
-12366a54KJJ%kJ%%%j%JJJlk%klJ%JJ%kkJ%JKJ%%j%Jj%%%k%%%JK%kkJ%%%%jj%%jj%JJJjlk
-12299a65kLL%%l%JJkk%%JjjKjj%JJ%JL%%%mkj%J%JKkJ%k%J%Jjlk%JJ%%%jjJJjjJJjjjj%%
-12232a73K%jk%LLKK%jkkkk%%%%LJ%k%j%kJ%%J%kJ%jJ%jjJ%lJJJ%jj%%%%%j%JJjJjljjJJ%
-12165a79klJLKK%lkjJL%Jkj%jk%J%%%%%kljKK%jj%%%J%jJkk%J%JjkkjLLJjjjjJ%k%J%l%J
$$ plain form
-12635 -90 -91 -93 -94 -95 -96 -96 -99 -100 -102 -104 -106 -108 -106 -106 -107 -109 -109 -109 -110 -110 -110 -112 -115 -116 -118 -120 -120 -118 -114 -110 -106 -105 -105 -106 -107 -108 -108 -108 -110 -111 -110 -111 -112 -114 -114 -115 -116 -117 -119 -119 -120 -120 -117 -116 -117 -118 -119 -120 -119 -120 -122 -122 -122 -121 -122 -123 -124 -124
-12567 -124 -124 -123 -121 -120 -123 -124 -125 -126 -125 -126 -125 -126 -126 -124 -124 -124 -124 -124 -126 -126 -125 -124 -124 -124 -125 -127 -128 -129 -131 -131 -131 -131 -131 -133 -131 -130 -130 -132 -132 -131 -129 -129 -131 -134 -135 -136 -133 -131 -132 -131 -131 -133 -132 -132 -134 -135 -136 -136 -133 -132 -132 -131 -131 -133 -133 -134 -138
-12500 -138 -138 -139 -138 -135 -134 -135 -134 -135 -137 -138 -137 -137 -138 -137 -136 -137 -137 -136 -135 -137 -137 -138 -137 -138 -140 -141 -139 -136 -135 -136 -137 -136 -136 -136 -137 -137 -138 -140 -142 -143 -143 -141 -140 -141 -141 -141 -140 -141 -143 -144 -145 -145 -145 -143 -141 -141 -142 -143 -142 -140 -139 -140 -141 -142 -144 -144 -144
-12433 -144 -144 -143 -143 -144 -145 -146 -147 -147 -146 -144 -143 -142 -141 -142 -144 -144 -145 -145 -145 -146 -147 -146 -146 -146 -146 -146 -148 -149 -150 -151 -150 -149 -148 -148 -149 -152 -151 -149 -149 -149 -149 -149 -151 -151 -150 -151 -152 -151 -150 -147 -145 -147 -148 -149 -151 -153 -153 -152 -151 -150 -151 -150 -151 -151 -152 -154 -154
-12366 -154 -152 -151 -150 -150 -152 -151 -151 -151 -151 -152 -152 -151 -150 -149 -152 -154 -154 -156 -159 -158 -158 -157 -156 -156 -158 -160 -159 -159 -158 -156 -155 -155 -155 -156 -156 -155 -156 -156 -156 -156 -158 -158 -158 -158 -157 -155 -155 -157 -159 -158 -158 -158 -158 -158 -159 -160 -160 -160 -161 -162 -162 -161 -160 -159 -160 -163 -165
-12299 -165 -167 -164 -161 -161 -161 -164 -164 -163 -162 -164 -166 -166 -166 -165 -166 -167 -165 -166 -167 -167 -166 -165 -165 -164 -161 -161 -161 -161 -165 -167 -168 -168 -167 -167 -166 -164 -166 -165 -165 -167 -167 -166 -166 -165 -166 -169 -171 -171 -170 -169 -169 -169 -169 -170 -171 -170 -169 -170 -171 -170 -169 -170 -171 -172 -173 -173 -173
-12232 -173 -171 -171 -172 -174 -174 -171 -168 -166 -164 -164 -165 -167 -169 -171 -173 -173 -173 -173 -173 -170 -169 -169 -171 -171 -172 -172 -174 -173 -173 -173 -172 -172 -174 -173 -173 -174 -173 -173 -174 -175 -174 -174 -177 -176 -175 -174 -174 -175 -176 -176 -176 -176 -176 -176 -177 -177 -176 -175 -176 -175 -176 -179 -180 -181 -180 -179 -179
-12165 -179 -181 -184 -183 -180 -178 -176 -176 -179 -181 -182 -181 -178 -178 -177 -179 -180 -180 -181 -183 -183 -182 -182 -182 -182 -182 -182 -184 -187 -188 -186 -184 -184 -185 -186 -186 -186 -186 -185 -185 -186 -185 -187 -189 -189 -188 -188 -187 -188 -190 -192 -193 -190 -187 -186 -187 -188 -189 -190 -189 -189 -191 -191 -190 -190 -193 -193 -192
-12098a92%JJjjJ%%jjJ%jjK%jjjjj%%jj%kj%LKJjkk%JlmjJJjKKJ%ljklkj%jklkkjklmlkkL
-12031b38J0J7K0J8J0%nlkml%klljkkkjkk%%mkkJjk%klkjkmmk%lnmnonnnlOK0L6M1L1J5Ll
-11974a22opponmmllllmk%%%kkj%%jklkj%JjmmkkjlnlkkkjKRJ9K1J6RMknnnkjlnjj%k%jkk
-11910a81kj%kkk%%KKJJjkjkj%%jjkkJkjj%%JJjJjj%%%J%jj%jj%j%%%J%%%%JKkjKJK%k%jk
-11843b03j%Jkkk%K%%j%%kjj%K%%j%jjj%JJJk%%%j%jjjKLJ%jkj%JJj%%%jjk%%j%K%KJ%jk%
-11776b17LJl%j%%%J%%lkk%JJJjjJJJ%jjkj%kJKJjjjjj%%%J%j%%kJKjjjJ%jk%%JK%j%J%%%
-11709b28%%%%J%%kjkk%JJjl%%%J%%j%KKJjkkjjJJjjjKLJKJjjmkljKKJJ%jj%%J%jlJJ%jj%
-11642b41%jjjjjjJJJJ%%K%lk%J%J%mk%JKK%JKjljk%K%lk%%JJjjjJ%Jjj%%kJ%J%j%Jk%Jj%
$$ plain form
-12098 -192 -192 -191 -190 -191 -192 -191 -191 -191 -192 -193 -192 -192 -193 -194 -192 -192 -193 -194 -195 -196 -197 -197 -197 -198 -199 -199 -201 -202 -202 -199 -197 -196 -197 -199 -201 -201 -200 -203 -207 -208 -207 -206 -207 -205 -203 -202 -202 -205 -206 -208 -211 -213 -214 -214 -215 -217 -220 -222 -224 -225 -227 -230 -234 -237 -239 -241 -238
-12031 -238 -228 -211 -191 -173 -163 -163 -168 -171 -173 -177 -180 -180 -182 -185 -188 -189 -191 -193 -195 -196 -198 -200 -200 -200 -204 -206 -208 -207 -208 -210 -210 -212 -215 -217 -218 -220 -224 -228 -230 -230 -233 -238 -242 -247 -253 -258 -263 -268 -271 -265 -245 -209 -168 -137 -122 -119 -122
-11974 -122 -128 -135 -142 -148 -153 -157 -161 -164 -167 -170 -173 -177 -179 -179 -179 -179 -181 -183 -184 -184 -184 -185 -187 -190 -192 -193 -193 -192 -193 -197 -201 -203 -205 -206 -209 -214 -217 -219 -221 -223 -224 -222 -213 -194 -173 -157 -148 -144 -146 -151 -156 -161 -163 -164 -167 -172 -173 -174 -174 -176 -176 -177 -179 -181
-11910 -181 -183 -184 -184 -186 -188 -190 -190 -190 -188 -186 -185 -184 -185 -187 -188 -190 -191 -191 -191 -192 -193 -195 -197 -196 -198 -199 -200 -200 -200 -199 -198 -199 -198 -199 -200 -200 -200 -200 -199 -199 -200 -201 -201 -202 -203 -203 -204 -204 -204 -204 -203 -203 -203 -203 -203 -202 -200 -202 -203 -201 -200 -198 -198 -200 -200 -201 -203
-11843 -203 -204 -204 -203 -205 -207 -209 -209 -207 -207 -207 -208 -208 -208 -210 -211 -212 -212 -210 -210 -210 -211 -211 -212 -213 -214 -214 -213 -212 -211 -213 -213 -213 -213 -214 -214 -215 -216 -217 -215 -212 -211 -211 -212 -214 -215 -215 -214 -213 -214 -214 -214 -214 -215 -216 -218 -218 -218 -219 -219 -217 -217 -215 -214 -214 -215 -217 -217
-11776 -217 -214 -213 -216 -216 -217 -217 -217 -217 -216 -216 -216 -219 -221 -223 -223 -222 -221 -220 -221 -222 -221 -220 -219 -219 -220 -221 -223 -224 -224 -226 -225 -223 -222 -223 -224 -225 -226 -227 -227 -227 -227 -226 -226 -227 -227 -227 -229 -228 -226 -227 -228 -229 -228 -228 -229 -231 -231 -231 -230 -228 -228 -229 -229 -228 -228 -228 -228
-11709 -228 -228 -228 -228 -228 -227 -227 -227 -229 -230 -232 -234 -234 -233 -232 -233 -236 -236 -236 -236 -235 -235 -235 -236 -236 -234 -232 -231 -232 -234 -236 -237 -238 -237 -236 -237 -238 -239 -237 -234 -233 -231 -230 -231 -232 -236 -238 -241 -242 -240 -238 -237 -236 -236 -237 -238 -238 -238 -237 -237 -238 -241 -240 -239 -239 -240 -241 -241
-11642 -241 -241 -242 -243 -244 -245 -246 -247 -246 -245 -244 -243 -243 -243 -241 -241 -244 -246 -246 -245 -245 -244 -244 -248 -250 -250 -249 -247 -245 -245 -244 -242 -243 -246 -247 -249 -249 -247 -247 -250 -252 -252 -252 -251 -250 -251 -252 -253 -252 -252 -251 -252 -253 -253 -253 -255 -254 -254 -253 -253 -254 -254 -253 -255 -255 -254 -255 -255
-11575b55J%%LKjlmjKJJJ%kjJ%%%%%JJ%jkkjJJJjk%%jkj%J%%jK%%kJ%%%jjjJjJJJj%k%%jl
-11508b69%JKjJJjljKKjj%jJ%jj%%%jj%JJjjjl%KJ%Kjl%JKJj%%jjjJjl%j%J%KJ%kj%l%LJj
-11441b78Jjjjj%%klKKjjJK%J%jjj%%%%kk%j%%%%%%j%%JjjjJL%jkjj%jjk%%%KKJ%%%kkl%j
-11374b99JKJjjKJJJjkjJjjJJ%jjlJ%jJJjkj%j%%JJ%J%JJjj%jk%%%%j%%lkJJJjk%KJjJJ%%
-11307c05lj%jJK%kJK%jjjJJlkJjjjkJJJ%kj%%KJjkkj%j%JKJkj%J%jlljJJkjJJJJ%JJ%k%L
-11240c20Jjj%jK%lll%JJj%%jkjj%%KKjkjkj%Jj%%%jJJj%%JJ%jlkjKJ%j%%J%%j%jjj%jJ%j
-11173c43%jJJjj%J%%jkJ%jk%Kjjj%jJJJ%%j%%kjkl%KJ%jj%%kJKjk%J%Jjj%j%kj%kJ%%jjk
-11106c66%LLJ%lmJJ%%kj%Jjk%j%JjJ%jll%JKKkjJjJJjkjj%J%j%j%%%JjkkjkJJ%%J%jjj%%
$$ plain form
-11575 -255 -254 -254 -254 -251 -249 -250 -253 -257 -258 -256 -255 -254 -253 -253 -255 -256 -255 -255 -255 -255 -255 -255 -254 -253 -253 -254 -256 -258 -259 -258 -257 -256 -257 -259 -259 -259 -260 -262 -263 -263 -262 -262 -262 -263 -261 -261 -261 -263 -262 -262 -262 -262 -263 -264 -265 -264 -265 -264 -263 -262 -263 -263 -265 -265 -265 -266 -269
-11508 -269 -269 -268 -266 -267 -266 -265 -266 -269 -270 -268 -266 -267 -268 -268 -269 -268 -268 -269 -270 -270 -270 -270 -271 -272 -272 -271 -270 -271 -272 -273 -276 -276 -274 -273 -273 -271 -272 -275 -275 -274 -272 -271 -272 -272 -272 -273 -274 -275 -274 -275 -278 -278 -279 -279 -278 -278 -276 -275 -275 -277 -278 -278 -281 -281 -278 -277 -278
-11441 -278 -277 -278 -279 -280 -281 -281 -281 -283 -286 -284 -282 -283 -284 -283 -281 -281 -280 -280 -281 -282 -283 -283 -283 -283 -283 -285 -287 -287 -288 -288 -288 -288 -288 -288 -288 -289 -289 -289 -288 -289 -290 -291 -290 -287 -287 -288 -290 -291 -292 -292 -293 -294 -296 -296 -296 -296 -294 -292 -291 -291 -291 -291 -293 -295 -298 -298 -299
-11374 -299 -298 -296 -295 -296 -297 -295 -294 -293 -292 -293 -295 -296 -295 -296 -297 -296 -295 -295 -296 -297 -300 -299 -299 -300 -299 -298 -299 -301 -302 -302 -303 -303 -303 -302 -301 -301 -300 -300 -299 -298 -299 -300 -300 -301 -303 -303 -303 -303 -303 -304 -304 -304 -307 -309 -308 -307 -306 -307 -309 -309 -307 -306 -307 -306 -305 -305 -305
-11307 -305 -308 -309 -309 -310 -309 -307 -307 -309 -308 -306 -306 -307 -308 -309 -308 -307 -310 -312 -311 -312 -313 -314 -316 -315 -314 -313 -313 -315 -316 -316 -316 -314 -313 -314 -316 -318 -319 -319 -320 -320 -319 -317 -316 -318 -319 -319 -318 -318 -319 -322 -325 -326 -325 -324 -326 -327 -326 -325 -324 -323 -323 -322 -321 -321 -323 -323 -320
-11240 -320 -319 -320 -321 -321 -322 -320 -320 -323 -326 -329 -329 -328 -327 -328 -328 -328 -329 -331 -332 -333 -333 -333 -331 -329 -330 -332 -333 -335 -336 -336 -335 -336 -336 -336 -336 -337 -336 -335 -336 -336 -336 -335 -334 -334 -335 -338 -340 -341 -339 -338 -338 -339 -339 -339 -338 -338 -338 -339 -339 -340 -341 -342 -342 -343 -342 -342 -343
-11173 -343 -343 -344 -343 -342 -343 -344 -344 -343 -343 -343 -344 -346 -345 -345 -346 -348 -348 -346 -347 -348 -349 -349 -350 -349 -348 -347 -347 -347 -348 -348 -348 -350 -351 -353 -356 -356 -354 -353 -353 -354 -355 -355 -355 -357 -356 -354 -355 -357 -357 -356 -356 -355 -356 -357 -357 -358 -358 -360 -361 -361 -363 -362 -362 -362 -363 -364 -366
-11106 -366 -366 -363 -360 -359 -359 -362 -366 -365 -364 -364 -364 -366 -367 -367 -366 -367 -369 -369 -370 -370 -369 -370 -369 -369 -370 -373 -376 -376 -375 -373 -371 -373 -374 -373 -374 -373 -372 -373 -375 -376 -377 -377 -376 -376 -377 -377 -378 -378 -378 -378 -377 -378 -380 -382 -383 -385 -384 -383 -383 -383 -382 -382 -383 -384 -385 -385 -385
-11039c85j%jkJK%kjJkjJ%%kj%J%KJkkj%Jkk%jjjjjkj%KJj%jkjJ%%%%%jj%jklk%j%Jjj%kj
-10972d21mnlljOJ4K0J4Nknlkjkkmkjj%%llljJ%k%KJ%jjkjjJjjjj%J%jk%Jjjk%KjjJjjj%k
-10908d29lj%%JJJjk%kk%J%%%j%J%kkKJklk%J%%%Jkk%J%jJjjklkJJKjj%%k%J%%jJ%kllk%%
-10841d63jJJKJ%lmlkJ%kJJ%%JK%klkkJ%%%jkjjjjJJkk%K%kk%JJJj%jkkKJ%kJ%lkKjjj%j%
-10774d94%kkkj%j%%J%%kmj%JJj%jjj%k%jjj%%jkjj%%jkk%JjKJ%%jjjljjJ%jjkk%Jj%%jjj
-10707e38j%%%%kkj%%jjjkj%lkKjj%%J%kk%%lmk%jj%KK%jjljk%%KLLJjkljjjkkjkjjkk%jj
-10640e88kj%%jkjj%kkjJKjl%jlkkklj%%jl%jljkklmlllkj%jjllmnmlmoorrj0j1ojJ2K6L8
-10578f58M9M4L2K0Nnj1j2j0qrqnnnmlnnonkkk%kmkj%k%Jkm%%kjmllj%jlkljJ%kml%%%kjJ
$$ plain form
-11039 -385 -386 -386 -387 -389 -388 -386 -386 -388 -389 -388 -390 -391 -390 -390 -390 -392 -393 -393 -392 -392 -390 -389 -391 -393 -394 -394 -393 -395 -397 -397 -398 -399 -400 -401 -402 -404 -405 -405 -403 -402 -403 -403 -404 -406 -407 -406 -406 -406 -406 -406 -406 -407 -408 -408 -409 -411 -414 -416 -416 -417 -417 -416 -417 -418 -418 -420 -421
-10972 -421 -425 -430 -433 -436 -437 -431 -417 -397 -383 -378 -380 -385 -388 -390 -391 -393 -395 -399 -401 -402 -403 -403 -403 -406 -409 -412 -413 -412 -412 -414 -414 -412 -411 -411 -412 -413 -415 -416 -417 -416 -417 -418 -419 -420 -420 -419 -419 -420 -422 -422 -421 -422 -423 -425 -425 -423 -424 -425 -424 -425 -426 -427 -427 -429
-10908 -429 -432 -433 -433 -433 -432 -431 -430 -431 -433 -433 -435 -437 -437 -436 -436 -436 -436 -437 -437 -436 -436 -438 -440 -438 -437 -439 -442 -444 -444 -443 -443 -443 -443 -442 -444 -446 -446 -445 -445 -446 -445 -446 -447 -449 -452 -454 -453 -452 -450 -451 -452 -452 -452 -454 -454 -453 -453 -453 -454 -453 -453 -455 -458 -461 -463 -463 -463
-10841 -463 -464 -463 -462 -460 -459 -459 -462 -466 -469 -471 -470 -470 -472 -471 -470 -470 -470 -469 -467 -467 -469 -472 -474 -476 -475 -475 -475 -475 -476 -478 -479 -480 -481 -482 -481 -480 -482 -484 -484 -482 -482 -484 -486 -486 -485 -484 -483 -484 -484 -485 -487 -489 -487 -486 -486 -488 -487 -487 -490 -492 -490 -491 -492 -493 -493 -494 -494
-10774 -494 -494 -496 -498 -500 -501 -501 -502 -502 -502 -501 -501 -501 -503 -507 -508 -508 -507 -506 -507 -507 -508 -509 -510 -510 -512 -512 -513 -514 -515 -515 -515 -516 -518 -519 -520 -520 -520 -521 -523 -525 -525 -524 -525 -523 -522 -522 -522 -523 -524 -525 -528 -529 -530 -529 -529 -530 -531 -533 -535 -535 -534 -535 -535 -535 -536 -537 -538
-10707 -538 -539 -539 -539 -539 -539 -541 -543 -544 -544 -544 -545 -546 -547 -549 -550 -550 -553 -555 -553 -554 -555 -555 -555 -554 -554 -556 -558 -558 -558 -561 -565 -567 -567 -568 -569 -569 -567 -565 -565 -566 -567 -570 -571 -573 -573 -573 -571 -568 -565 -564 -565 -567 -570 -571 -572 -573 -575 -577 -578 -580 -581 -582 -584 -586 -586 -587 -588
-10640 -588 -590 -591 -591 -591 -592 -594 -595 -596 -596 -598 -600 -601 -600 -598 -599 -602 -602 -603 -606 -608 -610 -612 -615 -616 -616 -616 -617 -620 -620 -621 -624 -625 -627 -629 -632 -636 -639 -642 -645 -647 -648 -648 -649 -650 -653 -656 -660 -665 -669 -672 -676 -682 -688 -697 -706 -716 -727 -733 -734 -722 -696 -658
-10578 -658 -609 -565 -533 -513 -508 -513 -524 -536 -546 -554 -563 -571 -576 -581 -586 -590 -593 -598 -603 -609 -614 -616 -618 -620 -620 -622 -626 -628 -629 -629 -631 -631 -630 -632 -636 -636 -636 -638 -639 -643 -646 -649 -650 -650 -651 -654 -656 -659 -660 -659 -659 -661 -665 -668 -668 -668 -668 -670 -671 -670
-10518f70jkjljklkj%%jlljjjjjkj%%kmkjj%Jjjlkkjkj%ll%jjjJ%kkkmlkjKJmkj%jjk%Jlm
-10451g61lj%jkkljllkljmkj%jkjj%jjjjjllljjlkkjjk%jk%kklmkkkljlnl%%%Jj%kkkmlmk
-10384h79jkkkjklklll%%kllmljlmlllmklllllljjnnnnorrqpmpjJ2L3M7K2krj3j0qpnnnnp
-10323i94onnopopoopmnlnpj0j2j2j1j1j2j5k0k0k4k4j9%N0J19J54J04K6j6k8k7k3k0j8j6
-10283i64j6j2rqpj0j1rnnmnnppnmnnnolmnoqnnnlmmpnmlmmpomolJ%momnponpnmmnnnoqqn
-10220a317llnmnnmonmmmnnoppoopoqpoqprpnnppoppqpqpoprnomklmorrrrj1rj0j0rqqqj2
-10158a723rrj0j0j2j0rj0j2j3j1j2j0j2j4j2j2j2j1j2j3j4j2j2j1j2j1j2j3j3j3j3j4j1j3
-10123b132j3j3j2j2j5j7j7j6j6j8j8j9j9j8j9j9k2k0k0k0k3k3k3k3k3k4k5k7k7k8k8k6k8
$$ plain form
-10518 -670 -671 -673 -674 -677 -678 -680 -683 -685 -686 -686 -686 -687 -690 -693 -694 -695 -696 -697 -698 -700 -701 -701 -701 -703 -707 -709 -710 -711 -711 -710 -711 -712 -715 -717 -719 -720 -722 -723 -723 -726 -729 -729 -730 -731 -732 -731 -731 -733 -735 -737 -741 -744 -746 -747 -745 -744 -748 -750 -751 -751 -752 -753 -755 -755 -754 -757 -761
-10451 -761 -764 -765 -765 -766 -768 -770 -773 -774 -777 -780 -782 -785 -786 -790 -792 -793 -793 -794 -796 -797 -798 -798 -799 -800 -801 -802 -803 -806 -809 -812 -813 -814 -817 -819 -821 -822 -823 -825 -825 -826 -828 -828 -830 -832 -835 -839 -841 -843 -845 -848 -849 -852 -857 -860 -860 -860 -860 -859 -860 -860 -862 -864 -866 -870 -873 -877 -879
-10384 -879 -880 -882 -884 -886 -887 -889 -892 -894 -897 -900 -903 -903 -903 -905 -908 -911 -915 -918 -919 -922 -926 -929 -932 -935 -939 -941 -944 -947 -950 -953 -956 -959 -960 -961 -966 -971 -976 -981 -987 -996 -1005 -1013 -1020 -1024 -1031 -1032 -1020 -987 -940 -918 -920 -929 -942 -952 -960 -967 -972 -977 -982 -987 -994
-10323 -994 -1000 -1005 -1010 -1016 -1023 -1029 -1036 -1042 -1048 -1055 -1059 -1064 -1067 -1072 -1079 -1089 -1101 -1113 -1124 -1135 -1147 -1162 -1182 -1202 -1226 -1250 -1269 -1269 -1219 -1100 -946 -842 -816 -832 -860 -887 -910 -930 -948 -964
-10283 -964 -980 -992 -1001 -1009 -1016 -1026 -1037 -1046 -1051 -1056 -1060 -1065 -1070 -1077 -1084 -1089 -1093 -1098 -1103 -1108 -1114 -1117 -1121 -1126 -1132 -1140 -1145 -1150 -1155 -1158 -1162 -1166 -1173 -1178 -1182 -1185 -1189 -1193 -1200 -1206 -1210 -1216 -1219 -1218 -1218 -1222 -1228 -1232 -1237 -1244 -1250 -1255 -1262 -1267 -1271 -1275 -1280 -1285 -1290 -1296 -1304 -1312 -1317
-10220 -1317 -1320 -1323 -1328 -1332 -1337 -1342 -1346 -1352 -1357 -1361 -1365 -1369 -1374 -1379 -1385 -1392 -1399 -1405 -1411 -1418 -1424 -1432 -1439 -1445 -1453 -1460 -1469 -1476 -1481 -1486 -1493 -1500 -1506 -1513 -1520 -1528 -1535 -1543 -1550 -1556 -1563 -1572 -1577 -1583 -1587 -1589 -1592 -1596 -1602 -1611 -1620 -1629 -1638 -1649 -1658 -1668 -1678 -1687 -1695 -1703 -1711 -1723
-10158 -1723 -1732 -1741 -1751 -1761 -1773 -1783 -1792 -1802 -1814 -1827 -1838 -1850 -1860 -1872 -1886 -1898 -1910 -1922 -1933 -1945 -1958 -1972 -1984 -1996 -2007 -2019 -2030 -2042 -2055 -2068 -2081 -2094 -2108 -2119 -2132
-10123 -2132 -2145 -2158 -2170 -2182 -2197 -2214 -2231 -2247 -2263 -2281 -2299 -2318 -2337 -2355 -2374 -2393 -2415 -2435 -2455 -2475 -2498 -2521 -2544 -2567 -2590 -2614 -2639 -2666 -2693 -2721 -2749 -2775 -2803
-10090b803k9l2l1l0l3l2l3l6l9l9m1m3m2m3m4m4m3m6m9n2n1n4n5n9o2o3o6o9p5p7q2q9r2
-10057d478r6r7r8r8j06j14j21j30j45j62j77j87k01k11k18k05j53p5o9j49k19k74l18l61
-10033h462m15m69n39o20p19q37r75j137j330j553j787j956j848j022J036M011O484Q758R940
-10014F560Q023N371K816K1j695k159k046j776j504j274j077r20p98o95o10n35m67m05l55
-9995F475l23l01k87k75k61k46k27k09j94j81j69j59j48j39j30j27j20j11j06j02r5r1q7q2
-9971B305q1p8p5o8o7o8o5o2o1n6n4n3n3n1m9m8m6m4m3m1m2m0l9l7l8l5l2l3l4l4l3l3l2l0
-9937F50k9l1l1k9k7k7k7k7k7k6k5k4k4k4k7k6k5k4k5k5k1k1k4k3k2k1k2k3k2k3k2k3k1k2
-9903a90k1k3k1k1k3k1j7j6k3k8k4j2kjqj5j9k4k7k8k4k3k4k4k5k4j9oJ2J0qk3k8k7k6k5k4
$$ plain form
-10090 -2803 -2832 -2864 -2895 -2925 -2958 -2990 -3023 -3059 -3098 -3137 -3178 -3221 -3263 -3306 -3350 -3394 -3437 -3483 -3532 -3584 -3635 -3689 -3744 -3803 -3865 -3928 -3994 -4063 -4138 -4215 -4297 -4386 -4478
-10057 -4478 -4574 -4671 -4769 -4867 -4973 -5087 -5208 -5338 -5483 -5645 -5822 -6009 -6210 -6421 -6639 -6844 -6997 -7072 -7141 -7290 -7509 -7783 -8101 -8462
-10033 -8462 -8877 -9346 -9885 -10505 -11224 -12061 -13036 -14173 -15503 -17056 -18843 -20799 -22647 -23669 -22633 -18622 -12138 -3380 6560
-10014 6560 14583 19954 22770 22791 21096 18937 16891 15115 13611 12337 11260 10340 9542 8847 8237 7702 7235 6830 6475
-9995 6475 6152 5851 5564 5289 5028 4782 4555 4346 4152 3971 3802 3643 3495 3356 3226 3099 2979 2868 2762 2660 2565 2474 2387 2305
-9971 2305 2224 2146 2071 2003 1936 1868 1803 1741 1680 1624 1570 1517 1464 1413 1364 1316 1270 1226 1183 1142 1100 1060 1021 984 946 911 879 846 812 778 745 712 680 650
-9937 650 621 590 559 530 503 476 449 422 395 369 344 320 296 272 245 219 194 170 145 120 99 78 54 31 9 -12 -34 -57 -79 -102 -124 -147 -168 -190
-9903 -190 -211 -234 -255 -276 -299 -320 -337 -353 -376 -404 -428 -440 -442 -443 -451 -466 -485 -509 -536 -564 -588 -611 -635 -659 -684 -708 -727 -733 -721 -711 -719 -742 -770 -797 -823 -848 -872
-9866h72k3k3k3k3k7k5k4k3k3k2j9j7k0k2k3k4k2k0k3k1k1k1j9j9k2k2k2k2k5k5k6k8k8k9
-9832a648k9k7k7k4k4k6l0l2l4l4l4l6l7l6l6l5l7l9m1l9l6l8m0m4m6m3m2m6m8m9m8n0n1n3
-9798b939n9o2o2o3o5o4o9o9p1p3p9p8p7q0q4r1r5j01j07j11j15j20j27j34j47j55j68j84
-9770e649j98k05k02j62n4J06J40k4k06k94l26l40l52l63l82m00m16m11l93l84m43n57o72
-9747a2187p70q70r81j110j265j465j703k005k369k813l321l850m129l318M99R749K3447K9918
-9729B1457K0165N467k574m712m583l954l314k760k306j946j655j419j231j078r51q49p63
-9712A2994o88o14n35m43l45k83k92l27l38l24l05k82k62k43k29k17k02j93j85j76j64j49
-9690F198j41j35j29j24j20j16j09j04r9r6r4r0q5q5q2q0p9p6p2o9o6o0n8n6n3n2n3n3n2n1
$$ plain form
-9866 -872 -895 -918 -941 -964 -991 -1016 -1040 -1063 -1086 -1108 -1127 -1144 -1164 -1186 -1209 -1233 -1255 -1275 -1298 -1319 -1340 -1361 -1380 -1399 -1421 -1443 -1465 -1487 -1512 -1537 -1563 -1591 -1619 -1648
-9832 -1648 -1677 -1704 -1731 -1755 -1779 -1805 -1835 -1867 -1901 -1935 -1969 -2005 -2042 -2078 -2114 -2149 -2186 -2225 -2266 -2305 -2341 -2379 -2419 -2463 -2509 -2552 -2594 -2640 -2688 -2737 -2785 -2835 -2886 -2939
-9798 -2939 -2998 -3060 -3122 -3185 -3250 -3314 -3383 -3452 -3523 -3596 -3675 -3753 -3830 -3910 -3994 -4085 -4180 -4281 -4388 -4499 -4614 -4734 -4861 -4995 -5142 -5297 -5465 -5649
-9770 -5649 -5847 -6052 -6254 -6416 -6470 -6364 -6224 -6248 -6454 -6748 -7074 -7414 -7766 -8129 -8511 -8911 -9327 -9738 -10131 -10515 -10958 -11515 -12187
-9747 -12187 -12957 -13827 -14808 -15918 -17183 -18648 -20351 -22356 -24725 -27538 -30859 -34709 -38838 -42156 -41657 -31908 -8461 21457
-9729 21457 41622 47089 44515 39803 35220 31266 27952 25192 22886 20940 19285 17866 16635 15557 14606 13757 12994
-9712 12994 12306 11692 11157 10714 10369 10086 9794 9467 9129 8805 8500 8218 7956 7713 7484 7267 7065 6872 6687 6511 6347 6198
-9690 6198 6057 5922 5793 5669 5549 5433 5324 5220 5121 5025 4931 4841 4756 4671 4589 4509 4430 4354 4282 4213 4147 4087 4029 3973 3920 3868 3815 3762 3710 3659
-9660C659m8m7m8m6m3m2m1l9l6l8m0l7l5l5l5l3l2l3l3l2l1k9k8k8k7k5k5k5k7k4k5k6k6k2
-9626B518k4k4k0k0k1j9k1j9k1k1j8j8k0k0k0j9j9j5j7j6j4j4j3j3j2j4j5j5j5j4j6j6j6j4
-9592A925j3j5j5j5j3j2j2j2j2j3j3j1j1j2j5j3j4j5j3pllnllpqprqppj0j2j0rppj0j1rpq
-9549A499qoproqqrqppqqqrqnpj0rqppnrpppnlmnnorqoonoonoplnonlnpoonnmmnnomnqqmk
-9483A084nonnmoonmlmmopqnmnnmkmnpmnoopqprqqqrj2j1j1j3rjJ3K9M2M8L9K5J1krj4j4j2
-9429I79j1qoppqponmpommnm%knmoonlnnk%llkmljkllmnlkmmkjkmllmkjkkmlmmljjkJjmlj
-9362G35klkklkmmmjk%jkmkklkkmkjlkjjmlkklllk%Kjkkmmjjkljkln%%mkjlk%klj%jkkllj
-9294E93%kkjkkk%jlllllljkk%%j%%%jjkmkkmkjjjkj%jkjkjkkjljlkk%lljjlkjkjj%kljJj
$$ plain form
-9660 3659 3611 3564 3516 3470 3427 3385 3344 3305 3269 3231 3191 3154 3119 3084 3049 3016 2984 2951 2918 2886 2855 2826 2798 2770 2743 2718 2693 2668 2641 2617 2592 2566 2540 2518
-9626 2518 2494 2470 2450 2430 2409 2390 2369 2350 2329 2308 2290 2272 2252 2232 2212 2193 2174 2159 2142 2126 2112 2098 2085 2072 2060 2046 2031 2016 2001 1987 1971 1955 1939 1925
-9592 1925 1912 1897 1882 1867 1854 1842 1830 1818 1806 1793 1780 1769 1758 1746 1731 1718 1704 1689 1676 1669 1666 1663 1658 1655 1652 1645 1637 1630 1621 1613 1606 1599 1589 1577 1567 1558 1551 1544 1534 1523 1514 1507 1499
-9549 1499 1491 1485 1478 1469 1463 1455 1447 1438 1430 1423 1416 1408 1400 1392 1383 1375 1370 1363 1353 1344 1336 1329 1322 1317 1308 1301 1294 1287 1282 1279 1275 1270 1265 1259 1250 1242 1236 1230 1225 1219 1213 1208 1202 1195 1192 1187 1181 1176 1173 1168 1161 1155 1149 1144 1139 1135 1131 1126 1121 1115 1111 1106 1098 1090 1086 1084
-9483 1084 1079 1073 1068 1063 1059 1053 1047 1042 1038 1035 1031 1027 1021 1014 1006 1001 997 992 987 983 981 977 972 965 961 956 950 944 937 929 922 913 905 897 889 880 868 857 846 833 824 823 836 865 907 955 994 1019 1030 1028 1019 1005 991 979
-9429 979 968 960 954 947 940 932 925 919 914 910 903 897 893 889 884 880 880 878 873 869 863 857 852 849 844 839 837 837 834 831 829 825 822 821 819 816 813 809 804 801 799 795 791 789 788 786 782 779 776 772 770 769 767 765 761 758 754 750 747 746 745 743 744 743 739 736 735
-9362 735 733 730 728 726 723 721 717 713 709 708 706 706 705 703 699 697 695 692 690 688 684 682 681 678 676 675 674 670 667 665 663 660 657 654 652 652 654 653 651 649 645 641 640 639 637 634 633 631 628 623 623 623 619 617 616 613 611 611 609 606 605 605 604 602 600 597 594 593
-9294 593 593 591 589 588 586 584 582 582 581 578 575 572 569 566 563 562 560 558 558 558 557 557 557 557 556 555 553 549 547 545 541 539 538 537 536 534 533 533 532 530 529 527 526 524 522 521 518 517 514 512 510 510 507 504 503 502 499 497 496 494 493 492 492 490 487 486 487 486
-9226D86lkjjj%kjkkkj%%kk%klnmk%%Jjmjlnmjjjlmll%jmnmllkjjljjmmnnmoqj0qppqprj1
-9160B83j3j6j6j9j2RO4J33J49Q8J6j9k8k6k1j7j6j4j2j0rj0qnllnmnnnlnmmolmmml%JkjK
-9114D01KKK%jkkK%%MMMM%jllmjkmmmjjjlklljllj%jllmjklmkkmjJLJjMMLMLjllklnmlj%l
-9046C36nljkmkkmnnlLJ2J8J7J4P%lnmmljmnkllk%jllklkkkkkomlkjknk%jlnmmmnlmqqo%J5
-8982B45L4M5L8K1Rjj0j1rpooomklmklnnkjllkjjj%jk%j%jjljjklkmlkmnpnlNJ3K1K2J4QK
-8924C28nmnmmlnklkjjkkjklkkk%j%%j%J%%Jklk%j%%jkjkl%JjmjjkjJJ%lj%Jk%%jjjkk%%k
-8856B35kJjk%%KjkjkJ%%%%Jj%jk%%ljjljJKjkjJJjkjK%%JkjjjjjjjjkJ%j%J%j%%%km%%kj
-8788A95JKj%Jk%KJjjjjj%Jjj%%JjlkJ%jkkjjjkJ%%JJkkkJJ%%J%%jjj%ljjj%jjkk%JJ%%J%
$$ plain form
-9226 486 483 481 480 479 478 478 476 475 473 471 469 468 468 468 466 464 464 462 459 454 450 448 448 448 449 448 444 443 440 435 431 430 429 428 425 421 418 415 415 414 410 405 401 398 395 393 392 391 388 387 386 382 378 373 368 364 358 350 340 332 325 318 310 303 294 283
-9160 283 270 254 238 219 207 216 280 413 562 650 666 647 619 593 572 555 539 525 513 503 494 484 476 471 468 465 460 456 451 446 441 438 433 429 425 419 416 412 408 404 401 401 402 400 399 401
-9114 401 403 405 407 407 406 404 402 404 404 404 408 412 416 420 420 419 416 413 409 408 406 402 398 394 393 392 391 388 386 383 380 379 376 373 372 372 371 368 365 361 360 358 355 351 349 347 343 342 343 346 347 346 350 354 357 361 364 363 360 357 355 352 347 343 340 339 339 336
-9046 336 331 328 327 325 321 319 317 313 308 303 300 303 315 333 350 364 371 371 368 363 359 355 352 351 347 342 340 337 334 332 332 331 328 325 323 320 318 316 314 312 310 304 300 297 295 294 292 287 285 285 284 281 276 272 268 264 259 256 252 244 236 230 230 245
-8982 245 279 324 362 383 392 391 381 370 361 354 348 342 336 332 330 327 323 321 318 313 308 306 305 302 299 297 296 295 294 294 293 291 291 290 290 289 288 285 284 283 281 278 276 272 269 267 263 258 251 246 243 248 261 282 304 318 326 328
-8924 328 323 319 314 310 306 303 298 296 293 291 290 289 287 285 284 282 279 277 275 273 273 272 272 272 271 271 272 272 272 273 271 268 266 266 265 265 265 264 262 261 259 256 256 257 256 252 251 250 248 247 248 249 249 246 245 245 246 244 244 244 243 242 241 239 237 237 237 235
-8856 235 233 234 233 231 231 231 233 232 230 229 227 228 228 228 228 228 229 228 228 227 225 225 225 222 221 220 217 216 217 219 218 216 215 216 217 216 214 213 215 215 215 216 214 213 212 211 210 209 208 207 206 204 205 205 204 204 205 205 204 204 204 204 202 198 198 198 196 195
-8788 195 196 198 197 197 198 196 196 198 199 198 197 196 195 194 194 195 194 193 193 193 194 193 190 188 189 189 188 186 184 183 182 181 179 180 180 180 181 182 180 178 176 177 178 178 178 179 179 179 178 177 176 176 173 172 171 170 170 169 168 166 164 164 165 166 166 166 167 167
-8720A67%l%%%kjJjjjjk%jj%Jjj%%%%J%%J%kk%Jjk%%JJjjjk%kjjjJjjJJJ%jkljKMJkmmkJ%
-8652A32%MLK%j%J%J%kljll%j%LKK%jlkJKjjjjlj%J%%JJj%%%jkj%kjj%JKK%Jjlkjj%%%%%k
-8584A15%jjkJJjj%j%kj%j%J%JjjJ%j%%kJKjljJ%kkkjjJJj%jJJ%jkkJLJkklJJjjlj%KJJ%j
-8516H9j%%JJkkjkjJkk%K%kjKJ%jj%%%j%%k%KK%kjJ%jkjJkjj%J%j%%jkjk%J%k%KJJj%jK%%
-8447F8%%kkl%%%JKJkjJJ%kkk%Jkj%%JkJjj%jjJJJ%Jjklk%K%jKkkkj%%%j%kJ%%kk%JKKJJj
-8378D4kj%j%%JJ%JjjjjL%kjj%jJJ%ljJjjJ%Jj%j%kjjj%%%%%jkkJKk%Kj%jjjjjKjjj%%jjJ
-8309A9Lj%%kkj%KJ%%kkjjjJKJJ%klk%JKJkkJJJjjjk%JK%j%kkjkjj%JJKJ%jj%jjjj%l%JJk
-8240cjJKJ%kk%%jJKJ%J%kjj%lkJKJjkjkmjJ%JJ%%JJ%jkk%K%lJJjkjjkKJ%%%%j%JjjjjJ%j
$$ plain form
-8720 167 167 164 164 164 164 162 161 162 161 160 159 158 156 156 155 154 154 155 154 153 153 153 153 153 154 154 154 155 155 153 151 151 152 151 149 149 149 150 151 150 149 148 146 146 144 143 142 141 142 141 140 141 142 143 143 142 140 137 136 138 142 143 141 137 133 131 132 132
-8652 132 132 136 139 141 141 140 140 141 141 142 142 140 137 136 133 130 130 129 129 132 134 136 136 135 132 130 131 133 132 131 130 129 126 125 125 126 126 126 127 128 127 127 127 127 126 124 123 123 121 120 119 119 120 122 124 124 125 124 121 119 118 117 117 117 117 117 117 115
-8584 115 115 114 113 111 112 113 112 111 111 110 110 108 107 107 106 106 107 107 108 107 106 107 107 106 106 106 104 105 107 106 103 102 103 103 101 99 97 96 95 96 97 96 96 95 96 97 97 96 94 92 93 96 97 95 93 90 91 92 91 90 87 86 86 88 89 90 90 89
-8516 89 88 88 88 89 90 88 86 85 83 82 83 81 79 79 81 81 79 78 80 81 81 80 79 79 79 79 78 78 78 76 76 78 80 80 78 77 78 78 77 75 74 75 73 72 71 71 72 72 71 71 71 70 68 67 65 65 66 66 64 64 66 67 68 67 67 66 68 68 68
-8447 68 68 68 66 64 61 61 61 61 62 64 65 63 62 63 64 64 62 60 58 58 59 57 56 56 56 57 55 56 55 54 54 53 52 53 54 55 55 56 55 53 50 48 48 50 50 49 51 49 47 45 44 44 44 44 43 43 41 42 42 42 40 38 38 39 41 43 44 45 44
-8378 44 42 41 41 40 40 40 41 42 42 43 42 41 40 39 42 42 40 39 38 38 37 38 39 39 36 35 36 35 34 35 35 36 35 35 34 34 32 31 30 29 29 29 29 29 29 28 26 24 25 27 25 25 27 26 26 25 24 23 22 21 23 22 21 20 20 20 19 18 19
-8309 19 22 21 21 21 19 17 16 16 18 19 19 19 17 15 14 13 12 13 15 16 17 17 15 12 10 10 11 13 14 12 10 11 12 13 12 11 10 8 8 9 11 11 10 10 8 6 5 3 2 1 1 2 3 5 6 6 5 4 4 3 2 1 0 0 -3 -3 -2 -1 -3
-8240 -3 -4 -3 -1 0 0 -2 -4 -4 -4 -5 -4 -2 -1 -1 0 0 -2 -3 -4 -4 -7 -9 -8 -6 -5 -6 -8 -9 -11 -15 -16 -15 -15 -14 -13 -13 -13 -12 -11 -11 -12 -14 -16 -16 -14 -14 -17 -16 -15 -16 -18 -19 -20 -22 -20 -19 -19 -19 -19 -19 -20 -20 -19 -20 -21 -22 -23 -22 -22 -23
-8170b3%%J%j%%K%kkkkJK%JJkl%J%%JjjjkjJ%%j%%J%%%jkjj%%J%%j%%kjJJ%jkmjjjj%KJ%%
-8101d6%LLJ%lkJjkj%kjjKJ%jjjjj%jkj%KJ%%kjJJ%jlkLKJjJJkljjll%JJLPNM%jJ%lnl%jj
-8032e9%lk%J%kjJ%%j%kj%jll%kkj%kkk%%NOMJklljk%j%LPJ0OKjkk%Jmmjlk%KKkmj%kjjjj
-7964h2lk%Jjlkklmljj%j%MJ2J8J4Knqmkkkl%LQOLjjJkmkkjkklkkjkljJ%%kl%Jjjjjklkjm
-7898a12lonj%NJ4K3K4J1%monnlkkJJJ%jlkkjkkjjJjkjjj%%jj%Jjlmkjj%jljkklkkjjLJ0J4
-7835i8J6RL%lomkjjkj%jkjmljJL%kjl%%jjjjkj%J%%jjkjkkJJjkjjjjkjJNRPJ%J%%klj%kl
-7767a14%Jjjk%J%jj%lj%kJJJ%%jj%l%K%jjjJkkkk%%%JJ%JKJkkjj%%%jjJJkkj%J%jl%KJJk
-7699a40j%%%jjjJ%%kjjkJL%kjKJ%%jjkk%JJkjjJJjl%JJ%%%%jjj%jj%kKJ%Jjl%Jj%K%kklJ
$$ plain form
-8170 -23 -23 -23 -22 -22 -23 -23 -23 -21 -21 -23 -25 -27 -29 -28 -26 -26 -25 -24 -26 -29 -29 -28 -28 -28 -27 -28 -29 -30 -32 -33 -32 -32 -32 -33 -33 -33 -32 -32 -32 -32 -33 -35 -36 -37 -37 -37 -36 -36 -36 -37 -37 -37 -39 -40 -39 -38 -38 -39 -41 -45 -46 -47 -48 -49 -49 -47 -46 -46 -46
-8101 -46 -46 -43 -40 -39 -39 -42 -44 -43 -44 -46 -47 -47 -49 -50 -51 -49 -48 -48 -49 -50 -51 -52 -53 -53 -54 -56 -57 -57 -55 -54 -54 -54 -56 -57 -56 -55 -55 -56 -59 -61 -58 -56 -55 -56 -55 -54 -56 -59 -60 -61 -64 -67 -67 -66 -65 -62 -55 -50 -46 -46 -47 -46 -46 -49 -54 -57 -57 -58 -59
-8032 -59 -59 -62 -64 -64 -63 -63 -65 -66 -65 -65 -65 -66 -66 -68 -69 -69 -70 -73 -76 -76 -78 -80 -81 -81 -83 -85 -87 -87 -87 -82 -76 -72 -71 -73 -76 -79 -80 -82 -82 -83 -83 -80 -73 -63 -57 -55 -56 -58 -60 -60 -59 -63 -67 -68 -71 -73 -73 -71 -69 -71 -75 -76 -76 -78 -79 -80 -81 -82
-7964 -82 -85 -87 -87 -86 -87 -90 -92 -94 -97 -101 -104 -105 -106 -106 -107 -107 -103 -91 -73 -59 -57 -62 -70 -74 -76 -78 -80 -83 -83 -80 -72 -66 -63 -64 -65 -64 -66 -70 -72 -74 -75 -77 -79 -82 -84 -86 -87 -89 -92 -93 -92 -92 -92 -94 -97 -97 -96 -97 -98 -99 -100 -102 -105 -107 -108 -112
-7898 -112 -115 -121 -126 -127 -127 -122 -108 -85 -61 -50 -50 -54 -60 -65 -70 -73 -75 -77 -76 -75 -74 -74 -75 -78 -80 -82 -83 -85 -87 -88 -89 -88 -89 -91 -92 -93 -94 -94 -94 -95 -96 -96 -95 -96 -99 -103 -105 -106 -107 -107 -108 -111 -112 -114 -116 -119 -121 -123 -124 -125 -122 -112 -98
-7835 -98 -82 -73 -70 -70 -73 -79 -83 -85 -86 -87 -89 -90 -90 -91 -93 -94 -98 -101 -102 -101 -98 -98 -100 -101 -104 -104 -104 -105 -106 -107 -108 -110 -111 -111 -110 -110 -110 -111 -112 -114 -115 -117 -119 -118 -117 -118 -120 -121 -122 -123 -124 -126 -127 -126 -121 -112 -105 -104 -104 -103 -103 -103 -105 -108 -109 -109 -111 -114
-7767 -114 -114 -113 -114 -115 -117 -117 -116 -116 -117 -118 -118 -121 -122 -122 -124 -123 -122 -121 -121 -121 -122 -123 -123 -126 -126 -124 -124 -125 -126 -127 -126 -128 -130 -132 -134 -134 -134 -134 -133 -132 -132 -131 -129 -128 -130 -132 -133 -134 -134 -134 -134 -135 -136 -135 -134 -136 -138 -139 -139 -138 -138 -139 -142 -142 -140 -139 -138 -140
-7699 -140 -141 -141 -141 -141 -142 -143 -144 -143 -143 -143 -145 -146 -147 -149 -148 -145 -145 -147 -148 -146 -145 -145 -145 -146 -147 -149 -151 -151 -150 -149 -151 -152 -153 -152 -151 -152 -155 -155 -154 -153 -153 -153 -153 -153 -154 -155 -156 -156 -157 -158 -158 -160 -158 -157 -157 -156 -157 -160 -160 -159 -160 -160 -158 -158 -160 -162 -165 -164
-7631a64JkjJ%%%K%j%jj%j%JJ%kkljKJ%%J%K%j%jjJkkj%%kjjkjK%J%ljJJK%kk%%kjJMK%jj
-7563a80jjJLklkk%%j%jkj%J%j%JJkjj%J%%JjjkkJ%jjjj%KKJ%km%j%JKjjJ%J%ljKK%j%jkk
-7495b06%KjkJ%jJjjj%kJ%JJklj%J%j%%j%%jjjKJjjj%jk%%jkkMK%jkl%%jJ%JJj%kjjj%%%J
-7427b29jKj%%%JJkkkJ%Jjk%JjjKJjk%kk%%%%jlkKJ%jkKLKjjkml%%%jJJj%%j%%%%%k%LJkj
-7359b51kJ%%kj%jjJLKjjkjjkj%%JJjJ%kljjkljJJJ%%KK%kljJ%%%j%JJ%%J%kklj%%%%%j%%
-7291b76%k%%jl%Lkl%KJkj%jjj%J%%%klkjJ%%J%jjkJJ%jJ%J%jjkj%KK%kmkjK%%%ljKJ%kjJ
-7223c04%%%kj%jkk%%kJJ%k%%%llkjKKJJ%jkjJ%j%Jj%jkjkjKJjjjj%jjjjjk%%%kklj%J%%%
-7155c43kjKkn%jkk%jjj%jlkknmkloonm%LOPMOJ3K2K4J4LKNNMjmmmmnnmlkjjk%jjkklkk%j
$$ plain form
-7631 -164 -163 -165 -166 -165 -165 -165 -165 -163 -163 -164 -164 -165 -166 -166 -167 -167 -166 -165 -165 -167 -169 -172 -173 -171 -170 -170 -170 -169 -169 -167 -167 -168 -168 -169 -170 -169 -171 -173 -174 -174 -174 -176 -177 -178 -180 -181 -179 -179 -178 -178 -181 -182 -181 -180 -178 -178 -180 -182 -182 -182 -184 -185 -184 -180 -178 -178 -179 -180
-7563 -180 -181 -182 -181 -178 -180 -183 -185 -187 -187 -187 -188 -188 -189 -191 -192 -192 -191 -191 -192 -192 -191 -190 -192 -193 -194 -194 -193 -193 -193 -192 -193 -194 -196 -198 -197 -197 -198 -199 -200 -201 -201 -199 -197 -196 -196 -198 -202 -202 -203 -203 -202 -200 -201 -202 -201 -201 -200 -200 -203 -204 -202 -200 -200 -201 -201 -202 -204 -206
-7495 -206 -206 -204 -205 -207 -206 -206 -207 -206 -207 -208 -209 -209 -211 -210 -210 -209 -208 -210 -213 -214 -214 -213 -213 -214 -214 -214 -215 -215 -215 -216 -217 -218 -216 -215 -216 -217 -218 -218 -219 -221 -221 -221 -222 -224 -226 -222 -220 -220 -221 -223 -226 -226 -226 -227 -226 -226 -225 -224 -225 -225 -227 -228 -229 -230 -230 -230 -230 -229
-7427 -229 -230 -228 -229 -229 -229 -229 -228 -227 -229 -231 -233 -232 -232 -231 -232 -234 -234 -233 -234 -235 -233 -232 -233 -235 -235 -237 -239 -239 -239 -239 -239 -240 -243 -245 -243 -242 -242 -243 -245 -243 -240 -238 -239 -240 -242 -246 -249 -249 -249 -249 -250 -249 -248 -249 -249 -249 -250 -250 -250 -250 -250 -250 -252 -252 -249 -248 -250 -251
-7359 -251 -253 -252 -252 -252 -254 -255 -255 -256 -257 -256 -253 -251 -252 -253 -255 -256 -257 -259 -260 -260 -260 -259 -258 -259 -258 -258 -260 -263 -264 -265 -267 -270 -271 -270 -269 -268 -268 -268 -266 -264 -264 -266 -269 -270 -269 -269 -269 -269 -270 -270 -269 -268 -268 -268 -267 -267 -269 -271 -274 -275 -275 -275 -275 -275 -275 -276 -276 -276
-7291 -276 -276 -278 -278 -278 -279 -282 -282 -279 -281 -284 -284 -282 -281 -283 -284 -284 -285 -286 -287 -287 -286 -286 -286 -286 -288 -291 -293 -294 -293 -293 -293 -292 -292 -293 -294 -296 -295 -294 -294 -295 -294 -294 -293 -293 -294 -295 -297 -298 -298 -296 -294 -294 -296 -300 -302 -303 -301 -301 -301 -301 -304 -305 -303 -302 -302 -304 -305 -304
-7223 -304 -304 -304 -304 -306 -307 -307 -308 -310 -312 -312 -312 -314 -313 -312 -312 -314 -314 -314 -314 -317 -320 -322 -323 -321 -319 -318 -317 -317 -318 -320 -321 -320 -320 -321 -321 -320 -321 -321 -322 -324 -325 -327 -328 -326 -325 -326 -327 -328 -329 -329 -330 -331 -332 -333 -334 -336 -336 -336 -336 -338 -340 -343 -344 -344 -343 -343 -343 -343
-7155 -343 -345 -346 -344 -346 -351 -351 -352 -354 -356 -356 -357 -358 -359 -359 -360 -363 -365 -367 -372 -376 -378 -381 -387 -393 -398 -402 -402 -399 -393 -386 -382 -376 -363 -341 -317 -303 -300 -298 -293 -288 -284 -285 -289 -293 -297 -301 -306 -311 -315 -318 -320 -321 -322 -324 -324 -325 -326 -328 -330 -333 -335 -337 -337 -338
-7091c38Jjlll%%JJ%k%Jkjjk%Jjkkmj%JjjjKJkkjjJK%kkkkK%J%jjkkkk%%%j%Kjk%JKjkjJ%
-7023c80%lkjJJjj%k%%%j%J%kJ%jjjkjjkj%%%j%%jJJjk%kj%%%jl%jjJJ%kjJjkj%JjjJKjjj
-6955d16klll%%J%%%%kkjk%JKJkj%J%jjj%%l%%kj%j%Jjk%J%kkj%JJjjjjjkjjj%j%%%kjj%J
-6887d59J%kkjJJj%jjjLjkkkjl%JJKjkk%J%jJjmkkj%%%Jjj%JKj%j%kkj%%kjjjlj%J%%jjjm
-6819e03kj%%jk%%jj%%%JJ%%jkkkjk%%%%%jk%%Jjkkk%kJKLJj%K%lk%jjj%%Jlk%Jjjlkklj%
-6751e46jjJJ%jkkj%%jjjkjJKkljjk%%%%%kJJjk%%K%%mlkj%Jjkjj%lkJJljJ%%kjjjkkjJkk
-6683e98%jkkmkj%%jj%%j%J%jjjkKKj%%jmkKjjj%j%kkjkl%%%k%jj%jjkkjjjjJjJ%k%kkljj
-6615f57kjjKJ%kkjkjJjll%%JjjJ%jj%jkl%jkkkk%J%jk%kl%%%J%kkjkk%%j%kklkjJ%j%%jl
$$ plain form
-7091 -338 -337 -338 -341 -344 -347 -347 -347 -346 -345 -345 -347 -347 -346 -348 -349 -350 -352 -352 -351 -352 -354 -356 -360 -361 -361 -360 -361 -362 -363 -361 -360 -362 -364 -365 -366 -365 -363 -363 -365 -367 -369 -371 -369 -369 -368 -368 -369 -370 -372 -374 -376 -378 -378 -378 -378 -379 -379 -377 -378 -380 -380 -379 -377 -378 -380 -381 -380 -380
-7023 -380 -380 -383 -385 -386 -385 -384 -385 -386 -386 -388 -388 -388 -388 -389 -389 -388 -388 -390 -389 -389 -390 -391 -392 -394 -395 -396 -398 -399 -399 -399 -399 -400 -400 -400 -401 -400 -399 -400 -402 -402 -404 -405 -405 -405 -405 -406 -409 -409 -410 -411 -410 -409 -409 -411 -412 -411 -412 -414 -415 -415 -414 -415 -416 -415 -413 -414 -415 -416
-6955 -416 -418 -421 -424 -427 -427 -427 -426 -426 -426 -426 -426 -428 -430 -431 -433 -433 -432 -430 -429 -431 -432 -432 -431 -431 -432 -433 -434 -434 -434 -437 -437 -437 -439 -440 -440 -441 -441 -440 -441 -443 -443 -442 -442 -444 -446 -447 -447 -446 -445 -446 -447 -448 -449 -450 -452 -453 -454 -455 -455 -456 -456 -456 -456 -458 -459 -460 -460 -459
-6887 -459 -458 -458 -460 -462 -463 -462 -461 -462 -462 -463 -464 -465 -462 -463 -465 -467 -469 -470 -473 -473 -472 -471 -469 -470 -472 -474 -474 -473 -473 -474 -473 -474 -478 -480 -482 -483 -483 -483 -483 -482 -483 -484 -484 -483 -481 -482 -482 -483 -483 -485 -487 -488 -488 -488 -490 -491 -492 -493 -496 -497 -497 -496 -496 -496 -497 -498 -499 -503
-6819 -503 -505 -506 -506 -506 -507 -509 -509 -509 -510 -511 -511 -511 -511 -510 -509 -509 -509 -510 -512 -514 -516 -517 -519 -519 -519 -519 -519 -519 -520 -522 -522 -522 -521 -522 -524 -526 -528 -528 -530 -529 -527 -524 -523 -524 -524 -522 -522 -525 -527 -527 -528 -529 -530 -530 -530 -529 -532 -534 -534 -533 -534 -535 -538 -540 -542 -545 -546 -546
-6751 -546 -547 -548 -547 -546 -546 -547 -549 -551 -552 -552 -552 -553 -554 -555 -557 -558 -557 -555 -557 -560 -561 -562 -564 -564 -564 -564 -564 -564 -566 -565 -564 -565 -567 -567 -567 -565 -565 -565 -569 -572 -574 -575 -575 -574 -575 -577 -578 -579 -579 -582 -584 -583 -582 -585 -586 -585 -585 -585 -587 -588 -589 -590 -592 -594 -595 -594 -596 -598
-6683 -598 -598 -599 -601 -603 -607 -609 -610 -610 -610 -611 -612 -612 -612 -613 -613 -612 -612 -613 -614 -615 -617 -615 -613 -614 -614 -614 -615 -619 -621 -619 -620 -621 -622 -622 -623 -623 -625 -627 -628 -630 -633 -633 -633 -633 -635 -635 -636 -637 -637 -638 -639 -641 -643 -644 -645 -646 -647 -646 -647 -646 -646 -648 -648 -650 -652 -655 -656 -657
-6615 -657 -659 -660 -661 -659 -658 -658 -660 -662 -663 -665 -666 -665 -666 -669 -672 -672 -672 -671 -672 -673 -672 -672 -673 -674 -674 -675 -677 -680 -680 -681 -683 -685 -687 -689 -689 -688 -688 -689 -691 -691 -693 -696 -696 -696 -696 -695 -695 -697 -699 -700 -702 -704 -704 -704 -705 -705 -707 -709 -712 -714 -715 -714 -714 -715 -715 -715 -716 -719
-6547g19kjlkjklkjjjJ%%J%jmj%kjj%%ljkJjklkjJklkk%K%%j%%kjjlllkkJJklljj%Jjlkjk
-6479h00k%j%%%kljjJkjkkkmljjj%%K%jkl%kkklkjJkkkkk%%jllkjjkjkjkkkk%L%lljjjjJj
-6411h85klkkjjJjkllmkjj%klj%jlkkjjjklllljj%jl%kklj%kljk%Jk%lklkkkkkmk%%Jkmlj
-6343i99jklkjkjlllmkkjkjjJjml%klklkkllllkkkkklkkkjjmjkllkkklllklkkjlkkjlkkjk
-6275a143kkkmmkjnlllljklmooml%%jmmmlmmmlkmommmolnnmmoolmppomopj0j1j2j3j3j3j5
-6215a431j2pkQK2L5N0N7N8M8L3J8Kqj3j4j5j6j6j2j0qqj1rqpononopqqplmkkkknonqpnon
-6165a396pplnnnpnonnnooqnpqppqnppprqpqj0rj1j2j3j6j7j8k1k5k4k2j8nJ2L2N9Q4R5R6
-6116a424Q5O1L2J0qk1k5k5k4k0j8j7j3j4j4j3j5j3rrpqrporj0rnnmmklqrpoqj0qpnppnoo
$$ plain form
-6547 -719 -721 -722 -725 -727 -728 -730 -733 -735 -736 -737 -738 -737 -737 -737 -736 -736 -737 -741 -742 -742 -744 -745 -746 -746 -746 -749 -750 -752 -751 -752 -754 -757 -759 -760 -759 -761 -764 -766 -768 -768 -766 -766 -766 -767 -767 -767 -769 -770 -771 -774 -777 -780 -782 -784 -783 -782 -784 -787 -790 -791 -792 -792 -791 -792 -795 -797 -798 -800
-6479 -800 -802 -802 -803 -803 -803 -803 -805 -808 -809 -810 -809 -811 -812 -814 -816 -818 -822 -825 -826 -827 -828 -828 -828 -826 -826 -827 -829 -832 -832 -834 -836 -838 -841 -843 -844 -843 -845 -847 -849 -851 -853 -853 -853 -854 -857 -860 -862 -863 -864 -866 -867 -869 -870 -872 -874 -876 -878 -878 -875 -875 -878 -881 -882 -883 -884 -885 -884 -885
-6411 -885 -887 -890 -892 -894 -895 -896 -895 -896 -898 -901 -904 -908 -910 -911 -912 -912 -914 -917 -918 -918 -919 -922 -924 -926 -927 -928 -929 -931 -934 -937 -940 -943 -944 -945 -945 -946 -949 -949 -951 -953 -956 -957 -957 -959 -962 -963 -965 -965 -964 -966 -966 -969 -971 -974 -976 -978 -980 -982 -984 -988 -990 -990 -990 -989 -991 -995 -998 -999
-6343 -999 -1000 -1002 -1005 -1007 -1008 -1010 -1011 -1014 -1017 -1020 -1024 -1026 -1028 -1029 -1031 -1032 -1033 -1032 -1033 -1037 -1040 -1040 -1042 -1045 -1047 -1050 -1052 -1054 -1057 -1060 -1063 -1066 -1068 -1070 -1072 -1074 -1076 -1079 -1081 -1083 -1085 -1086 -1087 -1091 -1092 -1094 -1097 -1100 -1102 -1104 -1106 -1109 -1112 -1115 -1117 -1120 -1122 -1124 -1125 -1128 -1130 -1132 -1133 -1136 -1138 -1140 -1141 -1143
-6275 -1143 -1145 -1147 -1149 -1153 -1157 -1159 -1160 -1165 -1168 -1171 -1174 -1177 -1178 -1180 -1183 -1187 -1193 -1199 -1203 -1206 -1206 -1206 -1207 -1211 -1215 -1219 -1222 -1226 -1230 -1234 -1237 -1239 -1243 -1249 -1253 -1257 -1261 -1267 -1270 -1275 -1280 -1284 -1288 -1294 -1300 -1303 -1307 -1314 -1321 -1327 -1331 -1337 -1344 -1354 -1365 -1377 -1390 -1403 -1416 -1431
-6215 -1431 -1443 -1450 -1452 -1444 -1422 -1387 -1337 -1280 -1222 -1174 -1141 -1123 -1121 -1129 -1142 -1156 -1171 -1187 -1203 -1215 -1225 -1233 -1241 -1252 -1261 -1269 -1276 -1282 -1287 -1293 -1298 -1304 -1311 -1319 -1327 -1334 -1337 -1341 -1343 -1345 -1347 -1349 -1354 -1360 -1365 -1373 -1380 -1385 -1391 -1396
-6165 -1396 -1403 -1410 -1413 -1418 -1423 -1428 -1435 -1440 -1446 -1451 -1456 -1461 -1467 -1473 -1481 -1486 -1493 -1501 -1508 -1515 -1523 -1528 -1535 -1542 -1549 -1558 -1566 -1573 -1581 -1591 -1600 -1611 -1623 -1636 -1652 -1669 -1687 -1708 -1733 -1757 -1779 -1797 -1802 -1790 -1758 -1699 -1615 -1520 -1424
-6116 -1424 -1339 -1278 -1246 -1236 -1244 -1265 -1290 -1315 -1339 -1359 -1377 -1394 -1407 -1421 -1435 -1448 -1463 -1476 -1485 -1494 -1501 -1509 -1518 -1525 -1531 -1540 -1550 -1559 -1564 -1569 -1573 -1577 -1579 -1582 -1590 -1599 -1606 -1612 -1620 -1630 -1638 -1645 -1650 -1657 -1664 -1669 -1675 -1681
-6068a681nnnljnonqqpppmnpppqqponpppponpnmklnopolnoj0j2j1ql%KKKKkmqj1j2rlkloj1
-6006b022j0rppqrrj1qoorj0ploprrj0oqqppnnpoprropqj0qqoqj0j2rprj4j1j0rj1qrj0j0
-5952b466j0j1j1j0qj0j0qprj1j1rj2j1j5j6j7j4j1mMMJJknj1j4j6j2qmqrj5j9j9j7j2j1j0
-5910b873j2j6j5j5j3j1j2j5j3j3j1j1j2j5j4j5j5j7j7j5j2j4j5j7j6j7j5j5j6j6j7j7j8j8
-5876c373j8j9j6j9k0k0j8j8j9j9k0j8j5j5k0k7k7j8mmqj1j5k6k8k7k6k3k3k6k2k5k4k5k3
-5841d059k4k4k5k4k7k7k8k8k9k7k7k8l1l0l1l0l2l3l3l1l3l3l5l7l7l4l0k4k1k2k9l0l1l2
-5807e056l6l5l7l7m0l9l9m1m2m3m7m5m8m8m9m6m8m9n3n3n5n3n5n4n7n8o2o3o5o4o7o8p1o7
-5773f790o2o6q2q2o9n5n4n9o8q0r4j02j05j02r9j01j10j09j13j16j19j20j25j28j33j38j45
$$ plain form
-6068 -1681 -1686 -1691 -1696 -1699 -1700 -1705 -1711 -1716 -1724 -1732 -1739 -1746 -1753 -1757 -1762 -1769 -1776 -1783 -1791 -1799 -1806 -1812 -1817 -1824 -1831 -1838 -1845 -1851 -1856 -1863 -1868 -1872 -1874 -1877 -1882 -1888 -1895 -1901 -1904 -1909 -1915 -1925 -1937 -1948 -1956 -1959 -1959 -1957 -1955 -1953 -1951 -1953 -1957 -1965 -1976 -1988 -1997 -2000 -2002 -2005 -2011 -2022
-6006 -2022 -2032 -2041 -2048 -2055 -2063 -2072 -2081 -2092 -2100 -2106 -2112 -2121 -2131 -2138 -2141 -2147 -2154 -2163 -2172 -2182 -2188 -2196 -2204 -2211 -2218 -2223 -2228 -2235 -2241 -2248 -2257 -2266 -2272 -2279 -2287 -2297 -2305 -2313 -2319 -2327 -2337 -2349 -2358 -2365 -2374 -2388 -2399 -2409 -2418 -2429 -2437 -2446 -2456 -2466
-5952 -2466 -2476 -2487 -2498 -2508 -2516 -2526 -2536 -2544 -2551 -2560 -2571 -2582 -2591 -2603 -2614 -2629 -2645 -2662 -2676 -2687 -2691 -2687 -2683 -2682 -2681 -2683 -2688 -2699 -2713 -2729 -2741 -2749 -2753 -2761 -2770 -2785 -2804 -2823 -2840 -2852 -2863 -2873
-5910 -2873 -2885 -2901 -2916 -2931 -2944 -2955 -2967 -2982 -2995 -3008 -3019 -3030 -3042 -3057 -3071 -3086 -3101 -3118 -3135 -3150 -3162 -3176 -3191 -3208 -3224 -3241 -3256 -3271 -3287 -3303 -3320 -3337 -3355 -3373
-5876 -3373 -3391 -3410 -3426 -3445 -3465 -3485 -3503 -3521 -3540 -3559 -3579 -3597 -3612 -3627 -3647 -3674 -3701 -3719 -3723 -3727 -3735 -3746 -3761 -3787 -3815 -3842 -3868 -3891 -3914 -3940 -3962 -3987 -4011 -4036 -4059
-5841 -4059 -4083 -4107 -4132 -4156 -4183 -4210 -4238 -4266 -4295 -4322 -4349 -4377 -4408 -4438 -4469 -4499 -4531 -4564 -4597 -4628 -4661 -4694 -4729 -4766 -4803 -4837 -4867 -4891 -4912 -4934 -4963 -4993 -5024 -5056
-5807 -5056 -5092 -5127 -5164 -5201 -5241 -5280 -5319 -5360 -5402 -5445 -5492 -5537 -5585 -5633 -5682 -5728 -5776 -5825 -5878 -5931 -5986 -6039 -6094 -6148 -6205 -6263 -6325 -6388 -6453 -6517 -6584 -6652 -6723 -6790
-5773 -6790 -6852 -6918 -7000 -7082 -7151 -7206 -7260 -7319 -7387 -7467 -7561 -7663 -7768 -7870 -7969 -8070 -8180 -8289 -8402 -8518 -8637 -8757 -8882 -9010 -9143 -9281 -9426
-5746i426j48j54j61j66j73j83j92k02k10k23k31k35k43k58k69k87l01l23l47l70l89m13m38
-5723a5342m71n05n47n91o33o67o87o67o13n89o92r25j210j467j716j975k285k635l042l458
-5703d0717l794l696k433J533R942K2407K9717K2033Q234m62l700m319m081l619l149k719
-5687B1177k358k048j790j563j367j170r57p21n41n19o13o81o93o71o38o05n73n38n10m86
-5667B135m63m40m26m14m01l94l90l84l78l72l67l65l67l71l75l78l84l90m01m04m07m03m08
-5644f947m28m53m78n01n25n51n78o07o36o68p13p62q18q81r51j016j073j102j079r86r09
-5623b2662j024j382j842k271k662l069l538m094m730n416o017o091m589P04J2661L1883M6913
-5606B2774L9028J7017J181n248o672o379n649m974m330l773l265k844k469k156j838j504
$$ plain form
-5746 -9426 -9574 -9728 -9889 -10055 -10228 -10411 -10603 -10805 -11015 -11238 -11469 -11704 -11947 -12205 -12474 -12761 -13062 -13385 -13732 -14102 -14491 -14904 -15342
-5723 -15342 -15813 -16318 -16865 -17456 -18089 -18756 -19443 -20110 -20723 -21312 -22004 -22929 -24139 -25606 -27322 -29297 -31582 -34217 -37259 -40717
-5703 -40717 -44511 -48207 -50640 -49107 -39165 -16758 12959 34992 43226 42764 39064 34745 30664 27045 23896 21177
-5687 21177 18819 16771 14981 13418 12051 10881 9924 9203 8662 8143 7530 6849 6156 5485 4847 4242 3669 3131 2621 2135
-5667 2135 1672 1232 806 392 -9 -403 -793 -1177 -1555 -1927 -2294 -2659 -3026 -3397 -3772 -4150 -4534 -4924 -5325 -5729 -6136 -6539 -6947
-5644 -6947 -7375 -7828 -8306 -8807 -9332 -9883 -10461 -11068 -11704 -12372 -13085 -13847 -14665 -15546 -16497 -17513 -18586 -19688 -20767 -21753 -22662
-5623 -22662 -23686 -25068 -26910 -29181 -31843 -34912 -38450 -42544 -47274 -52690 -58707 -64798 -69387 -68683 -56022 -24139 22774
-5606 22774 61802 78819 80000 74752 68080 61701 56052 51078 46748 42975 39710 36866 34397 32241 30403 28899
-5590B8899j110p70o69q09r35r72r36q87q24p75p16o66o06n49m74m00l28k84k81l15l36l48
-5568A4909l33l24l13l08k93k82k64k53k39k34k25k18k01j91j83j85j79j78j70j66j58j52
-5546I860j44j42j33j28j15j07r9j05j07j10j07j06j03j05j01r8q9q7q4q5q3q5p9q2p9q1p7
-5519G139p7p4p3o6o2o0o9p0p0o4o2n9n9n2n4n9o6o5o5o3o5o3o1m8l2k3l9o1q0q4q5o6rJ15
-5485E249K29J57Lo9q4p8p3o2o1n7n6n5n6n2n4n4n4n0n0l9j9K7P7P0Ql2m9m9m7m4m4m0m1m2
-5451D409l9k4k0j7k1j7j5j9k4k4k7k6k2k4k8k7l0k7k6k4k6k5k6k4k3k2k2k2k6k4k5k2k6k3
-5417C592k5k6k6k7k8k5k8k5k4k4k8l3l4l4l9m2m7n1o1o9p5p1l8O4K72M44L11O8n2p8p7p0
-5385C594o0n3m9m4l8l4l2l2l2k8k7k5k6k5k5j6njj1k2k8k9l0l2l5l8k9nM4O9L5J0J1K0K4
$$ plain form
-5590 28899 27789 27019 26350 25541 24606 23634 22698 21811 20987 20212 19496 18830 18224 17675 17201 16801 16473 16189 15908 15593 15257 14909
-5568 14909 14576 14252 13939 13631 13338 13056 12792 12539 12300 12066 11841 11623 11422 11231 11048 10863 10684 10506 10336 10170 10012 9860
-5546 9860 9716 9574 9441 9313 9198 9091 8992 8887 8780 8670 8563 8457 8354 8249 8148 8050 7961 7874 7790 7705 7622 7537 7458 7376 7297 7216 7139
-5519 7139 7062 6988 6915 6849 6787 6727 6658 6588 6518 6454 6392 6333 6274 6222 6168 6109 6043 5978 5913 5850 5785 5722 5661 5613 5581 5558 5519 5458 5378 5294 5209 5143 5134 5249
-5485 5249 5478 5635 5638 5569 5485 5407 5334 5272 5211 5154 5098 5043 4987 4935 4881 4827 4773 4723 4673 4634 4615 4642 4719 4789 4797 4765 4716 4667 4620 4576 4532 4492 4451 4409
-5451 4409 4370 4346 4326 4309 4288 4271 4256 4237 4213 4189 4162 4136 4114 4090 4062 4035 4005 3978 3952 3928 3902 3877 3851 3827 3804 3782 3760 3738 3712 3688 3663 3641 3615 3592
-5417 3592 3567 3541 3515 3488 3460 3435 3407 3382 3358 3334 3306 3273 3239 3205 3166 3124 3077 3026 2965 2896 2821 2750 2712 2776 3048 3492 3803 3871 3819 3741 3664 3594
-5385 3594 3534 3481 3432 3388 3350 3316 3284 3252 3220 3192 3165 3140 3114 3089 3064 3048 3043 3042 3031 3009 2981 2952 2922 2890 2855 2817 2788 2783 2827 2896 2931 2941 2952 2972 2996
-5350B996K3J4Kqj7k3k4k5k2k2k1k0j7j3ronmorj2j3j4j5j3j5j4j5j4j6j4j5j3j1j0rnkKJ
-5310B567%norrj1j2j2j3j1prj1rpj1j1j2j1poooj1j2j3j1j0plkmnrqj0j0rrronqj2j0qj0
-5263B165rj0qpqj0j2j1j0j2j1j2j3j4j7j5j1rkRK2L5M2M0L5K3J0lj0j4j4j7j5j6j5j4j2j1
-5225B039j0rlMLmj0j3j1j0qqrrroorpj0qoqrppqqpqnqrrrj2rj0j2j5j5j6j7j6j2oLJ5L0M4
-5175A731N6N8N0L6K0Pmj1j5j8j6j6j6j3j2j0qqj0j0pnoqqj0j2poqpppnnnmmnmkmmpopoqr
-5126A608qpoppopopplLNMlqrj0j0rrpqrj0j1j1j2j4j5j6k0k5k1k0j8j0NK6N0P7R5R8R0O9
-5081A774L9J5kj7k3k4j9k0j9j9j5j2j0rpqj1j0ppqrppppnpqnkllolmnommnnmmmmkkjllmn
-5028A433onnklnmmkllmlJ%llkmlomllnlmnmmlknnonlkmnnpnoppj0j2j2j5j5j3LL6Q4Q9L6
$$ plain form
-5350 2996 3019 3033 3035 3027 3010 2987 2963 2938 2916 2894 2873 2853 2836 2823 2814 2808 2803 2799 2793 2784 2772 2759 2745 2730 2717 2702 2688 2673 2659 2643 2629 2614 2601 2590 2580 2571 2566 2564 2566 2567
-5310 2567 2567 2562 2556 2547 2538 2527 2515 2503 2490 2479 2472 2463 2452 2443 2436 2425 2414 2402 2391 2384 2378 2372 2366 2355 2343 2330 2319 2309 2302 2299 2297 2293 2288 2279 2271 2261 2251 2242 2233 2224 2218 2213 2205 2193 2183 2175 2165
-5263 2165 2156 2146 2138 2131 2123 2113 2101 2090 2080 2068 2057 2045 2032 2018 2001 1986 1975 1966 1964 1973 1995 2030 2072 2112 2147 2170 2180 2177 2167 2153 2139 2122 2107 2091 2076 2062 2050 2039
-5225 2039 2029 2020 2017 2021 2024 2020 2010 1997 1986 1976 1968 1960 1951 1942 1933 1927 1921 1912 1905 1895 1887 1881 1873 1864 1857 1850 1842 1834 1827 1819 1814 1806 1797 1788 1779 1767 1758 1748 1736 1721 1706 1690 1673 1657 1645 1639 1642 1657 1687 1731
-5175 1731 1787 1845 1895 1931 1951 1958 1954 1943 1928 1910 1894 1878 1862 1849 1837 1827 1819 1811 1801 1791 1784 1779 1773 1765 1757 1747 1735 1728 1722 1714 1707 1700 1693 1688 1683 1678 1674 1670 1665 1661 1659 1655 1651 1644 1638 1631 1625 1617 1608
-5126 1608 1600 1593 1587 1580 1573 1567 1560 1554 1547 1540 1537 1540 1545 1549 1546 1538 1529 1519 1509 1500 1491 1484 1476 1467 1457 1446 1435 1423 1409 1394 1378 1358 1333 1312 1292 1274 1264 1269 1295 1345 1422 1517 1615 1705 1774
-5081 1774 1813 1828 1826 1809 1786 1762 1743 1723 1704 1685 1670 1658 1648 1639 1632 1624 1613 1603 1596 1589 1581 1572 1565 1558 1551 1544 1539 1532 1524 1519 1517 1514 1511 1505 1502 1498 1493 1487 1483 1479 1474 1469 1465 1461 1457 1453 1451 1449 1448 1445 1442 1438 1433
-5028 1433 1427 1422 1417 1415 1412 1407 1403 1399 1397 1394 1391 1387 1384 1385 1385 1382 1379 1377 1373 1370 1364 1360 1357 1354 1349 1346 1342 1337 1333 1329 1326 1324 1319 1314 1308 1303 1300 1298 1294 1289 1284 1277 1272 1266 1259 1252 1242 1230 1218 1203 1188 1175 1178 1214 1298 1387 1423
-4971A423lj5j3j3j2j1j0j0nmlooppnmkjmmlmomkmlmmkkklknlmjkjNP%nonljkjlmlj%J%jk
-4911A193jkkmlllmk%J%%%kllljlkmllj%klkklljkkJ%jJj%jllkklklljklljkmml%jkjj%%%
-4844A072kkmllljKjkkjmnkjkmjjjJjjJKkmkjjjknllmmlkkmomopoJJ0K5K6J4MmnonooolJk
-4781I97mljllkkllljj%kjjmmkkkj%lmnmjjlmommmmpolMJ5K6J9Omnppmlmjmnmppnoopnoqo
-4716H45%J3L4M7L4Rkppnoqpooooomllkklmjj%jnnllmmnmmmmk%J%%%JJ%mpprrmMK0M2M5K1
-4656I34%opnlqponnonlj%%llmjkkmlomj%klkkkl%jllljjlmljlkk%KJJj%KJJJjk%J%klkJK
-4588G92kjKjmkkmlmllkkKjk%J%kljJKJkmmllomlonkjjJOPRPK%lnpnkJJLMMJKjkjjJJ%mno
-4520G23ml%KJJ%Jjlmlkkomklnonmj%KJL%j%jjjjjjml%KLLLNONNJlnnnmlkmlJJJKjmlmmlk
$$ plain form
-4971 1423 1420 1405 1392 1379 1367 1356 1346 1336 1331 1327 1324 1318 1312 1305 1298 1293 1289 1287 1286 1282 1278 1275 1271 1265 1261 1259 1255 1252 1248 1244 1242 1240 1238 1235 1233 1228 1225 1221 1220 1218 1217 1222 1229 1229 1224 1218 1213 1210 1209 1207 1206 1203 1199 1196 1195 1195 1196 1196 1195 1193
-4911 1193 1192 1190 1188 1184 1181 1178 1175 1171 1169 1169 1170 1170 1170 1170 1168 1165 1162 1159 1158 1155 1153 1149 1146 1143 1142 1142 1140 1137 1135 1133 1130 1127 1126 1124 1122 1123 1123 1122 1123 1122 1122 1121 1118 1115 1113 1111 1108 1106 1103 1100 1099 1097 1094 1091 1090 1088 1084 1080 1077 1077 1076 1074 1073 1072 1072 1072 1072
-4844 1072 1070 1068 1064 1061 1058 1055 1054 1056 1055 1053 1051 1050 1046 1041 1039 1038 1036 1032 1031 1030 1029 1030 1029 1028 1029 1031 1029 1025 1023 1022 1021 1020 1018 1013 1010 1007 1003 999 996 994 992 988 982 978 972 965 959 960 970 995 1021 1035 1039 1035 1030 1024 1019 1013 1007 1001 998 999 997
-4781 997 993 990 989 986 983 981 979 976 973 970 969 968 968 966 965 964 960 956 954 952 950 949 949 946 942 937 933 932 931 928 924 918 914 910 906 902 895 889 886 890 905 931 950 956 952 947 940 933 929 926 922 921 917 912 908 901 894 889 883 877 870 865 859 851 845
-4716 845 845 858 892 939 973 982 980 973 966 961 955 947 940 934 928 922 916 910 906 903 900 898 896 893 889 888 887 887 886 881 876 873 870 866 862 857 853 849 845 841 839 839 840 840 840 840 841 842 842 838 831 824 815 806 802 806 826 868 913 934
-4656 934 934 928 921 916 913 905 898 892 887 882 876 871 868 867 867 867 864 861 857 856 854 852 848 845 839 835 834 834 832 829 827 825 823 820 820 819 816 813 810 809 808 805 801 798 797 794 792 790 790 792 793 794 793 793 795 796 797 798 797 795 795 796 796 794 791 789 790 792
-4588 792 790 789 791 790 786 784 782 778 775 771 768 765 763 761 763 762 760 760 761 761 759 756 755 756 758 759 757 753 749 746 743 737 733 730 724 719 717 716 715 716 722 729 738 745 747 747 744 739 732 727 725 726 727 730 734 738 739 741 740 738 737 736 737 738 738 734 729 723
-4520 723 719 716 716 718 719 720 720 721 720 717 713 710 708 706 700 696 694 691 686 680 675 671 670 670 672 673 676 676 675 675 674 673 672 671 670 669 665 662 662 664 667 670 673 678 684 689 694 695 692 687 682 677 673 670 668 664 661 662 663 664 666 665 661 658 654 650 647 645
-4452F45kllllk%jlmlmnmlllkjlllj%JLJkjmmomljlmoqporj0ppqrj0rqnoqqpqj1j9k6l4m0
-4391B80m6n3m9l2J8J27K79L46K29O7k2n0n1m7m3l8l2k9k3j8j4j2j0j0j1j1j0j1j0j0onln
-4357F85opooljjKK%%mppnmljLJ0J0QMJ%%%j%%KJMNMMMKK%JJKJjjjj%JJKOPRQLjmmmljkjL
-4291G12K%jmlj%KK%%JKjlmnnkllklmjjklllmmmmnmlkmmjk%jjjjnonppmnl%Jj%kloqj1qj0
-4225E29j6j9k1k6k9l5m2m8n3n1j2Q9K96M21K41K8n3o3n7m9m1l3k7k5k1j7j5j1pnkjorrol
-4188G92klllljlmljk%%jkjkmmml%OLKJKJ%%lmmklmkMLK%kl%%jkjkmklkjljjJjkkJ%LNLJJ
-4120G27JJKJk%%KKMLL%jJLMNMklll%kjkklkjjjj%J%JJjk%jkl%%j%%%jjlkkjJKJjlj%ljkJ
-4052G10JkkKjj%j%KKjlml%%%klk%%K%JJklmkJ%%jJjllj%%j%jmlkkmmkJjJPRNJkkjkkj%K%
$$ plain form
-4452 645 643 640 637 634 631 629 629 628 625 621 618 614 609 605 602 599 596 594 593 590 587 584 583 583 584 587 588 586 585 581 577 571 567 564 563 560 556 550 542 535 529 520 510 503 496 488 479 469 460 452 447 441 433 425 418 410 399 380 354 320 280
-4391 280 234 181 132 100 118 245 524 870 1099 1166 1144 1094 1043 996 953 915 883 854 831 813 799 787 777 767 756 745 735 724 714 704 698 693 690 685
-4357 685 679 672 666 660 657 656 655 657 659 659 659 655 648 641 636 632 629 628 631 641 651 659 663 664 664 664 664 663 663 663 665 666 670 675 679 683 687 689 691 691 692 693 695 696 695 694 693 692 692 693 694 696 702 709 718 726 729 728 724 720 716 713 712 710 709 712
-4291 712 714 714 713 709 706 705 705 707 709 709 709 710 712 711 708 704 699 694 692 689 686 684 681 677 676 675 673 670 667 664 660 656 652 648 643 639 636 634 630 626 625 623 623 622 621 620 619 614 608 603 596 589 585 580 577 577 578 577 577 575 572 566 558 547 539 529
-4225 529 513 494 473 447 418 383 341 293 240 189 177 266 562 983 1224 1252 1199 1136 1079 1030 989 956 929 904 883 866 851 840 833 828 826 825 819 810 801 795 792
-4188 792 790 787 784 781 778 777 774 770 767 766 764 764 764 763 761 760 758 754 750 746 743 743 749 752 754 755 757 758 758 758 755 751 747 745 742 738 736 740 743 745 745 743 740 740 740 739 737 736 734 730 728 725 723 722 719 718 717 718 717 715 713 714 714 717 722 725 726 727
-4120 727 728 729 731 732 730 730 730 732 734 738 741 744 744 743 744 747 751 756 760 758 755 752 749 749 747 746 744 742 739 737 736 735 734 733 733 734 734 735 736 735 733 733 732 730 727 727 727 726 726 726 726 725 724 721 719 717 716 717 719 720 719 716 715 715 712 711 709 710
-4052 710 711 709 707 709 708 707 707 706 706 708 710 709 706 702 699 699 699 699 697 694 692 692 692 694 694 695 696 694 691 687 685 686 686 686 685 686 685 682 679 678 678 678 677 677 676 672 669 667 665 661 657 655 656 655 656 663 672 677 678 676 674 673 671 669 668 668 670 670
-3984F70kj%J%llj%kklj%kk%JJlljjkmkKKkkkjJKJJJJjklkkJK%kjJ%klljJkjkj%J%kK%JJj
-3916F18kjj%%jk%%%klkjj%KJJJ%JjkkjJJkkj%jjJkjj%%J%ljjjjkjj%%JJjkj%Jk%j%%jJjk
-3848E77jjJ%jjJjj%%%%kkkjjj%Jkk%%jJJJJKjml%%%%jjkj%kk%%K%jk%J%JjkjljjjJjjK%k
-3780E39k%jkJjjj%j%KJ%%j%%jjjkkkkm%jlkk%KKMNQPKllmmj%jJjkj%%%%lmjjJjj%%klkj%
-3712E03%kjJJJ%L%jlj%%j%jl%%%mlJKLLJ%jjklkjj%%jklJJ%%jkllkkjKj%kjkkjJ%%jJJjl
-3644D61%%kklmjj%%j%jkjkjkllkkjljkjkmljlnlkmllmkkmppmloj1j2j3j3j7k0k4k0qK4R2
-3586C26J50J18L8j1k5k7k4k2k2j8j2j0p%J5L2K9J2mqrj1j0rqpoopqnoppnnnpnmoqqoj0j0
-3540C45j1j6k0k0k2k3j8ON7J27J43P3Mk1k7k4k1k0j7j6j4j2j1j2j2rpqj1j1qj1j3j5j9k3
$$ plain form
-3984 670 668 667 667 668 668 665 662 661 661 659 657 654 653 653 651 649 649 650 651 648 645 644 643 641 637 635 637 639 637 635 633 632 633 635 636 637 638 639 638 636 633 631 629 630 632 632 630 629 630 630 628 625 622 621 622 620 619 617 616 616 617 617 615 617 617 618 619 618
-3916 618 616 615 614 614 614 613 611 611 611 611 609 606 604 603 602 602 604 605 606 607 607 608 607 605 603 602 603 604 602 600 599 599 598 597 598 596 595 594 594 594 595 595 592 591 590 589 588 586 585 584 584 584 585 586 585 583 582 582 583 581 581 580 580 580 579 580 579 577
-3848 577 576 575 576 576 575 574 575 574 573 573 573 573 573 571 569 567 566 565 564 564 565 563 561 561 561 560 561 562 563 564 566 565 561 558 558 558 558 558 557 556 554 553 553 551 549 549 549 551 551 550 548 548 549 549 550 549 547 546 543 542 541 540 541 540 539 541 541 539
-3780 539 537 537 536 534 535 534 533 532 532 531 531 533 534 534 534 533 533 533 532 531 530 528 526 524 522 518 518 517 514 512 510 510 512 514 518 523 531 538 540 537 534 530 526 525 525 524 525 524 522 521 521 521 521 521 518 514 513 512 513 512 511 511 511 509 506 504 503 503
-3712 503 503 501 500 501 502 503 503 506 506 505 502 501 501 501 500 500 499 496 496 496 496 492 489 490 492 495 498 499 499 498 497 495 492 490 489 488 488 488 487 485 482 483 484 484 484 483 481 478 475 473 471 470 472 471 471 469 468 466 464 463 464 464 464 463 464 465 464 461
-3644 461 461 461 459 457 454 450 449 448 448 448 447 447 446 444 443 441 440 438 435 432 430 428 427 424 423 421 420 418 414 411 410 407 402 399 397 393 390 387 383 381 379 375 368 361 357 354 348 337 325 312 299 282 262 238 218 210 234 326
-3586 326 476 594 632 621 596 569 545 523 501 483 471 461 454 454 469 501 530 542 538 530 521 510 500 491 483 476 470 464 457 449 444 438 431 424 419 414 409 402 397 393 387 379 371 365 355 345
-3540 345 334 318 298 278 256 233 215 221 278 405 548 621 625 604 577 553 532 512 495 479 465 453 442 430 418 409 402 394 383 372 364 353 340 325 306 283
-3504B83k5k7l2l6m4m8m4k1N1J98L36K70Q9j9n1n3m6m0l3k8k6k1j5rrj1j2j0qoppnpj0rj0
-3467D98j0qpqopommqj1j0qj0j2j4j6j8k0k5k8l5l9m4m4l3RJ20K81L18J65J5m2n2m8m2l5k9
-3429G23k6k3k0j7j5j5j4j3j2rqrrj1j6j6j7k1k4k5k0nK9P4J07J02O3K0j0k1k3k1j8j6j5j3
-3393F36j0qqppollk%jmmj%kllklmmlmlklj%jnllklmmjJJKKKjllljJkljkljnjKNJkkkkjjj
-3326D86klkjj%MRNjmlmllkk%JllklklKOOLLjklkj%kmmj%kljj%JklmklljlmmlmnmJPO%mpq
-3258D02j2j1j2j5j8j8j6KM4J15J14L8rk3k1j6j5j1mJMKkkmmmkkkmllj%lljkjkmlk%%jjkk
-3208D61kjjj%JjkjJJllkkkj%%k%kjjjK%%jjkjJ%kjl%kkjjJ%jllkjjjkmmlnnnnkNQJ3J5J4
-3143D30J3J0MkmoomlllmklolKQPPL%jlmk%%%%%JJjlmkJjlkjj%KKjj%%%kkjjkljkj%%KOMJ
$$ plain form
-3504 283 258 231 199 163 119 71 27 6 57 255 591 861 950 931 880 827 781 741 708 680 654 633 618 609 600 589 577 567 559 553 546 539 534 527 517 508 498
-3467 498 488 480 473 465 459 452 446 442 438 430 419 409 401 391 379 365 349 331 311 286 258 223 184 140 96 63 72 192 473 791 956 971 929 877 829 787 752 723
-3429 723 697 674 654 637 622 607 593 580 568 559 551 542 533 522 506 490 473 452 428 403 383 378 407 481 588 690 753 773 763 742 719 698 680 664 649 636
-3393 636 626 618 610 603 596 590 587 584 582 582 581 577 573 572 572 570 567 564 562 559 555 551 548 544 541 539 536 535 535 534 529 526 523 521 518 514 510 509 510 511 513 515 517 516 513 510 507 506 507 505 502 501 499 496 495 490 489 491 496 497 495 493 491 489 488 487 486
-3326 486 484 481 479 478 477 477 481 490 495 494 490 487 483 480 477 475 473 473 474 471 468 466 463 461 458 460 466 472 475 478 477 475 472 470 469 469 467 463 459 458 458 456 453 452 451 451 452 450 447 443 441 438 435 434 431 427 423 420 416 411 407 408 415 421 421 417 410 402
-3258 402 390 379 367 352 334 316 300 302 346 461 575 613 604 581 560 544 529 518 514 515 519 521 519 517 513 509 505 503 501 499 495 492 489 488 488 485 482 481 479 478 476 472 469 467 467 467 466 465 463 461
-3208 461 459 458 457 456 456 457 456 454 453 454 455 452 449 447 445 443 442 442 442 440 440 438 437 436 435 437 437 437 436 435 433 432 433 433 431 430 427 427 425 423 422 421 422 422 421 418 415 413 412 411 410 408 404 400 397 392 387 382 377 375 380 388 401 416 430
-3143 430 443 453 457 455 451 445 439 435 432 429 426 422 420 417 411 408 410 418 425 432 435 435 434 431 427 425 425 425 425 425 425 426 427 426 423 419 417 418 417 414 412 411 410 410 412 414 413 412 412 412 412 410 408 407 406 404 401 400 398 397 397 397 399 405 409 410
-3077D10JmljjJ%ljj%%j%J%%jlkJ%kjJ%j%%%kjkJJKjljK%k%jkJ%%%j%%%jkkjJKj%%jJjk%%
-3009C74lJK%lkjJ%kjJJJJJJjjljkj%Jj%%KK%Jkkll%JJ%jJ%JKJJj%KKjKNLJjkkj%%j%%J%k
-2941C70j%%k%%J%%%%%%KKLK%%jJKJ%jJNNOOOOONJk%JLK%%%kkkklj%kljk%kjK%jj%jjj%JJ
-2873D06JJKJJJJ%%%JJJ%JLK%KLKJJJ%%LJkj%kkjjjk%kjjj%%KJkkjJkk%jk%jj%jjJ%%K%%%
-2805D11j%j%Jjlk%kkJ%%J%j%lj%%%llkjK%lnlJ%KKJj%j%K%jjjk%JJ%jkkkjjjjkjjlkLLPQ
-2737C83OONKjjklmlJJjmmlklkkkk%KJJJ%%KJj%jljjkjkj%jjkjllllmookJLRK3K7J5Mlnlm
-2672C92mlmmljkkkklkkkllljjjjj%kjkkklmljlnqj1oKK5M9M7J8mj1j2rnllJLNKJjlmlmmm
-2611C72onkkkJLQJ2RLllmlmonmmnmkjllloj0j0rMK7N3M8J6nrj2rmmopnlkljJLJKKlnonkm
$$ plain form
-3077 410 411 407 404 403 402 403 403 400 399 398 398 398 397 397 398 398 398 397 394 392 393 393 391 390 391 391 390 390 390 390 388 387 385 386 387 389 388 385 384 386 386 384 384 383 381 382 382 382 382 381 381 381 381 380 378 376 375 376 378 377 377 377 376 377 376 374 374 374
-3009 374 371 372 374 374 371 369 368 369 369 367 366 367 368 369 370 371 372 371 370 367 366 364 363 363 364 363 363 363 365 367 367 368 366 364 361 358 358 359 360 360 359 360 360 361 363 364 365 364 364 366 368 367 369 374 377 378 377 375 373 372 372 372 371 371 371 372 372 370
-2941 370 369 369 369 367 367 367 368 368 368 368 368 368 368 370 372 375 377 377 377 376 377 379 380 380 379 380 385 390 396 402 408 414 420 425 426 424 424 425 428 430 430 430 430 428 426 424 422 419 418 418 416 413 412 410 410 408 407 409 409 408 407 407 406 405 404 404 405 406
-2873 406 407 408 410 411 412 413 414 414 414 414 415 416 417 417 418 421 423 423 425 428 430 431 432 433 433 433 436 437 435 434 434 432 430 429 428 427 425 425 423 422 421 420 420 420 422 423 421 419 418 419 417 415 415 414 412 412 411 410 410 409 408 409 409 409 411 411 411 411
-2805 411 410 410 409 409 410 409 406 404 404 402 400 401 401 401 402 402 401 401 398 397 397 397 397 394 391 389 388 390 390 387 382 379 380 380 382 384 385 384 384 383 383 385 385 384 383 382 380 380 381 382 382 381 379 377 375 374 373 372 371 369 368 367 364 362 365 368 375 383
-2737 383 389 395 400 402 401 400 398 395 391 388 389 390 389 385 381 378 376 373 371 369 367 365 365 367 368 369 370 370 370 372 373 372 372 371 368 367 366 364 363 361 360 360 359 358 356 355 352 349 346 343 339 333 327 325 326 329 338 361 388 403 407 404 399 396 392
-2672 392 388 385 381 377 374 373 371 369 367 365 362 360 358 356 353 350 347 346 345 344 343 342 342 340 339 337 335 333 330 326 323 322 319 314 306 295 289 291 316 365 412 430 426 415 403 394 389 386 383 384 387 392 394 395 394 391 387 384 380 376 372
-2611 372 366 361 359 357 355 356 359 367 379 388 391 388 385 381 378 374 368 363 359 355 350 346 344 343 340 337 334 328 318 308 299 303 330 383 431 447 442 433 421 412 408 404 398 391 386 383 381 378 377 378 381 382 384 386 383 378 372 367 365 361
-2551C61nnmmmKJ3K9L2J5joopolkklnl%jlklk%jlllk%KjmJJKJjJLjj%KJ%k%%jlk%lllklk%
-2487C45jKPRJ0QJknmjjjjmljJjkmm%JLONNJkkkj%kk%m%%%jJJ%jjj%%%kmjJkjjj%%kjlk%J
-2420C34jjjjkjkkklnlm%NQJ1J2RLjmm%LQPNMKlnkkljlkklj%%jjjjjjjj%jjk%jjjjjkjJkk
-2354C24kkjlkkjKKK%kkmkLJ1J7J9J7J0Jjknolkkmkjjkjm%%%%kljJ%ljJ%%%jk%Klljkjj%%
-2291C29jknj%jkkj%KORRPK%jk%%jJk%%klk%JjjkJjkjj%%JJjklJL%kj%%%kk%L%k%jJ%%kj%
-2223C21jl%%jLJjj%K%kk%j%j%jjL%j%KL%jl%JjjJjjJ%J%jj%%%jlmj%JKK%jj%j%%KJJ%%%%
-2155C10kkjJJJJ%%lk%%%jj%%JL%jjJjk%%jkjKK%j%jJjJ%jjj%%j%Jjk%jKL%%jjJjj%%j%jj
-2087B93jJKjj%%jJ%%J%%%jkjJKj%jjJJ%JJJ%%%kjjjjjj%l%KL%JJlk%kjJKJj%%kjJ%%kk%%
$$ plain form
-2551 361 356 351 347 343 339 341 354 383 415 430 429 423 417 410 404 401 399 397 394 389 386 386 385 382 380 377 375 375 374 371 368 365 363 363 365 364 360 361 362 364 365 364 365 368 367 366 366 368 369 369 367 367 367 366 363 361 361 358 355 352 350 347 345 345
-2487 345 344 346 353 362 372 380 381 379 374 370 369 368 367 366 362 359 358 359 358 356 352 348 348 349 352 358 363 368 369 367 365 363 362 362 360 358 358 354 354 354 354 353 354 355 355 354 353 352 352 352 352 350 346 345 346 344 343 342 341 341 341 339 338 335 333 333 334
-2420 334 333 332 331 330 328 327 325 323 321 318 313 310 306 306 311 319 330 342 351 354 353 349 345 345 348 356 363 368 372 374 371 366 364 362 359 358 355 353 351 348 347 347 347 346 345 344 343 342 341 340 339 339 338 337 335 335 334 333 332 331 330 328 327 328 326 324
-2354 324 322 320 319 316 314 312 311 313 315 317 317 315 313 309 307 310 321 338 357 374 384 385 384 382 377 371 368 366 364 360 358 357 356 354 353 349 349 349 349 349 347 344 343 344 344 341 340 341 341 341 341 340 338 338 340 337 334 333 331 330 329 329 329
-2291 329 328 326 321 320 320 319 317 315 314 314 316 322 331 340 347 349 349 348 346 346 346 345 346 344 344 344 342 339 337 337 338 337 336 334 335 334 332 331 330 330 330 331 332 331 329 326 327 330 330 328 327 327 327 327 325 323 323 326 326 324 324 323 324 324 324 322 321 321
-2223 321 320 317 317 317 316 319 320 319 318 318 320 320 318 316 316 315 315 314 314 313 312 315 315 314 314 316 319 319 318 315 315 316 315 314 315 314 313 314 314 315 315 314 313 313 313 313 312 309 305 304 304 305 307 309 309 308 307 307 306 306 306 308 309 310 310 310 310 310
-2155 310 308 306 305 306 307 308 309 309 309 306 304 304 304 304 303 302 302 302 303 306 306 305 304 305 304 302 302 302 301 299 298 300 302 302 301 301 300 301 300 301 301 300 299 298 298 298 297 297 298 297 295 295 294 296 299 299 299 298 297 298 297 296 296 296 295 295 294 293
-2087 293 292 293 295 294 293 293 293 292 293 293 293 294 294 294 294 293 291 290 291 293 292 292 291 290 291 292 292 293 294 295 295 295 295 293 292 291 290 289 288 287 287 284 284 286 289 289 290 291 288 286 286 284 283 284 286 287 286 286 286 284 283 284 284 284 282 280 280 280
-2019B80k%L%%j%%J%%JjJjk%%J%J%ll%%jJ%%JJJj%j%KKj%j%kk%JJKJj%jkj%J%%%%Kklk%%k
-1951B68kJ%j%JK%Jj%J%j%%%jj%jjk%JJ%jK%%JJkjJjkk%JjlJ%%%%%jj%K%%jjk%jj%JKKjkk
-1883B53JJJjj%j%JJjjjJLKj%jljj%%lJJJ%kk%Jj%kjK%kjJJ%%jjJjJ%jj%k%%J%jj%jJJ%%k
-1815B38j%K%%k%JJjlkkjkjKJjj%Jk%JKjj%j%K%j%%%k%%JJ%jj%%J%kj%j%JjJ%%k%kkJ%jjl
-1747B14l%JJj%%Jjj%j%Jjj%j%%jjJkkj%J%JKkj%%%jj%%%k%klj%j%%J%jjljJjlJJ%%%kjJl
-1679A81kJKJjkjJ%kkjjj%jJkk%kl%%%%jjkkk%%jj%%%jjjjj%kljjK%jjkl%%%kJjjklkj%%k
-1611A24jk%jjkkkjJjjjjklkkkk%j%jmnl%%%%%kmlklmlk%kmmkjjjjjj%nnlll%jllkmmmlm%
-1543flmlmklmmlmmnnmlnnoonopommppqpomnqrqrrrqrrrrj1j1j1j3j3j4j6j4j7j5j8j9j8j9
$$ plain form
-2019 280 278 278 281 281 281 280 280 280 281 281 281 282 281 282 281 279 279 279 280 280 281 281 278 275 275 275 274 275 275 275 276 277 278 277 277 276 276 278 280 279 279 278 278 276 274 274 275 276 278 279 278 278 277 275 274 274 275 275 275 275 275 277 275 272 270 270 270 268
-1951 268 266 267 267 266 266 267 269 269 270 269 269 270 270 269 269 269 269 268 267 267 266 265 263 263 264 265 265 264 266 266 266 267 268 266 265 266 265 263 261 261 262 261 258 259 259 259 259 259 259 258 257 257 259 259 259 258 257 255 255 254 253 253 254 256 258 257 255 253
-1883 253 254 255 256 255 254 254 253 253 254 255 254 253 252 253 256 258 257 257 256 253 252 251 251 251 248 249 250 251 251 249 247 247 248 247 247 245 244 246 246 244 243 244 245 245 245 244 243 244 243 244 244 243 242 242 240 240 240 241 241 240 239 239 238 239 240 240 240 238
-1815 238 237 237 239 239 239 237 237 238 239 238 235 233 231 230 228 227 229 230 229 228 228 229 227 227 228 230 229 228 228 227 227 229 229 228 228 228 228 226 226 226 227 228 228 227 226 226 226 227 227 225 224 224 223 223 224 223 224 224 224 222 222 220 218 219 219 218 217 214
-1747 214 211 211 212 213 212 212 212 213 212 211 211 210 210 211 210 209 209 208 208 208 207 206 207 205 203 202 202 203 203 204 206 204 203 203 203 203 202 201 201 201 201 199 199 197 194 193 193 192 192 192 193 193 192 191 188 187 188 187 184 185 186 186 186 186 184 183 184 181
-1679 181 179 180 182 183 182 180 179 180 180 178 176 175 174 173 173 172 173 171 169 169 167 164 164 164 164 164 163 162 160 158 156 156 156 155 154 154 154 154 153 152 151 150 149 149 147 144 143 142 144 144 143 142 140 137 137 137 137 135 136 135 134 132 129 127 126 126 126 124
-1611 124 123 121 121 120 119 117 115 113 112 113 112 111 110 109 107 104 102 100 98 96 96 95 95 94 90 85 82 82 82 82 82 82 80 76 73 71 68 64 61 59 59 57 53 49 47 46 45 44 43 42 41 41 36 31 28 25 22 22 21 18 15 13 9 5 1 -2 -6 -6
-1543 -6 -9 -13 -16 -20 -22 -25 -29 -33 -36 -40 -44 -49 -54 -58 -61 -66 -71 -77 -83 -88 -94 -101 -107 -111 -115 -122 -129 -137 -144 -150 -154 -159 -167 -176 -184 -193 -202 -211 -219 -228 -237 -246 -255 -266 -277 -288 -301 -314 -328 -344 -358 -375 -390 -408 -427 -445 -464
-1486d64j9k2k3k5k5k6k7l0l2l3l6l9m1m3m8m9n4n8o3o7p0p3p7p8p2o4m4rM3J21K32L66N01
-1453d48O02O32N70M47L05J76P6Ol9o3p5q1q3q0p8p3o8o4o1n5n2m9m5m3m0l5l2l2l1k8k6k4
-1421A109k3k3k3k2j9j6j6j8j8j6j5j2j1j2j3j4j3j3j1rj1j0oorrqqpopnmopopoonomnnnl
-1375F25lmnknnlpmkmlknnlkknlmjjjlmmlmkJklmmkj%%llkklkllj%J%lkmklk%jkkkkkjk%j
-1307D57l%jJJklkk%jllk%JJjllk%j%j%%j%jllJJjlkkkj%Jj%%%%jkljJjj%jkjJ%jkj%j%%K
-1239C97%kkj%k%%kkJ%ljll%jJJk%%kjj%JJKLKjkmjj%kjk%JlkJJJj%j%jljJJ%J%j%JJjkk%
-1171C58k%J%Jjkjj%J%jlj%J%%J%j%Jjjjkj%jjJ%%jJJ%%jJjkjj%%%K%jklJ%%jk%JKJjkkjj
-1103C31JK%kjjjjJ%JJjk%J%j%kjj%KjjjJK%j%k%%%%jjJJ%kl%jjJK%kj%jjJ%J%jK%%jjJK%
$$ plain form
-1486 -464 -483 -505 -528 -553 -578 -604 -631 -661 -693 -726 -762 -801 -842 -885 -933 -982 -1036 -1094 -1157 -1224 -1294 -1367 -1444 -1522 -1594 -1658 -1702 -1711 -1668 -1547 -1315 -949 -448
-1453 -448 154 786 1356 1803 2108 2284 2360 2366 2327 2264 2189 2108 2025 1945 1867 1794 1726 1662 1601 1546 1494 1445 1400 1357 1317 1282 1250 1218 1187 1159 1133 1109
-1421 1109 1086 1063 1040 1018 999 983 967 949 931 915 900 888 877 865 852 838 825 812 801 792 781 771 765 759 750 741 733 725 718 712 705 700 696 690 683 677 670 664 658 653 647 643 638 633 628 625
-1375 625 622 618 613 611 606 601 598 591 587 585 581 578 576 571 566 563 561 559 554 551 547 546 545 544 541 537 533 530 526 524 525 523 520 516 512 510 509 509 509 506 503 501 499 496 494 491 488 487 487 488 488 485 483 479 477 474 472 472 471 469 467 465 463 461 460 458 458 457
-1307 457 454 454 453 454 455 453 450 448 446 446 445 442 439 437 437 438 439 438 435 432 430 430 429 429 428 428 428 427 427 426 423 420 421 422 421 418 416 414 412 411 411 412 411 411 411 411 411 410 408 405 404 405 404 403 403 402 400 399 400 400 399 397 396 396 395 395 395 397
-1239 397 397 395 393 392 392 390 390 390 388 386 387 387 384 383 380 377 377 376 377 378 376 376 376 374 373 372 372 373 374 376 379 381 380 378 374 373 372 372 370 369 367 367 368 365 363 364 365 366 365 365 364 364 363 360 359 360 361 361 362 362 361 361 362 363 362 360 358 358
-1171 358 356 356 357 357 358 357 355 354 353 353 354 354 353 350 349 349 350 350 350 351 351 350 350 351 350 349 348 346 345 345 344 343 344 344 344 343 344 345 345 345 344 345 344 342 341 340 340 340 340 342 342 341 339 336 337 337 337 336 334 334 335 337 338 337 335 333 332 331
-1103 331 332 334 334 332 331 330 329 328 329 329 330 331 330 328 328 329 329 328 328 326 325 324 324 326 325 324 323 324 326 326 325 325 323 323 323 323 323 322 321 322 323 323 321 318 318 317 316 317 319 319 317 316 316 315 314 315 315 316 316 315 317 317 317 316 315 316 318 318
-1035C18%%%jljkl%JJJjkJJJ%Jjjj%Jjkl%%jkjJLjjkkJKJ%%ljj%%jkjkJK%%jjjjkjjkJ%j%
-967B84jkkJ%JJjjlkjkkjjllkklmnnlmnpo%MOJ4J8J8J5J4J4J0QML%JKLLMKkkk%jkkkJ%kjj
-905C43mkj%%%%Kklkkk%JjjjJ%Jkkjkkj%kjJ%%J%kkJ%%lk%%jJ%%%KKkjjJJ%kJJ%kjKKkkjk
-836C04%jlj%JJ%JJJJjjjkJjjkjJ%%%JJjjJ%%%JJj%Kj%%%jkJ%%jjjj%j%jJJkkkJK%kjLKJj
-767B93kjK%%%%%JJkkJJ%%%kj%%%jJKjjkkJL%jj%j%%%k%%%kjjJjjJMJ%j%%JJjlj%%%jjJ%J
-698B81JJkkj%K%j%Jjj%KJ%jk%KJJ%%%jjjj%jjJK%jkjKKjjJK%kkj%j%jJLL%jkjjK%kjJjJJ
-629B76Jj%jkjk%KJj%%jJJ%j%%%JJJJ%J%kjkJ%J%%%J%kl%J%JJ%J%j%%%j%jJj%%jjJjjJjJJ
-560B70jjKKjjk%%kJJ%J%JJ%jjjk%%j%JKJ%k%%%jjKJ%%kjJK%jjjjkKJj%%JJ%%kjj%%j%JK%
$$ plain form
-1035 318 318 318 318 317 314 313 311 308 308 309 310 311 310 308 309 310 311 311 312 311 310 309 309 310 309 307 304 304 304 303 301 300 301 304 303 302 300 298 299 301 302 302 302 299 298 297 297 297 296 294 293 291 292 294 294 294 293 292 291 290 288 287 286 284 285 285 284 284
-967 284 283 281 279 280 280 281 282 281 280 277 275 274 272 270 269 268 265 262 260 258 255 251 246 241 238 234 229 222 216 216 220 226 240 258 276 291 305 319 329 337 341 344 344 345 347 350 353 357 359 357 355 353 353 352 350 348 346 347 347 345 344 343
-905 343 339 337 336 336 336 336 336 338 336 333 331 329 327 327 328 327 326 325 326 326 327 325 323 322 320 318 317 317 315 314 315 315 315 316 316 314 312 313 313 313 310 308 308 308 307 308 308 308 308 310 312 310 309 308 309 310 310 308 309 310 310 308 307 309 311 309 307 306 304
-836 304 304 303 300 299 299 300 301 301 302 303 304 305 304 303 302 300 301 300 299 297 296 297 297 297 297 298 299 298 297 298 298 298 298 299 300 299 299 301 300 300 300 300 299 297 298 298 298 297 296 295 294 294 293 293 292 293 294 292 290 288 289 291 291 289 288 291 293 294 293
-767 293 291 290 292 292 292 292 292 292 293 294 292 290 291 292 292 292 292 290 289 289 289 289 288 289 291 290 289 287 285 286 289 289 288 287 287 286 286 286 286 284 284 284 284 282 281 280 281 280 279 280 284 285 285 284 284 284 285 286 285 282 281 281 281 281 280 279 280 280 281
-698 281 282 283 281 279 278 278 280 280 279 279 280 279 278 278 280 281 281 280 278 278 280 281 282 282 282 282 281 280 279 278 278 277 276 277 279 279 278 276 275 277 279 278 277 278 280 280 278 276 275 275 274 274 273 274 277 280 280 279 277 276 275 277 277 275 274 275 274 275 276
-629 276 277 276 276 275 273 272 270 270 272 273 272 272 272 271 272 273 273 272 272 272 272 273 274 275 276 276 277 277 275 274 272 273 273 274 274 274 274 275 275 273 270 270 271 271 272 273 273 274 274 273 273 273 273 272 272 271 272 271 271 271 270 269 270 269 268 269 268 269 270
-560 270 269 268 270 272 271 270 268 268 268 266 267 268 268 269 269 270 271 271 270 269 268 266 266 266 265 265 266 268 269 269 267 267 267 267 266 265 267 268 268 268 266 265 266 268 268 267 266 265 264 262 264 265 264 264 264 265 266 266 266 264 263 262 262 262 261 261 262 264 264
-491B64jj%JJKJj%kkljKJ%%jjjJ%%%JJ%JjkJLKjj%jj%jjj%kKKJ%kk%KJ%%%J%%kj%JJjJJjj
-422B59%j%JJJj%jjKJJ%%%jjj%%jmJLJ%jk%j%JJKJkkj%JK%jj%jjJ%jjLKjjK%%j%jJJ%%%jk
-353B55%j%%%%JJ%kjKJ%JjljJ%j%J%%j%%%%jJJj%J%jk%KJjl%KJ%jj%%j%j%%JJ%jjKJK%%kk
-284B49%%K%lk%J%K%ljKKkj%%KJjj%j%%jjKJ%jj%KK%%JJj%%j%%J%kjj%jJKJkn%JJ%jKJ%j%
-215B45%Kj%%lj%LKJ%kljjj%%%K%J%jjJJJjjJJLJkmkJ%JJjj%KjkjKJjjJJ%%LJll%JJ%JJ%j
-146B43jJ%kjJJ%%Jjj%JJJj%jJJk%KJjkk%kj%%JK%j%JJj%%%%J%j%%kk%KJ%Jjkm%LLK%j%kk
-77B36%JKjJJJJ%jk%J%k%Jjkjj%JJJ%jJK%jj%jk%KJJj%Jj%JJJj%k%%kj%j%jjjJML%%kkjJJ
-7B35%%%%JJj%%%%%%%k%%jJjj%J%k%%%jJ%J%jJKjjkjKj%%%J%%%jjJJJLJ%jj%kjJK%%%jkkj
$$ plain form
-491 264 263 262 262 263 264 266 267 266 266 264 262 259 258 260 261 261 261 260 259 258 259 259 259 259 260 261 261 262 261 259 260 263 265 264 263 263 262 261 261 260 259 258 258 256 258 260 261 261 259 257 257 259 260 260 260 260 261 261 261 259 258 258 259 260 259 260 261 260 259
-422 259 259 258 258 259 260 261 260 260 259 258 260 261 262 262 262 262 261 260 259 259 259 258 254 255 258 259 259 258 256 256 255 255 256 257 259 260 258 256 255 255 256 258 258 257 256 256 255 254 255 255 254 253 256 258 257 256 258 258 258 257 257 256 257 258 258 258 258 257 255
-353 255 255 254 254 254 254 254 255 256 256 254 253 255 256 256 257 256 253 252 253 253 252 252 253 253 253 252 252 252 252 252 251 252 253 252 252 253 253 252 250 250 252 253 252 249 249 251 252 252 251 250 250 250 249 249 248 248 248 249 250 250 249 248 250 251 253 253 253 251 249
-284 249 249 249 251 251 248 246 246 247 247 249 249 246 245 247 249 247 246 246 246 248 249 248 247 247 246 246 246 245 244 246 247 247 246 245 245 247 249 249 249 250 251 250 250 250 249 249 249 250 250 248 247 246 246 245 246 248 249 247 242 242 243 244 244 243 245 246 246 245 245
-215 245 245 247 246 246 246 243 242 242 245 247 248 248 246 243 242 241 240 240 240 240 242 242 243 243 242 241 242 243 244 243 242 243 244 247 248 246 242 240 241 241 242 243 242 241 241 243 242 240 239 241 242 241 240 241 242 242 242 245 246 243 240 240 241 242 242 243 244 244 243
-146 243 242 243 243 241 240 241 242 242 242 243 242 241 241 242 243 244 243 243 242 243 244 242 242 244 245 244 242 240 240 238 237 237 237 238 240 240 239 239 240 241 240 240 240 240 240 241 241 240 240 240 238 236 236 238 239 239 240 239 237 233 233 236 239 241 241 240 240 238 236
-77 236 236 237 239 238 239 240 241 242 242 241 239 239 240 240 238 238 239 238 236 235 234 234 235 236 237 237 236 237 239 239 238 237 237 236 234 234 236 237 238 237 237 238 237 237 238 239 240 239 239 237 237 237 235 234 234 233 233 232 231 230 231 235 238 238 238 236 234 233 234 235
-7 235 235 235 235 235 236 237 236 236 236 236 236 236 236 236 234 234 234 233 234 233 232 232 233 233 231 231 231 231 230 231 231 232 232 231 232 234 233 232 230 229 231 230 230 230 230 231 231 231 231 230 229 230 231 232 235 236 236 235 234 234 232 231 232 234 234 234 234 233 231 229 228
63B28%JK%jkj%JJ%%kJLL%jkjj%J%j%jJ%%J%%JJJJJj%jkj%jJj%%jj%JJjkkjkJLL%%jj%j%K%
134B27%JK%%jjjjJK%%j%jJ%%%J%jk%JjkjJKJ%jjjjjKL%kk%JKKjj%kl%KJ%j%%%J%JJjkJ%K%
204B26JJjjkJJLjj%%%KJ%jj%Jj%jlJ%jjj%j%%Kjjj%Kj%%%%%kJJJJk%JJJ%jjJJj%%JkJJ%KJ
274B27Jkj%j%kkjJKJKjkJjlk%jJJLJkk%JJJk%Jj%K%%%J%k%kkJ%%%%%%KJJk%K%k%%J%jJ%J%
344B21JjllJLKjjJJjkJj%%%jkkJJ%%J%KJk%%lJKKJkjKJjj%j%Jj%J%jJ%%%j%%jjJJ%jJ%J%j
414B17jJ%%jjkjJJJKJ%%k%Jj%kjK%%%jJj%JJK%jl%%K%%%%%k%jJJ%JkjJjkjj%%%JJJJj%Jjk
484B10jKJ%jk%LL%jk%%jj%J%JjjK%jJ%JjJ%J%j%KJjljkkj%JLKjkjjJKLJjjk%%kkJK%%%J%j
554B09%%J%Jk%J%%JKj%j%Jjlj%%JJk%%KJJk%%jj%kj%%jKLK%%J%%jlkJKL%%%ljJJj%jJJJ%%
$$ plain form
63 228 228 229 231 231 230 228 227 227 228 229 229 229 227 228 231 234 234 233 231 230 229 229 230 230 229 229 228 229 229 229 230 230 230 231 232 233 234 235 234 234 233 231 230 230 229 230 229 229 229 228 227 227 228 229 228 226 224 223 221 222 225 228 228 228 227 226 226 225 225 227 227
134 227 227 228 230 230 230 229 228 227 226 227 229 229 229 228 228 227 228 228 228 228 229 229 228 226 226 227 226 224 223 224 226 227 227 226 225 224 223 222 224 227 227 225 223 223 224 226 228 227 226 226 224 221 221 223 224 224 223 223 223 223 224 224 225 226 225 223 224 224 226 226
204 226 227 228 227 226 224 225 226 229 228 227 227 227 227 229 230 230 229 228 228 229 228 228 227 224 225 225 224 223 222 222 221 221 221 223 222 221 220 220 222 221 221 221 221 221 221 219 220 221 222 223 221 221 222 223 224 224 223 222 223 224 223 223 223 224 222 223 224 224 226 227
274 227 228 226 225 225 224 224 222 220 219 220 222 223 225 224 222 223 222 219 217 217 216 217 218 221 222 220 218 218 219 220 221 219 219 220 219 219 221 221 221 221 222 222 220 220 218 216 217 217 217 217 217 217 217 219 220 221 219 219 221 221 219 219 219 220 220 219 220 220 221 221
344 221 222 221 218 215 216 219 221 220 219 220 221 220 218 219 218 218 218 218 217 215 213 214 215 215 215 216 216 218 219 217 217 217 214 215 217 219 220 218 217 219 220 219 218 218 217 217 218 217 217 218 218 217 218 218 218 218 217 217 217 216 215 216 217 217 216 217 217 218 218 217
414 217 216 217 217 217 216 215 213 212 213 214 215 217 218 218 218 216 216 217 216 216 214 213 215 215 215 215 214 215 214 214 215 216 218 218 217 214 214 214 216 216 216 216 216 216 214 214 213 214 215 215 216 214 213 214 213 211 210 209 209 209 209 210 211 212 213 212 212 213 212 210
484 210 209 211 212 212 211 209 209 212 215 215 214 212 212 212 211 210 210 211 211 212 211 210 212 212 211 212 212 213 212 213 213 214 214 213 213 215 216 215 212 211 209 207 206 206 207 210 212 211 209 208 207 208 210 213 214 213 212 210 210 210 208 206 207 209 209 209 209 210 210 209
554 209 209 209 210 210 211 209 209 210 210 210 211 213 212 212 211 211 212 211 208 207 207 207 208 209 207 207 207 209 210 211 209 209 209 208 207 207 205 204 204 204 203 205 208 210 210 210 211 211 211 210 207 205 206 208 211 211 211 211 208 207 208 209 208 208 207 208 209 210 210 210
624B10%%ljJjj%JJJjJ%Kkj%j%k%LKKJj%Kjj%%%Jkj%%k%%j%JJjj%JkJljKK%jjj%KKjJ%J%jj
694B06JjkjJjjJK%%J%kJJ%%KJ%jk%%klj%j%J%J%JJjJKjJjJjjJJJjjJjjJk%JJJjk%%JJj%JK
764B06kjj%j%JJKJ%%jkj%%kJJ%%jkK%JJJ%JkkkjJJJjlKJJ%JKjkl%K%%%J%j%JJJjkkj%%JJK
834B01J%jJ%kjJLllKJJlkJKKKJj%j%K%%j%JJ%lkjJ%kj%JJj%Jj%KJkk%%Jjjk%%%LKk%JJjkk
904A94jJLKK%%%jk%%%%%JjljJJJ%j%%%%%jj%%JjJJ%JJ%%%k%%JJJj%K%jJ%j%Jjkj%K%J%J%j
974A99kkj%JjJJ%k%Jj%%J%%%J%jJ%%kL%j%%%ljJL%%%Jjkk%jk%JKjkjJJKKjk%%J%JJj%j%J%
1044A93jKKJjjjjjJ%%kjKK%j%jkKLJj%jkkkJJ%KLKkkj%%JjjJK%ljJJKj%jjjj%%%%KJkJKjj
1113A91%%KLJjklj%%KJj%%%Jjk%%JKj%J%k%JJj%%jj%jJjjjJ%JJJKJkk%J%%jjJ%%jJ%jJK%j
$$ plain form
624 210 210 210 207 206 207 206 205 205 206 207 208 207 208 208 210 208 207 207 206 206 204 204 207 209 211 212 211 211 213 212 211 211 211 211 212 210 209 209 209 207 207 207 206 206 207 208 207 206 206 207 205 206 203 202 204 206 206 205 204 203 203 205 207 206 207 207 208 208 207 206
694 206 207 206 204 203 204 203 202 203 205 205 205 206 206 204 205 206 206 206 208 209 209 208 206 206 206 204 201 200 200 199 199 200 200 201 201 202 203 202 203 205 204 205 204 205 204 203 204 205 206 205 204 205 204 203 204 202 202 203 204 205 204 202 202 202 203 204 203 203 204 206
764 206 204 203 202 202 201 201 202 203 205 206 206 206 205 203 202 202 202 200 201 202 202 202 201 199 201 201 202 203 204 204 205 203 201 199 198 199 200 201 200 197 199 200 201 201 202 204 203 201 198 198 200 200 200 200 201 201 200 200 201 202 203 202 200 198 197 197 197 198 199 201
834 201 202 202 201 202 202 200 199 200 203 200 197 199 200 201 198 196 197 199 201 203 204 203 203 202 202 204 204 204 203 203 204 205 205 202 200 199 200 200 198 197 197 198 199 198 198 199 198 198 200 201 199 197 197 197 198 197 196 194 194 194 194 197 199 197 197 198 199 198 196 194
904 194 193 194 197 199 201 201 201 201 200 198 198 198 198 198 198 199 198 195 194 195 196 197 197 196 196 196 196 196 196 195 194 194 194 195 194 195 196 196 197 198 198 198 198 196 196 196 197 198 199 198 198 200 200 199 200 200 199 199 200 199 197 196 196 198 198 199 199 200 200 199
974 199 197 195 194 194 195 194 195 196 196 194 194 195 194 194 194 195 195 195 195 196 196 195 196 196 196 194 197 197 196 196 196 196 193 192 193 196 196 196 196 197 196 194 192 192 191 189 189 190 192 191 189 188 189 190 192 194 193 191 191 191 192 192 193 194 193 193 192 192 193 193
1044 193 192 194 196 197 196 195 194 193 192 193 193 193 191 190 192 194 194 193 193 192 190 192 195 196 195 195 194 192 190 188 189 190 190 192 195 197 195 193 192 192 192 193 192 191 192 194 194 191 190 191 192 194 193 193 192 191 190 189 189 189 189 189 191 192 190 191 193 192 191
1113 191 191 191 193 196 197 196 194 191 190 190 190 192 193 192 192 192 192 193 192 190 190 190 191 193 192 192 193 193 191 191 192 193 192 192 192 191 190 190 189 190 189 188 187 188 188 189 190 191 193 194 192 190 190 191 191 191 190 189 190 190 190 189 190 190 189 190 192 192 191
1182A91jjjj%JJK%kJJ%%%kkJjJJkJJ%jj%%%J%%JJ%j%j%%%JJ%J%kKj%%%j%%%%J%%jJ%%jljJ
1251A86J%jj%%%kjjJK%k%JKJkjJJJJ%JJlkJj%K%%K%kkk%JJjJK%kj%JKJJ%j%%jjJ%j%J%jkj
1320A82JJ%%j%JjjKJjjjJ%kJKJJjkkJKJJ%kjJK%j%jjjjJ%J%JJjJ%kkjj%KK%%JJJjjJjjjj%
1389A81%jj%KKk%%K%JKjjjJJjkjKJjkJj%JKJ%kk%J%KJ%%%jkj%%%J%j%KJJjl%J%%k%J%Jjj%
1458A80JJ%Jj%%J%%%%jk%J%%jJKJJ%jmk%KjjJ%J%J%%%%J%j%J%%j%K%ll%%%KJ%j%J%%%%%K%
1527A82%J%j%jj%%%kkKLJ%%jjjkkJL%k%%JJk%%%%jK%jJJ%kj%jjJJK%jk%JKj%j%%%%%JJKJj
1596A80jk%JJ%%Jj%jj%%%%%jj%J%%kJKjlJj%JL%j%J%jJ%%k%%JJJKKkkJJkk%%%jjJ%KJJ%jk
1665A76jKJj%%%J%jjkj%JJ%%Jj%K%lj%%KKJ%j%%K%jj%j%%%k%jjKK%jJj%%%j%%%JKjkjKJjk
$$ plain form
1182 191 190 189 188 187 187 188 189 191 191 189 190 191 191 191 191 189 187 188 187 188 189 187 188 189 189 188 187 187 187 187 188 188 188 189 190 190 189 189 188 188 188 188 189 190 190 191 191 189 191 190 190 190 190 189 189 189 189 189 190 190 190 189 190 190 190 189 186 185 186
1251 186 187 187 186 185 185 185 185 183 182 181 182 184 184 182 182 183 185 186 184 183 184 185 186 187 187 188 189 186 184 185 184 184 186 186 186 188 188 186 184 182 182 183 184 183 184 186 186 184 183 183 184 186 187 188 188 187 187 187 186 185 186 186 185 185 186 186 185 183 182
1320 182 183 184 184 184 183 183 184 183 182 184 185 184 183 182 183 183 181 182 184 185 186 185 183 181 182 184 185 186 186 184 183 184 186 186 185 185 184 183 182 181 182 182 183 183 184 185 184 185 185 183 181 180 179 179 181 183 183 183 184 185 186 185 184 185 184 183 182 181 181
1389 181 181 180 179 179 181 183 181 181 181 183 183 184 186 185 184 183 184 185 184 182 181 183 184 183 181 182 181 181 182 184 185 185 183 181 181 182 182 184 185 185 185 185 184 182 181 181 181 181 182 182 181 181 183 184 185 184 181 181 182 182 182 180 180 181 181 182 181 180 180
1458 180 181 182 182 183 182 182 182 183 183 183 183 183 182 180 180 181 181 181 180 181 183 184 185 185 184 180 178 178 180 179 178 179 179 180 180 181 181 181 181 181 182 182 181 181 182 182 182 181 181 183 183 180 177 177 177 177 179 180 180 179 179 180 180 180 180 180 180 182 182
1527 182 182 183 183 182 182 181 180 180 180 180 178 176 178 181 182 182 182 181 180 179 177 175 176 179 179 177 177 177 178 179 177 177 177 177 177 176 178 178 177 178 179 179 177 176 176 175 174 175 176 178 178 177 175 175 176 178 177 177 176 176 176 176 176 176 177 178 180 181 180
1596 180 179 177 177 178 179 179 179 180 179 179 178 177 177 177 177 177 177 176 175 175 176 176 176 174 175 177 176 173 174 173 173 174 177 177 176 176 177 177 176 177 177 177 175 175 175 176 177 178 180 182 180 178 179 180 178 176 176 176 176 175 174 175 175 177 178 179 179 178 176
1665 176 175 177 178 177 177 177 177 178 178 177 176 174 173 173 174 175 175 175 176 175 175 177 177 174 173 173 173 175 177 178 178 177 177 177 179 179 178 177 177 176 176 176 176 174 174 173 172 174 176 176 175 176 175 175 175 175 174 174 174 174 175 177 176 174 173 175 176 175 173
1734A73%JjJKk%J%jk%KJ%lkJKKJ%j%%kl%%JjjJjjj%KJJJKJkj%%jJ%%jJ%jj%L%%jkJLJkkjJ
1803A71JJJ%j%%k%JJ%%%j%jjjKjJJjj%%%JL%lj%%JJ%kj%JL%jJj%J%%%j%%%jkJMjk%JJJJjk
1872A72jk%KK%%%%jjljLKkjj%K%jjJKj%%jjJL%jj%%%%%Jj%JkjJJjJ%%%j%%j%k%LJkkJ%kjJ
1941A65JJj%%JJ%J%%Jjj%JJ%jJ%%%JJJjjk%j%J%jj%%jJKL%%kkjkJJJJJ%J%%%jkkJj%jk%KJ
2010A66j%%%%%jJKKJkkJ%kj%%JK%J%jJK%lj%%KJJj%%kkjJjJK%%J%%%kj%JJk%J%k%KJjJJ%j
2079A67%jjJ%jjj%JJJ%k%JJj%jJJ%jJJ%%%jlj%j%%%KMKklj%%KKJk%%%jkkKLJjj%jJ%j%%L%
2148A67jk%JK%jjjkJJjj%JJJjjKL%%K%kkjjj%KK%kk%kk%KJJjj%J%Jj%%%J%jjjJJjjJJ%JJ%
2217A64%klJ%j%jjK%kJJLJj%JkjKJ%J%j%%JJjkj%%jkj%J%%JJJ%%Jk%%%kjJ%JJ%%Jj%KLJkk
$$ plain form
1734 173 173 174 173 174 176 174 174 175 175 174 172 172 174 175 175 172 170 171 173 175 176 176 175 175 175 173 170 170 170 171 170 169 170 169 168 167 167 169 170 171 172 174 175 173 172 172 172 171 172 172 172 171 172 172 171 170 170 173 173 173 172 170 171 174 175 173 171 170 171
1803 171 172 173 174 174 173 173 173 171 171 172 173 173 173 173 172 172 171 170 169 171 170 171 172 171 170 170 170 170 171 174 174 171 170 170 170 171 172 172 170 169 169 170 173 173 172 173 172 172 173 173 173 173 172 172 172 172 171 169 170 174 173 171 171 172 173 174 175 174 172
1872 172 171 169 169 171 173 173 173 173 173 172 171 168 167 170 172 170 169 168 168 170 170 169 168 169 171 170 170 170 169 168 169 172 172 171 170 170 170 170 170 170 171 170 170 171 169 168 169 170 169 170 170 170 170 169 169 169 168 168 166 166 169 170 168 166 167 167 165 164 165
1941 165 166 167 166 166 166 167 168 168 169 169 169 170 169 168 168 169 170 170 169 170 170 170 170 171 172 173 172 171 169 169 168 168 169 169 168 167 167 167 166 167 169 172 172 172 170 168 167 165 166 167 168 169 170 170 171 171 171 171 170 168 166 167 166 166 165 163 163 165 166
2010 166 165 165 165 165 165 165 164 165 167 169 170 168 166 167 167 165 164 164 164 165 167 167 168 168 167 168 170 170 167 166 166 166 168 169 170 169 169 169 167 165 164 165 164 165 167 167 167 168 168 168 168 166 165 165 166 167 165 165 166 166 164 164 166 167 166 167 168 168 167
2079 167 167 166 165 166 166 165 164 163 163 164 165 166 166 164 164 165 166 165 165 164 165 166 166 165 166 167 167 167 167 166 163 162 162 161 161 161 161 163 167 169 167 164 163 163 163 165 167 168 166 166 166 166 165 163 161 163 166 167 166 165 165 164 165 165 164 164 164 167 167
2148 167 166 164 164 165 167 167 166 165 164 162 163 164 163 162 162 163 164 165 164 163 165 168 168 168 170 170 168 166 165 164 163 163 165 167 167 165 163 163 161 159 159 161 162 163 162 161 161 162 162 163 162 162 162 162 163 163 162 161 160 161 162 161 160 161 162 162 163 164 164
2217 164 164 162 159 160 160 159 159 158 157 159 159 157 158 159 162 163 162 162 163 161 160 162 163 163 164 164 163 163 163 164 165 164 162 161 161 161 160 158 157 157 158 158 158 159 160 161 161 161 162 160 160 160 160 158 157 158 158 159 160 160 160 161 160 160 162 165 166 164 162
2286A62%%jjJLkjKj%JJkjjjjjjJ%jj%JJ%%JKjjj%JKJj%jjJKJj%J%%%jJ%kkk%jJLKJ%kkJJj
2355A59%%j%j%%JK%kJJ%%%jjJJ%%L%kjj%kKJjj%jJJ%kjjjKKJj%j%%%JJJ%jlJJ%%J%KJjmj%
2424A56ljLJJ%kJKJ%%J%j%kj%%%J%KjkljKKjjJ%Jj%JJk%Jj%J%%JJJKjlJ%%%j%J%%JjjJ%%j
2493A57jk%%KJJ%kj%%%KKJjkkJ%l%KJJjj%Jj%K%jkjjJJj%%%%J%%KJ%%jjJjj%j%LJjj%J%%k
2562A54jj%JKJlkJK%%J%%JjjkjJKK%%j%%j%%%K%%kjJ%jJJ%%%J%J%jj%JJjj%j%j%J%j%j%%J
2631A53JkjJLJKj%jJjjjjjj%j%LL%J%j%jjjJJjjjj%LJ%jjJK%jk%%Jlj%%%%kJ%%jKJjL%j%J
2700A53%jjjjj%%%kJLLJkj%J%kJKJJ%j%jjj%%%%J%JJj%J%jljK%k%%%%%J%Jjj%%LJ%%Jjkk%
2769A49K%JJ%%jkjj%%jjLJ%j%%KKKjjljJLJJjljkJJ%%J%%%k%%JKKjj%jk%%jkjJ%KJJkjKjk
$$ plain form
2286 162 162 162 161 160 161 164 162 161 163 162 162 163 164 162 161 160 159 158 157 156 157 157 156 155 155 156 157 157 157 158 160 159 158 157 157 158 160 161 160 160 159 158 159 161 162 161 161 162 162 162 162 161 162 162 160 158 156 156 155 156 159 161 162 162 160 158 159 160 159
2355 159 159 159 158 158 157 157 157 158 160 160 158 159 160 160 160 160 159 158 159 160 160 160 163 163 161 160 159 159 157 159 160 159 158 158 157 158 159 159 157 156 155 154 156 158 159 158 158 157 157 157 157 158 159 160 160 159 156 157 158 158 158 159 159 161 162 161 157 156 156
2424 156 153 152 155 156 157 157 155 156 158 159 159 159 160 160 159 159 157 156 156 156 156 157 157 159 158 156 153 152 154 156 155 154 155 155 156 155 155 156 157 155 155 156 155 155 156 156 156 157 158 159 161 160 157 158 158 158 158 157 157 158 158 158 159 158 157 158 158 158 157
2493 157 156 154 154 154 156 157 158 158 156 155 155 155 155 157 159 160 159 157 155 156 156 153 153 155 156 157 156 155 155 156 155 155 157 157 156 154 153 152 153 154 153 153 153 153 153 154 154 154 156 157 157 157 156 155 156 155 154 154 153 153 156 157 156 155 155 156 156 156 154
2562 154 153 152 152 153 155 156 153 151 152 154 154 154 155 155 155 156 155 154 152 151 152 154 156 156 156 155 155 155 154 154 154 154 156 156 156 154 153 154 154 153 154 155 155 155 155 156 156 157 157 156 155 155 156 157 156 155 155 154 154 153 153 154 154 153 153 152 152 152 153
2631 153 154 152 151 152 155 156 158 157 157 156 157 156 155 154 153 152 151 151 150 150 153 156 156 157 157 156 156 155 154 153 154 155 154 153 152 151 151 154 155 155 154 153 154 156 156 155 153 153 153 154 151 150 150 150 150 150 148 149 149 149 148 150 151 150 153 153 152 152 153
2700 153 153 152 151 150 149 148 148 148 148 146 147 150 153 154 152 151 151 152 152 150 151 153 154 155 155 154 154 153 152 151 151 151 151 151 152 152 153 154 153 153 154 154 153 150 149 151 151 149 149 149 149 149 149 150 150 151 150 149 149 149 152 153 153 153 154 153 151 149 149
2769 149 151 151 152 153 153 153 152 150 149 148 148 148 147 146 149 150 150 149 149 149 151 153 155 154 153 150 149 150 153 154 155 154 151 150 148 149 150 150 150 151 151 151 151 149 149 149 150 152 154 153 152 152 151 149 149 149 148 146 145 146 146 148 149 150 148 147 149 148 146
2838A46J%jkJKJ%%%jj%jj%KK%jk%%%%KK%%JJjk%%k%JKKK%lkjJ%JJ%%%j%Jjk%Jj%%JjjjkjJ
2907A43JKJj%%k%K%%K%%JKJ%jkjJjj%J%Jj%jj%J%%JjKL%jkkk%%%JKJj%jj%JJJjk%%j%j%%%
2976A44jk%%%J%KKjkJLJ%%j%%%%J%%jj%jJ%%k%%JJj%%jj%J%jjJJ%KKjkjJ%jjkKJj%%JKJJj
3045A47kj%KJ%kkJKJjjJ%K%kkJKLjl%JJ%%jjjj%%K%j%JJ%jjk%J%%%j%jJJjj%Jkj%KJ%%KJ%
3114A46%kkJK%J%%%%k%%%JJJ%%kkJ%%J%%JjjjkjjKJ%%%%j%kJKKJ%%j%kkJ%JJ%l%J%%%JjjJ
3183A41%%%JJ%J%j%JKkj%%jkjKJ%%JJJjJKjlj%KJl%j%JJJjljJJKKJJJ%ljjkk%KK%%Jjj%J%
3252A43%%%k%JKJjJjjJJjj%J%jk%JJ%jj%jJJjj%JJjj%%%k%%%KM%j%kkj%JLJ%jjj%KjkJ%%j
3321A39%KJ%jK%%%%jj%jjJ%jjj%JJj%%J%Jkk%JJKJkjjKJ%%%jjJjjJj%jJj%KjjJJ%%jJJj%%
$$ plain form
2838 146 147 147 146 144 145 147 148 148 148 148 147 146 146 145 144 144 146 148 148 147 145 145 145 145 145 147 149 149 149 150 151 150 148 148 148 146 146 147 149 151 153 153 150 148 147 148 148 149 150 150 150 150 149 149 150 149 147 147 148 147 147 147 148 147 146 145 143 142 143
2907 143 144 146 147 146 146 146 144 144 146 146 146 148 148 148 149 151 152 152 151 149 148 149 148 147 147 148 148 149 148 148 147 146 146 147 147 147 148 147 149 152 152 151 149 147 145 145 145 145 146 148 149 148 148 147 146 146 147 148 149 148 146 146 146 145 145 144 144 144 144
2976 144 143 141 141 141 141 142 142 144 146 145 143 144 147 148 148 148 147 147 147 147 147 148 148 148 147 146 146 145 146 146 146 144 144 144 145 146 145 145 145 144 143 143 144 144 143 142 143 144 144 146 148 147 145 144 145 145 144 143 141 143 144 143 143 143 144 146 147 148 147
3045 147 145 144 144 146 147 147 145 143 144 146 147 146 145 146 146 148 148 146 144 145 147 150 149 146 146 147 148 148 148 147 146 145 144 144 144 146 146 145 145 146 147 147 146 145 143 143 144 144 144 144 143 143 142 143 144 143 142 142 143 141 140 140 142 143 143 143 145 146 146
3114 146 146 144 142 143 145 145 146 146 146 146 146 144 144 144 144 145 146 147 147 147 145 143 144 144 144 145 145 145 146 145 144 143 141 140 139 141 142 142 142 142 142 141 141 139 140 142 144 145 145 145 144 144 142 140 141 141 142 143 143 140 140 141 141 141 141 142 141 140 141
3183 141 141 141 141 142 143 143 144 144 143 143 144 146 144 143 143 143 142 140 139 141 142 142 142 143 144 145 144 145 147 146 143 142 142 144 145 142 142 141 141 142 143 144 143 140 139 140 141 143 145 146 147 148 148 145 144 143 141 139 139 141 143 143 143 144 143 142 142 143 143
3252 143 143 143 143 141 141 142 144 145 144 145 144 143 144 145 144 143 143 144 144 143 141 141 142 143 143 142 141 141 140 141 142 141 140 140 141 142 141 140 140 140 140 138 138 138 138 140 144 144 143 143 141 139 138 138 139 142 143 143 142 141 140 140 142 141 139 140 140 140 139
3321 139 139 141 142 142 141 143 143 143 143 143 142 141 141 140 139 140 140 139 138 137 137 138 139 138 138 138 139 139 140 138 136 136 137 138 140 141 139 138 137 139 140 140 140 140 139 138 139 138 137 138 137 137 136 137 136 136 138 137 136 137 138 138 138 137 138 139 138 138 138
3390A38%JJJ%kjkkJLKJJ%ljKjj%%kkJ%KJ%kj%K%%jKKJkjKjlJ%jjj%KLJkk%JKJjKLjkjk%%K
3459A40jj%j%jjj%JjJJjj%%%%J%%jJJKJjkj%j%%KJ%jK%%jkj%%%LJJ%kj%J%%%%jk%JKJjJkj
3528A35J%jj%%KKKJlk%kkjJJjL%JKJjJ%%kj%jj%jK%j%J%Jk%JJJk%%%%%JK%JjjjKjkjJJ%%%
3597A36Jjjjl%KL%jJ%j%%%J%jj%jk%%jjjKKKJlj%J%J%%K%j%%%j%JJJ%kk%J%%JlJjJKKK%jm
3666A33kj%KJjJJ%%%%%%%jkj%KJJ%jKJJJjkljJ%k%KKjj%J%JK%kljJKKJ%%kkjJ%j%%J%%JKJ
3735A36%%ljJjjJ%JJK%jlm%JJ%%J%%jjJK%%%%%%jk%K%%K%%j%k%%%%JJjjJ%jJKjJJj%J%J%%
3804A35jjK%j%%%JJk%JJk%%jjKJj%jjJ%%jJJkjk%MJj%jkJ%j%KKjjj%j%JJ%jlk%%jJKJ%%j%
3873A28%JJJJjmjKJJJk%jjJJJJj%JK%%jjJK%j%j%J%%%%jjkjjJLJjjkkJKJjjKJ%j%jkJK%%k
$$ plain form
3390 138 138 139 140 141 141 139 138 136 134 135 138 140 141 142 142 139 138 140 139 138 138 138 136 134 135 135 137 138 138 136 135 135 137 137 137 136 138 140 141 139 138 140 139 136 137 137 136 135 134 134 136 139 140 138 136 136 137 139 140 139 141 144 143 141 140 138 138 138 140
3459 140 139 138 138 137 137 136 135 134 134 135 134 135 136 135 134 134 134 134 134 135 135 135 134 135 136 138 139 138 136 135 135 134 134 134 136 137 137 136 138 138 138 137 135 134 134 134 134 137 138 139 139 137 136 136 137 137 137 137 137 136 134 134 135 137 138 137 138 136 135
3528 135 136 136 135 134 134 134 136 138 140 141 138 136 136 134 132 131 132 133 132 135 135 136 138 139 138 139 139 139 137 136 136 135 134 134 133 135 135 134 134 135 135 136 134 134 135 136 137 135 135 135 135 135 135 136 138 138 139 138 137 136 138 137 135 134 135 136 136 136 136
3597 136 137 136 135 134 131 131 133 136 136 135 136 136 135 135 135 135 136 136 135 134 134 133 131 131 131 130 129 128 130 132 134 135 132 131 131 132 132 133 133 133 135 135 134 134 134 134 133 133 134 135 136 136 134 132 132 133 133 133 134 131 132 131 132 134 136 138 138 137 133
3666 133 131 130 130 132 133 132 133 134 134 134 134 134 134 134 134 133 131 130 130 132 133 134 134 133 135 136 137 138 137 135 132 131 132 132 130 130 132 134 133 132 132 133 133 134 136 136 134 131 130 131 133 135 136 136 136 134 132 131 132 132 131 131 131 132 132 132 133 135 136
3735 136 136 136 133 132 133 132 131 132 132 133 134 136 136 135 132 128 128 129 130 130 130 131 131 131 130 129 130 132 132 132 132 132 132 132 131 129 129 131 131 131 133 133 133 132 132 130 130 130 130 130 131 132 131 130 131 131 130 131 133 132 133 134 133 133 134 134 135 135 135
3804 135 134 133 135 135 134 134 134 134 135 136 134 134 135 136 134 134 134 133 132 134 135 134 134 133 132 133 133 133 132 133 134 132 131 129 129 133 134 133 133 132 130 131 131 130 130 132 134 133 132 131 131 130 130 131 132 132 131 128 126 126 126 125 126 128 129 129 129 128 128
3873 128 128 129 130 131 132 131 127 126 128 129 130 131 129 129 128 127 128 129 130 131 130 130 131 133 133 133 132 131 132 134 134 133 133 132 132 133 133 133 133 133 132 131 129 128 127 128 131 132 131 130 128 126 127 129 130 129 128 130 131 131 130 130 129 127 128 130 130 130 128
3942A28jJjjJJ%jKK%j%%JJ%kjjJ%J%J%lkJ%JKKkj%%Jkj%jJ%%KJJ%%jlJL%k%%%jkjKjj%KKJ
4011A30Jkj%%%jJJJJjjjkJ%jk%J%KK%JJJkjk%jj%JK%jJ%%JJ%j%j%%%kkjJ%JJ%%J%jjjJJ%%
4080A26%JKK%jjjljJLJjjJJjjkk%JK%jJJJ%kk%JKJj%JJjj%%K%kj%Jj%%%JJKLJkjJkmkJJj%
4149A25%j%kj%KJJ%J%J%JJ%lljJ%%%JJjKJ%%jJJj%J%j%jjJ%%%%%%%%J%kjjjJ%%jJKJJ%j%%
4218A26jj%%%%JJjj%%%J%%kl%LK%K%j%Jjk%%%%%j%K%jJJJ%%%jkjJK%%jJJJ%kjJ%kkkJKjj%
4287A21J%%%lKK%kj%%JjjJ%KJJJ%kJjkKJjJJjj%J%J%%jj%jJJ%%JjjJK%%kJ%j%%%j%KJmjKJ
4356A24j%jJKjjj%%J%%%JKj%j%jJjj%%J%jkjjJJ%%j%JJKJ%JL%kll%Jj%K%J%jJJ%%jJJ%%j%
4425A24j%%jJ%%jjj%j%LJjjjJjkKKjJJkkkJK%kk%J%%KK%%JKjj%kJK%jjJjk%KKjjj%%%JJJK
$$ plain form
3942 128 127 128 127 126 127 128 128 127 129 131 131 130 130 130 131 132 132 130 129 128 129 129 130 130 131 131 128 126 127 127 128 130 132 130 129 129 129 130 128 127 127 126 127 127 127 129 130 131 131 131 130 127 128 131 131 129 129 129 129 128 126 125 127 126 125 125 127 129 130
4011 130 131 129 128 128 128 128 127 128 129 130 131 130 129 128 126 127 127 126 124 124 125 125 127 129 129 130 131 132 130 129 127 127 126 125 125 126 128 128 127 128 128 128 129 130 130 129 129 128 128 128 128 126 124 123 124 124 125 126 126 126 127 127 126 125 124 125 126 126 126
4080 126 126 127 129 131 131 130 129 128 125 124 125 128 129 128 127 128 129 128 127 125 123 123 124 126 126 125 126 127 128 128 126 124 124 125 127 128 127 127 128 129 128 127 127 127 129 129 127 126 126 127 126 126 126 126 127 128 130 133 134 132 131 132 130 126 124 125 126 125 125
4149 125 125 124 124 122 121 121 123 124 125 125 126 126 127 127 128 129 129 126 123 122 123 123 123 123 124 125 124 126 127 127 127 126 127 128 127 127 128 128 127 127 126 125 126 126 126 126 126 126 126 126 126 127 127 125 124 123 122 123 123 123 122 123 125 126 127 127 126 126 126
4218 126 125 124 124 124 124 124 125 126 125 124 124 124 124 125 125 125 123 120 120 123 125 125 127 127 126 126 127 126 124 124 124 124 124 124 123 123 125 125 124 125 126 127 127 127 127 126 124 123 124 126 126 126 125 126 127 128 128 126 125 126 126 124 122 120 121 123 122 121 121
4287 121 122 122 122 122 119 121 123 123 121 120 120 120 121 120 119 120 120 122 123 124 125 125 123 124 123 121 123 124 123 124 125 124 123 123 124 124 125 125 125 124 123 123 122 123 124 124 124 125 124 123 124 126 126 126 124 125 125 124 124 124 124 123 123 125 126 122 121 123 124
4356 124 123 123 122 123 125 124 123 122 122 122 123 123 123 123 124 126 125 125 124 124 123 124 123 122 122 122 123 123 122 120 119 118 119 120 120 120 119 119 120 121 123 124 124 125 128 128 126 123 120 120 121 120 120 122 122 123 123 122 123 124 124 124 123 124 125 125 125 124 124
4425 124 123 123 123 122 123 123 123 122 121 120 120 119 119 122 123 122 121 120 121 120 118 120 122 121 122 123 121 119 117 118 120 120 118 116 116 117 117 117 119 121 121 121 122 124 123 122 122 120 121 123 123 122 121 122 121 119 119 121 123 122 121 120 120 120 120 121 122 123 125
4494A25jkkkjjJKKJ%j%j%%jJ%%jJ%kj%%J%jJ%JjJjkJJJjJ%JKjkj%J%%%%jkKj%JjK%%KKJ%j
4563A23jkjJ%j%JJJj%JJ%kljJKJJ%%kJKj%jJ%kjj%%%j%K%%%JKJJkkjjJJ%jjjJJ%LJ%Jjkjj
4632A19kJK%KJJ%%jk%%jj%jjj%j%%J%jkJL%%%jk%K%%%JJjjkj%JKKJ%%Jkjjj%jJJJ%JMJjj%
4701A21l%%J%kjJJ%%%km%KJKKj%j%KJjj%%j%K%%%%jk%L%jkJKJJ%k%JJ%jkkJKJ%Jkj%j%%%%
4770A17%j%jj%JJJ%j%j%KJ%%jj%JJ%j%%jj%%jkKJjJJ%JJj%%j%%%%%Jjjj%LJ%%%%kjJ%%%%%
4839A16%%%jjJK%JKjlkJJ%%Jjjjl%JJ%JJ%kJJK%jJJk%%k%J%%JJ%jj%Jkk%%KK%%%j%jj%%J%
4908A14J%j%%%%JJ%J%jJJjk%kjKj%KJ%j%KJ%Jklk%%LL%llkjJJK%JK%kkjJ%JKK%jkjKKJkk%
4977A14j%JLJ%j%jlkJKJJjkjJJJJjj%%%%JJjkjjkj%K%JJJJjj%%JKJkl%jJj%JK%J%jjkJJ%%
$$ plain form
4494 125 124 122 120 118 117 116 117 119 121 122 122 121 121 120 120 120 119 120 120 120 119 120 120 118 117 117 117 118 118 117 118 118 119 118 119 118 116 117 118 119 118 119 119 120 122 121 119 118 118 119 119 119 119 119 118 116 118 117 117 118 117 119 119 119 121 123 124 124 123
4563 123 122 120 119 120 120 119 119 120 121 122 121 121 122 123 123 121 118 117 118 120 121 122 122 122 120 121 123 122 122 121 122 122 120 119 118 118 118 118 117 117 119 119 119 119 120 122 123 124 122 120 119 118 119 120 120 119 118 117 118 119 119 122 123 123 124 123 121 120 119
4632 119 117 118 120 120 122 123 124 124 124 123 121 121 121 120 119 119 118 117 116 116 115 115 115 116 116 115 113 114 117 117 117 117 116 114 114 116 116 116 116 117 118 117 116 114 113 113 114 116 118 119 119 119 120 118 117 116 115 115 114 115 116 117 117 118 122 123 122 121 121
4701 121 118 118 118 119 119 117 116 117 118 118 118 118 116 112 112 114 115 117 119 118 118 117 117 119 120 119 118 118 118 117 117 119 119 119 119 119 118 116 116 119 119 118 116 117 119 120 121 121 119 119 120 121 121 120 118 116 117 119 120 120 121 119 118 118 117 117 117 117 117
4770 117 117 116 116 115 114 114 115 116 117 117 116 116 115 115 117 118 118 118 117 116 116 117 118 118 117 117 117 116 115 115 115 114 112 114 115 114 115 116 116 117 118 117 117 117 116 116 116 116 116 116 117 116 115 114 114 117 118 118 118 118 118 116 115 116 116 116 116 116 116
4839 116 116 116 116 115 114 115 117 117 118 120 119 116 114 115 116 116 116 117 116 115 114 111 111 112 113 113 114 115 115 113 114 115 117 117 116 117 118 116 116 116 114 114 115 115 115 116 117 117 116 115 115 116 114 112 112 112 114 116 116 116 116 115 115 114 113 113 113 114 114
4908 114 115 115 114 114 114 114 114 115 116 116 117 117 116 117 118 117 115 115 113 112 114 113 113 115 116 116 115 115 117 118 118 119 117 114 112 112 112 115 118 118 115 112 110 109 110 111 113 113 114 116 116 114 112 111 112 112 113 115 117 117 116 114 113 115 117 118 116 114 114
4977 114 113 113 114 117 118 118 117 117 116 113 111 112 114 115 116 115 113 112 113 114 115 116 115 114 114 114 114 114 115 116 115 113 112 111 109 108 108 110 110 111 112 113 114 113 112 112 112 113 115 116 114 111 111 110 111 110 110 111 113 113 114 114 113 112 110 111 112 112 112
5046A12jJ%J%J%%KJ%jjjjk%%%%kJKJJ%%k%%%Jk%%jJKJ%%ljJ%%LJjjk%JKJ%%%j%%KkjJ%Jjk
5115A12k%%JjjkJKKK%%%%Jjlkj%%KKJJ%%J%j%J%kkkjKJJJ%%%jjKkjJJJ%Jj%jkj%J%%%J%kJ
5184A10KJKj%JkjjjK%%%kjKLJJjJJl%JJkj%kj%jjjKJJ%%%%jj%KJ%jjkJJkj%JLKKJkll%J%k
5253A07jJJJ%JJ%JJ%jJJ%jjj%J%j%jjjkj%%LKjk%%%KJjj%J%jJ%Jjj%J%jljLKLjjj%jjj%JK
5322A09Jj%j%jjj%KLK%kj%%k%JJJJjj%kjJJj%%JKjJ%%jJ%%%%j%JJJ%lkJK%j%jJ%%k%%Jj%j
5391A06%%%kJJjKLK%kjkjJJJkkkjJKJ%%JjJ%%JJjkJKJjJ%j%kk%jj%j%K%JJKJjjj%jkKJ%K%
5460A08ljJJ%%j%J%J%%j%%jKLJjjkj%JJ%%%j%JJ%J%lkjJJ%j%%j%LJJJ%J%kj%J%%kj%kJKK%
5529A09jjJ%jk%%jJjj%%%K%%JJJjKJjkjJJJjJ%j%jj%%jJJjk%J%%%KJ%jjJJkj%kLJ%jJK%k%
$$ plain form
5046 112 111 112 112 113 113 114 114 114 116 117 117 116 115 114 113 111 111 111 111 111 109 110 112 113 114 114 114 112 112 112 112 113 111 111 111 110 111 113 114 114 114 111 110 111 111 111 114 115 114 113 111 111 112 114 115 115 115 115 114 114 114 116 114 113 114 114 115 114 112
5115 112 110 110 110 111 110 109 107 108 110 112 114 114 114 114 114 115 114 111 109 108 108 108 110 112 113 114 114 114 115 115 114 114 115 115 113 111 109 108 110 111 112 113 113 113 113 112 111 113 111 110 111 112 113 113 114 113 113 112 110 109 109 110 110 110 110 111 111 109 110
5184 110 112 113 115 114 114 115 113 112 111 110 112 112 112 112 110 109 111 114 115 116 115 116 117 114 114 115 116 114 113 113 111 110 110 109 108 107 109 110 111 111 111 111 111 110 109 109 111 112 112 111 110 108 109 110 108 107 107 108 111 113 115 116 114 111 108 108 109 109 107
5253 107 106 107 108 109 109 110 111 111 112 113 113 112 113 114 114 113 112 111 111 112 112 111 111 110 109 108 106 105 105 105 108 110 109 107 107 107 107 109 110 109 108 108 109 109 108 109 109 110 109 108 108 109 109 108 105 104 107 109 112 111 110 109 109 108 107 106 106 107 109
5322 109 110 109 109 108 108 107 106 105 105 107 110 112 112 110 109 109 109 107 107 108 109 110 111 110 109 109 107 106 107 108 107 107 107 108 110 109 110 110 110 109 110 110 110 110 110 109 109 110 111 112 112 109 107 108 110 110 109 109 108 109 109 109 107 107 107 108 107 107 106
5391 106 106 106 106 104 105 106 105 107 110 112 112 110 109 107 106 107 108 109 107 105 103 102 103 105 106 106 106 107 106 107 107 107 108 109 108 106 107 109 110 109 110 110 109 109 107 105 105 104 103 103 102 102 104 104 105 106 108 109 108 107 106 106 105 103 105 106 106 108 108
5460 108 105 104 105 106 106 106 105 105 106 106 107 107 107 106 106 106 105 107 110 111 110 109 107 106 106 107 108 108 108 108 107 107 108 109 109 110 110 107 105 104 105 106 106 105 105 105 104 104 107 108 109 110 110 111 111 109 108 108 109 109 109 107 106 106 104 105 107 109 109
5529 109 108 107 108 108 107 105 105 105 104 105 104 103 103 103 103 105 105 105 106 107 108 107 109 110 109 107 106 107 108 109 108 109 109 108 108 107 106 106 106 105 106 107 106 104 104 105 105 105 105 107 108 108 107 106 107 108 106 105 105 103 106 107 107 106 107 109 109 107 107
5598A07jkJKJJKkkj%%jj%J%KJjk%%%jjJ%JJKJj%kjJLJlk%j%%jKJ%jj%JJ%kjjjJK%%j%j%jK
5667A03K%JK%Jjkj%JJj%%%%Jjj%JkkjjJ%%Jj%JKjjj%KL%kJjj%jkJJJ%Kjjj%KJJ%j%%%jkj%
5736A01%JK%%%JJj%J%%jJJkj%K%%%j%k%%JM%jlkJK%j%%KjjKKkmk%KJJLL%jmjJ%%k%JjJJkk
5805A01Kjk%JJK%kjKK%k%%%kjJJJ%%jjJJ%jj%KKjj%JjkkJjjJK%LJk%%kj%%JJJ%J%j%j%k%%
5874A00%J%%%K%%k%%J%K%%%j%%j%K%%%j%%JKjJjll%J%JjJjjJJJ%JJJJ%l%jjjKJkj%jJJJ%%
5943A02j%JK%%Jkk%%%jj%%J%%JL%%kjK%jjjKJjjjjj%J%K%%jjJ%J%J%%jj%%%%%KJ%jj%j%jJ
6012A00J%kJJjjJJjj%%JJ%jJ%JJjjkj%%j%KKJJKjjjJJllkJKJjJJjJJ%jjkjJK%Jjkj%J%JLK
6081A04jjk%JjjLJ%jkj%LJjjjk%jj%%KL%kkjjKJj%J%%%JjJKKKjjJ%jkmjjKJjkJJJ%jj%%KJ
$$ plain form
5598 107 106 104 105 107 108 109 111 109 107 106 106 106 105 104 104 105 105 107 108 107 105 105 105 105 104 103 104 104 105 106 108 109 108 108 106 105 106 109 110 107 105 105 104 104 104 103 105 106 106 105 104 104 105 106 106 104 103 102 101 102 104 104 104 103 103 102 102 101 103
5667 103 105 105 106 108 108 109 108 106 105 105 106 107 106 106 106 106 106 107 106 105 105 106 104 102 101 100 101 101 101 102 101 101 102 104 103 102 101 101 103 106 106 104 105 104 103 103 102 100 101 102 103 103 105 104 103 102 102 104 105 106 106 105 105 105 105 104 102 101 101
5736 101 101 102 104 104 104 104 105 106 105 105 106 106 106 105 106 107 105 104 104 106 106 106 106 105 105 103 103 103 104 108 108 107 104 102 103 105 105 104 104 104 106 105 104 106 108 106 102 100 100 102 103 104 107 110 110 109 105 104 105 105 105 103 103 104 103 104 105 103 101
5805 101 103 102 100 100 101 102 104 104 102 101 103 105 105 103 103 103 103 101 100 101 102 103 103 103 102 101 102 103 103 102 101 101 103 105 104 103 103 104 103 101 99 100 99 98 99 101 101 104 105 103 103 103 101 100 100 100 101 102 103 103 104 104 103 103 102 102 100 100 100
5874 100 100 101 101 101 101 103 103 103 101 101 101 102 102 104 104 104 104 103 103 103 102 102 104 104 104 104 103 103 103 104 106 105 106 105 102 99 99 100 100 101 100 101 100 99 100 101 102 102 103 104 105 106 106 103 103 102 101 100 102 103 101 100 100 99 100 101 102 102 102
5943 102 101 101 102 104 104 104 105 103 101 101 101 101 100 99 99 99 100 100 100 101 104 104 104 102 101 103 103 102 101 100 102 103 102 101 100 99 98 98 99 99 101 101 101 100 99 100 100 101 101 102 102 102 101 100 100 100 100 100 100 102 103 103 102 101 101 100 100 99 100
6012 100 101 101 99 100 101 100 99 100 101 100 99 99 99 100 101 101 100 101 101 102 103 102 101 99 98 98 98 97 97 99 101 102 103 105 104 103 102 103 104 101 98 96 97 99 100 99 100 101 100 101 102 102 101 100 98 97 98 100 100 101 100 98 97 97 98 98 99 102 104
6081 104 103 102 100 100 101 100 99 102 103 103 102 100 99 99 102 103 102 101 100 98 98 97 96 96 96 98 101 101 99 97 96 95 97 98 97 97 98 98 98 98 99 98 99 101 103 105 104 103 104 104 103 101 97 96 95 97 98 97 95 96 97 98 98 97 96 96 96 98 99
6150I9%j%%%kk%KK%%%%%j%%K%jkjJKK%j%J%jkjJJJjjJJ%%%%kj%K%jJ%%jJKj%j%%jj%jkJL%
6220I7KKjjjJ%%JKjjjJJJjjjjjJjJJjjjJJ%JJKjjj%%%jjjJj%JJJ%jJjjJ%kjj%J%jj%jj%%J
6290I2LJJ%Jj%%%J%kj%JjJK%j%j%J%jJJ%%jjk%JJJ%Jk%JJJ%jjj%j%J%%MJj%%j%%kkJJ%kJ%
6360I6%%%J%JJjkjj%%jJJKK%kljJLK%jlj%%JKJjj%%jjjjKKJJJ%kjjJJk%J%%%Jk%JjJK%kkJ
6430I5%%%K%jjjJJjjk%%KLJ%jk%%jjJ%JjjjK%%KKjj%JK%%lJ%jJKjkkjJ%JJ%%j%jj%Kjj%Jj
6500I3%%%%JKJjJ%%kkjKKJk%JjJJjl%LKJ%kkJ%jJ%jJj%%%%LJ%k%%lljKJK%%jkj%%jJJ%KJJ
6570I6kk%JJj%K%k%K%j%%%%%Jkj%jjjJKKLK%kljKK%JJkl%%%%%J%%l%jj%jj%KMKkjj%%JLKj
6640I7jJjkkjJ%%J%kjLJ%kjJJJ%jjj%%KJJjklj%KLJJj%jk%%%%jJJLKJlj%%%KJkk%%JKkjk%
$$ plain form
6150 99 99 98 98 98 98 96 94 94 96 98 98 98 98 98 98 97 97 97 99 99 98 96 95 96 98 100 100 99 99 100 100 99 97 96 97 98 99 98 97 98 99 99 99 99 99 97 96 96 98 98 97 98 98 98 97 98 100 99 99 98 98 98 97 96 96 95 93 94 97 97
6220 97 99 101 100 99 98 99 99 99 100 102 101 100 99 100 101 102 101 100 99 98 97 98 97 98 99 98 97 96 97 98 98 99 100 102 101 100 99 99 99 99 98 97 96 97 96 96 97 98 99 99 98 99 98 97 98 98 96 95 94 94 95 95 94 93 93 92 91 91 91 92
6290 92 95 96 97 97 98 97 97 97 97 98 98 96 95 95 96 95 96 98 98 97 97 96 96 97 97 96 97 98 98 98 97 96 94 94 95 96 97 97 98 96 96 97 98 99 99 98 97 96 96 95 95 96 96 96 100 101 100 100 100 99 99 99 97 95 96 97 97 95 96 96
6360 96 96 96 96 97 97 98 99 98 96 95 94 94 94 93 94 95 97 99 99 97 94 93 94 97 99 99 98 95 94 94 94 95 97 98 97 96 96 96 95 94 93 92 94 96 97 98 99 99 97 96 95 96 97 95 95 96 96 96 96 97 95 95 96 95 96 98 98 96 94 95
6430 95 95 95 95 97 97 96 95 94 95 96 95 94 92 92 92 94 97 98 98 97 95 95 95 94 93 94 94 95 94 93 92 94 94 94 96 98 97 96 96 97 99 99 99 96 97 97 96 97 99 98 96 94 93 94 94 95 96 96 96 95 95 94 93 93 95 94 93 93 94 93
6500 93 93 93 93 93 94 96 97 96 97 97 97 95 93 92 94 96 97 95 95 96 95 96 97 96 93 93 96 98 99 99 97 95 96 96 95 96 96 95 96 95 95 95 95 95 98 99 99 97 97 97 94 91 90 92 93 95 95 95 94 92 91 91 91 90 91 92 92 94 95 96
6570 96 94 92 92 93 94 93 93 95 95 93 93 95 95 94 94 94 94 94 94 95 93 92 92 91 90 89 90 92 94 97 99 99 97 94 93 95 97 97 98 99 97 94 94 94 94 94 94 95 95 95 92 92 91 90 90 89 88 88 90 94 96 94 93 92 92 92 93 96 98 97
6640 97 96 97 96 94 92 91 92 92 92 93 93 91 90 93 94 94 92 91 92 93 94 94 93 92 91 91 91 93 94 95 94 92 89 88 88 90 93 94 95 94 94 93 91 91 91 91 91 90 91 92 95 97 98 95 94 94 94 94 96 97 95 93 93 93 94 96 94 93 91 91
6710I1JJ%%%%j%JjjkJJJJJ%%%%Jjkj%%JJjjj%J%KJj%%%jkkjJKK%%k%J%jJK%%j%%%JK%k%%j
6780I2%%jk%%%%j%%J%%%KKjkjJKJ%J%JjJjjK%jjj%Jjkj%K%JkJ%Kj%jj%KJLKjllkj%L%jjJJ
6850I1%%%%jk%%KKjjk%%J%JJ%kjjJLJ%jk%%%KJ%%jJK%%jk%%J%kkjJKJJjJKJkkk%j%J%%jK%
6920I0j%%jkJKJj%JJ%%%%JJj%JjJJj%%%%J%jjj%kkJ%jKKJJjjj%%jjJJL%kj%Jjkj%JLKjj%j
6990I0jk%JLKj%%%%jjJJk%J%k%K%jjjJKjml%KLLjKJklk%%%mjLJJJJJ%k%LJjJJKjjklJJLJj
7060I2%%jj%Jjkk%j%jJK%JK%k%%J%%%J%JjkjJ%j%j%%%%K%kJKJ%jjJ%K%j%jj%jj%jJKKjkjj
7130H5jJMJkljKJJKJJjkkkjJ%%%JJ%jKJk%Jj%%JJJ%kk%Jjjj%JKjKJjJLJll%Jk%K%jJjkJ%%
7200H6%JKKjl%%JjjJjjk%JK%KK%kkjjjjjKLLjl%jJJJ%Jj%kkjjKKJkkJLM%%j%k%jjjJJ%J%%
$$ plain form
6710 91 92 93 93 93 93 93 92 92 93 92 91 89 90 91 92 93 94 94 94 94 94 95 94 92 91 91 91 92 93 92 91 90 90 91 91 93 94 93 93 93 93 92 90 88 87 88 90 92 92 92 90 90 91 91 90 91 93 93 93 92 92 92 92 93 95 95 93 93 93 92
6780 92 92 92 91 89 89 89 89 89 88 88 88 89 89 89 89 91 93 92 90 89 90 92 93 93 94 94 95 94 95 94 93 95 95 94 93 92 92 93 92 90 89 89 91 91 92 90 91 91 93 92 92 91 90 90 92 93 96 98 97 94 91 89 88 88 91 91 90 89 90 91
6850 91 91 91 91 91 90 88 88 88 90 92 91 90 88 88 88 89 89 90 91 91 89 88 87 88 91 92 92 91 89 89 89 89 91 92 92 92 91 92 94 94 94 93 91 91 91 92 92 90 88 87 88 90 91 92 91 92 94 95 93 91 89 89 88 88 89 89 89 88 90 90
6920 90 89 89 89 88 86 87 89 90 89 89 90 91 91 91 91 91 92 93 92 92 93 92 93 94 93 93 93 93 93 94 94 93 92 91 91 89 87 88 88 87 89 91 92 93 92 91 90 90 90 89 88 89 90 93 93 91 90 90 91 90 88 87 87 88 91 93 92 91 91 90
6990 90 89 87 87 88 91 93 92 92 92 92 92 91 90 91 92 90 90 91 91 89 89 91 91 90 89 88 89 91 90 86 83 83 85 88 91 90 92 93 91 88 86 86 86 86 82 81 84 85 86 87 88 89 89 87 87 90 91 90 91 92 94 93 92 90 87 88 89 92 93 92
7060 92 92 92 91 90 90 91 90 88 86 86 85 85 84 85 87 87 88 90 90 88 88 88 89 89 89 89 90 90 91 90 88 87 88 88 87 87 86 86 86 86 86 88 88 86 87 89 90 90 89 88 89 89 91 91 90 90 89 88 88 87 86 86 85 86 88 90 89 87 86 85
7130 85 84 85 89 90 88 85 84 86 87 88 90 91 92 91 89 87 85 84 85 85 85 85 86 87 87 86 88 89 87 87 88 87 87 87 88 89 90 90 88 86 86 87 86 85 84 84 85 87 86 88 89 88 89 92 93 90 87 87 88 86 86 88 88 87 88 87 85 86 86 86
7200 86 86 87 89 91 90 87 87 87 88 87 86 87 86 85 83 83 84 86 86 88 90 90 88 86 85 84 83 82 81 83 86 89 88 85 85 84 85 86 87 87 88 87 87 85 83 82 81 83 85 86 84 82 83 86 90 90 90 89 89 87 87 86 85 84 85 86 86 87 87 87
7270H7K%jJ%%jl%k%JKK%j%%%%%k%J%jJ%jjJJJJ%J%k%%ljJJ%kk%%KKLKjjjkjLKJkj%jjjjjJ
7340H3%jJJjjJ%%JJJJJkj%%JJK%%jkj%Jj%%kJJ%jJ%jJKkkjJJ%%%%%JjJ%KK%%Jlkjk%J%%%%
7410H3JjJKJjkj%Jkj%JLJkjkj%%JJJJ%j%K%%%JK%kllkJKKKKJ%jkk%JJj%%KJjl%%KKk%KKk%
7480H7j%jj%%jkKJ%k%J%%j%JKJllJJKJJJkkJKklKLkjJJJJljJj%j%%%Jj%%J%JJJJKJjk%%jk
7550H4j%JJ%k%JJ%%JjJJk%k%%%J%jJ%jjJJJJjJjj%%%%%%%j%K%%%J%kj%jk%JJj%J%%%%%Jj%
7620H2%%%%%%JKjJjkkk%JJLL%j%%kj%%JJ%%%JjjJK%j%Jkk%JJJ%kjKJlkJj%K%jkjKKJJkkj%
7690G9jj%KJ%JKJjlk%KJ%JK%JJ%j%jk%%lkJJKKj%jjKKKJjlk%JJj%KJ%kkkJJKJj%%j%%k%Jk
7760G9jj%JJJ%JKJK%%%jkkkjJjKJjJJJjkk%JJ%JK%jj%JJ%kk%JJJ%lkJJJj%Kj%kjJKJ%lk%K
$$ plain form
7270 87 89 89 88 89 89 89 88 85 85 83 83 84 86 88 88 87 87 87 87 87 87 85 85 86 86 85 86 86 85 84 85 86 87 88 88 89 89 87 87 87 84 83 84 85 85 83 81 81 81 83 85 88 90 89 88 87 85 84 87 89 90 88 87 87 86 85 84 83 82 83
7340 83 83 82 83 84 83 82 83 83 83 84 85 86 87 88 86 85 85 85 86 87 89 89 89 88 86 85 85 86 85 85 85 83 84 85 85 84 85 85 84 85 87 85 83 82 83 84 84 84 84 84 84 85 84 85 85 87 89 89 89 90 87 85 84 82 82 83 83 83 83 83
7410 83 84 83 84 86 87 86 84 83 83 84 82 81 81 82 85 86 84 83 81 80 80 80 81 82 83 84 84 83 83 85 85 85 85 86 88 88 86 83 80 78 79 81 83 85 87 88 88 87 85 83 83 84 85 84 84 84 86 87 86 83 83 83 85 87 85 85 87 89 87 87
7480 87 86 86 85 84 84 84 83 81 83 84 84 82 82 83 83 83 82 82 83 85 86 83 80 81 82 84 85 86 87 85 83 84 86 84 81 83 86 84 83 84 85 86 87 84 83 84 83 83 82 82 82 82 83 82 82 82 83 83 84 85 86 87 89 90 89 87 87 87 86 84
7550 84 83 83 84 85 85 83 83 84 85 85 85 86 85 86 87 85 85 83 83 83 83 84 84 83 84 84 83 82 83 84 85 86 85 86 85 84 84 84 84 84 84 84 84 83 83 85 85 85 85 86 86 84 83 83 82 80 80 81 82 81 81 82 82 82 82 82 82 83 82 82
7620 82 82 82 82 82 82 82 83 85 84 85 84 82 80 78 78 79 80 83 86 86 85 85 85 83 82 82 82 83 84 84 84 84 85 84 83 84 86 86 85 85 86 84 82 82 83 84 85 85 83 82 84 85 82 80 81 80 80 82 82 81 79 78 80 82 83 84 82 80 79 79
7690 79 78 77 77 79 80 80 81 83 84 83 80 78 78 80 81 81 82 84 84 85 86 86 85 85 84 82 82 82 79 77 78 79 81 83 82 82 81 80 82 84 86 87 86 83 81 81 82 83 82 82 84 85 85 83 81 79 80 81 83 84 83 83 83 82 82 82 80 80 81 79
7760 79 78 77 77 78 79 80 80 81 83 84 86 86 86 86 85 83 81 79 78 79 78 80 81 80 81 82 83 82 80 78 78 79 80 80 81 83 83 82 81 81 82 83 83 81 79 79 80 81 82 82 79 77 78 79 80 79 79 81 80 80 78 77 78 80 81 81 78 76 76 78
7830G8J%JJJ%j%JKjk%kjj%JJJJ%KJ%K%kjkjj%JJjkk%LjkJJ%KK%%kj%%%K%k%Jj%Kj%%%JJJj
7900H2kkKLJkkjjJJ%KJ%%jJjkkJ%jJJ%k%%j%JJ%%j%%%j%KKkj%%J%j%%KJ%jk%%%J%%%kJKK%
7970H2jj%jJLKj%%j%%%%JjjJ%%jj%jkJ%%%K%%kj%%J%JJ%KJ%klljJ%%%%JJj%KL%kk%J%jjK%
8040G9kJKKjk%jkkjJMK%Jj%j%jk%JJ%%%jKj%jkJ%JKJKjk%J%kj%k%JjKJ%kJJjj%%%%L%%%Jj
8110G9%J%k%jk%%kJJKJjj%%j%LKJ%j%J%j%kjJJj%J%jjJK%jJJ%kkjKJjkJ%%J%JjjK%k%Jkkj
8180G3j%JJ%K%kk%%LJ%JJ%%%JJ%JJ%jjj%LKJkllkK%%JKJJj%%j%KlljjjJJJjJJkk%L%j%JJ%
8250G7jJ%%j%j%%%J%KjjjJK%jjJj%jJKj%%%kjJJk%J%jJJkJKJJ%jJj%jkkj%KJJkjkKKjjK%%
8320G5%JJ%%%j%%jJKJ%k%kjJ%jJKKkj%KK%jlkJK%jj%JJJjJ%ljJj%%Kjk%%KJ%%%jKKJ%j%%j
$$ plain form
7830 78 79 79 80 81 82 82 81 81 82 84 83 81 81 79 78 77 77 78 79 80 81 81 83 84 84 86 86 84 83 81 80 79 79 80 81 80 78 76 76 79 78 76 77 78 78 80 82 82 82 80 79 79 79 79 81 81 79 79 80 79 79 81 80 80 80 80 81 82 83 82
7900 82 80 78 80 83 84 82 80 79 78 79 80 80 82 83 83 83 82 83 82 80 78 79 79 78 79 80 80 78 78 78 77 77 78 79 79 79 78 78 78 78 77 77 79 81 79 78 78 78 79 79 78 78 78 80 81 81 80 78 78 78 78 79 79 79 79 77 78 80 82 82
7970 82 81 80 80 79 80 83 85 84 84 84 83 83 83 83 83 84 83 82 83 83 83 82 81 81 80 78 79 79 79 79 81 81 81 79 78 78 78 79 79 80 81 81 83 84 84 82 79 76 75 76 76 76 76 76 77 78 77 77 79 82 82 80 78 78 79 79 78 77 79 79
8040 79 77 78 80 82 81 79 79 78 76 74 73 74 78 80 80 81 80 80 79 79 78 76 76 77 78 78 78 78 77 79 78 78 77 75 76 76 77 79 80 82 81 79 79 80 80 78 77 77 75 75 76 75 77 78 78 76 77 78 77 76 76 76 76 76 79 79 79 79 80 79
8110 79 79 80 80 78 78 77 75 75 75 73 74 75 77 78 77 76 76 76 75 75 78 80 81 81 80 80 81 81 80 80 78 77 78 79 78 78 79 79 78 77 78 80 80 79 80 81 81 79 77 76 78 79 78 76 77 77 77 78 78 79 78 77 79 79 77 77 78 76 74 73
8180 73 72 72 73 74 74 76 76 74 72 72 72 75 76 76 77 78 78 78 78 79 80 80 81 82 82 81 80 79 79 82 84 85 83 80 77 75 77 77 77 78 80 81 82 81 81 81 80 80 82 79 76 75 74 73 74 75 76 75 76 77 75 73 73 76 76 75 75 76 77 77
8250 77 76 77 77 77 76 76 75 75 75 75 76 76 78 77 76 75 76 78 78 77 76 77 76 76 75 76 78 77 77 77 77 75 74 75 76 74 74 75 75 74 75 76 74 75 77 78 79 79 78 79 78 78 77 75 73 72 72 74 75 76 74 73 71 73 75 74 73 75 75 75
8320 75 75 76 77 77 77 77 76 76 76 75 76 78 79 79 77 77 75 74 75 75 74 75 77 79 77 76 76 78 80 80 79 76 74 75 77 77 76 75 75 76 77 78 77 78 78 75 74 75 74 74 74 76 75 73 73 73 75 76 76 76 76 75 77 79 80 80 79 79 79 78
8390G8jkjJ%%K%jjjjj%KKJJJljj%KJj%j%%jjJjkJJ%JKjj%J%kJKjkj%KJjjJ%jJKJjk%JJJKJ
8460H0j%J%kk%Jkk%KJJ%J%l%JKj%k%%JJj%%%%lJ%JKK%kjkk%JKj%J%jlJJjj%%%%J%JJ%J%J%
8530G6jkk%JJKj%JJkkLJkkj%JKJkjJK%%%%jljjj%KK%jJJKjjjj%%j%%JJ%KJj%jkJK%jKkmj%
8600F8JLKkj%%JKJJjj%%kJ%%j%JjjjJJJJJ%j%%%%jjjKj%%jkJKj%Lj%%%J%Jjj%jJKKkljK%k
8670G1k%LK%jklJLM%%j%JJjk%%%%jJJJll%JKJjljJLJ%%%%J%j%K%Jj%%j%kjjKJ%jkjJ%jj%J
$$ plain form
8390 78 77 75 74 75 75 75 77 77 76 75 74 73 72 72 74 76 77 78 79 76 75 74 74 76 77 76 76 75 75 75 74 73 74 73 71 72 73 73 74 76 75 74 74 75 75 73 74 76 75 73 72 72 74 75 74 73 74 74 73 74 76 77 76 74 74 75 76 77 79 80
8460 80 79 79 80 80 78 76 76 77 75 73 73 75 76 77 77 78 78 75 75 76 78 77 77 75 75 75 76 77 76 76 76 76 76 73 74 74 75 77 79 79 77 76 74 72 72 73 75 74 74 75 75 74 71 72 73 72 71 71 71 71 71 72 72 73 74 74 75 75 76 76
8530 76 75 73 71 71 72 73 75 74 74 75 76 74 72 75 76 74 72 71 71 72 74 75 73 72 73 75 75 75 75 75 74 71 70 69 68 68 70 72 72 71 72 73 75 74 73 72 71 71 71 70 70 70 71 72 72 74 75 74 74 73 71 72 74 74 73 75 73 69 68 68
8600 68 69 72 74 72 71 71 71 72 74 75 76 75 74 74 74 72 73 73 73 72 72 73 72 71 70 71 72 73 74 75 75 74 74 74 74 74 73 72 71 73 72 72 72 71 69 70 72 71 71 74 73 73 73 73 74 74 75 74 73 73 72 73 75 77 75 72 71 73 73 71
8670 71 69 69 72 74 74 73 71 68 69 72 76 76 76 75 75 76 77 76 74 74 74 74 74 73 74 75 76 73 70 70 71 73 74 73 70 69 70 73 74 74 74 74 74 75 75 74 74 76 76 77 76 76 76 75 75 73 72 71 73 74 74 73 71 70 71 71 70 69 69 70
$$ [...]
13531C5
##ENDNTUPLES=	NMRSPECTRUM
##END=	

