{"text_format":"1","workbook":"xlsx","n_sheets":3,"sheets":["InOut","Tests","Poly"],"not_rendered":{"charts":0,"images":0,"macros":1,"external_links":0,"defined_names":0,"comments":0,"pivot_tables":0},"unopened":[],"bounds":{"document_bytes":16777216,"sheet_cells":100000,"rows_first":2000,"rows_last":500,"rows_between":2000,"halvings":0,"cell_chars":16384,"cell_head_chars":4096},"cells_cut":0,"cells_raw":0,"read":"whole","date_system":"1900"}

{"sheet":"InOut","index":0,"n_rows":34,"n_cols":8,"rows_kept":34,"cut":false,"hidden":false,"merged":[]}
[]
["Actual","input"]
["# atoms in plane (3 or 4)",3,{"$f":"IF(AND(B4=(B5+B6),B3=3),\"Arrow (α = β+γ), Chk atoms\",\"\")","v":""}]
["alpha (largest)",146,{"$f":"IF(B4>(B5+B6),\"alpha too large, must be ≤ sum β + γ\",\"\")","v":""}]
["beta",121]
["gamma (smallest)",73]
[]
["Output",null,null,"ideal match"]
["Planar Section:",null,null,"Planar"]
["Sum of Angles",{"$f":"SUM(B4:B6)","v":340},null,"alpha",{"$f":"IF($B$3=3,\"pyramid\",Tests!$B64)","v":"pyramid"},"alpha'",{"$f":"IF($B$3=3,\"pyramid\",IF(B10=360, \" \",Tests!$B74))","v":"pyramid"}]
["Fit asymmetry",{"$f":"IF(B3=3,\"Pyramid? (chk # atoms in plane)\",ROUND(Tests!$B68,3))","v":"Pyramid? (chk # atoms in plane)"},null,"beta",{"$f":"IF($B$3=3,\"pyramid\",Tests!$B65)","v":"pyramid"}]
["polyhedral index",{"$f":"IF(B3=4,IF(SUM(B4:B6)=360,1,\"Arrow? Chk #atoms, angles\"),IF(B3=3,\"See Pyramid / Chk # atoms\",SUM(B4:B6)/360))","v":"See Pyramid / Chk # atoms"},{"$f":"IF(AND(B3=4,B10<360,B4<>(B5+B6)),\"Not Arrow, α<>(β+γ)\",\"\")","v":""},"Gamma",{"$f":"IF($B$3=3,\"pyramid\",Tests!$B66)","v":"pyramid"}]
["name",{"$f":"IF($B3=3,\"See Pyramid/Chk # atoms\",Tests!B63)","v":"See Pyramid/Chk # atoms"},null,"rms deviation (o)",{"$f":"IF($B$3=3,\"pyramid\",IF(AND(B10<360,B5>90),\"Pyramid/Chk atoms Angles\",ROUND(Tests!$B67, 2)))","v":"pyramid"}]
["Alpha distortion (deg) ",{"$f":"IF($B3=3,\"See Pyramid/Chk # atoms\",ABS(Tests!$B$69))","v":"See Pyramid/Chk # atoms"}]
["Beta distortion (deg)",{"$f":"IF($B3=3,\"See Pyramid/Chk # atoms\",ABS(Tests!$B$70))","v":"See Pyramid/Chk # atoms"}]
["Gamma distortion (deg)",{"$f":"IF($B5=3,\"See Pyramid/Chk # atoms\",ABS(Tests!$B$71))","v":5}]
[]
["Pyramid Section:",null,null,"Pyramid"]
["Type",{"$f":"IF(B10=360,\"Planar\",IF(B4>(B5+B6),\"Alpha too large, must be < sum β + γ\",Poly!G52&\" \"&Poly!H52&\" \"&Poly!I52))","v":"Acute  Triclinic  Pyramid"},null,"Base"]
["Name",{"$f":"Poly!B65","v":"17 % α-folded Semi-Orthogonal γ-Compressed Y"},null,{"$f":"IF(OR($B$3=4,AND(Tests!B41=B4,Tests!B42=B5,Tests!$B43=B6)),\"planar! Chk # atoms\",ROUND(Poly!$I58, 1))","v":79.099999999999994},"ALPHA'"]
["dev.(o)",{"$f":"IF(Poly!B64=0.01,0,Poly!B64)","v":1.4139999999999999},null,{"$f":"IF(OR($B$3=4,AND(Tests!B41=B4,Tests!B42=B5,Tests!$B43=B6)),\"planar! Chk # atoms\",ROUND(Poly!$I59, 0))","v":63},"BETA'"]
["ideal Alpha",{"$f":"Poly!B66","v":145},null,{"$f":"IF(OR($B$3=4,AND(Tests!B41=B4,Tests!B42=B5,Tests!$B46=B6)),\"planar! Chk # atoms\",ROUND(Poly!$I60, 0))","v":38},"GAMMA'"]
["ideal Beta",{"$f":"Poly!B67","v":120},null,"Actual Base Projection","ideal match","(Base Projection)"]
["Ideal Gamma",{"$f":"Poly!B68","v":75},null,{"$f":"IF(OR($B$3=4,AND(Tests!B41=B4,Tests!B42=B5,Tests!$B43=B6)),\"planar! Chk # atoms\",Tests!$B41)","v":158},"alpha",{"$f":"IF($B$3=4,\"planar\",Tests!$B64)","v":160},"dev",{"$f":"IF($B$3=4,\"planar\",Tests!$B69)","v":2}]
["height",{"$f":"IF(B10=360,\"Planar\",IF(B10>360,\"ANGLES >360\",IF(B4>(B5+B6),\"Alpha too large\",ROUND(Poly!I66,3))))","v":0.22600000000000001},null,{"$f":"IF(OR($B$3=4,AND(Tests!B41=B4,Tests!B42=B5,Tests!$B43=B6)),\"planar! Chk # atoms\",Tests!$B42)","v":126},"beta",{"$f":"IF($B$3=4,\"planar\",Tests!$B65)","v":120},"dev",{"$f":"IF($B$3=4,\"planar\",Tests!$B70)","v":-6}]
["Alpha incline (deg.)",{"$f":"IF(B10=360,\"Planar\",IF(B10>360,\"ANGLES >360\",IF(B4>(B5+B6),\"Alpha too large\",ROUND(Poly!I67,1))))","v":50.6},null,{"$f":"IF(OR($B$3=4,AND(Tests!B41=B4,Tests!B42=B5,Tests!$B43=B6)),\"planar!, Chk # atoms\",Tests!$B43)","v":75},"Gamma",{"$f":"IF($B$3=4,\"planar\",Tests!$B66)","v":80},"dev",{"$f":"IF($B$3=4,\"planar\",Tests!$B71)","v":5}]
["Beta incline (deg.)",{"$f":"IF(B10=360,\"Planar\",IF(B10>360,\"ANGLES >360\",IF(B4>(B5+B6),\"Alpha too large\",ROUND(Poly!K67,1))))","v":27.3},null,null,"rms deviation (o)",{"$f":"IF($B$3=4,\"planar\",Tests!$B67)","v":4.6547466812563139}]
["gamma incline (deg.)",{"$f":"IF(B10=360,\"Planar\",IF(B10>360,\"ANGLES >360\",IF(B4>(B5+B6),\"Alpha too large\",ROUND(Poly!M67,1))))","v":16.3},null,null,"Type",{"$f":"IF($B3=4,\"See Planar Section\",IF(AND(D25<90,D26<90,D24=SUM(D25,D26)),Tests!B73,Tests!B63))","v":"Near 1/3 γ-Compressed Orthogonal Y (γ expanded)"}]
[null,null,null,null,"edge length",{"$f":"IF(B3=4,\"See Planar Section\",Poly!I57)","v":0.97406379943504973}]
[null,null,null,null,"Asymmetry",{"$f":"IF(B3=4,\"See Planar Section\",Tests!B68)","v":-0.14285714285714285}]
[null,null,null,null,"Tri/Monoclinic relation:"]
[null,null,null,null,{"$f":"IF(B10=360,\"Planar\",IF(B10>360,\"ANGLES >360\",IF(B4>(B5+B6),\"Alpha too large\",Poly!B65)))","v":"17 % α-folded Semi-Orthogonal γ-Compressed Y"}]
[null,null,null,null,"rms deviation (o) (Tri/Mono)"]
[null,null,null,null,{"$f":"IF(B10=360,\"Planar\",IF(B10>360,\"ANGLES >360\",IF(B4>(B5+B6),\"Alpha too large\",IF(Poly!B64=0.01,0,ROUND(Poly!B64,3)))))","v":1.4139999999999999}]

{"sheet":"Tests","index":1,"n_rows":84,"n_cols":34,"rows_kept":84,"cut":false,"hidden":false,"merged":[]}
["monoclinic",null,null,null,"%constriction","1-(γ-60)/120",null,"beta 120 series",null,null,null,null,null,null,"alpha 180 series",null,"oblique",null,null,null,null,"beta 135",null,null,null,"Monoclinic Arrows"]
[{"$f":"(360-C2)/2","v":180},{"$f":"(360-C2)/2","v":180},0,"Closed Y",{"$f":"(1-(C2/120))*100","v":100},null,null,120,120,120,{"$f":"(1-(J2/120))*100","v":0},"trigonal planar",null,null,{"$f":"R2/90","v":0},180,180,{"$f":"P2-Q2","v":0},"Closed Y",null,null,180,135,{"$f":"360-(V2+W2)","v":45},"Inclined Y","alpha","alpha'","beta","gamma","expansion:  (g-45)/45","or (a-90)/90]*100"]
[{"$f":"(360-C3)/2","v":177.5},{"$f":"(360-C3)/2","v":177.5},5,"Closed Y",{"$f":"(1-(C3/120))*100","v":95.833333333333343},"(near)",null,125,120,115,{"$f":"((J3-90)/30)*100","v":83.333333333333343},"α-Expanded Trigonal Plane",null,null,{"$f":"R3/90","v":5.5555555555555552E-2},180,175,{"$f":"P3-Q3","v":5},"γ-expanded Closed Y ",null,null,175,135,{"$f":"360-(V3+W3)","v":50},null,180,{"$f":"360-(AB3+AC3)","v":180},90,90,"T-shape",{"$f":"((AC3/45)-1)*100","v":100},{"$f":"(Z3-90)/90*100","v":100}]
[{"$f":"(360-C4)/2","v":175},{"$f":"(360-C4)/2","v":175},10,"11/12 Constricted γ-dominant Y",91.666666666666657,null,"expansion %",130,120,110,{"$f":"((J4-90)/30)*100","v":66.666666666666657}," 2/3 γ-Expanded Orthogonal Y ",null,null,0.1111111111111111,180,170,10," semi-Oblique Y","(constricted γ)",null,170,135,{"$f":"360-(V4+W4)","v":55},null,170,190,85,85,"8/9 α-Expanded Arrow",88.888888888888886,{"$f":"(Z4-90)/90*100","v":88.888888888888886}]
[{"$f":"(360-C5)/2","v":172.5},172.5,15,"7/8 Constricted γ-dominant Y",87.5,null,"[(b-90)/30]",135,120,105,50," Semi-Orthogonal Y (γ-Expanded)",null,null,0.16666666666666666,180,165,15,"Semi-Oblique Y",null,null,165,135,60,null,160,200,80,80,"7/9 α-Expanded Arrow",77.777777777777771,{"$f":"(Z5-90)/90*100","v":77.777777777777786}]
[170,170,20,"5/6 Constricted γ-dominant Y",83.333333333333343,null,null,140,120,100,33.333333333333329,"1/3 γ-Expanded Orthogonal Y ",null,null,0.22222222222222221,180,160,20,"semi-Oblique Y","(γ- expanded)",null,160,135,65,null,150,210,75,75,"2/3 α-Expanded Arrow",66.666666666666671]
[167.5,167.5,25,"19/24 Constricted γ-dominant Y",79.166666666666657,null,null,145,120,95,16.666666666666664,"1/6 γ-Expanded Orthogonal Y ",null,null,0.27777777777777779,180,155,25,"oblique Y ","(constricted γ)",null,155,135,70,null,140,220,70,70,"5/9 α-Expanded Arrow",55.555555555555557]
[165,165,30,"3/4 Constricted γ-dominant Y",75,null,"%constriction",150,120,90,{"$f":"(1-(J8/120))*100","v":25},"Orthogonal Y ",null,null,0.33333333333333331,180,150,30,"Oblique Y",null,null,150,135,75,null,130,230,65,65,"4/9 α-expanded Arrow",44.444444444444443]
[162.5,162.5,35,"17/24 Constricted γ-dominant Y",70.833333333333329,null,"[(90-b)/30]",155,120,85,{"$f":"(90-J9)/30*100","v":16.666666666666664},"1/6 γ-Compressed Orthogonal Y ",null,null,0.3888888888888889,180,145,35,"oblique Y ","(γ-expanded)",null,145,135,80,null,120,240,60,60,"1/3 α-Expanded Arrow",33.333333333333329]
[160,160,40,"2/3 Constricted γ-dominant Y",66.666666666666671,null,null,160,120,80,{"$f":"(90-J10)/30*100","v":33.333333333333329},"1/3 γ-Compressed Orthogonal Y",null,null,0.44444444444444442,180,140,40," inclined Y"," (constricted γ)",null,140,135,85,null,110,250,55,55,"2/9 α-Expanded Arrow",22.222222222222232]
[157.5,157.5,45,"5/8 Constricted γ-dominant Y",62.5,null,null,165,120,75,50," Semi-Orthogonal Y (γ compressed)",null,"(alpha expanded)",0.5,180,135,45,"Inclined Y",null,null,135,135,90,"1/4 Constricted γ-dominant Y",100,260,50,50,"1/9 α-Expanded Arrow",11.111111111111116]
[155,155,50,"7/12 Constricted γ-dominant Y",58.333333333333329,null,null,170,120,70,66.666666666666657," 2/3 γ-Compressed Orthogonal Y ",null,null,0.55555555555555558,180,130,50,"inclined Y","(γ-expanded)",null,"beta 150",null,null,null,90,270,45,45,"Normal Arrow",0]
[152.5,152.5,55,"13/24 Constricted γ-dominant Y",54.166666666666671,null,null,175,120,65,83.333333333333343,"α-Constricted Oblique T",null,"(gamma expanded)",0.61111111111111116,180,125,55," oblique T","(compressed γ)",null,180,150,{"$f":"360-(V13+W13)","v":30},"Oblique Y",80,280,40,40,"1/9 α-Constricted Arrow",{"$f":"(1-AC13/45)*100","v":11.111111111111116}]
[150,150,60,"1/2 Constricted γ-dominant Y",50,null,"a-expansion %",180,120,60,50,"Oblique T",null,null,0.66666666666666663,180,120,60,"Oblique T",null,null,175,150,{"$f":"360-(V14+W14)","v":35},null,70,290,35,35,"2/9 α-Constricted Arrow",22.222222222222221]
[147.5,147.5,65,"11/24 Constricted γ-dominant Y",45.833333333333336,null,"100(a-90)/90",175,120,55,54.166666666666671,"54% Oblique 17/18 α-Expanded Arrow",null,null,0.72222222222222221,180,115,65,"oblique T","(γ-expanded)",null,170,150,{"$f":"360-(V15+W15)","v":40},null,60,300,30,30,"1/3 α-Constricted Arrow",33.333333333333336]
[145,145,70,"5/12 Constricted γ-dominant Y",41.666666666666664,null,null,170,120,50,58.333333333333329,"58% Oblique 8/9 α-Expanded Arrow",null,null,0.77777777777777779,180,110,70," semi oblique T","(constricted γ)",null,165,150,45,null,50,310,25,25,"4/9 α-Constricted Arrow",44.444444444444443]
[142.5,142.5,75,"3/8 Constricted γ-dominant Y",37.5,null,null,165,120,45,62.5,"62.5% Oblique 15/18 α-Expanded Arrow",null,null,0.83333333333333337,180,105,75,"Semi oblique T",null,null,160,150,50,null,40,320,20,20,"5/9 α-Constricted Arrow",55.555555555555557]
[140,140,80,"1/3 Constricted γ-dominant Y",33.333333333333336,null,null,160,120,40,66.666666666666671,"2/3 Oblique 7/9 α-Expanded Arrow",null,null,0.88888888888888884,180,100,80,"semi oblique T ","(γ-expanded)",null,155,150,55,null,30,330,15,15,"2/3 α-Constricted Arrow",66.666666666666671]
[137.5,137.5,85,"7/24 Constricted γ-dominant Y",29.166666666666664,null,null,155,120,35,70.833333333333329,"71% Oblique 13/18 α-Expanded Arrow",null,null,0.94444444444444442,180,95,85,"T -shape","(constricted γ)",null,150,150,60,"1/2 Constricted γ-dominant Y",20,340,10,10,"7/9 α-Constricted Arrow",77.777777777777786]
[135,135,90,"1/4 Constricted γ-dominant Y",25,null,null,150,120,30,75,"3/4 oblique 2/3 α-Expanded Arrow",null,null,1,180,90,90,"T-shape",null,null,"beta 165",null,null,null,10,350,5,5,"8/9 α-Constricted Arrow",88.888888888888886]
[132.5,132.5,95,"5/24 Constricted γ-dominant Y",20.833333333333336,null,null,145,120,25,79.166666666666657,"79% oblique 11/18  α-Expanded Arrow ",null,null,null,"gamma 90",null,"compression: (120-b)/30",null,null,null,180,165,15,"Semi-closed Oblique Y",0,360,0,0,"Closed arrow",100]
[130,130,100,"1/6 Constricted γ-dominant Y",16.666666666666664,null,null,140,120,20,83.333333333333343,"83% Oblique 5/9  α-Expanded Arrow ",null,null,null,180,90,90,"T-Shape",null,null,175,165,20,null,"arrows defined by alpha(')",null,null,"at 5's round up:  "]
[127.5,127.5,105,"1/8 Constricted γ-dominant Y",12.5,null,null,135,120,15,87.5,"87.5% Oblique 1/2  α-Expanded Arrow ",null,null,null,{"$f":"360-(Q23+R23)","v":175},95,90,"T-shape (expanded β)",null,null,170,165,25,null,"g/b = ","obliqueness of arrow",null,"%oblique","(1-g/gmax)*100%"]
[125,125,110,"1/12 Constricted γ-dominant Y",8.3333333333333375,null,null,130,120,10,91.666666666666657,"92% Oblique 4/9 α-Expanded Arrow ",null,null,null,{"$f":"360-(Q24+R24)","v":170},100,90,"2/3  β- compressed Orthogonal Y",null,null,165,165,30,"3/4 Constricted γ-dominant Y",0,"oblique"]
[122.5,122.5,115,"trigonal",4.1666666666666625,null,null,125,120,5,95.833333333333343,"96% Oblique 7/18 α-Expanded Arrow",null,null,null,165,105,90,"Semi-Orthogonal Y (β- compressed) ",null,null,"beta 105",null,null,null,0.25,"3/4 oblique","( g constricted)"]
[120,120,120,"trigonal planar",0,null,null,120,120,0,100,"Oblique 1/3  α-Expanded Arrow (folded trigonal plane)",null,null,null,160,110,90,"1/3 β-compressed Orthogonal Y",null,null,180,105,75,"Semi oblique T",0.33,"2/3 oblique"]
[125,117.5,117.5,"trigonal",{"$f":"(1-((B27-90)/30))*100","v":8.3333333333333375},null,null,"See Arrow head section for naming",null,null,"obliqueness:  (1-g/120)*100",null,null,null,null,155,115,90,"1/6 β-compressed Orthogonal Y",null,null,175,105,80,null,0.5,"Semi-oblique"]
[130,115,115,"1/6 Expanded α-dominant Y",{"$f":"(1-((B28-90)/30))*100","v":16.666666666666664},null,null,null,null,null,null,null,null,null,null,150,120,90,"Orthogonal Y",null,null,170,105,85,null,0.67,"1/3 oblique","(gamma expanded)"]
[135,112.5,112.5,"1/4 Expanded α-dominant Y",25,null,null,null,null,null,null,null,null,null,null,145,125,90,"1/3 β-expanded Orthogonal Y",null,null,165,105,90,"1/2 β- compressed Orthogonal Y",0.75,"quarter oblique","(gamma expanded)"]
[{"$f":"360-(B30+C30)","v":140},110,110,"1/3 Expanded α-dominant Y",33.333333333333336,null,null,null,null,null,null,null,null,null,null,140,130,90,"2/3 β-Expanded Orthogonal Y",null,null,160,105,95,null,1,"monoclinic"]
[145,107.5,107.5," 1/2 Expanded α-dominant Y",41.666666666666664,null,null,null,null,null,null,null,null,null,null,{"$f":"360-(Q31+R31)","v":135},135,90,"1/4 Constricted γ-dominant Y",null,null,155,105,100]
[150,105,105,"1/2 Expanded α-dominant Y",50,null,null,null,null,null,null,null,null,null,null,null,"expansion: (b-120)/15",null,null,null,null,150,105,105,"1/2 Expanded α-dominant Y"]
[155,102.5,102.5," 1/2 Expanded α-dominant Y",58.333333333333329]
[160,100,100,"2/3 Expanded α-dominant Y",66.666666666666671]
[165,97.5,97.5," 3/4 Expanded α-dominant Y",75]
[{"$f":"360-(B36+C36)","v":170},95,95," 3/4 Expanded α-dominant Y",83.333333333333343]
[175,92.5,92.5,"T-shape",91.666666666666657]
[180,90,90,"T-shape",100,null,null,null,null,null,null,null,null,null,null,null,"alpha180 (beta)",null,null,"gamma 90",null,null,null,null,null,null,"actual"]
[null,null,null,null,"expansion %",null,null,null,null,null,null,null,null,null,null,null,"actual",null,null,null,null,null,null,null,null,null,{"$f":"$B41","v":158},"oblique",null,"asym g/b"]
["INPUT",null,null,null,"[(a-120)/60]*100",null,null,null,null,null,null,null,null,null,"gamma",null,{"$f":"360-B42-B43","v":159},"gamma","gamma","round alpha",null,"round beta",null,null,null,null,{"$f":"$B42","v":126},{"$f":"(1-(2*AA41/AA39))*100","v":5.0632911392405111}]
["alpha",{"$f":"IF(InOut!$B3=4,InOut!$B4,IF(InOut!$B3=3,Poly!$K58,\"Atom#ERR\"))","v":158},null,null,{"$f":"$B41","v":158},null,null,null,{"$f":"$B41","v":158},null,null,null,null,null,"round half",{"$f":"P42*0.5+P43*0.5","v":75},{"$f":"InOut!B5","v":121},"round half",{"$f":"(S42+S43)/2","v":75},"up",{"$f":"ROUNDUP(Q40, -1)","v":160},"up",{"$f":"ROUNDUP(Q41, -1)","v":130},null,null,null,{"$f":"$B43","v":75}]
["beta",{"$f":"IF(InOut!$B3=4,InOut!$B5,IF(InOut!$B3=3,Poly!$K59,\"Atom#ERR\"))","v":126},null,null,{"$f":"B42","v":126},null,null,null,{"$f":"$B42","v":126},null,null,null,null,null,"gamma up",{"$f":"ROUNDUP(P44,0)*10","v":80},{"$f":"InOut!B6","v":73},"roundup",{"$f":"ROUNDUP(S44,-1)","v":80},"half",{"$f":"(U41+U43)/2","v":155},"half",{"$f":"(W41+W43)/2","v":125},null,null,null,"alpha up",{"$f":"ROUNDUP(B41,-1)","v":160},"beta up",{"$f":"ROUNDUP($B42,-1)","v":130},"gam up",{"$f":"ROUNDUP($B43,-1)","v":80}]
["gamma",{"$f":"IF(InOut!$B3=4,InOut!$B6,IF(InOut!$B3=3,Poly!$K60,\"Atom#ERR\"))","v":75},null,null,{"$f":"B43","v":75},null,null,null,{"$f":"$B43","v":75},null,null,null,"Triclinic",null,"gamma down",{"$f":"ROUNDDOWN(P44,0)*10","v":70},"g/90","rounddown",{"$f":"ROUNDDOWN(S44,-1)","v":70},"down",{"$f":"ROUNDDOWN(Q40, -1)","v":150},"down",{"$f":"ROUNDDOWN(Q41, -1)","v":120},null,null,null,"alpha down",{"$f":"ROUNDDOWN(B41,-1)","v":150},"beta dwn",{"$f":"ROUNDDOWN($B42,-1)","v":120},"gam dwn",{"$f":"ROUNDDOWN($B43,-1)","v":70}]
["TESTS",null,null,"Monoclinic",null,null,null,null,null,null,null,null,"gamma/120",{"$f":"$B43/120","v":0.625},"*12=",{"$f":"N44*12","v":7.5},"oblique",{"$f":"$B43/90","v":0.83333333333333337},{"$f":"R44*90","v":75},null,null,null,null,null,null,"Arrows","Monoclinic",null,null,null,null,null,"Triclinic"]
["Trigonal",null,null,"g-dominant","rndup","rndhlf","down10","a-dominant","rndup","rnd hlf","rnd dwn",null,"beta120","rndup","(mid)","(down)","(up)","(half)","(down)","a up","a half","a down","b up","b half","b dwn",null,"alpha'",{"$f":"360-AB42","v":200},{"$f":"360-AB43","v":210},{"$f":"360-AD46","v":100},{"$f":"360-AE46","v":120},200,220,150]
["alpha",120,null,"alpha",{"$f":"ROUNDUP($E41,-1)","v":160},{"$f":"($E46+$G46)/2","v":155},{"$f":"ROUNDDOWN(E41,-1)","v":150},"alpha",{"$f":"ROUNDUP(I41,-1)","v":160},{"$f":"(I46+K46)/2","v":155},{"$f":"ROUNDDOWN(I41,-1)","v":150},null,"alpha",{"$f":"360-(N47+N48)","v":160},{"$f":"(N46+P46)/2","v":165},{"$f":"360-(P47+P48)","v":170},180,180,180,{"$f":"U41","v":160},{"$f":"U42","v":155},{"$f":"U43","v":150},{"$f":"360-(W47+W48)","v":140},{"$f":"360-(X47+X48)","v":145},150,null,"alpha",{"$f":"AB42","v":160},{"$f":"AB43","v":150},{"$f":"SUM(AD47,AD48)","v":260},{"$f":"SUM(AE47,AE48)","v":240},160,140,210]
["beta",120,null,"beta",{"$f":"$E46","v":160},{"$f":"$F46","v":155},{"$f":"G46","v":150},"beta",{"$f":"(360-I46)/2","v":100},{"$f":"(I47+K47)/2","v":102.5},{"$f":"(360-K46)/2","v":105},null,"beta",120,{"$f":"120","v":120},120,{"$f":"180-Q48","v":100},{"$f":"180-R48","v":105},{"$f":"180-S48","v":110},{"$f":"360-(T46+T48)","v":110},{"$f":"360-(U46+U48)","v":115},120,{"$f":"W41","v":130},{"$f":"W42","v":125},{"$f":"W43","v":120},null,"beta",{"$f":"(AB45)/2","v":100},{"$f":"(AC45)/2","v":105},{"$f":"AD42","v":130},{"$f":"AD43","v":120},{"$f":"AF42","v":80},{"$f":"AF43","v":70},{"$f":"ROUND(AA40,-1)","v":130}]
["gamma",120,null,"gamma",{"$f":"360-($E46+$E47)","v":40},{"$f":"360-($F46+$F47)","v":50},{"$f":"360-(G46*2)","v":60},"gamma",{"$f":"I47","v":100},102.5,{"$f":"K47","v":105},null,"gamma",{"$f":"P42","v":80},{"$f":"360-(O46+O47)","v":75},{"$f":"P43","v":70},{"$f":"S42","v":80},{"$f":"S41","v":75},{"$f":"S43","v":70},90,90,90,90,90,90,null,"gamma",{"$f":"AB47","v":100},{"$f":"AC47","v":105},{"$f":"AD42","v":130},{"$f":"AD43","v":120},{"$f":"AF42","v":80},{"$f":"AF43","v":70},{"$f":"ROUND(AA41,-1)","v":80}]
[]
["normrms",{"$f":"(1/SQRT(3))*(SQRT(SUMSQ(B52:B54)))","v":34.180891347847172},null,"normrms",{"$f":"(1/SQRT(3))*(SQRT(SUMSQ($E52:$E54)))","v":28.195744359743372},{"$f":"(1/SQRT(3))*(SQRT(SUMSQ($F52:$F54)))","v":22.173557826083453},{"$f":"(1/SQRT(3))*(SQRT(SUMSQ($G52:$G54)))","v":16.980380835933374},"normrms",{"$f":"(1/SQRT(3))*(SQRT(SUMSQ(I52:I54)))","v":20.85665361461421},{"$f":"(1/SQRT(3))*(SQRT(SUMSQ(J52:J54)))","v":20.956303745333212},21.641010450839246,null,"normrms",{"$f":"(1/SQRT(3))*(SQRT(SUMSQ(N52:N54)))","v":4.6547466812563139},5.3229064742237711,8.2663978450914968,19.874606914351794,17.559422921421234,15.968719422671313,12.714820748507101,10.87811258138715,10.408329997330664,13.723459233492603,11.474609652039005,10.408329997330664,null,"normrms",{"$f":"IF(AA39<>(AA40+AA41),1000,(1/SQRT(3))*(SQRT(SUMSQ(AB52:AB54))))","v":1000},{"$f":"IF(AA39<>(AA40+AA41),1000,(1/SQRT(3))*(SQRT(SUMSQ(AC52:AC54))))","v":1000},{"$f":"IF(AA39<>(AA40+AA41),1000,(1/SQRT(3))*(SQRT(SUMSQ(AD52:AD54))))","v":1000},{"$f":"IF(AA39<>(AA40+AA41),1000,(1/SQRT(3))*(SQRT(SUMSQ(AE52:AE54))))","v":1000},{"$f":"IF(AA39<>(AA40+AA41),1000,(1/SQRT(3))*(SQRT(SUMSQ(AF52:AF54))))","v":1000},{"$f":"IF(AA39<>(AA40+AA41),1000,(1/SQRT(3))*(SQRT(SUMSQ(AG52:AG54))))","v":1000},{"$f":"IF(AA39<>(AA40+AA41),1000,(1/SQRT(3))*(SQRT(SUMSQ(AH52:AH54))))","v":1000}]
["asym",{"$f":"IF(B48-B43=0,0,(B47-B42)/(B48-B43))","v":-0.13333333333333333},null,"asym",{"$f":"IF($E48-$B43=0,0,($E47-$B42)/($E48-$B43))","v":-0.97142857142857142},{"$f":"IF($F48-$B43=0,0,($F47-$B42)/($F48-$B43))","v":-1.1599999999999999},{"$f":"IF($G48-$B43=0,0,($G47-$B42)/($G48-$B43))","v":-1.6},"Asym",{"$f":"IF(I48-$B43=0,0,(I47-$B42)/(I48-$B43))","v":-1.04},{"$f":"IF(J48-$B43=0,0,(J47-$B42)/(J48-$B43))","v":-0.8545454545454545},{"$f":"IF(K48-$B43=0,0,(K47-$B42)/(K48-$B43))","v":-0.7},null,"Asymm",{"$f":"IF(N48-InOut!$B$6=0,0,(N47-InOut!$B$5)/(N48-InOut!$B$6))","v":-0.14285714285714285},{"$f":"IF(O48-InOut!$B$6=0,0,(O47-InOut!$B$5)/(O48-InOut!$B$6))","v":-0.5},{"$f":"IF(P48-InOut!$B$6=0,0,(P47-InOut!$B$5)/(P48-InOut!$B$6))","v":0.33333333333333331},{"$f":"IF(Q54=0,0,(Q47-InOut!$B$5)/(Q48-InOut!$B$6))","v":-3},{"$f":"IF(R54=0,0,(R47-InOut!$B$5)/(R48-InOut!$B$6))","v":0},{"$f":"IF(S54=0,0,(S47-InOut!$B$5)/(S48-InOut!$B$6))","v":3.6666666666666665},{"$f":"IF(T54=0,0,(T47-InOut!$B$5)/(T48-InOut!$B$6))","v":-0.6470588235294118},{"$f":"IF(U54=0,0,(U47-InOut!$B$5)/(U48-InOut!$B$6))","v":-0.35294117647058826},{"$f":"IF(V54=0,0,(V47-InOut!$B$5)/(V48-InOut!$B$6))","v":-5.8823529411764705E-2},{"$f":"IF(W54=0,0,(W47-InOut!$B$5)/(W48-InOut!$B$6))","v":0.52941176470588236},{"$f":"IF(X54=0,0,(X47-InOut!$B$5)/(X48-InOut!$B$6))","v":0.23529411764705882},{"$f":"IF(Y54=0,0,(Y47-InOut!$B$5)/(Y48-InOut!$B$6))","v":-5.8823529411764705E-2},null,"Asymm",{"$f":"IF(AND(AB53=0,AB54=0),AB48/AB47,IF(AB47-$AA40=0,0,(AB48-$AA$41)/(AB47-$AA$40)))","v":-0.96153846153846156},-1.4285714285714286,13.75,-7.5,-0.10869565217391304,8.9285714285714288E-2,{"$f":"IF(AND(AH53=0,AH54=0),AH48/AH47,IF(AH47-$AA40=0,0,(AH48-$AA$41)/(AH47-$AA$40)))","v":1.25}]
["delta a",{"$f":"B46-$B41","v":-38},null,"delta a",{"$f":"$E41-E46","v":-2},3,{"$f":"E41-G46","v":8},"delta a",{"$f":"I41-I46","v":-2},{"$f":"I41-J46","v":3},{"$f":"I41-K46","v":8},null,"delta a",{"$f":"N46-B41","v":2},{"$f":"O46-B41","v":7},{"$f":"P46-B41","v":12},{"$f":"Q46-B41","v":22},{"$f":"R46-B41","v":22},{"$f":"S46-B41","v":22},{"$f":"T46-$B41","v":2},{"$f":"U46-$B41","v":-3},-8,-18,-13,-8,null,"delta a",{"$f":"AB46-$AA$39","v":2},{"$f":"AC46-$AA$39","v":-8},{"$f":"AD46-$AA$39","v":102},{"$f":"AE46-$AA$39","v":82},{"$f":"AF46-$AA$39","v":2},-18,52]
["delta b",{"$f":"B47-$B42","v":-6},null,"delta b",-34,-29,{"$f":"E42-G47","v":-24},"delta b",{"$f":"I42-I47","v":26},{"$f":"I42-J47","v":23.5},{"$f":"I42-K47","v":21},null,"delta b",{"$f":"N47-B42","v":-6},{"$f":"O47-B42","v":-6},{"$f":"P47-B42","v":-6},{"$f":"Q47-B42","v":-26},{"$f":"R47-B42","v":-21},{"$f":"S47-B42","v":-16},{"$f":"T47-$B42","v":-16},{"$f":"U47-$B42","v":-11},-6,4,-1,-6,null,"delta b",{"$f":"AB47-AA40","v":-26},{"$f":"AC47-AA40","v":-21},{"$f":"AD47-AA40","v":4},{"$f":"AE47-AA40","v":-6},{"$f":"AF47-AA40","v":-46},{"$f":"AG47-AA40","v":-56},{"$f":"$AH47-$AA40","v":4}]
["delta g",{"$f":"B48-$B43","v":45},null,"delta g",35,25,{"$f":"E43-G48","v":15},"delta g",{"$f":"I43-I48","v":-25},{"$f":"I43-J48","v":-27.5},{"$f":"I43-K48","v":-30},null,"delta g",{"$f":"N48-B43","v":5},{"$f":"O48-B43","v":0},{"$f":"P48-B43","v":-5},{"$f":"Q48-B43","v":5},{"$f":"R48-B43","v":0},{"$f":"S48-B43","v":-5},{"$f":"T48-$B43","v":15},{"$f":"U48-$B43","v":15},15,15,15,15,null,"delta g",{"$f":"AB48-AA41","v":25},{"$f":"AC48-AA41","v":30},{"$f":"AD48-AA41","v":55},{"$f":"AE48-AA41","v":45},{"$f":"AF48-AA41","v":5},{"$f":"AG48-AA41","v":-5},{"$f":"$AH48-$AA41","v":5}]
[null,{"$f":"IF($B54=0,\"trigonal planar\",IF($B54<=15,\"near trigonal\",\"not trigonal\"))","v":"not trigonal"},null,null,{"$f":"IF(E46=120,$B55,IF(E50=0,VLOOKUP(E46,$B2:$F38,3,FALSE),\"near \"&VLOOKUP(E46,$B2:$F38,3,FALSE)&IF(E54<0,\" (γ constricted)\",IF(E54>0,\" (γ expanded)\",\" \"))))","v":"near 2/3 Constricted γ-dominant Y (γ expanded)"},{"$f":"IF(F46=120,$B55,IF(F50=0,VLOOKUP(F46,$B2:$F38,3,FALSE),\"near \"&VLOOKUP(F46,$B2:$F38,3,FALSE)&IF(F54<0,\" (γ constricted)\",IF(F54>0,\" (γ expanded)\",\" \"))))","v":"near 7/12 Constricted γ-dominant Y (γ expanded)"},{"$f":"IF(G46=120,$B55,IF(G50=0,VLOOKUP(G46,$B2:$F38,3,FALSE),\"near \"&VLOOKUP(G46,$B2:$F38,3,FALSE)&IF(G54<0,\" (γ constricted)\",IF(G54>0,\" (γ expanded)\",\" \"))))","v":"near 1/2 Constricted γ-dominant Y (γ expanded)"},null,"near 2/3 Constricted γ-dominant Y (γ constricted)","near 7/12 Constricted γ-dominant Y (γ constricted)","near 1/2 Constricted γ-dominant Y (γ constricted)",null,null,{"$f":"IF(N50=0,VLOOKUP(N46,$H$1:$L$26,5,FALSE),\"Near \"& VLOOKUP(N46,$H$1:$L$26,5,FALSE)&  IF(N54>0,\" (γ expanded)\",IF(N54<0,\" (γ constricted)\",IF(N53<0,\"(β-Expanded)\",\"(β- compressed)\"))))","v":"Near 1/3 γ-Compressed Orthogonal Y (γ expanded)"},{"$f":"IF(O50=0,VLOOKUP(O46,$H$1:$L$26,5,FALSE),\"Near \"& VLOOKUP(O46,$H$1:$L$26,5,FALSE)&  IF(O54>0,\" (γ constricted)\",IF(O54<0,\" (γ expanded)\",IF(O53<0,\"(β-Expanded)\",\"(β- compressed)\"))))","v":"Near  Semi-Orthogonal Y (γ compressed)(β-Expanded)"},"Near  2/3 γ-Compressed Orthogonal Y  (γ expanded)","Near Oblique T (γ constricted)","Near Oblique T(β-Expanded)","Near Oblique T (γ expanded)",{"$f":"IF(T50=0,VLOOKUP(T46,$P$22:$S$31,4,FALSE),\"Near \"& VLOOKUP(T46,$P$22:$S$31,4,FALSE)&  IF(T54>0,\" (γ constricted)\",IF(T54<0,\" (γ expanded)\",IF(T53<0,\"(β-Expanded)\",\"(β- compressed)\"))))","v":"Near 1/3 β-compressed Orthogonal Y (γ constricted)"},{"$f":"IF(U50=0,VLOOKUP(U46,$P$22:$S$31,4,FALSE),\"Near \"& VLOOKUP(U46,$P$22:$S$31,4,FALSE)&  IF(U54>0,\" (γ constricted)\",IF(U54<0,\" (γ expanded)\",IF(U53<0,\"(β-Expanded)\",\"(β- compressed)\"))))","v":"Near 1/6 β-compressed Orthogonal Y (γ constricted)"},"Near Orthogonal Y (γ constricted)",{"$f":"IF(W50=0,VLOOKUP(W47,$Q$22:$S$31,3,FALSE),\"Near \"& VLOOKUP(W47,$Q$22:$S$31,3,FALSE)&  IF(W54>0,\" (γ constricted)\",IF(W54<0,\" (γ expanded)\",IF(W53<0,\"(β-Expanded)\",\"(β- compressed)\"))))","v":"Near 2/3 β-Expanded Orthogonal Y (γ constricted)"},{"$f":"IF(X50=0,VLOOKUP(X47,$Q$22:$S$31,3,FALSE),\"Near \"& VLOOKUP(X47,$Q$22:$S$31,3,FALSE)&  IF(X54>0,\" (γ constricted)\",IF(X54<0,\" (γ expanded)\",IF(X53<0,\"(β-Expanded)\",\"(β- compressed)\"))))","v":"Near 1/3 β-expanded Orthogonal Y (γ constricted)"},"Near Orthogonal Y (γ constricted)",null,"name",{"$f":"IF(AB50=0,VLOOKUP(AB46,$Z$3:$AD$21,5,FALSE), IF($AB$52<>0,\"near \",\" \")&VLOOKUP(AB46,$Z$3:$AD$21,5,FALSE)&\" (\"&ROUND(AB$40,2)&\" % oblique)\")","v":"near 7/9 α-Expanded Arrow (5.06 % oblique)"},{"$f":"IF(AC50=0,VLOOKUP(AC46,$Z$3:$AD$21,5,FALSE), IF($AC$52<>0,\"near \",\" \")&VLOOKUP(AC46,$Z$3:$AD$21,5,FALSE)&\" (\"&ROUND($AB$40,2)&\" % oblique)\")","v":"near 2/3 α-Expanded Arrow (5.06 % oblique)"},{"$f":"IF(AD50=0,VLOOKUP(AD46,$Z$3:$AD$21,5,FALSE), IF($AD$52<>0,\"near \",\" \")&VLOOKUP(AD46,$Z$3:$AD$21,5,FALSE)&\" (\"&ROUND($AB$40,2)&\" % oblique)\")","v":{"$error":"#N/A"}},{"$f":"IF(AE50=0,VLOOKUP(AE46,$Z$3:$AD$21,5,FALSE), IF($AE$52<>0,\"near \",\" \")&VLOOKUP(AE46,$Z$3:$AD$21,5,FALSE)&\" (\"&ROUND($AB$40,2)&\" % oblique)\")","v":{"$error":"#N/A"}},{"$f":"IF(AF50=0,VLOOKUP(AF46,$Z$3:$AD$21,5,FALSE), IF($AF$52<>0,\"near \",\" \")&VLOOKUP(AF46,$Z$3:$AD$21,5,FALSE)&\" (\"&ROUND($AB$40,2)&\" % oblique)\")","v":"near 7/9 α-Expanded Arrow (5.06 % oblique)"},{"$f":"IF(AG50=0,VLOOKUP(AG46,$Z$3:$AD$21,5,FALSE), IF($AG$52<>0,\"near \",\" \")&VLOOKUP(AG46,$Z$3:$AD$21,5,FALSE)&\" (\"&ROUND($AB$40,2)&\" % oblique)\")","v":"near 5/9 α-Expanded Arrow (5.06 % oblique)"},{"$f":"IF(AND(AH50=0,AH48=0),\"Closed \"&VLOOKUP(AH46,$Z$3:$AD$21,5,FALSE),IF(AH50=0,VLOOKUP(AH46,$Z$3:$AD$21,5,FALSE)&\" (\"&ROUND($AB$40,2)&\" % oblique)\", IF(AH48=0,\"Closed\",IF($AH54<>0,\"near \",\" \")&VLOOKUP(AH46,$Z$3:$AD$21,5,FALSE)&\" (\"&ROUND($AB$40,2)&\" % oblique)\")))","v":{"$error":"#N/A"}}]
["alpha",120,null,null,{"$f":"E46","v":160},155,{"$f":"G46","v":150},null,{"$f":"I46","v":160},{"$f":"J46","v":155},{"$f":"K46","v":150},null,null,{"$f":"N46","v":160},{"$f":"O46","v":165},{"$f":"P46","v":170},{"$f":"Q46","v":180},180,180,{"$f":"T46","v":160},155,150,140,145,150,null,"Alpha",{"$f":"AB46","v":160},150,260,240,160,140,210]
["Beta",120,null,null,{"$f":"E47","v":160},155,{"$f":"G47","v":150},null,{"$f":"I47","v":100},{"$f":"J47","v":102.5},{"$f":"K47","v":105},null,null,{"$f":"N47","v":120},120,120,100,105,110,{"$f":"T47","v":110},115,120,130,125,120,null,"beta",100,105,130,120,80,70,130]
["gamma",120,null,null,{"$f":"E48","v":40},50,{"$f":"G48","v":60},null,{"$f":"I48","v":100},{"$f":"J48","v":102.5},{"$f":"K48","v":105},null,null,80,75,70,80,75,70,{"$f":"T48","v":90},90,90,90,90,90,null,"gama",100,105,130,120,80,70,80]
[null,null,null,null,null,null,null,null,null,null,null,null,null,null,null,null,"t with Xo alpha distortion and xo gamma distortion",null,null,null,null,null,null,null,null,null,"Alpha'",{"$f":"AB45","v":200},210,100,120,200,220,150]
[null,null,null,null,null,null,null,null,null,null,null,null,null,null,null,null,"(beta distortion implied)"]
["Indexing","Planar",null,"Pyramid"]
["normal"]
["Name",{"$f":"HLOOKUP($B67, A50:AH55,6,FALSE)","v":"Near 1/3 γ-Compressed Orthogonal Y (γ expanded)"}]
["ideal a",{"$f":"HLOOKUP($B$67, $A$50:$AH$58,7,FALSE)","v":160}]
["ideal b",{"$f":"HLOOKUP($B$67, $A$50:$AH$58,8,FALSE)","v":120}]
["ideal g",{"$f":"HLOOKUP($B$67, $A$50:$AH$58,9,FALSE)","v":80}]
["Min:",{"$f":"MIN(B50,E50:G50,I50:K50,N50:P50,Q50:Y50, AB50:AH50)","v":4.6547466812563139}]
["Asymm",{"$f":"HLOOKUP($B$67, $A$50:$AH$55,2,FALSE)","v":-0.14285714285714285}]
["a deviate",{"$f":"HLOOKUP($B$67, $A$50:$AH$55,3,FALSE)","v":2}]
["b deviate",{"$f":"HLOOKUP($B$67, $A$50:$AH$55,4,FALSE)","v":-6}]
["g deviate",{"$f":"HLOOKUP($B$67, $A$50:$AH$55,5,FALSE)","v":5}]
["Arrow"]
["Name",{"$f":"HLOOKUP($B$78,$AB$50:$AH$58,6,FALSE)","v":"near 7/9 α-Expanded Arrow (5.06 % oblique)"}]
["Ideala'",{"$f":"HLOOKUP($B$78,$AB$50:$AH$59,10,FALSE)","v":200}]
["Ideal a",{"$f":"HLOOKUP($B$78,$AB$50:$AH$58,7,FALSE)","v":160}]
["ideal b",{"$f":"HLOOKUP($B$78,$AB$50:$AH$58,8,FALSE)","v":100}]
["ideal g",{"$f":"HLOOKUP($B$78,$AB$50:$AH$58,9,FALSE)","v":100}]
["Min:",{"$f":"MIN(AB50:AH50)","v":1000}]
["Asym",{"$f":"HLOOKUP($B$78,$AB$50:$AH$58,2,FALSE)","v":-0.96153846153846156}]
["a dev",{"$f":"HLOOKUP($B$78,$AB$50:$AH$58,3,FALSE)","v":2}]
["b dev",{"$f":"HLOOKUP($B$78,$AB$50:$AH$58,4,FALSE)","v":-26}]
["g dev",{"$f":"HLOOKUP($B$78,$AB$50:$AH$58,5,FALSE)","v":25}]
[]
["min",{"$f":"MIN(B67,B78)","v":4.6547466812563139}]

{"sheet":"Poly","index":2,"n_rows":155,"n_cols":171,"rows_kept":155,"cut":false,"hidden":false,"merged":[]}
[null,"Trigonal",null,null,null,"edge","b (base length)","s (slant height)","a (apothem height)","a1","a2","h","h check",null,"Monoclinic","a,b=150 series",null,"%fold",null,null,null,null,null,null,null,null,null,null,null,null,null,null,null,null,null,"zero prblm","RMSD","a,b=120 series",null,null,null,null,null,null,"alpha fold","Orthogonal Y",null,null,"folding",null,"zero issue","rmsd","alpha fold","semiorthogonal Y (g expanded)","gamma ref",null,null,null,"zero issue","rmsd","Triclinic","semiorthogonal Y (g expanded)","gamma ref",null,null,null,"zero issue","rmsd","Triclinic","semiorthogonal Y (g expanded)","gamma ref",null,null,"zero issue","rmsd","Monoclinic","T-Shape","alpha ref",null,"zero issue","rmsd","Monoclinic","a-dominant","a-ref",null,"zero issue","rmsd","Monoclinic","a-dominant","a-ref",null,null,"zero issue","rmsd","Monoclinic","a-dominant","a-ref",null,null,"zero issue","rmsd","Monoclinic ","Arrow","a-ref",null,null,"zero issue","rmsd","Triclinic","orthogonal Y","gamma ref",null,null,null,null,"zero issue","rmsd","Triclinic","semiorthogonal Y (g expanded)","gamma ref",null,null,null,"zero issue","rmsd","Triclinic","semiorthogonal Y (g expanded)","gamma ref",null,null,null,"zero issue","rmsd","Triclinic","semiorthogonal Y (g expanded)","gamma ref",null,"zero issue","rmsd","Triclinic","a180 series","gamma ref",null,null,"zero issue","rmsd","Triclinic","a180 series","gamma ref",null,null,"zero issue","rmsd","Triclinic","a180 series","gamma ref",null,null,"zero issue","rmsd","Triclinic","a180 series","gamma ref",null,null,"zero issue","rmsd","Triclinic","a180 series","gamma ref"]
[{"$f":"(SUM(B2:D2)/360)","v":1},120,120,120,"Trigonal planar",1,{"$f":"2*SIN(RADIANS(B2/2))","v":1.7320508075688772},{"$f":"COS(RADIANS(B2/2))","v":0.50000000000000011},{"$f":"G2*COS(RADIANS(30))","v":1.5},{"$f":"(G2/2)*TAN(RADIANS(30))","v":0.49999999999999994},{"$f":"(G2/2)/COS(RADIANS(30))","v":0.99999999999999989},{"$f":"SQRT(F2^2-K2^2)","v":1.4901161193847656E-8},{"$f":"SQRT((H2^2)-(J2^2))","v":1.2904784139758924E-8},null,150,150,60,"Constricted Y",null,null,null,null,null,null,null,null,null,null,null,null,null,null,null,null,null,{"$f":"IF(AK2=0,0.01,AK2)","v":31.015999999999998},{"$f":"ROUND((1/SQRT(3))*SQRT(($A$29-AL2)^2+($A$30-AM2)^2+($A$31-AN2)^2),3)","v":31.015999999999998},120,120,120,"trigonal planar",null,null,{"$f":"IF(AS2=0,0.01,AS2)","v":10.1},{"$f":"ROUND((1/SQRT(3))*SQRT(($A$29-AT2)^2+($A$30-AU2)^2+($A$31-AV2)^2),3)","v":10.1},150,120,90,"Orthogonal Y",null,{"$f":"IF(AZ2=0,0.01,AZ2)","v":19.545000000000002},{"$f":"ROUND((1/SQRT(3))*SQRT(($A$29-BA2)^2+($A$30-BB2)^2+($A$31-BC2)^2),3)","v":19.545000000000002},135,120,105,"Semi-Orthogonal γ-Expanded Y",null,null,{"$f":"IF(BH2=0,0.01,BH2)","v":11.045},{"$f":"ROUND((1/SQRT(3))*SQRT(($A$29-BI2)^2+($A$30-BJ2)^2+($A$31-BK2)^2),3)","v":11.045},165,120,75,"Semi-Orthogonal γ-Compressed Y",null,null,{"$f":"IF(BP2=0,0.01,BP2)","v":17.378},{"$f":"ROUND((1/SQRT(3))*SQRT(($A$29-BQ2)^2+($A$30-BR2)^2+($A$31-BS2)^2),3)","v":17.378},165,105,90,"Semi-Orthogonal β-Compressed Y",null,{"$f":"IF(BW2=0,0.01,BW2)","v":28.32},{"$f":"ROUND((1/SQRT(3))*SQRT(($A$29-BX2)^2+($A$30-BY2)^2+($A$31-BZ2)^2),3)","v":28.32},180,90,90,"T-Shape",{"$f":"IF(CC2=0,0.01,CC2)","v":22.460999999999999},{"$f":"ROUND((1/SQRT(3))*SQRT(($A$29-CD2)^2+($A$30-CE2)^2+($A$31-CF2)^2),3)","v":22.460999999999999},165,{"$f":"(360-165)/2","v":97.5},{"$f":"(360-165)/2","v":97.5}," 3/4 Expanded α-dominant Y",{"$f":"IF(CI2=0,0.01,CI2)","v":20.785},{"$f":"ROUND((1/SQRT(3))*SQRT(($A$29-CJ2)^2+($A$30-CK2)^2+($A$31-CL2)^2),3)","v":20.785},150,105,105," 1/2 Expanded α-dominant Y",null,{"$f":"IF(CP2=0,0.01,CP2)","v":24.175999999999998},{"$f":"ROUND((1/SQRT(3))*SQRT(($A$29-CQ2)^2+($A$30-CR2)^2+($A$31-CS2)^2),3)","v":24.175999999999998},135,112.5,112.5," 1/4 Expanded α-dominant Y",null,{"$f":"IF(CW2=0,0.01,CW2)","v":26.683},{"$f":"ROUND((1/SQRT(3))*SQRT(($A$29-CX2)^2+($A$30-CY2)^2+($A$31-CZ2)^2),3)","v":26.683},150,75,75,"2/3 α-Expanded Arrow",null,{"$f":"IF(DD2=0,0.01,DD2)","v":10.1},{"$f":"ROUND((1/SQRT(3))*SQRT(($A$29-DE2)^2+($A$30-DF2)^2+($A$31-DG2)^2),3)","v":10.1},150,120,90,"Orthogonal Y",null,null,null,{"$f":"IF(DM2=0,0.01,DM2)","v":19.545000000000002},{"$f":"ROUND((1/SQRT(3))*SQRT(($A$29-DN2)^2+($A$30-DO2)^2+($A$31-DP2)^2),3)","v":19.545000000000002},135,120,105,"Semi-Orthogonal γ-Expanded Y",null,null,{"$f":"IF(DU2=0,0.01,DU2)","v":11.045},{"$f":"ROUND((1/SQRT(3))*SQRT(($A$29-DV2)^2+($A$30-DW2)^2+($A$31-DX2)^2),3)","v":11.045},165,120,75,"Semi-Orthogonal γ-Compressed Y",null,null,{"$f":"IF(EC2=0,0.01,EC2)","v":17.378},{"$f":"ROUND((1/SQRT(3))*SQRT(($A$29-ED2)^2+($A$30-EE2)^2+($A$31-EF2)^2),3)","v":17.378},165,105,90,"Semi-Orthogonal β-Compressed Y",{"$f":"IF(EI2=0,0.01,EI2)","v":21.725999999999999},{"$f":"ROUND((1/SQRT(3))*SQRT(($A$29-EJ2)^2+($A$30-EK2)^2+($A$31-EL2)^2),3)","v":21.725999999999999},180,105,75,"Semi oblique T",null,{"$f":"IF(EP2=0,0.01,EP2)","v":21.024000000000001},{"$f":"ROUND((1/SQRT(3))*SQRT(($A$29-EQ2)^2+($A$30-ER2)^2+($A$31-ES2)^2),3)","v":21.024000000000001},180,120,60,"Oblique T",null,{"$f":"IF(EW2=0,0.01,EW2)","v":26.683},{"$f":"ROUND((1/SQRT(3))*SQRT(($A$29-EX2)^2+($A$30-EY2)^2+($A$31-EZ2)^2),3)","v":26.683},180,135,45,"Inclined Y",null,{"$f":"IF(FD2=0,0.01,FD2)","v":35.805},{"$f":"ROUND((1/SQRT(3))*SQRT(($A$29-FE2)^2+($A$30-FF2)^2+($A$31-FG2)^2),3)","v":35.805},180,150,30,"Oblique Y",null,{"$f":"IF(FK2=0,0.01,FK2)","v":46.39},{"$f":"ROUND((1/SQRT(3))*SQRT(($A$29-FL2)^2+($A$30-FM2)^2+($A$31-FN2)^2),3)","v":46.39},180,165,15,"Semi-Oblique Y"]
[{"$f":"(SUM(B3:D3)/360)","v":0.95833333333333337},115,115,115,"Trigonal Semiplanar",1,{"$f":"2*SIN(RADIANS(B3/2))","v":1.6867828916257714},{"$f":"COS(RADIANS(B3/2))","v":0.53729960834682389},{"$f":"G3*COS(RADIANS(30))","v":1.4607968348168918},{"$f":"(G3/2)*TAN(RADIANS(30))","v":0.48693227827229724},{"$f":"(G3/2)/COS(RADIANS(30))","v":0.97386455654459436},{"$f":"SQRT(F3^2-K3^2)","v":0.22712953464091928},{"$f":"SQRT((H3^2)-(J3^2))","v":0.22712953464091906},null,150,150,55,{"$f":"(1-ROUND(Q3/60,1))*100&\" % folded\"","v":"10 % folded"},null,null,null,null,null,null,null,null,null,null,null,null,null,null,null,null,null,{"$f":"IF(AK3=0,0.01,AK3)","v":28.524999999999999},{"$f":"ROUND((1/SQRT(3))*SQRT(($A$29-AL3)^2+($A$30-AM3)^2+($A$31-AN3)^2),3)","v":28.524999999999999},120,120,115,{"$f":"(1-ROUND(AN3/120,2))*100&\" % folded Trigonal Plane\"","v":"4 % folded Trigonal Plane"},null,null,{"$f":"IF(AS3=0,0.01,AS3)","v":9.8320000000000007},{"$f":"ROUND((1/SQRT(3))*SQRT(($A$29-AT3)^2+($A$30-AU3)^2+($A$31-AV3)^2),3)","v":9.8320000000000007},145,{"$f":"$A$30","v":121},90,{"$f":"ROUND(((150-AT3)/120)*100,0)&\" % α-folded Orthogonal Y\"","v":"4 % α-folded Orthogonal Y"},null,{"$f":"IF(AZ3=0,0.01,AZ3)","v":20.664000000000001},{"$f":"ROUND((1/SQRT(3))*SQRT(($A$29-BA3)^2+($A$30-BB3)^2+($A$31-BC3)^2),3)","v":20.664000000000001},130,120,105,{"$f":"ROUND(((135-BA3)/120)*100,0)&\" % α-folded Semi-Orthogonal γ-Expanded Y\"","v":"4 % α-folded Semi-Orthogonal γ-Expanded Y"},null,null,{"$f":"IF(BH3=0,0.01,BH3)","v":8.1850000000000005},{"$f":"ROUND((1/SQRT(3))*SQRT(($A$29-BI3)^2+($A$30-BJ3)^2+($A$31-BK3)^2),3)","v":8.1850000000000005},160,120,75,{"$f":"ROUND(((165-BI3)/120)*100,0)&\" % α-folded Semi-Orthogonal γ-Compressed Y\"","v":"4 % α-folded Semi-Orthogonal γ-Compressed Y"},null,null,{"$f":"IF(BP3=0,0.01,BP3)","v":15.715999999999999},{"$f":"ROUND((1/SQRT(3))*SQRT(($A$29-BQ3)^2+($A$30-BR3)^2+($A$31-BS3)^2),3)","v":15.715999999999999},160,105,90,{"$f":"ROUND(((165-BQ3)/150)*100,0)&\" % α-folded Semi-Orthogonal β-Compressed Y\"","v":"3 % α-folded Semi-Orthogonal β-Compressed Y"},null,{"$f":"IF(BW3=0,0.01,BW3)","v":26.42},26.42,175,{"$f":"2*DEGREES(ASIN(((SIN(RADIANS(BX3/2))*SIN(RADIANS($BY$2/2))/SIN(RADIANS($BX$2/2))))))","v":89.890986064668695},{"$f":"2*DEGREES(ASIN(((SIN(RADIANS(BX3/2))*SIN(RADIANS($BZ$2/2))/SIN(RADIANS($BX$2/2))))))","v":89.890986064668695},{"$f":"ROUND(100*($BX$2-BX3)/$BX$2,0)&\" % closed T-shape\"","v":"3 % closed T-shape"},{"$f":"IF(CC3=0,0.01,CC3)","v":21.2},{"$f":"ROUND((1/SQRT(3))*SQRT(($A$29-CD3)^2+($A$30-CE3)^2+($A$31-CF3)^2),3)","v":21.2},160,{"$f":"2*DEGREES(ASIN(((SIN(RADIANS(CD3/2))*SIN(RADIANS($CE$2/2))/SIN(RADIANS($CD$2/2))))))","v":96.629033821267839},{"$f":"2*DEGREES(ASIN(((SIN(RADIANS(CD3/2))*SIN(RADIANS($CE$2/2))/SIN(RADIANS($CD$2/2))))))","v":96.629033821267839},{"$f":"ROUND(100*($CD$2-CD3)/$CD$2,0)&\" % Closed 3/4  Expanded α-dominant Y\"","v":"3 % Closed 3/4  Expanded α-dominant Y"},{"$f":"IF(CI3=0,0.01,CI3)","v":20.234000000000002},{"$f":"ROUND((1/SQRT(3))*SQRT(($A$29-CJ3)^2+($A$30-CK3)^2+($A$31-CL3)^2),3)","v":20.234000000000002},145,{"$f":"2*DEGREES(ASIN(((SIN(RADIANS(CJ3/2))*SIN(RADIANS($CK$2/2))/SIN(RADIANS($CJ$2/2))))))","v":103.1321810002855},{"$f":"2*DEGREES(ASIN(((SIN(RADIANS(CJ3/2))*SIN(RADIANS($CL$2/2))/SIN(RADIANS($CJ$2/2))))))","v":103.1321810002855},{"$f":"ROUND(100*($CJ$2-CJ3)/$CJ$2,0)&\" % Closed 1/2  Expanded α-dominant Y\"","v":"3 % Closed 1/2  Expanded α-dominant Y"},null,{"$f":"IF(CP3=0,0.01,CP3)","v":23.88},{"$f":"ROUND((1/SQRT(3))*SQRT(($A$29-CQ3)^2+($A$30-CR3)^2+($A$31-CS3)^2),3)","v":23.88},130,{"$f":"2*DEGREES(ASIN(((SIN(RADIANS(CQ3/2))*SIN(RADIANS($CR$2/2))/SIN(RADIANS($CQ$2/2))))))","v":109.30444770036473},{"$f":"2*DEGREES(ASIN(((SIN(RADIANS(CQ3/2))*SIN(RADIANS($CS$2/2))/SIN(RADIANS($CQ$2/2))))))","v":109.30444770036473},{"$f":"ROUND(100*($CQ$2-CQ3)/$CQ$2,0)&\" % Closed 1/4 Expanded α-dominant Y\"","v":"4 % Closed 1/4 Expanded α-dominant Y"},null,{"$f":"IF(CW3=0,0.01,CW3)","v":27.207999999999998},{"$f":"ROUND((1/SQRT(3))*SQRT(($A$29-CX3)^2+($A$30-CY3)^2+($A$31-CZ3)^2),3)","v":27.207999999999998},145,{"$f":"2*DEGREES(ASIN(((SIN(RADIANS(CX3/2))*SIN(RADIANS($CY$2/2))/SIN(RADIANS($CX$2/2))))))","v":73.89270169410392},{"$f":"2*DEGREES(ASIN(((SIN(RADIANS(CX3/2))*SIN(RADIANS($CY$2/2))/SIN(RADIANS($CX$2/2))))))","v":73.89270169410392},{"$f":"ROUND(100*($CX$2-CX3)/$CX$2,0)&\" % Closed 2/3 α-Expanded Arrow\"","v":"3 % Closed 2/3 α-Expanded Arrow"},null,{"$f":"IF(DD3=0,0.01,DD3)","v":10.935},{"$f":"ROUND((1/SQRT(3))*SQRT(($A$29-DE3)^2+($A$30-DF3)^2+($A$31-DG3)^2),3)","v":10.935},{"$f":"2*DEGREES(ASIN(((SIN(RADIANS(DG3/2))*SIN(RADIANS(75))/SIN(RADIANS(45))))))","v":134.69966716616608},{"$f":"2*DEGREES(ASIN(((SIN(RADIANS(DG3/2))*SIN(RADIANS(60))/SIN(RADIANS(45))))))","v":111.6703805195984},85,{"$f":"ROUND((150-DE3)/1.5,0)&\" % closed orthogonal Y\"","v":"10 % closed orthogonal Y"},null,null,null,{"$f":"IF(DM3=0,0.01,DM3)","v":19.788},{"$f":"ROUND((1/SQRT(3))*SQRT(($A$29-DN3)^2+($A$30-DO3)^2+($A$31-DP3)^2),3)","v":19.788},{"$f":"2*DEGREES(ASIN(((SIN(RADIANS(DP3/2))*SIN(RADIANS($DN$2/2))/SIN(RADIANS($DP$2/2))))))","v":126.27099110103279},{"$f":"2*DEGREES(ASIN(((SIN(RADIANS(DP3/2))*SIN(RADIANS($DO$2/2))/SIN(RADIANS($DP$2/2))))))","v":113.48512609811438},100,{"$f":"ROUND(100*($DN$2-DN3)/$DN$2,0)&\" % closed Semi-Orthogonal γ-Expanded Y\"","v":"6 % closed Semi-Orthogonal γ-Expanded Y"},null,null,{"$f":"IF(DU3=0,0.01,DU3)","v":8.2759999999999998},{"$f":"ROUND((1/SQRT(3))*SQRT(($A$29-DV3)^2+($A$30-DW3)^2+($A$31-DX3)^2),3)","v":8.2759999999999998},{"$f":"2*DEGREES(ASIN(((SIN(RADIANS(DX3/2))*SIN(RADIANS($DV$2/2))/SIN(RADIANS($DX$2/2))))))","v":138.17982665683522},{"$f":"2*DEGREES(ASIN(((SIN(RADIANS(DX3/2))*SIN(RADIANS($DW$2/2))/SIN(RADIANS($DX$2/2))))))","v":109.36700147043746},70,{"$f":"ROUND(100*($DV$2-DV3)/$DV$2,0)&\" % closed Semi-Orthogonal γ-Compressed Y\"","v":"16 % closed Semi-Orthogonal γ-Compressed Y"},null,null,{"$f":"IF(EC3=0,0.01,EC3)","v":14.814},{"$f":"ROUND((1/SQRT(3))*SQRT(($A$29-ED3)^2+($A$30-EE3)^2+($A$31-EF3)^2),3)","v":14.814},{"$f":"2*DEGREES(ASIN(((SIN(RADIANS(EF3/2))*SIN(RADIANS($ED$2/2))/SIN(RADIANS($EF$2/2))))))","v":142.61599054648747},{"$f":"2*DEGREES(ASIN(((SIN(RADIANS(EF3/2))*SIN(RADIANS($EE$2/2))/SIN(RADIANS($EF$2/2))))))","v":98.575106232337006},85,{"$f":"ROUND(100*($ED$2-ED3)/$ED$2,0)&\" % closed Semi-Orthogonal β-Compressed Y\"","v":"14 % closed Semi-Orthogonal β-Compressed Y"},{"$f":"IF(EI3=0,0.01,EI3)","v":14.417999999999999},{"$f":"ROUND((1/SQRT(3))*SQRT(($A$29-EJ3)^2+($A$30-EK3)^2+($A$31-EL3)^2),3)","v":14.417999999999999},{"$f":"2*DEGREES(ASIN(((SIN(RADIANS(EL3/2))*SIN(RADIANS($EJ$2/2))/SIN(RADIANS($EL$2/2))))))","v":140.84952040268701},{"$f":"2*DEGREES(ASIN(((SIN(RADIANS(EL3/2))*SIN(RADIANS($EK$2/2))/SIN(RADIANS($EL$2/2))))))","v":96.748454002424253},70,{"$f":"ROUND(100*($EL$2-EL3)/$EL$2,0)&\" % closed Semi-Oblique T\"","v":"7 % closed Semi-Oblique T"},null,{"$f":"IF(EP3=0,0.01,EP3)","v":14.901},{"$f":"ROUND((1/SQRT(3))*SQRT(($A$29-EQ3)^2+($A$30-ER3)^2+($A$31-ES3)^2),3)","v":14.901},{"$f":"2*DEGREES(ASIN(((SIN(RADIANS(ES3/2))*SIN(RADIANS($EQ$2/2))/SIN(RADIANS($ES$2/2))))))","v":134.88565914846291},{"$f":"2*DEGREES(ASIN(((SIN(RADIANS(ES3/2))*SIN(RADIANS($ER$2/2))/SIN(RADIANS($ES$2/2))))))","v":106.21668209760679},55,{"$f":"ROUND(100*($ES$2-ES3)/$ES$2,0)&\" % closed Oblique T\"","v":"8 % closed Oblique T"},null,{"$f":"IF(EW3=0,0.01,EW3)","v":22.77},{"$f":"ROUND((1/SQRT(3))*SQRT(($A$29-EX3)^2+($A$30-EY3)^2+($A$31-EZ3)^2),3)","v":22.77},{"$f":"2*DEGREES(ASIN(((SIN(RADIANS(EZ3/2))*SIN(RADIANS($EX$2/2))/SIN(RADIANS($EZ$2/2))))))","v":126.69452081556372},{"$f":"2*DEGREES(ASIN(((SIN(RADIANS(EZ3/2))*SIN(RADIANS($EY$2/2))/SIN(RADIANS($EZ$2/2))))))","v":111.321013837089},40,{"$f":"ROUND(100*($EZ$2-EZ3)/$EZ$2,0)&\" % closed Inclined Y\"","v":"11 % closed Inclined Y"},null,{"$f":"IF(FD3=0,0.01,FD3)","v":34.332000000000001},{"$f":"ROUND((1/SQRT(3))*SQRT(($A$29-FE3)^2+($A$30-FF3)^2+($A$31-FG3)^2),3)","v":34.332000000000001},{"$f":"2*DEGREES(ASIN(((SIN(RADIANS(FG3/2))*SIN(RADIANS($FE$2/2))/SIN(RADIANS($FG$2/2))))))","v":113.4942101516549},{"$f":"2*DEGREES(ASIN(((SIN(RADIANS(FG3/2))*SIN(RADIANS($FF$2/2))/SIN(RADIANS($FG$2/2))))))","v":107.75600909864657},25,{"$f":"ROUND(100*($FG$2-FG3)/$FG$2,0)&\" % closed Oblique Y\"","v":"17 % closed Oblique Y"},null,{"$f":"IF(FK3=0,0.01,FK3)","v":55.651000000000003},{"$f":"ROUND((1/SQRT(3))*SQRT(($A$29-FL3)^2+($A$30-FM3)^2+($A$31-FN3)^2),3)","v":55.651000000000003},{"$f":"2*DEGREES(ASIN(((SIN(RADIANS(FN3/2))*SIN(RADIANS($FL$2/2))/SIN(RADIANS($FN$2/2))))))","v":83.783608560364215},{"$f":"2*DEGREES(ASIN(((SIN(RADIANS(FN3/2))*SIN(RADIANS($FM$2/2))/SIN(RADIANS($FN$2/2))))))","v":82.907244233583924},10,{"$f":"ROUND(100*($FN$2-FN3)/$FN$2,0)&\" % closed Semi-Oblique Y\"","v":"33 % closed Semi-Oblique Y"}]
[0.91666666666666663,110,110,110,"Trigonal Pyramidal",1,{"$f":"2*SIN(RADIANS(B4/2))","v":1.6383040885779836},{"$f":"COS(RADIANS(B4/2))","v":0.57357643635104616},{"$f":"G4*COS(RADIANS(30))","v":1.418812959832445},{"$f":"(G4/2)*TAN(RADIANS(30))","v":0.47293765327748161},{"$f":"(G4/2)/COS(RADIANS(30))","v":0.94587530655496321},{"$f":"SQRT(F4^2-K4^2)","v":0.32453028279276869},{"$f":"SQRT((H4^2)-(J4^2))","v":0.32453028279276858},null,150,150,50,{"$f":"(1-ROUND(Q4/60,1))*100&\" % folded\"","v":"20 % folded"},null,null,null,null,null,null,null,null,null,null,null,null,null,null,null,null,null,{"$f":"IF(AK4=0,0.01,AK4)","v":26.114999999999998},26.114999999999998,120,120,110,{"$f":"(1-ROUND(AN4/120,2))*100&\" % folded Trigonal Plane\"","v":"8 % folded Trigonal Plane"},null,null,10.407999999999999,10.407999999999999,140,121,90,{"$f":"ROUND(((150-AT4)/120)*100,0)&\" % α-folded Orthogonal Y\"","v":"8 % α-folded Orthogonal Y"},null,22.106000000000002,22.106000000000002,125,120,105,{"$f":"ROUND(((135-BA4)/120)*100,0)&\" % α-folded Semi-Orthogonal γ-Expanded Y\"","v":"8 % α-folded Semi-Orthogonal γ-Expanded Y"},null,null,5.3540000000000001,5.3540000000000001,155,120,75,{"$f":"ROUND(((165-BI4)/120)*100,0)&\" % α-folded Semi-Orthogonal γ-Compressed Y\"","v":"8 % α-folded Semi-Orthogonal γ-Compressed Y"},null,null,14.445,14.445,155,105,90,{"$f":"ROUND(((165-BQ4)/150)*100,0)&\" % α-folded Semi-Orthogonal β-Compressed Y\"","v":"7 % α-folded Semi-Orthogonal β-Compressed Y"},null,{"$f":"IF(BW4=0,0.01,BW4)","v":24.756},24.756,170,89.564769997530078,89.564769997530078,"6 % closed T-shape",20.309000000000001,20.309000000000001,155,{"$f":"2*DEGREES(ASIN(((SIN(RADIANS(CD4/2))*SIN(RADIANS($CE$2/2))/SIN(RADIANS($CD$2/2))))))","v":95.522821166244441},{"$f":"2*DEGREES(ASIN(((SIN(RADIANS(CD4/2))*SIN(RADIANS($CE$2/2))/SIN(RADIANS($CD$2/2))))))","v":95.522821166244441},{"$f":"ROUND(100*($CD$2-CD4)/$CD$2,0)&\" % Closed 3/4  Expanded α-dominant Y\"","v":"6 % Closed 3/4  Expanded α-dominant Y"},20.170000000000002,20.170000000000002,140,{"$f":"2*DEGREES(ASIN(((SIN(RADIANS(CJ4/2))*SIN(RADIANS($CK$2/2))/SIN(RADIANS($CJ$2/2))))))","v":101.03286219733116},{"$f":"2*DEGREES(ASIN(((SIN(RADIANS(CJ4/2))*SIN(RADIANS($CL$2/2))/SIN(RADIANS($CJ$2/2))))))","v":101.03286219733116},{"$f":"ROUND(100*($CJ$2-CJ4)/$CJ$2,0)&\" % Closed 1/2  Expanded α-dominant Y\"","v":"7 % Closed 1/2  Expanded α-dominant Y"},null,24.17,24.17,125,{"$f":"2*DEGREES(ASIN(((SIN(RADIANS(CQ4/2))*SIN(RADIANS($CR$2/2))/SIN(RADIANS($CQ$2/2))))))","v":105.93398144798645},{"$f":"2*DEGREES(ASIN(((SIN(RADIANS(CQ4/2))*SIN(RADIANS($CS$2/2))/SIN(RADIANS($CQ$2/2))))))","v":105.93398144798645},{"$f":"ROUND(100*($CQ$2-CQ4)/$CQ$2,0)&\" % Closed 1/4 Expanded α-dominant Y\"","v":"7 % Closed 1/4 Expanded α-dominant Y"},null,28.140999999999998,28.140999999999998,140,{"$f":"2*DEGREES(ASIN(((SIN(RADIANS(CX4/2))*SIN(RADIANS($CY$2/2))/SIN(RADIANS($CX$2/2))))))","v":72.630592039480959},{"$f":"2*DEGREES(ASIN(((SIN(RADIANS(CX4/2))*SIN(RADIANS($CY$2/2))/SIN(RADIANS($CX$2/2))))))","v":72.630592039480959},{"$f":"ROUND(100*($CX$2-CX4)/$CX$2,0)&\" % Closed 2/3 α-Expanded Arrow\"","v":"7 % Closed 2/3 α-Expanded Arrow"},null,17.129000000000001,17.129000000000001,{"$f":"2*DEGREES(ASIN(((SIN(RADIANS(DG4/2))*SIN(RADIANS(75))/SIN(RADIANS(45))))))","v":122.81944792985435},{"$f":"2*DEGREES(ASIN(((SIN(RADIANS(DG4/2))*SIN(RADIANS(60))/SIN(RADIANS(45))))))","v":103.85866849716069},80,{"$f":"ROUND((150-DE4)/1.5,0)&\" % closed orthogonal Y\"","v":"18 % closed orthogonal Y"},null,null,null,21.919,21.919,118.31450785498798,107.18435569710611,95,"12 % closed Semi-Orthogonal γ-Expanded Y",null,null,19.05,19.05,122.10421689306939,99.700826066948053,65,{"$f":"ROUND(100*($DV$2-DV4)/$DV$2,0)&\" % closed Semi-Orthogonal γ-Compressed Y\"","v":"26 % closed Semi-Orthogonal γ-Compressed Y"},null,null,19.777000000000001,19.777000000000001,128.64890136166861,92.305483014335053,80,"22 % closed Semi-Orthogonal β-Compressed Y",22.969000000000001,22.969000000000001,{"$f":"2*DEGREES(ASIN(((SIN(RADIANS(EL4/2))*SIN(RADIANS($EJ$2/2))/SIN(RADIANS($EL$2/2))))))","v":123.91792753889749},{"$f":"2*DEGREES(ASIN(((SIN(RADIANS(EL4/2))*SIN(RADIANS($EK$2/2))/SIN(RADIANS($EL$2/2))))))","v":88.889713044786063},65,{"$f":"ROUND(100*($EL$2-EL4)/$EL$2,0)&\" % closed Semi-Oblique T\"","v":"13 % closed Semi-Oblique T"},null,47.73,47.73,{"$f":"2*DEGREES(ASIN(((SIN(RADIANS(ES4/2))*SIN(RADIANS($EJ$2/2))/SIN(RADIANS($EL$2/2))))))","v":87.931208284437886},{"$f":"2*DEGREES(ASIN(((SIN(RADIANS(ES4/2))*SIN(RADIANS($EK$2/2))/SIN(RADIANS($EL$2/2))))))","v":66.839274866995382},50,{"$f":"ROUND(100*($ES$2-ES4)/$ES$2,0)&\" % closed Oblique T\"","v":"17 % closed Oblique T"},null,36.612000000000002,{"$f":"ROUND((1/SQRT(3))*SQRT(($A$29-EX4)^2+($A$30-EY4)^2+($A$31-EZ4)^2),3)","v":36.612000000000002},{"$f":"2*DEGREES(ASIN(((SIN(RADIANS(EZ4/2))*SIN(RADIANS($EX$2/2))/SIN(RADIANS($EZ$2/2))))))","v":103.58614589059695},{"$f":"2*DEGREES(ASIN(((SIN(RADIANS(EZ4/2))*SIN(RADIANS($EY$2/2))/SIN(RADIANS($EZ$2/2))))))","v":93.098870625846843},35,{"$f":"ROUND(100*($EZ$2-EZ4)/$EZ$2,0)&\" % closed Inclined Y\"","v":"22 % closed Inclined Y"},null,52.393999999999998,{"$f":"ROUND((1/SQRT(3))*SQRT(($A$29-FE4)^2+($A$30-FF4)^2+($A$31-FG4)^2),3)","v":52.393999999999998},{"$f":"2*DEGREES(ASIN(((SIN(RADIANS(FG4/2))*SIN(RADIANS($FE$2/2))/SIN(RADIANS($FG$2/2))))))","v":84.276999759901202},{"$f":"2*DEGREES(ASIN(((SIN(RADIANS(FG4/2))*SIN(RADIANS($FF$2/2))/SIN(RADIANS($FG$2/2))))))","v":80.791561789031249},20,{"$f":"ROUND(100*($FG$2-FG4)/$FG$2,0)&\" % closed Oblique Y\"","v":"33 % closed Oblique Y"},null,87.248000000000005,{"$f":"ROUND((1/SQRT(3))*SQRT(($A$29-FL4)^2+($A$30-FM4)^2+($A$31-FN4)^2),3)","v":87.248000000000005},{"$f":"2*DEGREES(ASIN(((SIN(RADIANS(FN4/2))*SIN(RADIANS($FL$2/2))/SIN(RADIANS($FN$2/2))))))","v":39.045498329602516},{"$f":"2*DEGREES(ASIN(((SIN(RADIANS(FN4/2))*SIN(RADIANS($FM$2/2))/SIN(RADIANS($FN$2/2))))))","v":38.69808743972289},5,{"$f":"ROUND(100*($FN$2-FN4)/$FN$2,0)&\" % closed Semi-Oblique Y\"","v":"67 % closed Semi-Oblique Y"}]
[0.875,105,105,105,{"$f":"ROUND(((110-D5)/110)*100,1)&\" % Closed  Trigonal Pyramid\"","v":"4.5 % Closed  Trigonal Pyramid"},1,{"$f":"2*SIN(RADIANS(B5/2))","v":1.5867066805824703},{"$f":"COS(RADIANS(B5/2))","v":0.60876142900872066},{"$f":"G5*COS(RADIANS(30))","v":1.3741282937389003},{"$f":"(G5/2)*TAN(RADIANS(30))","v":0.45804276457963339},{"$f":"(G5/2)/COS(RADIANS(30))","v":0.91608552915926678},{"$f":"SQRT(F5^2-K5^2)","v":0.40098292141310227},{"$f":"SQRT((H5^2)-(J5^2))","v":0.40098292141310227},null,150,150,45,"20 % folded",null,null,null,null,null,null,null,null,null,null,null,null,null,null,null,null,null,{"$f":"IF(AK5=0,0.01,AK5)","v":23.812000000000001},23.812000000000001,120,120,105,"12 % folded Trigonal Plane",null,null,11.69,11.69,135,121,90,"13 % α-folded Orthogonal Y",null,23.812000000000001,23.812000000000001,120,120,105,"12% folded Trigonal Plane",null,null,2.6459999999999999,2.6459999999999999,150,120,75,"13 % α-folded Semi-Orthogonal γ-Compressed Y",null,null,13.675000000000001,13.675000000000001,150,105,90,"10 % α-folded Semi-Orthogonal β-Compressed Y",null,23.382999999999999,23.382999999999999,165,89.023799598399236,89.023799598399236,"8 % closed T-shape",19.864000000000001,19.864000000000001,150,94.190762835720577,94.190762835720577,"9 % Closed 3/4  Expanded α-dominant Y",20.646999999999998,20.646999999999998,135,98.720395671112456,98.720395671112456,"10 % Closed 1/2  Expanded α-dominant Y",null,25.077000000000002,25.077000000000002,120,102.41176105515291,102.41176105515291,"11 % Closed 1/4 Expanded α-dominant Y",null,29.452000000000002,29.452000000000002,135,71.219641729439502,71.219641729439502,"10 % Closed 2/3 α-Expanded Arrow",null,24.007000000000001,24.007000000000001,112.5235098678922,96.417440971025385,75,"25 % closed orthogonal Y",null,null,null,25.31,25.31,110.86196084535821,101.04576621363273,90,"18 % closed Semi-Orthogonal γ-Expanded Y",null,null,28.603000000000002,28.603000000000002,109.03900645269223,90.681757921849382,60,"34 % closed Semi-Orthogonal γ-Compressed Y",null,null,26.123000000000001,26.123000000000001,117.20057038016193,86.159034283741889,75,"29 % closed Semi-Orthogonal β-Compressed Y",31.663,31.663,110.43828044942435,81.32660431156836,60,"20 % closed Semi-Oblique T",null,55.268000000000001,55.268000000000001,77.897689019967501,59.831068638258756,45,"25 % closed Oblique T",null,49.874000000000002,49.874000000000002,85.114531017712451,77.341542652407711,30,"33 % closed Inclined Y",null,69.744,69.744,60.571713211165793,58.304287426708399,15,"50 % closed Oblique Y",null,117.312,117.312,0,0,0,"Closed Arrow"]
[0.83333333333333337,100,100,100,{"$f":"ROUND(((110-D6)/110)*100,1)&\" % Closed  Trigonal Pyramid\"","v":"9.1 % Closed  Trigonal Pyramid"},1,1.532088886237956,0.64278760968653936,1.3268278963378768,0.44227596544595887,0.88455193089191775,0.46644172364335074,0.46644172364335057,null,150,150,40,"30 % folded",null,null,null,null,null,null,null,null,null,null,null,null,null,null,null,null,null,21.649000000000001,21.649000000000001,120,120,100,"17 % folded Trigonal Plane",null,null,13.478,13.478,130,121,90,"17 % α-folded Orthogonal Y",null,24.055,24.055,120,115,105,{"$f":"ROUND(((135-BB6)/120)*100,0)&\" % α-folded Semi-Orthogonal γ-Expanded Y\"","v":"17 % α-folded Semi-Orthogonal γ-Expanded Y"},null,null,1.4139999999999999,1.4139999999999999,145,120,75,"17 % α-folded Semi-Orthogonal γ-Compressed Y",null,null,13.491,13.491,145,105,90,"13 % α-folded Semi-Orthogonal β-Compressed Y",null,22.363,22.363,160,88.272058927649482,88.272058927649482,"11 % closed T-shape",19.925000000000001,19.925000000000001,145,92.643556399475784,92.643556399475784,"12 % Closed 3/4  Expanded α-dominant Y",21.673999999999999,21.673999999999999,130,96.212891246091971,96.212891246091971,"13 % Closed 1/2  Expanded α-dominant Y",null,26.577999999999999,26.577999999999999,115,98.757914264861157,98.757914264861157,"15 % Closed 1/4 Expanded α-dominant Y",null,31.103000000000002,31.103000000000002,130,69.666217938069437,69.666217938069437,"13 % Closed 2/3 α-Expanded Arrow",null,30.83,30.83,103.16800248579951,89.253402546965845,70,"31 % closed orthogonal Y",null,null,null,29.451000000000001,29.451000000000001,103.76406020939284,95.033538311192459,85,"23 % closed Semi-Orthogonal γ-Expanded Y",null,null,37.347999999999999,37.347999999999999,97.530613354799158,82.125415857031641,55,"41 % closed Semi-Orthogonal γ-Compressed Y",null,null,32.640999999999998,32.640999999999998,107.06998564634368,80.112020389098248,70,"35 % closed Semi-Orthogonal β-Compressed Y",39.893000000000001,39.893000000000001,98.665164700438837,73.992465185420912,55,"27 % closed Semi-Oblique T",null,62.579000000000001,62.579000000000001,68.36483222683043,52.940020913632267,40,"33 % closed Oblique T",null,62.22,62.22,68.88570575918078,63.004419896657389,25,"44 % closed Inclined Y",null,86.093999999999994,86.093999999999994,39.357240900747584,37.963826120737338,10,"67 % closed Oblique Y",null,null,null,null,"b-ref"]
[0.79166666666666663,95,95,95,"13.6 % Closed  Trigonal Pyramid",1,1.4745546736202482,0.67559020761566024,1.2770018066242066,0.42566726887473549,0.85133453774947099,0.52462320272257745,0.52462320272257745,null,150,150,35,"40 % folded",null,null,null,null,null,null,null,null,null,null,null,null,null,null,null,null,null,19.672000000000001,19.672000000000001,120,120,95,"21 % folded Trigonal Plane",null,null,15.599,15.599,125,121,90,"21 % α-folded Orthogonal Y",null,24.637,24.637,120,110,105,{"$f":"ROUND(((135-BB7)/120)*100,0)&\" % α-folded Semi-Orthogonal γ-Expanded Y\"","v":"21 % α-folded Semi-Orthogonal γ-Expanded Y"},null,null,3.6970000000000001,3.6970000000000001,140,120,75,"21 % α-folded Semi-Orthogonal γ-Compressed Y",null,null,13.916,13.916,140,105,90,"17 % α-folded Semi-Orthogonal β-Compressed Y",null,21.760999999999999,21.760999999999999,155,87.314933111602869,87.314933111602869,"14 % closed T-shape",20.515000000000001,20.515000000000001,140,90.892836954013745,90.892836954013745,"15 % Closed 3/4  Expanded α-dominant Y",23.216999999999999,23.216999999999999,125,93.527823422751311,93.527823422751311,"17 % Closed 1/2  Expanded α-dominant Y",null,28.613,28.613,110,94.989827916104261,94.989827916104261,"19 % Closed 1/4 Expanded α-dominant Y",null,33.054000000000002,33.054000000000002,125,67.976979182670078,67.976979182670078,"17 % Closed 2/3 α-Expanded Arrow",null,37.505000000000003,37.505000000000003,94.439649890035227,82.303399216266627,65,"37 % closed orthogonal Y",null,null,null,34.026000000000003,34.026000000000003,96.928481989958158,89.121911914720371,80,"28 % closed Semi-Orthogonal γ-Expanded Y",null,null,45.564,45.564,86.989357907203214,73.914318787055336,50,"47 % closed Semi-Orthogonal γ-Compressed Y",null,null,39.097999999999999,39.097999999999999,97.763805150730903,74.146364723375015,65,"41 % closed Semi-Orthogonal β-Compressed Y",47.73,47.73,87.931208284437886,66.839274866995382,50,"33 % closed Semi-Oblique T",null,69.716999999999999,69.716999999999999,59.202823693080127,46.143983494623406,35,"42 % closed Oblique T",null,73.893000000000001,73.893000000000001,53.970943416168566,49.571183057491538,20,"56 % closed Inclined Y",null,101.83,101.83,19.404997942329004,18.73772339776788,5,"83 % closed Oblique Y",null,{"$f":"IF(FK7=0,0.01,FK7)","v":46.39},{"$f":"ROUND((1/SQRT(3))*SQRT(($A$29-FL7)^2+($A$30-FM7)^2+($A$31-FN7)^2),3)","v":46.39},180,165,15,"Semi-Oblique Y"]
[0.75,90,90,90,"Triorthopyramidal",1,1.4142135623730949,0.70710678118654757,1.2247448713915889,0.40824829046386296,0.81649658092772592,0.57735026918962584,0.57735026918962584,null,150,150,30,"50 % folded",null,null,null,null,null,null,null,null,null,null,null,null,null,null,null,null,null,17.943999999999999,17.943999999999999,120,120,90,"25 % folded Trigonal Plane",null,null,17.934999999999999,17.934999999999999,120,121,90,"25% folded trigonal plane",null,25.533999999999999,25.533999999999999,120,105,105,"7 % Closed 1/4 Expanded α-dominant Y",null,null,6.4809999999999999,6.4809999999999999,135,120,75,"25 % α-folded Semi-Orthogonal γ-Compressed Y",null,null,14.9,14.9,135,105,90,"20 % α-folded Semi-Orthogonal β-Compressed Y",null,21.626000000000001,21.626000000000001,150,86.159034283741875,86.159034283741875,"17 % closed T-shape",21.622,21.622,135,88.950832465287363,88.950832465287363,"18 % Closed 3/4  Expanded α-dominant Y",25.218,25.218,120,90.68175792184941,90.68175792184941,"20 % Closed 1/2  Expanded α-dominant Y",null,31.102,31.102,105,91.122470443436583,91.122470443436583,"22 % Closed 1/4 Expanded α-dominant Y",null,35.262999999999998,35.262999999999998,120,66.158776955322253,66.158776955322253,"20 % Closed 2/3 α-Expanded Arrow",null,44.037999999999997,44.037999999999997,86.159034283741875,75.522487814070075,60,"43 % closed orthogonal Y",null,null,null,38.854999999999997,38.854999999999997,90.293848866060102,83.291738572507526,75,"33 % closed Semi-Orthogonal γ-Expanded Y",null,null,53.411999999999999,53.411999999999999,77.10746426463156,65.968206958896147,45,"53 % closed Semi-Orthogonal γ-Compressed Y",null,null,45.454000000000001,45.454000000000001,89.023799598399265,68.247961839989387,60,"46 % closed Semi-Orthogonal β-Compressed Y",55.268000000000001,55.268000000000001,77.897689019967501,59.831068638258756,45,"40 % closed Semi-Oblique T",null,76.72,76.72,50.321174155833809,39.424865998164222,30,"50 % closed Oblique T",null,85.096999999999994,85.096999999999994,39.885542234055698,36.735887479092852,15,"67 % closed Inclined Y",null,117.312,117.312,0,0,0,"Closed Arrow",null,{"$f":"IF(FK8=0,0.01,FK8)","v":42.137},{"$f":"ROUND((1/SQRT(3))*SQRT(($A$29-FL8)^2+($A$30-FM8)^2+($A$31-FN8)^2),3)","v":42.137},{"$f":"2*DEGREES(ASIN(((SIN(RADIANS(FM8/2))*SIN(RADIANS($FL$7/2))/SIN(RADIANS($FM$7/2))))))","v":166.73322473080515},160,{"$f":"2*DEGREES(ASIN(((SIN(RADIANS(FM8/2))*SIN(RADIANS($FN$7/2))/SIN(RADIANS($FM$7/2))))))","v":14.899012659406235},{"$f":"ROUND(100*($FM$7-FM8)/$FM$7,0)&\" % closed Semi-Oblique Y\"","v":"3 % closed Semi-Oblique Y"}]
[0.70833333333333337,85,85,85,"22.7 % Closed  Trigonal Pyramid",1,1.3511804152313205,0.73727733681012397,1.1701565646863299,0.39005218822877658,0.78010437645755315,0.62564939209734094,0.62564939209734072,null,150,150,25,"60 % folded",null,null,null,null,null,null,null,null,null,null,null,null,null,null,null,null,null,16.542999999999999,16.542999999999999,120,120,85,"29 % folded Trigonal Plane",null,null,18.266999999999999,18.266999999999999,120,115,90,{"$f":"ROUND(((150-AU9)/120)*100,0)&\" % α-folded Orthogonal Y\"","v":"29 % α-folded Orthogonal Y"},null,23.53,23.53,120,105,100,{"$f":"ROUND(((135-BC9)/120)*100,0)&\" % α-folded Semi-Orthogonal γ-Expanded Y\"","v":"29 % α-folded Semi-Orthogonal γ-Expanded Y"},null,null,9.327,9.327,130,120,75,"29 % α-folded Semi-Orthogonal γ-Compressed Y",null,null,16.34,16.34,130,105,90,"23 % α-folded Semi-Orthogonal β-Compressed Y",null,21.986000000000001,21.986000000000001,145,84.8120013125979,84.8120013125979,"19 % closed T-shape",23.201000000000001,23.201000000000001,130,86.830051568426242,86.830051568426242,"21 % Closed 3/4  Expanded α-dominant Y",27.606000000000002,27.606000000000002,115,87.690181972863826,87.690181972863826,"23 % Closed 1/2  Expanded α-dominant Y",null,33.966999999999999,33.966999999999999,100,87.168711054695763,87.168711054695763,"26 % Closed 1/4 Expanded α-dominant Y",null,37.692999999999998,37.692999999999998,115,64.218566475220442,64.218566475220442,"23 % Closed 2/3 α-Expanded Arrow",null,50.451000000000001,50.451000000000001,78.212482077049415,68.877407609417602,55,"48 % closed orthogonal Y",null,null,null,43.838999999999999,43.838999999999999,83.817144461459947,77.528392624144189,70,"38 % closed Semi-Orthogonal γ-Expanded Y",null,null,60.991999999999997,60.991999999999997,67.700333810944258,58.229281583508708,40,"59 % closed Semi-Orthogonal γ-Compressed Y",null,null,51.710999999999999,51.710999999999999,80.695408543658004,62.40556896521376,55,"51 % closed Semi-Orthogonal β-Compressed Y",62.579000000000001,62.579000000000001,68.36483222683043,52.940020913632267,40,"47 % closed Semi-Oblique T",null,83.620999999999995,83.620999999999995,41.653202608900592,32.767527217944405,25,"58 % closed Oblique T",null,95.99,95.99,26.329156116444892,24.293062702583931,10,"78 % closed Inclined Y",null,null,null,null,"b-ref",null,null,null,39.753999999999998,{"$f":"ROUND((1/SQRT(3))*SQRT(($A$29-FL9)^2+($A$30-FM9)^2+($A$31-FN9)^2),3)","v":39.753999999999998},{"$f":"2*DEGREES(ASIN(((SIN(RADIANS(FM9/2))*SIN(RADIANS($FL$7/2))/SIN(RADIANS($FM$7/2))))))","v":159.9424548601049},155,{"$f":"2*DEGREES(ASIN(((SIN(RADIANS(FM9/2))*SIN(RADIANS($FN$7/2))/SIN(RADIANS($FM$7/2))))))","v":14.76951867152799},{"$f":"ROUND(100*($FM$7-FM9)/$FM$7,0)&\" % closed Semi-Oblique Y\"","v":"6 % closed Semi-Oblique Y"}]
[0.66666666666666663,80,80,80,"27.3 % Closed  Trigonal Pyramid",1,1.2855752193730785,0.76604444311897801,1.1133407984528387,0.37111359948427952,0.74222719896855904,0.67014833067857982,0.6701483306785796,null,150,150,20,"70 % folded",null,null,null,null,null,null,null,null,null,null,null,null,null,null,null,null,null,15.555999999999999,15.555999999999999,120,120,80,"33 % folded Trigonal Plane",null,null,19.026,19.026,120,110,90,{"$f":"ROUND(((150-AU10)/120)*100,0)&\" % α-folded Orthogonal Y\"","v":"33 % α-folded Orthogonal Y"},null,21.725999999999999,21.725999999999999,120,105,95,{"$f":"ROUND(((135-BC10)/120)*100,0)&\" % α-folded Semi-Orthogonal γ-Expanded Y\"","v":"33 % α-folded Semi-Orthogonal γ-Expanded Y"},null,null,12.193,12.193,125,120,75,"33 % α-folded Semi-Orthogonal γ-Compressed Y",null,null,18.129000000000001,18.129000000000001,125,105,90,"27 % α-folded Semi-Orthogonal β-Compressed Y",null,22.835000000000001,22.835000000000001,140,83.282286535819551,83.282286535819551,"22 % closed T-shape",25.187999999999999,25.187999999999999,125,84.543015208921773,84.543015208921773,"24 % Closed 3/4  Expanded α-dominant Y",30.315999999999999,30.315999999999999,110,84.567418524692258,84.567418524692258,"27 % Closed 1/2  Expanded α-dominant Y",null,37.136000000000003,37.136000000000003,95,83.139616697556832,83.139616697556832,"30 % Closed 1/4 Expanded α-dominant Y",null,40.311999999999998,40.311999999999998,110,62.163328078002536,62.163328078002536,"27 % Closed 2/3 α-Expanded Arrow",null,56.764000000000003,56.764000000000003,70.522746372057682,62.342742539301128,50,"53 % closed orthogonal Y",null,null,null,48.92,48.92,77.466969235458137,71.82044334453542,65,"43 % closed Semi-Orthogonal γ-Expanded Y",null,null,68.369,68.369,58.646641937539243,50.654114683696754,35,"64 % closed Semi-Orthogonal γ-Compressed Y",null,null,57.883000000000003,57.883000000000003,72.677670956003965,56.610053754235182,50,"56 % closed Semi-Orthogonal β-Compressed Y",69.716999999999999,69.716999999999999,59.202823693080127,46.143983494623406,35,"53 % closed Semi-Oblique T",null,90.441999999999993,90.441999999999993,33.147385410007615,26.15898816968415,20,"67 % closed Oblique T",null,106.694,106.694,13.089933548501865,12.089653144072241,5,"89 % closed Inclined Y",null,{"$f":"IF(FD10=0,0.01,FD10)","v":35.805},{"$f":"ROUND((1/SQRT(3))*SQRT(($A$29-FE10)^2+($A$30-FF10)^2+($A$31-FG10)^2),3)","v":35.805},180,150,30,"Oblique Y",null,37.917999999999999,37.917999999999999,153.94437898911858,150,14.611776874100238,"9 % closed Semi-Oblique Y"]
[0.625,75,75,75,"31.8 % Closed  Trigonal Pyramid",1,1.2175228580174413,0.79335334029123517,1.0544057247313385,0.35146857491044609,0.70293714982089217,0.71125196899669851,0.7112519689966984,null,150,150,15,"70 % folded",null,null,null,null,null,null,null,null,null,null,null,null,null,null,null,null,null,15.067,15.067,120,120,75,"37 % folded Trigonal Plane",null,null,21.649000000000001,21.649000000000001,120,100,90,"42 % α-folded Orthogonal Y",null,20.173999999999999,20.173999999999999,120,105,90,"38 % α-folded Semi-Orthogonal γ-Expanded Y",null,null,15.067,15.067,120,120,75,"37 % folded Trigonal Plane",null,null,20.173999999999999,20.173999999999999,120,105,90,"30 % α-folded Semi-Orthogonal β-Compressed Y",null,24.143000000000001,24.143000000000001,135,81.578941881850582,81.578941881850582,"25 % closed T-shape",27.518999999999998,27.518999999999998,120,82.102037430631526,82.102037430631526,"27 % Closed 3/4  Expanded α-dominant Y",33.287999999999997,33.287999999999997,105,81.32660431156836,81.32660431156836,"30 % Closed 1/2  Expanded α-dominant Y",null,40.548999999999999,40.548999999999999,90,79.044718161294838,79.044718161294838,"33 % Closed 1/4 Expanded α-dominant Y",null,43.093000000000004,43.093000000000004,105,60.000000000000007,60.000000000000007,"30 % Closed 2/3 α-Expanded Arrow",null,62.996000000000002,62.996000000000002,63.034506104380476,55.898534677261708,45,"58 % closed orthogonal Y",null,null,null,54.064,54.064,71.219641729439502,66.158776955322253,60,"47 % closed Semi-Orthogonal γ-Expanded Y",null,null,75.593999999999994,75.593999999999994,49.861114016987102,43.208875588880616,30,"70 % closed Semi-Orthogonal γ-Compressed Y",null,null,63.982999999999997,63.982999999999997,64.90036481428433,50.853868209238854,45,"61 % closed Semi-Orthogonal β-Compressed Y",76.72,76.72,50.321174155833809,39.424865998164222,30,"60 % closed Semi-Oblique T",null,97.206000000000003,97.206000000000003,24.762150027707612,19.5878533585574,15,"75 % closed Oblique T",null,117.312,117.312,0,0,0,"Closed Arrow",null,{"$f":"IF(FD11=0,0.01,FD11)","v":30.038},{"$f":"ROUND((1/SQRT(3))*SQRT(($A$29-FE11)^2+($A$30-FF11)^2+($A$31-FG11)^2),3)","v":30.038},{"$f":"2*DEGREES(ASIN(((SIN(RADIANS(FF11/2))*SIN(RADIANS($FE$2/2))/SIN(RADIANS($FF$10/2))))))","v":161.76137581175075},145,{"$f":"2*DEGREES(ASIN(((SIN(RADIANS(FF11/2))*SIN(RADIANS($FG$10/2))/SIN(RADIANS($FF$10/2))))))","v":29.612081157544775},{"$f":"ROUND(100*($FF$10-FF11)/$FF$10,0)&\" % closed Oblique Y\"","v":"3 % closed Oblique Y"},null,36.57,36.57,148.28595552383797,145,14.426102168896733,"12 % closed Semi-Oblique Y"]
[0.58333333333333337,70,70,70,"36.4 % Closed  Trigonal Pyramid",1,1.1471528727020921,0.8191520442889918,0.99346352978430807,0.33115450992810269,0.66230901985620527,0.74923078034549051,0.7492307803454904,null,150,150,10,"80 % folded",null,null,null,null,null,null,null,null,null,null,null,null,null,null,null,null,null,15.122,15.122,120,120,70,"42 % folded Trigonal Plane",null,null,23.388000000000002,23.388000000000002,120,95,90,"46 % α-folded Orthogonal Y",null,18.937999999999999,18.937999999999999,120,105,85,"42 % α-folded Semi-Orthogonal γ-Expanded Y",null,null,15.449,15.449,120,115,75,{"$f":"ROUND(((165-BJ12)/120)*100,0)&\" % α-folded Semi-Orthogonal γ-Compressed Y\"","v":"42 % α-folded Semi-Orthogonal γ-Compressed Y"},null,null,22.405000000000001,22.405000000000001,115,105,90,"33 % α-folded Semi-Orthogonal β-Compressed Y",null,25.856999999999999,25.856999999999999,130,79.711414863237479,79.711414863237479,"28 % closed T-shape",30.134,30.134,115,79.519055642639429,79.519055642639429,"30 % Closed 3/4  Expanded α-dominant Y",36.475999999999999,36.475999999999999,100,77.979713680324082,77.979713680324082,"33 % Closed 1/2  Expanded α-dominant Y",null,44.161000000000001,44.161000000000001,85,74.89224285809334,74.89224285809334,"37 % Closed 1/4 Expanded α-dominant Y",null,46.012,46.012,100,57.735422675934657,57.735422675934657,"33 % Closed 2/3 α-Expanded Arrow",null,69.162000000000006,69.162000000000006,55.706454222941176,49.528730700788813,40,"63 % closed orthogonal Y",null,null,null,59.25,59.25,65.056808132474018,60.53599661352925,55,"52 % closed Semi-Orthogonal γ-Expanded Y",null,null,82.7,82.7,41.280512800577114,35.866342648842213,25,"75 % closed Semi-Orthogonal γ-Compressed Y",null,null,70.025000000000006,70.025000000000006,57.312227004665502,45.130670912499113,40,"65 % closed Semi-Orthogonal β-Compressed Y",83.620999999999995,83.620999999999995,41.653202608900592,32.767527217944405,25,"67 % closed Semi-Oblique T",null,103.929,103.929,16.462524516542356,13.043869174303659,10,"83 % closed Oblique T",null,null,null,null,"bref",null,null,null,27.896999999999998,{"$f":"ROUND((1/SQRT(3))*SQRT(($A$29-FE12)^2+($A$30-FF12)^2+($A$31-FG12)^2),3)","v":27.896999999999998},{"$f":"2*DEGREES(ASIN(((SIN(RADIANS(FF12/2))*SIN(RADIANS($FE$2/2))/SIN(RADIANS($FF$10/2))))))","v":153.23241124067403},140,{"$f":"2*DEGREES(ASIN(((SIN(RADIANS(FF12/2))*SIN(RADIANS($FG$10/2))/SIN(RADIANS($FF$10/2))))))","v":29.166906614492333},{"$f":"ROUND(100*($FF$10-FF12)/$FF$10,0)&\" % closed Oblique Y\"","v":"7 % closed Oblique Y"},null,35.716999999999999,35.716999999999999,142.81177905975372,140,14.212864665780971,"15 % closed Semi-Oblique Y"]
[0.54166666666666663,65,65,65,"40.9 % Closed  Trigonal Pyramid",1,1.0745992166936478,0.84339144581288572,0.93063022054355782,0.31021007351451924,0.62042014702903847,0.78426962274492451,0.78426962274492451,null,150,150,5,"90 % folded",null,null,null,null,null,null,null,null,null,null,null,null,null,null,null,null,null,15.715999999999999,15.715999999999999,120,120,65,"46 % folded Trigonal Plane",null,null,25.338000000000001,25.338000000000001,120,90,90,"33% α-folded T",null,18.082999999999998,18.082999999999998,120,105,80,"46 % α-folded Semi-Orthogonal γ-Expanded Y",null,null,16.34,16.34,120,110,75,{"$f":"ROUND(((165-BJ13)/120)*100,0)&\" % α-folded Semi-Orthogonal γ-Compressed Y\"","v":"46 % α-folded Semi-Orthogonal γ-Compressed Y"},null,null,24.771999999999998,24.771999999999998,110,105,90,"37 % α-folded Semi-Orthogonal β-Compressed Y",null,27.920999999999999,27.920999999999999,125,77.689362410407043,77.689362410407043,"31 % closed T-shape",32.982999999999997,32.982999999999997,110,76.805507121454639,76.805507121454639,"33 % Closed 3/4  Expanded α-dominant Y",39.841999999999999,39.841999999999999,95,74.537613089804765,74.537613089804765,"37 % Closed 1/2  Expanded α-dominant Y",null,47.932000000000002,47.932000000000002,80,70.689315302458169,70.689315302458169,"41 % Closed 1/4 Expanded α-dominant Y",null,49.051000000000002,49.051000000000002,95,55.37629416750427,55.37629416750427,"37 % Closed 2/3 α-Expanded Arrow",null,75.274000000000001,75.274000000000001,48.5066497123319,43.220130903321028,35,"68 % closed orthogonal Y",null,null,null,64.465999999999994,64.465999999999994,58.963905748470005,54.946000600788501,50,"56 % closed Semi-Orthogonal γ-Expanded Y",null,null,89.716999999999999,89.716999999999999,32.855731579977721,28.60393588512688,20,"80 % closed Semi-Orthogonal γ-Compressed Y",null,null,76.02,76.02,49.874325246082243,39.435049200641522,35,"70 % closed Semi-Orthogonal β-Compressed Y",90.441999999999993,90.441999999999993,33.147385410007615,26.15898816968415,20,"73 % closed Semi-Oblique T",null,110.626,110.626,8.2178343435594954,6.5175728570032607,5,"92 % closed Oblique T",null,{"$f":"IF(EW13=0,0.01,EW13)","v":22.516999999999999},{"$f":"ROUND((1/SQRT(3))*SQRT(($A$29-EX13)^2+($A$30-EY13)^2+($A$31-EZ13)^2),3)","v":22.516999999999999},180,135,60,"Inclined Y",null,26.841999999999999,26.841999999999999,146.06501134057092,135,28.665490234276632,"10 % closed Oblique Y",null,35.371000000000002,35.371000000000002,137.45063650895736,135,13.972488686468861,"18 % closed Semi-Oblique Y"]
[0.5,60,60,60,"Equilateral pyramid",1,0.99999999999999989,0.86602540378443871,0.8660254037844386,0.28867513459481281,0.57735026918962562,0.81649658092772615,0.81649658092772615,null,150,150,0,"planar",1.9319999999999999,null,null,null,null,null,null,null,null,null,null,null,null,null,null,null,null,16.792999999999999,16.792999999999999,120,120,60,"50 % folded Trigonal Plane",null,null,24.364999999999998,24.364999999999998,120,90,85,{"$f":"ROUND(((150-AV14)/120)*100,0)&\" % α-folded Orthogonal Y\"","v":"54 % α-folded Orthogonal Y"},null,17.664000000000001,17.664000000000001,120,105,75,"50 % α-folded Semi-Orthogonal γ-Expanded Y",null,null,17.664000000000001,17.664000000000001,120,105,75,"50 % α-folded Semi-Orthogonal γ-Compressed Y",null,null,27.24,27.24,105,105,90,"40 % α-folded Semi-Orthogonal β-Compressed Y",null,30.28,30.28,120,75.522487814070075,75.522487814070075,"33 % closed T-shape",36.026000000000003,36.026000000000003,105,73.972246304734014,73.972246304734014,"36 % Closed 3/4  Expanded α-dominant Y",43.354999999999997,43.354999999999997,90,71.01013442559416,71.01013442559416,"40 % Closed 1/2  Expanded α-dominant Y",null,51.835000000000001,51.835000000000001,75,66.442128051283888,66.442128051283888,"44 % Closed 1/4 Expanded α-dominant Y",null,52.192999999999998,52.192999999999998,90,52.929135978774241,52.929135978774241,"40 % Closed 2/3 α-Expanded Arrow",null,81.343999999999994,81.343999999999994,41.409622109270856,36.961653864976448,30,"72 % closed orthogonal Y",null,null,null,69.701999999999998,69.701999999999998,52.929135978774241,49.383678340468833,45,"61 % closed Semi-Orthogonal γ-Expanded Y",null,null,96.668999999999997,96.668999999999997,24.546990487684411,21.402360931513709,15,"85 % closed Semi-Orthogonal γ-Compressed Y",null,null,81.975999999999999,81.975999999999999,42.556067114692112,33.762310217249983,30,"74 % closed Semi-Orthogonal β-Compressed Y",97.206000000000003,97.206000000000003,24.762150027707612,19.5878533585574,15,"80 % closed Semi-Oblique T",null,117.312,117.312,0,0,0,{"$f":"ROUND(100*($EL$2-ES14)/$EL$2,0)&\" % closed Semi-Oblique T\"","v":"100 % closed Semi-Oblique T"},null,{"$f":"IF(EW14=0,0.01,EW14)","v":11.819000000000001},{"$f":"ROUND((1/SQRT(3))*SQRT(($A$29-EX14)^2+($A$30-EY14)^2+($A$31-EZ14)^2),3)","v":11.819000000000001},{"$f":"2*DEGREES(ASIN(((SIN(RADIANS(EY14/2))*SIN(RADIANS($EX$13/2))/SIN(RADIANS($EY$13/2))))))","v":157.61494544569968},130,{"$f":"2*DEGREES(ASIN(((SIN(RADIANS(EY14/2))*SIN(RADIANS($EZ$13/2))/SIN(RADIANS($EY$13/2))))))","v":58.745617424364049},{"$f":"ROUND(100*($EY$13-EY14)/$EY$13,0)&\" % closed Inclined Y\"","v":"4 % closed Inclined Y"},null,26.696000000000002,26.696000000000002,139.52898852650523,130,28.108965035272579,"13 % closed Oblique Y",null,35.534999999999997,35.534999999999997,132.16446638210928,130,13.705451635205129,"21 % closed Semi-Oblique Y"]
[0.45833333333333331,55,55,55,"Trigonal Semipyramidal",1,0.92349722647006782,0.88701083317822171,0.79977205844754973,0.26659068614918319,0.53318137229836637,0.84600095994864621,0.8460009599486461,null,null,null,null,null,null,null,null,null,null,null,null,null,null,null,null,null,null,null,null,null,null,18.266999999999999,18.266999999999999,120,120,55,"54 % folded Trigonal Plane",null,null,23.707000000000001,23.707000000000001,120,90,80,{"$f":"ROUND(((150-AV15)/120)*100,0)&\" % α-folded Orthogonal Y\"","v":"58 % α-folded Orthogonal Y"},null,17.710999999999999,17.710999999999999,120,105,70,"54 % α-folded Semi-Orthogonal γ-Expanded Y",null,null,19.329999999999998,19.329999999999998,120,100,75,"54 % α-folded Semi-Orthogonal γ-Compressed Y",null,null,28.349,28.349,105,100,90,{"$f":"ROUND(((165-BR15)/150)*100,0)&\" % α-folded Semi-Orthogonal β-Compressed Y\"","v":"43 % α-folded Semi-Orthogonal β-Compressed Y"},null,32.883000000000003,32.883000000000003,115,73.220403507229108,73.220403507229108,"36 % closed T-shape",39.229999999999997,39.229999999999997,100,71.029496393959093,71.029496393959093,"39 % Closed 3/4  Expanded α-dominant Y",46.991,46.991,85,67.40615826792461,67.40615826792461,"43 % Closed 1/2  Expanded α-dominant Y",null,55.845999999999997,55.845999999999997,70,62.156086569704357,62.156086569704357,"48 % Closed 1/4 Expanded α-dominant Y",null,55.426000000000002,55.426000000000002,85,50.400268280808476,50.400268280808476,"43 % Closed 2/3 α-Expanded Arrow",null,87.38,87.38,34.394477375541399,30.743805957222929,25,"77 % closed orthogonal Y",null,null,null,74.953999999999994,74.953999999999994,46.942754645131835,43.844686389957602,40,"65 % closed Semi-Orthogonal γ-Expanded Y",null,null,103.574,103.574,16.320721002477622,14.244630951436877,10,"90 % closed Semi-Orthogonal γ-Compressed Y",null,null,87.902000000000001,87.902000000000001,35.332660561638782,28.108320301814651,25,"79 % closed Semi-Orthogonal β-Compressed Y",103.929,103.929,16.462524516542356,13.043869174303659,10,"87 % closed Semi-Oblique T",null,null,null,null,"bref",null,null,null,9.3520000000000003,{"$f":"ROUND((1/SQRT(3))*SQRT(($A$29-EX15)^2+($A$30-EY15)^2+($A$31-EZ15)^2),3)","v":9.3520000000000003},{"$f":"2*DEGREES(ASIN(((SIN(RADIANS(EY15/2))*SIN(RADIANS($EX$13/2))/SIN(RADIANS($EY$13/2))))))","v":147.51792191713673},125,{"$f":"2*DEGREES(ASIN(((SIN(RADIANS(EY15/2))*SIN(RADIANS($EZ$13/2))/SIN(RADIANS($EY$13/2))))))","v":57.376917763895854},{"$f":"ROUND(100*($EY$13-EY15)/$EY$13,0)&\" % closed Inclined Y\"","v":"7 % closed Inclined Y"},null,27.363,27.363,133.35795446748642,125,27.498577738842464,"17 % closed Oblique Y",null,36.195,36.195,126.93081742682847,125,13.412282744321343,"24 % closed Semi-Oblique Y"]
[0.41666666666666669,50,50,50,"54.5 % Closed  Trigonal Pyramid",1,0.84523652348139888,0.90630778703664994,0.73199630154133366,0.24399876718044453,0.48799753436088905,0.87284500712193624,0.87284500712193624,null,null,"folded",null,"folding",null,null,null,null,null,null,null,null,null,null,null,null,null,null,null,null,null,20.05,20.05,120,120,50,"58 % folded Trigonal Plane",null,null,23.388000000000002,23.388000000000002,120,90,75,"63 % α-folded Orthogonal Y",null,18.221,18.221,120,105,65,"58 % α-folded Semi-Orthogonal γ-Expanded Y",null,null,21.26,21.26,120,95,75,"58 % α-folded Semi-Orthogonal γ-Compressed Y",null,null,29.698,29.698,105,95,90,{"$f":"ROUND(((165-BR16)/150)*100,0)&\" % α-folded Semi-Orthogonal β-Compressed Y\"","v":"47 % α-folded Semi-Orthogonal β-Compressed Y"},null,35.692,35.692,110,70.792520274655843,70.792520274655843,"39 % closed T-shape",42.57,42.57,95,67.986828613148774,67.986828613148774,"42 % Closed 3/4  Expanded α-dominant Y",50.731999999999999,50.731999999999999,80,63.733700791002832,63.733700791002832,"47 % Closed 1/2  Expanded α-dominant Y",null,59.945999999999998,59.945999999999998,65,57.835931599350815,57.835931599350815,"52 % Closed 1/4 Expanded α-dominant Y",null,58.737000000000002,58.737000000000002,80,47.795793443455253,47.795793443455253,"47 % Closed 2/3 α-Expanded Arrow",null,93.391000000000005,93.391000000000005,27.443604289520344,24.558287199919217,20,"82 % closed orthogonal Y",null,null,null,80.218000000000004,80.218000000000004,40.9965670702179,38.325279927339892,35,"70 % closed Semi-Orthogonal γ-Expanded Y",null,null,110.449,110.449,8.147410409453343,7.1153259900743766,5,"95 % closed Semi-Orthogonal γ-Compressed Y",null,null,93.805000000000007,93.805000000000007,28.183419288237364,22.469378754848407,20,"83 % closed Semi-Orthogonal β-Compressed Y",110.626,110.626,8.2178343435594954,6.5175728570032607,5,{"$f":"ROUND(100*($EL$2-EL16)/$EL$2,0)&\" % closed Semi-Oblique T\"","v":"93 % closed Semi-Oblique T"},null,{"$f":"IF(EP16=0,0.01,EP16)","v":21.024000000000001},{"$f":"ROUND((1/SQRT(3))*SQRT(($A$29-EQ16)^2+($A$30-ER16)^2+($A$31-ES16)^2),3)","v":21.024000000000001},180,120,60,"Oblique T",null,10.634,10.634,139.2319505484098,120,55.898534677261701,"11 % closed Inclined Y",null,28.736000000000001,28.736000000000001,127.42303357228081,120,26.8356829759249,"20 % closed Oblique Y",null,37.320999999999998,37.320999999999998,121.73549086129002,120,13.093561703279144,"27 % closed Semi-Oblique Y"]
[0.375,45,45,45,"59.1 % Closed  Trigonal Pyramid",1,0.76536686473017956,0.92387953251128674,0.66282714807118359,0.22094238269039451,0.44188476538078902,0.89707182216607662,0.89707182216607662,null,"a>120","α-dominant",null,"(1-g/gmax)x100%",null,null,null,null,null,null,null,null,null,null,null,null,null,null,null,null,null,22.068000000000001,22.068000000000001,120,120,45,"62 % folded Trigonal Plane",null,null,23.423999999999999,23.423999999999999,120,90,70,"67 % α-folded Orthogonal Y",null,19.157,19.157,120,105,60,"63 % α-folded Semi-Orthogonal γ-Expanded Y",null,null,23.388000000000002,23.388000000000002,120,90,75,"63 % α-folded Semi-Orthogonal γ-Compressed Y",null,null,31.257000000000001,31.257000000000001,105,90,90,"50 % α-folded Semi-Orthogonal β-Compressed Y",null,38.670999999999999,38.670999999999999,105,68.247961839989387,68.247961839989387,"42 % closed T-shape",46.024999999999999,46.024999999999999,90,64.853162875609144,64.853162875609144,"45 % Closed 3/4  Expanded α-dominant Y",54.561999999999998,54.561999999999998,75,60.000000000000007,60.000000000000007,"50 % Closed 1/2  Expanded α-dominant Y",null,64.122,64.122,60,53.485842407184805,53.485842407184805,"56 % Closed 1/4 Expanded α-dominant Y",null,62.116999999999997,62.116999999999997,75,45.12158673440868,45.12158673440868,"50 % Closed 2/3 α-Expanded Arrow",null,99.382999999999996,99.382999999999996,20.541754409889123,18.397689545298309,15,"86 % closed orthogonal Y",null,null,null,85.492000000000004,85.492000000000004,35.083559178679565,32.822183456554164,30,"74 % closed Semi-Orthogonal γ-Expanded Y",null,null,117.312,117.312,0,0,0,"Closed Arrow",null,null,99.691999999999993,99.691999999999993,21.090581178999109,16.842116236298843,15,"87 % closed Semi-Orthogonal β-Compressed Y",117.312,117.312,0,0,0,"Closed Arrow",null,{"$f":"IF(EP17=0,0.01,EP17)","v":10.209},{"$f":"ROUND((1/SQRT(3))*SQRT(($A$29-EQ17)^2+($A$30-ER17)^2+($A$31-ES17)^2),3)","v":10.209},{"$f":"2*DEGREES(ASIN(((SIN(RADIANS(ER17/2))*SIN(RADIANS($EQ$16/2))/SIN(RADIANS($ER$16/2))))))","v":153.74373173870143},115,{"$f":"2*DEGREES(ASIN(((SIN(RADIANS(ER17/2))*SIN(RADIANS($ES$16/2))/SIN(RADIANS($ER$16/2))))))","v":58.2782955409835},{"$f":"ROUND(100*($ER$16-ER17)/$ER$16,0)&\" % closed Oblique T\"","v":"4 % closed Oblique T"},null,13.981,13.981,131.81295165159887,115,54.31527018587645,"15 % closed Inclined Y",null,30.693999999999999,30.693999999999999,121.65193030794595,115,26.12173723203324,"23 % closed Oblique Y",null,38.868000000000002,38.868000000000002,116.56902459262793,115,12.749917180300987,"30 % closed Semi-Oblique Y"]
[0.33333333333333331,40,40,40,"63.6 % Closed  Trigonal Pyramid",1,0.68404028665133743,0.93969262078590843,0.59239626545204771,0.19746542181734922,0.39493084363469838,0.91871085154469867,0.91871085154469867,null,"a=120","trigonal plane",null,null,null,null,null,null,null,null,null,null,null,null,null,null,null,null,null,null,null,24.262,24.262,120,120,40,"67 % folded Trigonal Plane",null,null,23.812000000000001,23.812000000000001,120,90,65,"71 % α-folded Orthogonal Y",null,20.460999999999999,20.460999999999999,120,105,55,"67 % α-folded Semi-Orthogonal γ-Expanded Y",null,null,25.664999999999999,25.664999999999999,120,85,75,"67 % α-folded Semi-Orthogonal γ-Compressed Y",null,null,30.474,30.474,105,90,85,{"$f":"ROUND(((165-BS18)/150)*100,0)&\" % α-folded Semi-Orthogonal β-Compressed Y\"","v":"53 % α-folded Semi-Orthogonal β-Compressed Y"},null,41.795000000000002,41.795000000000002,100,65.59550266211437,65.59550266211437,"44 % closed T-shape",49.579000000000001,49.579000000000001,85,61.636784342303329,61.636784342303329,"48 % Closed 3/4  Expanded α-dominant Y",58.468000000000004,58.468000000000004,70,56.21159855774183,56.21159855774183,"53 % Closed 1/2  Expanded α-dominant Y",null,68.361999999999995,68.361999999999995,55,49.109523953009592,49.109523953009592,"59 % Closed 1/4 Expanded α-dominant Y",null,65.558999999999997,65.558999999999997,70,42.383293072377661,42.383293072377661,"53 % Closed 2/3 α-Expanded Arrow",null,105.363,105.363,13.675360245297407,12.25525838038291,10,"91 % closed orthogonal Y",null,null,null,90.775000000000006,90.775000000000006,29.197621112488608,27.332489633272438,25,"78 % closed Semi-Orthogonal γ-Expanded Y",null,null,null,null,null,"bref",null,null,null,null,{"$f":"IF(EC18=0,0.01,EC18)","v":105.568},{"$f":"ROUND((1/SQRT(3))*SQRT(($A$29-ED18)^2+($A$30-EE18)^2+($A$31-EF18)^2),3)","v":105.568},14.038447588054668,11.223410806600784,10,"91 % closed Semi-Orthogonal β-Compressed Y",null,null,null,"bref",null,null,null,11.689,11.689,{"$f":"2*DEGREES(ASIN(((SIN(RADIANS(ER18/2))*SIN(RADIANS($EQ$16/2))/SIN(RADIANS($ER$16/2))))))","v":142.12576049999569},110,{"$f":"2*DEGREES(ASIN(((SIN(RADIANS(ER18/2))*SIN(RADIANS($ES$16/2))/SIN(RADIANS($ER$16/2))))))","v":56.450311123019411},{"$f":"ROUND(100*($ER$16-ER18)/$ER$16,0)&\" % closed Oblique T\"","v":"8 % closed Oblique T"},null,18.079999999999998,18.079999999999998,124.90897920898921,110,52.632047558289081,"19 % closed Inclined Y",null,33.119999999999997,33.119999999999997,116.00010886355412,110,25.358292610011162,"27 % closed Oblique Y",null,40.787999999999997,40.787999999999997,111.42484903575961,110,12.382025246047682,"33 % closed Semi-Oblique Y"]
[0.29166666666666669,35,35,35,"68.2 % Closed  Trigonal Pyramid",1,0.60141159900854624,0.95371695074822693,0.52083772287202124,0.1736125742906737,0.3472251485813474,0.93778179561807518,0.93778179561807518,null,"90<a<120","γ-dominant Y",null,null,null,null,null,null,null,null,null,null,null,null,null,null,null,null,null,null,null,26.588999999999999,26.588999999999999,120,120,35,"71 % folded Trigonal Plane",null,null,24.536000000000001,24.536000000000001,120,90,60,"75 % α-folded Orthogonal Y",null,22.068000000000001,22.068000000000001,120,105,50,"71 % α-folded Semi-Orthogonal γ-Expanded Y",null,null,28.053999999999998,28.053999999999998,120,80,75,"71 % α-folded Semi-Orthogonal γ-Compressed Y",null,null,29.95,29.95,105,90,80,{"$f":"ROUND(((165-BS19)/150)*100,0)&\" % α-folded Semi-Orthogonal β-Compressed Y\"","v":"57 % α-folded Semi-Orthogonal β-Compressed Y"},null,45.042000000000002,45.042000000000002,95,62.843526120889535,62.843526120889535,"47 % closed T-shape",53.218000000000004,53.218000000000004,80,58.345371226341143,58.345371226341143,"52 % Closed 3/4  Expanded α-dominant Y",62.439,62.439,65,52.374421586855341,52.374421586855341,"57 % Closed 1/2  Expanded α-dominant Y",null,72.655000000000001,72.655000000000001,50,44.710280628413194,44.710280628413194,"63 % Closed 1/4 Expanded α-dominant Y",null,69.055000000000007,69.055000000000007,65,39.586328792299071,39.586328792299071,"57 % Closed 2/3 α-Expanded Arrow",null,111.337,111.337,6.832006753546076,6.1246970735033388,5,"95 % closed orthogonal Y",null,null,null,96.066000000000003,96.066000000000003,23.33333491573843,21.853578460878115,20,"83 % closed Semi-Orthogonal γ-Expanded Y",null,null,{"$f":"IF(DU19=0,0.01,DU19)","v":11.045},{"$f":"ROUND((1/SQRT(3))*SQRT(($A$29-DV19)^2+($A$30-DW19)^2+($A$31-DX19)^2),3)","v":11.045},165,120,75,"Semi-Orthogonal γ-Compressed Y",null,null,111.43899999999999,111.43899999999999,7.0127259925152874,5.6103164354464186,5,"96 % closed Semi-Orthogonal β-Compressed Y",{"$f":"IF(EI19=0,0.01,EI19)","v":21.725999999999999},{"$f":"ROUND((1/SQRT(3))*SQRT(($A$29-EJ19)^2+($A$30-EK19)^2+($A$31-EL19)^2),3)","v":21.725999999999999},180,105,75,"Semi oblique T",null,16.059999999999999,16.059999999999999,132.72071993406746,105,54.521765238054229,"13 % closed Oblique T",null,22.443999999999999,22.443999999999999,118.34621479615151,105,50.853868209238847,"22 % closed Inclined Y",null,35.908999999999999,35.908999999999999,110.43828044942437,105,24.546990487684415,"30 % closed Oblique Y",null,43.029000000000003,43.029000000000003,106.29824893088801,105,11.990607709016693,"36 % closed Semi-Oblique Y"]
[0.25,30,30,30,"72.7 % Closed  Trigonal Pyramid",1,0.51763809020504148,0.96592582628906831,0.44828773608402678,0.14942924536134222,0.29885849072268444,0.95429743923106025,0.95429743923106025,null,"a = 90","T",null,null,null,null,null,null,null,null,null,null,null,null,null,null,null,null,null,null,null,29.016999999999999,29.016999999999999,120,120,30,"75 % folded Trigonal Plane",null,null,25.567,25.567,120,90,55,"79 % α-folded Orthogonal Y",null,23.917000000000002,23.917000000000002,120,105,45,"75 % α-folded Semi-Orthogonal γ-Expanded Y",null,null,30.529,30.529,120,75,75,"75 % α-folded Semi-Orthogonal γ-Compressed Y",null,null,29.698,29.698,105,90,75,"60 % α-folded Semi-Orthogonal β-Compressed Y",null,48.393999999999998,48.393999999999998,90,59.999999999999986,59.999999999999986,"50 % closed T-shape",56.930999999999997,56.930999999999997,75,54.986030081330199,54.986030081330199,"55 % Closed 3/4  Expanded α-dominant Y",66.466999999999999,66.466999999999999,60,48.493848635992386,48.493848635992386,"60 % Closed 1/2  Expanded α-dominant Y",null,76.995000000000005,76.995000000000005,45,40.291078841233805,40.291078841233805,"67 % Closed 1/4 Expanded α-dominant Y",null,72.597999999999999,72.597999999999999,60,36.735887479092852,36.735887479092852,"60 % Closed 2/3 α-Expanded Arrow",null,117.312,117.312,0,{"$f":"2*DEGREES(ASIN(((SIN(RADIANS(DG20/2))*SIN(RADIANS(60))/SIN(RADIANS(45))))))","v":0},0,"closed arrow",null,null,null,101.36499999999999,101.36499999999999,17.48580711265279,16.383051312244621,15,"87 % closed Semi-Orthogonal γ-Expanded Y",null,null,4.1120000000000001,4.1120000000000001,{"$f":"2*DEGREES(ASIN(((SIN(RADIANS(DW20/2))*SIN(RADIANS($DV$2/2))/SIN(RADIANS($DW$2/2))))))","v":149.82657129347095},115,{"$f":"2*DEGREES(ASIN(((SIN(RADIANS(DW20/2))*SIN(RADIANS($DX$2/2))/SIN(RADIANS($DW$2/2))))))","v":72.719197305802297},{"$f":"ROUND(100*($DW$2-DW20)/$DW$2,0)&\" % closed Semi-Orthogonal γ-Compressed Y\"","v":"4 % closed Semi-Orthogonal γ-Compressed Y"},null,null,117.312,117.312,0,0,0,"Closed Arrow",{"$f":"IF(EI20=0,0.01,EI20)","v":12.339},{"$f":"ROUND((1/SQRT(3))*SQRT(($A$29-EJ20)^2+($A$30-EK20)^2+($A$31-EL20)^2),3)","v":12.339},{"$f":"2*DEGREES(ASIN(((SIN(RADIANS(EK20/2))*SIN(RADIANS($EJ$19/2))/SIN(RADIANS($EK$19/2))))))","v":149.84633576201102},100,{"$f":"2*DEGREES(ASIN(((SIN(RADIANS(EK20/2))*SIN(RADIANS($EL$19/2))/SIN(RADIANS($EK$19/2))))))","v":72.003020268088946},{"$f":"ROUND(100*($EK$2-EK20)/$EK$2,0)&\" % closed Semi-Oblique T\"","v":"5 % closed Semi-Oblique T"},null,21.041,21.041,124.39286420867998,100,52.498374187983863,"17 % closed Oblique T",null,26.907,26.907,112.02520099617055,100,48.985773128757138,"26 % closed Inclined Y",null,38.978000000000002,38.978000000000002,104.94622291475322,100,23.689555143834966,"33 % closed Oblique Y",null,45.542000000000002,45.542000000000002,101.18574541994992,100,11.576430372408657,"39 % closed Semi-Oblique Y"]
[0.20833333333333334,25,25,25,"77.3 % Closed  Trigonal Pyramid",1,0.43287922787620575,0.97629600711993336,0.37488440811138712,0.12496146937046236,0.24992293874092472,0.96826573041242148,0.96826573041242148,null,"60<a<90","extended Arrow",null,null,null,null,null,null,null,null,null,null,null,null,null,null,null,null,null,null,null,31.521999999999998,31.521999999999998,120,120,25,"79 % folded Trigonal Plane",null,null,26.87,26.87,120,90,50,"83 % α-folded Orthogonal Y",null,25.954999999999998,25.954999999999998,120,105,40,"79 % α-folded Semi-Orthogonal γ-Expanded Y",null,null,30.556000000000001,30.556000000000001,120,75,70,{"$f":"ROUND(((165-BK21)/120)*100,0)&\" % α-folded Semi-Orthogonal γ-Compressed Y\"","v":"79 % α-folded Semi-Orthogonal γ-Compressed Y"},null,null,29.727,29.727,105,90,70,"63 % α-folded Semi-Orthogonal β-Compressed Y",null,51.838000000000001,51.838000000000001,85,57.072466183455205,57.072466183455205,"53 % closed T-shape",60.709000000000003,60.709000000000003,70,51.56533563025922,51.56533563025922,"58 % Closed 3/4  Expanded α-dominant Y",70.545000000000002,70.545000000000002,55,44.574779547630129,44.574779547630129,"63 % Closed 1/2  Expanded α-dominant Y",null,81.375,81.375,40,35.854600373189832,35.854600373189832,"70 % Closed 1/4 Expanded α-dominant Y",null,76.183999999999997,76.183999999999997,55,33.836949039073026,33.836949039073026,"63 % Closed 2/3 α-Expanded Arrow",null,null,null,null,"beta ref",null,null,null,null,null,106.672,106.672,11.650532845246019,10.918675708503851,10,"91 % closed Semi-Orthogonal γ-Expanded Y",null,null,7.577,7.577,139.36509464528049,110,70.313090330202499,"8 % closed Semi-Orthogonal γ-Compressed Y",null,null,null,null,null,"bref",null,null,16.125,16.125,{"$f":"2*DEGREES(ASIN(((SIN(RADIANS(EK21/2))*SIN(RADIANS($EJ$19/2))/SIN(RADIANS($EK$19/2))))))","v":136.65742479396553},95,{"$f":"2*DEGREES(ASIN(((SIN(RADIANS(EK21/2))*SIN(RADIANS($EL$19/2))/SIN(RADIANS($EK$19/2))))))","v":68.906387213770387},{"$f":"ROUND(100*($EK$2-EK21)/$EK$2,0)&\" % closed Semi-Oblique T\"","v":"10 % closed Semi-Oblique T"},null,26.109000000000002,26.109000000000002,116.71423818079666,95,50.385813332146064,"21 % closed Oblique T",null,31.408999999999999,31.408999999999999,105.88349604799527,95,47.032809129125624,"30 % closed Inclined Y",null,42.264000000000003,42.264000000000003,99.509434779368434,95,22.787787420923763,"37 % closed Oblique Y",null,48.283999999999999,48.283999999999999,96.084711246773921,95,11.140301222147254,"42 % closed Semi-Oblique Y"]
[0.16666666666666666,20,20,20,"81.8 % Closed  Trigonal Pyramid",1,0.34729635533386066,0.98480775301220802,0.30076746636087059,0.10025582212029018,0.20051164424058035,0.9796913189999894,0.97969131899998929,null,"a=60","arrow",null,null,null,null,null,null,null,null,null,null,null,null,null,null,null,null,null,null,null,{"$f":"IF(AK22=0,0.01,AK22)","v":34.088000000000001},34.088000000000001,120,120,20,"83 % folded Trigonal Plane",null,null,28.408000000000001,28.408000000000001,120,90,45,"88 % α-folded Orthogonal Y",null,28.141999999999999,28.141999999999999,120,105,35,"83 % α-folded Semi-Orthogonal γ-Expanded Y",null,null,30.853999999999999,30.853999999999999,120,75,65,{"$f":"ROUND(((165-BK22)/120)*100,0)&\" % α-folded Semi-Orthogonal γ-Compressed Y\"","v":"83 % α-folded Semi-Orthogonal γ-Compressed Y"},null,null,30.033000000000001,30.033000000000001,105,90,65,"67 % α-folded Semi-Orthogonal β-Compressed Y",null,55.36,55.36,80,54.06804167964971,54.06804167964971,"56 % closed T-shape",64.543000000000006,64.543000000000006,65,48.089372907217694,48.089372907217694,"61 % Closed 3/4  Expanded α-dominant Y",74.665999999999997,74.665999999999997,50,40.621694325626109,40.621694325626109,"67 % Closed 1/2  Expanded α-dominant Y",null,85.787999999999997,85.787999999999997,35,31.403288134432152,31.403288134432152,"74 % Closed 1/4 Expanded α-dominant Y",null,79.808000000000007,79.808000000000007,50,30.894291294792446,30.894291294792446,"67 % Closed 2/3 α-Expanded Arrow",null,10.1,10.1,150,120,90,"Orthogonal Y",null,null,null,111.98699999999999,111.98699999999999,5.8232819799624025,5.4583377798727648,5,"96 % closed Semi-Orthogonal γ-Expanded Y",null,null,13.196999999999999,13.196999999999999,130.52877936550934,105,67.790671100326875,"13 % closed Semi-Orthogonal γ-Compressed Y",null,null,{"$f":"IF(EC22=0,0.01,EC22)","v":17.378},{"$f":"ROUND((1/SQRT(3))*SQRT(($A$29-ED22)^2+($A$30-EE22)^2+($A$31-EF22)^2),3)","v":17.378},165,105,90,"Semi-Orthogonal β-Compressed Y",21.687999999999999,21.687999999999999,126.0712399480831,90,65.71917660607933,"14 % closed Semi-Oblique T",null,31.15,31.15,109.47122063449069,90,48.189685104221397,"25 % closed Oblique T",null,35.926000000000002,35.926000000000002,99.879281947278628,90,44.999999999999986,"33 % closed Inclined Y",null,45.716000000000001,45.716000000000001,94.117194270240162,90,21.843558486937212,"40 % closed Oblique Y",null,51.219000000000001,51.219000000000001,90.993121958275793,90,10.683068555545178,"45 % closed Semi-Oblique Y"]
[0.125,15,15,15,"86.4 % Closed  Trigonal Pyramid",1,0.26105238444010315,0.99144486137381038,0.22607799664363085,7.5359332214543606E-2,0.15071866442908721,0.9885766961610577,0.9885766961610577,null,"a<60","compressed Arrow",null,null,null,null,null,null,null,null,null,null,null,null,null,null,null,null,null,null,null,36.701000000000001,36.701000000000001,120,120,15,"87 % folded Trigonal Plane",null,null,30.143999999999998,30.143999999999998,120,90,40,"92 % α-folded Orthogonal Y",null,30.446999999999999,30.446999999999999,120,105,30,"88 % α-folded Semi-Orthogonal γ-Expanded Y",null,null,31.417000000000002,31.417000000000002,120,75,60,"88 % α-folded Semi-Orthogonal γ-Compressed Y",null,null,30.61,30.61,105,90,60,"70 % α-folded Semi-Orthogonal β-Compressed Y",null,58.953000000000003,58.953000000000003,75,50.993428395322205,50.993428395322205,"58 % closed T-shape",68.427999999999997,68.427999999999997,60,44.563780083198338,44.563780083198338,"64 % Closed 3/4  Expanded α-dominant Y",78.825000000000003,78.825000000000003,45,36.638707326092785,36.638707326092785,"70 % Closed 1/2  Expanded α-dominant Y",null,90.230999999999995,90.230999999999995,30,26.939385679479145,26.939385679479145,"78 % Closed 1/4 Expanded α-dominant Y",null,83.465000000000003,83.465000000000003,45,27.912503502801236,27.912503502801236,"70 % Closed 2/3 α-Expanded Arrow",null,9.4039999999999999,9.4039999999999999,{"$f":"2*DEGREES(ASIN(((SIN(RADIANS(DF23/2))*SIN(RADIANS(75))/SIN(RADIANS(60))))))","v":140.33245063842932},115,{"$f":"2*DEGREES(ASIN(((SIN(RADIANS(DF23/2))*SIN(RADIANS(45))/SIN(RADIANS(60))))))","v":87.042922720407532},{"$f":"ROUND((150-DE23)/1.5,0)&\" % closed orthogonal Y\"","v":"6 % closed orthogonal Y"},null,null,null,117.312,117.312,0,0,0,"closed arrow",null,null,18.725000000000001,18.725000000000001,122.5614274586067,100,65.160600626652609,"17 % closed Semi-Orthogonal γ-Compressed Y",null,null,14.298,14.298,{"$f":"2*DEGREES(ASIN(((SIN(RADIANS(EE23/2))*SIN(RADIANS($ED$2/2))/SIN(RADIANS($EE$2/2))))))","v":146.39910329656684},100,{"$f":"2*DEGREES(ASIN(((SIN(RADIANS(EE23/2))*SIN(RADIANS($EF$2/2))/SIN(RADIANS($EE$2/2))))))","v":86.120441484266891},{"$f":"ROUND(100*($EE$2-EE23)/$EE$2,0)&\" % closed Semi-Orthogonal β-Compressed Y\"","v":"5 % closed Semi-Orthogonal β-Compressed Y"},27.459,27.459,116.76411864285313,85,62.449787738868508,"19 % closed Semi-Oblique T",null,36.14,36.14,102.54026601077263,85,45.915493487616402,"29 % closed Oblique T",null,40.448,40.448,93.983177108611102,85,42.892322499291815,"37 % closed Inclined Y",null,49.298000000000002,49.298000000000002,88.761370806871383,85,20.85880375187628,"43 % closed Oblique Y",null,54.314,54.314,85.909389844200618,85,10.205619059797142,"48 % closed Semi-Oblique Y"]
[8.3333333333333329E-2,10,10,10,"90.9 % Closed  Trigonal Pyramid",1,0.17431148549531633,0.99619469809174555,0.15095817461034666,5.0319391536782214E-2,0.10063878307356443,0.99492302985782377,0.99492302985782377,null,null,null,null,null,null,null,null,null,null,null,null,null,null,null,null,null,null,null,null,null,null,39.353000000000002,39.353000000000002,120,120,10,"92 % folded Trigonal Plane",null,null,32.046999999999997,32.046999999999997,120,90,35,"96 % α-folded Orthogonal Y",null,32.843000000000004,32.843000000000004,120,105,25,"92 % α-folded Semi-Orthogonal γ-Expanded Y",null,null,32.228000000000002,32.228000000000002,120,75,55,"92 % α-folded Semi-Orthogonal γ-Compressed Y",null,null,31.443000000000001,31.443000000000001,105,90,55,"73 % α-folded Semi-Orthogonal β-Compressed Y",null,62.606000000000002,62.606000000000002,70,47.854929441517818,47.854929441517818,"61 % closed T-shape",72.356999999999999,72.356999999999999,55,40.993790831912719,40.993790831912719,"67 % Closed 3/4  Expanded α-dominant Y",83.016000000000005,83.016000000000005,40,32.629616226029782,32.629616226029782,"73 % Closed 1/2  Expanded α-dominant Y",null,94.698999999999998,94.698999999999998,25,22.464971632081411,22.464971632081411,"81 % Closed 1/4 Expanded α-dominant Y",null,87.150999999999996,87.150999999999996,40,24.896001299979009,24.896001299979009,"73 % Closed 2/3 α-Expanded Arrow",null,12.058,12.058,{"$f":"2*DEGREES(ASIN(((SIN(RADIANS(DF24/2))*SIN(RADIANS(75))/SIN(RADIANS(60))))))","v":132.0281612885432},110,{"$f":"2*DEGREES(ASIN(((SIN(RADIANS(DF24/2))*SIN(RADIANS(45))/SIN(RADIANS(60))))))","v":83.954402068935508},{"$f":"ROUND((150-DE24)/1.5,0)&\" % closed orthogonal Y\"","v":"12 % closed orthogonal Y"},null,null,null,null,null,null,"bref",null,null,null,null,24.082999999999998,24.082999999999998,115.14085500207915,95,62.431166288388781,"21 % closed Semi-Orthogonal γ-Compressed Y",null,null,17.300999999999998,17.300999999999998,134.25359574366166,95,82.162237224919238,"10 % closed Semi-Orthogonal β-Compressed Y",33.167999999999999,33.167999999999999,108.23409093113669,80,59.105977710412063,"24 % closed Semi-Oblique T",null,41.081000000000003,41.081000000000003,95.842971866593885,80,43.568624494286063,"33 % closed Oblique T",null,44.970999999999997,44.970999999999997,88.173753387175154,80,40.714686980663778,"41 % closed Inclined Y",null,52.984000000000002,52.984000000000002,83.435664751189989,80,19.835516986987123,"47 % closed Oblique Y",null,57.542999999999999,57.542999999999999,80.832250031079383,80,9.7088758490592699,"52 % closed Semi-Oblique Y"]
[4.1666666666666664E-2,5,5,5,"95.5 % Closed  Trigonal Pyramid",1,8.7238774730672E-2,0.9990482215818578,7.5550995111789906E-2,2.5183665037263298E-2,5.0367330074526595E-2,0.99873076054618626,0.99873076054618637,null,null,null,null,null,null,null,null,null,null,null,null,null,null,null,null,null,null,null,null,null,null,42.036000000000001,42.036000000000001,120,120,5,"96 % folded Trigonal Plane",null,null,34.088000000000001,34.088000000000001,120,90,30,"50% oblique 1/3 α-Expanded Arrow",null,35.313000000000002,35.313000000000002,120,105,20,"96 % α-folded Semi-Orthogonal γ-Expanded Y",null,null,33.271999999999998,33.271999999999998,120,75,50,"96 % α-folded Semi-Orthogonal γ-Compressed Y",null,null,32.512,32.512,105,90,50,"77 % α-folded Semi-Orthogonal β-Compressed Y",null,66.313000000000002,66.313000000000002,65,44.658470122517045,44.658470122517045,"64 % closed T-shape",76.323999999999998,76.323999999999998,50,37.384275473022058,37.384275473022058,"70 % Closed 3/4  Expanded α-dominant Y",87.236999999999995,87.236999999999995,35,28.597946290956319,28.597946290956319,"77 % Closed 1/2  Expanded α-dominant Y",null,99.19,99.19,20,17.981989987960127,17.981989987960127,"85 % Closed 1/4 Expanded α-dominant Y",null,90.863,90.863,35,21.849042680121066,21.849042680121066,"77 % Closed 2/3 α-Expanded Arrow",null,16.119,16.119,124.47122063449072,105,80.747402940153989,"17 % closed orthogonal Y",null,null,null,19.545000000000002,19.545000000000002,135,120,105,"Semi-Orthogonal γ-Expanded Y",null,null,29.309000000000001,29.309000000000001,108.09643081219369,90,59.610256121653777,"25 % closed Semi-Orthogonal γ-Compressed Y",null,null,22.088000000000001,22.088000000000001,124.17499299439753,90,78.135103222205643,"14 % closed Semi-Orthogonal β-Compressed Y",38.774999999999999,38.774999999999999,100.2289155318886,75,55.694902584313866,"29 % closed Semi-Oblique T",null,45.978000000000002,45.978000000000002,89.326259055014901,75,41.154332100584504,"38 % closed Oblique T",null,49.493000000000002,49.493000000000002,82.434905725098361,75,38.471922366237138,"44 % closed Inclined Y",null,56.750999999999998,56.750999999999998,78.135103222205686,75,18.77574468707931,"50 % closed Oblique Y",null,60.884999999999998,60.884999999999998,75.760680468759432,75,9.193796468356485,"55 % closed Semi-Oblique Y"]
[{"$f":"(SUM(B26:D26)/360)","v":0},0,0,0,"Closed Arrow",1,{"$f":"2*SIN(RADIANS(B26/2))","v":0},{"$f":"COS(RADIANS(B26/2))","v":1},{"$f":"G26*COS(RADIANS(30))","v":0},{"$f":"(G26/2)*TAN(RADIANS(30))","v":0},{"$f":"(G26/2)/COS(RADIANS(30))","v":0},{"$f":"SQRT(F26^2-K26^2)","v":1},{"$f":"SQRT((H26^2)-(J26^2))","v":1},null,null,null,null,null,null,null,null,null,null,null,null,null,null,null,null,null,null,null,null,null,null,44.744,44.744,120,120,0,"folded trigonal plane",null,null,null,"betafold",null,null,null,null,null,37.841999999999999,37.841999999999999,120,105,15,"75% oblique 1/3 a-expanded Arrow  ",null,null,34.524999999999999,34.524999999999999,120,75,45,"near 4/9 α-expanded Arrow (25 % oblique)",null,null,33.792999999999999,33.792999999999999,105,90,45,"80 % α-folded Semi-Orthogonal β-Compressed Y",null,70.067999999999998,70.067999999999998,60,41.409622109270849,{"$f":"2*DEGREES(ASIN(((SIN(RADIANS(BX26/2))*SIN(RADIANS($BZ$2/2))/SIN(RADIANS($BX$2/2))))))","v":41.409622109270849},{"$f":"ROUND(100*($BX$2-BX26)/$BX$2,0)&\" % closed T-shape\"","v":"67 % closed T-shape"},80.325999999999993,80.325999999999993,45,33.739780423273324,33.739780423273324,"73 % Closed 3/4  Expanded α-dominant Y",91.481999999999999,91.481999999999999,30,24.546990487684415,24.546990487684415,"80 % Closed 1/2  Expanded α-dominant Y",null,103.69799999999999,103.69799999999999,15,13.492277119451147,13.492277119451147,"89 % Closed 1/4 Expanded α-dominant Y",null,94.597999999999999,94.597999999999999,30,18.77574468707931,18.77574468707931,"80 % Closed 2/3 α-Expanded Arrow",null,20.65,20.65,117.38957313553816,100,77.433776979697711,"22 % closed orthogonal Y",null,null,null,19.539000000000001,19.539000000000001,{"$f":"2*DEGREES(ASIN(((SIN(RADIANS(DP26/2))*SIN(RADIANS($DN$2/2))/SIN(RADIANS($DP$2/2))))))","v":128.24612636520101},115,{"$f":"2*DEGREES(ASIN(((SIN(RADIANS(DO26/2))*SIN(RADIANS($DP$25/2))/SIN(RADIANS($DO$25/2))))))","v":101.17926331541592},{"$f":"ROUND(100*($DN$2-DN26)/$DN$2,0)&\" % closed Semi-Orthogonal γ-Expanded Y\"","v":"5 % closed Semi-Orthogonal γ-Expanded Y"},null,null,34.435000000000002,34.435000000000002,101.32589993840912,85,56.705347087084839,"29 % closed Semi-Orthogonal γ-Compressed Y",null,null,27.364000000000001,27.364000000000001,115.18923434832691,85,74.047475046752865,"19 % closed Semi-Orthogonal β-Compressed Y",44.286999999999999,44.286999999999999,92.601680107774186,70,52.223162404534229,"33 % closed Semi-Oblique T",null,50.84,50.84,82.952420844693094,70,38.677729046839467,"42 % closed Oblique T",null,54.014000000000003,54.014000000000003,76.754222980997483,70,36.168765111980882,"48 % closed Inclined Y",null,60.584000000000003,60.584000000000003,72.855695386667804,70,17.681580708401675,"53 % closed Oblique Y",null,64.320999999999998,64.320999999999998,70.693844532530207,70,8.6613708719587255,"58 % closed Semi-Oblique Y"]
[null,null,null,null,null,null,null,null,null,null,null,null,null,null,"Reference ","alpha","asym","Reference","beta",null,"Reference","gamma",null,"Reference ","alpha",null,"Reference","beta",null,"Reference","gamma",null,"ARROW",null,null,"RMSD","RMSD","Monoclinic","diorthogonal pyramid",null,"T",null,null,10.1,10.1,150,120,90,"Orthogonal Y",null,null,null,null,"beta fold",null,null,null,null,null,null,null,"b-fold",null,null,null,null,35.265999999999998,35.265999999999998,105,90,40,"83 % α-folded Semi-Orthogonal β-Compressed Y",null,73.864999999999995,73.864999999999995,55,38.113629615468817,38.113629615468817,"69 % closed T-shape",84.358000000000004,84.358000000000004,40,30.064565706305419,30.064565706305419,"76 % Closed 3/4  Expanded α-dominant Y",95.748999999999995,95.748999999999995,25,20.479845987155812,20.479845987155812,"83 % Closed 1/2  Expanded α-dominant Y",null,108.223,108.223,10,8.9975861904065102,8.9975861904065102,"93 % Closed 1/4 Expanded α-dominant Y",null,98.350999999999999,98.350999999999999,25,15.680100583727485,15.680100583727485,"83 % Closed 2/3 α-Expanded Arrow",null,25.347999999999999,25.347999999999999,110.63663877748252,95,74.024308384912956,"26 % closed orthogonal Y",null,null,null,20.765999999999998,20.765999999999998,121.82418251600161,110,97.252389691479607,"10 % closed Semi-Orthogonal γ-Expanded Y",null,null,39.488,39.488,94.762804931267382,80,53.723504557087857,"33 % closed Semi-Orthogonal γ-Compressed Y",null,null,32.762999999999998,32.762999999999998,106.88981491190115,80,69.906695431549082,"24 % closed Semi-Orthogonal β-Compressed Y",49.72,49.72,85.258448427540401,65,48.696847822143702,"38 % closed Semi-Oblique T",null,55.670999999999999,55.670999999999999,76.693644661015739,65,36.143781895973383,"46 % closed Oblique T",null,58.533999999999999,58.533999999999999,71.121933805983701,65,33.809851778823678,"52 % closed Inclined Y",null,64.471000000000004,64.471000000000004,67.594190537851787,65,16.555161206734105,"57 % closed Oblique Y",null,67.837000000000003,67.837000000000003,65.63104906972535,65,8.1126193831978135,"61 % closed Semi-Oblique Y"]
["INPUT","Trigonal","roundup a","roundwn a","roundhalf a","roundup b","rdown b","rhalf b","round g","round g","round g",null,null,"Monoclinic","Alpha Dominant",null,"beta/gamma",null,null,null,null,null,null,"Gamma Dominant",null,"alpha/beta","b up","b down","b half",null,null,null,"ref a","ref b","ref g",28.32,{"$f":"ROUND((1/SQRT(3))*SQRT(($A$29-AL28)^2+($A$30-AM28)^2+($A$31-AN28)^2),3)","v":28.32},180,90,90,"T-shape",null,null,10.661,10.661,150,115,90,{"$f":"ROUND(((120-AU28)/60)*100,0)&\" % β-folded Orthogonal Y\"","v":"8 % β-folded Orthogonal Y"},null,{"$f":"IF(AZ28=0,0.01,AZ28)","v":19.545000000000002},{"$f":"ROUND((1/SQRT(3))*SQRT(($A$29-BA28)^2+($A$30-BB28)^2+($A$31-BC28)^2),3)","v":19.545000000000002},135,120,105,"Semi-Orthogonal γ-Expanded Y",null,null,{"$f":"IF(BH28=0,0.01,BH28)","v":11.045},{"$f":"ROUND((1/SQRT(3))*SQRT(($A$29-BI28)^2+($A$30-BJ28)^2+($A$31-BK28)^2),3)","v":11.045},165,120,75,"Semi-Orthogonal γ-Compressed Y",null,null,36.905000000000001,36.905000000000001,105,90,35,"87 % α-folded Semi-Orthogonal β-Compressed Y",null,77.7,77.7,50,34.775436669718921,34.775436669718921,"72 % closed T-shape",88.415999999999997,88.415999999999997,35,26.362640433976427,26.362640433976427,"79 % Closed 3/4  Expanded α-dominant Y",100.035,100.035,20,16.399447585978109,16.399447585978109,"87 % Closed 1/2  Expanded α-dominant Y",null,112.762,112.762,5,4.4996095992953391,4.4996095992953391,"96 % Closed 1/4 Expanded α-dominant Y",null,102.121,102.121,20,12.565997317714293,12.565997317714293,"87 % Closed 2/3 α-Expanded Arrow",null,30.114999999999998,30.114999999999998,104.123745145629,90,70.528779365509294,"31 % closed orthogonal Y",null,null,null,23.004000000000001,23.004000000000001,115.6343085114631,105,93.234168932660054,"14 % closed Semi-Orthogonal γ-Expanded Y",null,null,44.484999999999999,44.484999999999999,88.361376358928879,75,50.67139053925424,"38 % closed Semi-Orthogonal γ-Compressed Y",null,null,38.174999999999997,38.174999999999997,99.062910988030666,75,65.71917660607933,"29 % closed Semi-Orthogonal β-Compressed Y",55.087000000000003,55.087000000000003,78.135103222205657,60,45.121586734408666,"43 % closed Semi-Oblique T",null,60.478000000000002,60.478000000000002,70.528779365509308,60,33.557309761920713,"50 % closed Oblique T",null,63.052999999999997,63.052999999999997,65.530199479297806,60,31.39971480991904,"56 % closed Inclined Y",null,68.402000000000001,68.402000000000001,62.347904392294254,60,15.398659892761778,"60 % closed Oblique Y",null,71.421000000000006,71.421000000000006,60.571713211165793,60,7.5485906419743287,"64 % closed Semi-Oblique Y"]
[{"$f":"InOut!B4","v":146},"normrms",{"$f":"(1/SQRT(3))*(SQRT(SUMSQ(C31:C33)))","v":47.560487802376471},40.356742518031204,43.821608064211127,34.573593005838049,31.01612483854165,32.460232079679699,45.040722315107992,52.87091197750739,48.856934001224438,null,null,"normrms",{"$f":"(1/SQRT(3))*(SQRT(SUMSQ(O31:O33)))","v":20.784609690826532},22.553639765383032,21.397040293772722,42.606728733069076,31.01612483854165,36.587793957365989,39.353102376644557,51.916599785938736,45.519226706964176,18.493242008906929,12.192894105447921,13.976170195491088,18.850287354131595,31.01612483854165,24.671170759951114,12.192894105447921,13.976170195491088,12.629330940315089,27.712812921102042,61.967733539318679,27.712812921102042,24.670999999999999,24.670999999999999,170,90,90,{"$f":"ROUND(((180-AL29)/180)*100,0) &\"% α-folded T\"","v":"6% α-folded T"},"Alpha Dominant Diorthopyramid",null,11.916,11.916,150,110,90,"17 % β-folded Orthogonal Y",null,{"$f":"IF(AZ29=0,0.01,AZ29)","v":19.841000000000001},{"$f":"ROUND((1/SQRT(3))*SQRT(($A$29-BA29)^2+($A$30-BB29)^2+($A$31-BC29)^2),3)","v":19.841000000000001},135,115,105,{"$f":"ROUND(((120-BB29)/90)*100,0)&\" % β-folded Semi-Orthogonal γ-Expanded Y\"","v":"6 % β-folded Semi-Orthogonal γ-Expanded Y"},null,null,{"$f":"IF(BH29=0,0.01,BH29)","v":11.561},{"$f":"ROUND((1/SQRT(3))*SQRT(($A$29-BI29)^2+($A$30-BJ29)^2+($A$31-BK29)^2),3)","v":11.561},165,115,75,{"$f":"ROUND(((120-BJ29)/30)*100,0)&\" % β-folded Semi-Orthogonal γ-Compressed Y\"","v":"17 % β-folded Semi-Orthogonal γ-Compressed Y"},null,null,38.691000000000003,38.691000000000003,105,90,30,"90 % α-folded Semi-Orthogonal β-Compressed Y",null,81.567999999999998,81.567999999999998,45,31.39971480991904,31.39971480991904,"75 % closed T-shape",92.498000000000005,92.498000000000005,30,22.637796288806612,22.637796288806612,"82 % Closed 3/4  Expanded α-dominant Y",104.336,104.336,15,12.308598551516448,12.308598551516448,"90 % Closed 1/2  Expanded α-dominant Y",null,117.312,117.312,0,0,0,"Closed Arrow",null,105.905,105.905,15,9.4372331561361609,9.4372331561361609,"90 % Closed 2/3 α-Expanded Arrow",null,34.911999999999999,34.911999999999999,97.792952989084057,85,66.956046595645759,"35 % closed orthogonal Y","folded orthogonal Y",null,null,25.983000000000001,25.983000000000001,109.61481672669676,100,89.137118852007433,"19 % closed Semi-Orthogonal γ-Expanded Y",null,null,49.441000000000003,49.441000000000003,82.088678178415762,70,47.555278484150435,"42 % closed Semi-Orthogonal γ-Compressed Y",null,null,43.57,43.57,91.58052359413044,70,61.490539627579679,"33 % closed Semi-Orthogonal β-Compressed Y",60.402000000000001,60.402000000000001,71.185684675932833,55,41.502589846940573,"48 % closed Semi-Oblique T",null,65.263999999999996,65.263999999999996,64.441320852566847,55,30.922986152942453,"54 % closed Oblique T",null,67.572000000000003,67.572000000000003,59.972624764079427,55,28.942781118862396,"59 % closed Inclined Y",null,72.37,72.37,57.114591816454578,55,14.214283614557152,"63 % closed Oblique Y",null,75.063000000000002,75.063000000000002,55.515344822545686,55,6.9703595454434586,"67 % closed Semi-Oblique Y"]
[{"$f":"InOut!B5","v":121},"asym",{"$f":"0","v":0},{"$f":"0","v":0},{"$f":"0","v":0},{"$f":"0","v":0},{"$f":"0","v":0},{"$f":"0","v":0},{"$f":"0","v":0},{"$f":"0","v":0},{"$f":"0","v":0},null,null,"asym",{"$f":"IF(O37-$A31=0,0,((O36-$A30)/(O37-$A31)))","v":-0.5},-0.29729729729729731,-0.39130434782608697,0.15789473684210525,-2.1276595744680851E-2,7.6923076923076927E-2,-5.8571428571428568,17,-23,{"$f":"IF(X36-$A30=0,0,((X35-$A29)/(X36-$A30)))","v":0.13793103448275862},{"$f":"IF(Y36-$A30=0,0,((Y35-$A29)/(Y36-$A30)))","v":-0.31578947368421051},{"$f":"IF(Z36-$A30=0,0,((Z35-$A29)/(Z36-$A30)))","v":-4.1666666666666664E-2},{"$f":"IF(AA37-$A31=0,0,((AA36-$A30)/(AA37-$A31)))","v":0.33333333333333331},-2.1276595744680851E-2,0.10810810810810811,2.7142857142857144,-8,10.75,0,0,0,21.954000000000001,21.954000000000001,160,90,90,{"$f":"ROUND(((180-AL30)/180)*100,0) &\"% α-folded T\"","v":"11% α-folded T"},"Alpha Dominant Diorthopyramid",null,13.675000000000001,13.675000000000001,150,105,90,{"$f":"ROUND(((120-AU30)/60)*100,0)&\" % β-folded Orthogonal Y\"","v":"25 % β-folded Orthogonal Y"},null,20.542999999999999,20.542999999999999,135,110,105,{"$f":"ROUND(((120-BB30)/90)*100,0)&\" % β-folded Semi-Orthogonal γ-Expanded Y\"","v":"11 % β-folded Semi-Orthogonal γ-Expanded Y"},null,null,{"$f":"IF(BH30=0,0.01,BH30)","v":12.728},{"$f":"ROUND((1/SQRT(3))*SQRT(($A$29-BI30)^2+($A$30-BJ30)^2+($A$31-BK30)^2),3)","v":12.728},165,110,75,{"$f":"ROUND(((120-BJ30)/30)*100,0)&\" % β-folded Semi-Orthogonal γ-Compressed Y\"","v":"33 % β-folded Semi-Orthogonal γ-Compressed Y"},null,null,40.603999999999999,40.603999999999999,105,90,25,"93 % α-folded Semi-Orthogonal β-Compressed Y",null,85.463999999999999,85.463999999999999,40,27.990890717782829,27.990890717782829,"78 % closed T-shape",96.599000000000004,96.599000000000004,25,18.893639119334996,18.893639119334996,"85 % Closed 3/4  Expanded α-dominant Y",108.651,108.651,10,8.2099993692419293,8.2099993692419293,"93 % Closed 1/2  Expanded α-dominant Y",null,null,null,null,"b/g ref",null,null,null,109.699,109.699,10,6.297535402823935,6.297535402823935,"93 % Closed 2/3 α-Expanded Arrow",null,39.722999999999999,39.722999999999999,91.604242877546028,80,63.314122371366835,"39 % closed orthogonal Y",150,120,"gamma<90",29.475999999999999,29.475999999999999,103.72491656223959,95,84.971854339779739,"23 % closed Semi-Orthogonal γ-Expanded Y",null,null,54.363999999999997,54.363999999999997,75.920171008779263,65,44.381072871416208,"46 % closed Semi-Orthogonal γ-Compressed Y",null,null,48.936999999999998,48.936999999999998,84.359288135336399,65,57.225733382911457,"38 % closed Semi-Orthogonal β-Compressed Y",65.674000000000007,65.674000000000007,64.375948882772434,50,37.844694463488501,"52 % closed Semi-Oblique T",null,70.034999999999997,70.034999999999997,58.418100165556318,50,28.245343421484449,"58 % closed Oblique T",null,72.09,72.09,54.443910501578259,50,26.443373110506315,"63 % closed Inclined Y",null,76.369,76.369,51.892351851618493,50,13.004268270200901,"67 % closed Oblique Y",null,78.754999999999995,78.754999999999995,50.461522465402716,50,6.3790251865846868,"70 % closed Semi-Oblique Y"]
[{"$f":"InOut!B6","v":73},"delta a",{"$f":"$A29-$C35","v":-4},{"$f":"$A29-$D35","v":6},{"$f":"$A29-$E35","v":1},{"$f":"$A29-$F35","v":16},{"$f":"$A29-$G35","v":26},{"$f":"$A29-$H35","v":21},{"$f":"$A29-$I35","v":66},{"$f":"$A29-$J35","v":76},{"$f":"$A29-$K35","v":71},null,null,"delta a",{"$f":"$A29-O35","v":-4},6,1,46,26,36,-54,-74,-64,{"$f":"$A29-X35","v":-4},6,1,16,{"$f":"$A29-AB35","v":26},21,6,1,3.5,{"$f":"AG35-$A29","v":0},96,0,20.542999999999999,20.542999999999999,150,90,90,"17% α-folded T","Alpha Dominant Diorthopyramid",null,15.769,15.769,150,100,90,"33 % β-folded Orthogonal Y",null,21.61,21.61,135,105,105,"17 % β-folded Semi-Orthogonal γ-Expanded Y",null,null,14.387,14.387,165,105,75,"50 % β-folded Semi-Orthogonal γ-Compressed Y",null,null,42.625999999999998,42.625999999999998,105,90,20,"97 % α-folded Semi-Orthogonal β-Compressed Y",null,89.387,89.387,35,24.553173466647468,24.553173466647468,"81 % closed T-shape",100.718,100.718,20,15.133618816635423,15.133618816635423,"88 % Closed 3/4  Expanded α-dominant Y",112.977,112.977,5,4.1062748458868343,4.1062748458868343,"97 % Closed 1/2  Expanded α-dominant Y",null,{"$f":"IF(CP31=0,0.01,CP31)","v":24.175999999999998},{"$f":"ROUND((1/SQRT(3))*SQRT(($A$29-CQ31)^2+($A$30-CR31)^2+($A$31-CS31)^2),3)","v":24.175999999999998},135,112.5,112.5,"1/4 Expanded α-dominant Y",null,113.502,113.502,5,3.1505781448484615,3.1505781448484615,"97 % Closed 2/3 α-Expanded Arrow",null,44.542000000000002,44.542000000000002,85.528779365509322,75,59.610256121653777,"43 % closed orthogonal Y",150,"90<beta<120",90,33.322000000000003,33.322000000000003,97.936249514494591,90,80.747402940153989,"27 % closed Semi-Orthogonal γ-Expanded Y",null,null,59.262,59.262,69.837041715583823,60,41.154332100584504,"50 % closed Semi-Orthogonal γ-Compressed Y",null,null,54.277000000000001,54.277000000000001,77.341542652407711,60,52.929135978774227,"43 % closed Semi-Orthogonal β-Compressed Y",70.912000000000006,70.912000000000006,57.679552040845941,45,34.152406104724044,"57 % closed Semi-Oblique T",null,74.792000000000002,74.792000000000002,52.448397094208424,45,25.528779365509308,"63 % closed Oblique T",null,76.608999999999995,76.608999999999995,48.939601041404387,45,23.905711781403909,"67 % closed Inclined Y",null,80.394000000000005,80.394000000000005,46.679555636187253,45,11.770875047298075,"70 % closed Oblique Y",null,82.489000000000004,82.489000000000004,45.409881387729484,45,5.7757087945680468,"73 % closed Semi-Oblique Y"]
[null,"delta b",{"$f":"$A30-$C36","v":-29},{"$f":"$A30-$D36","v":-19},{"$f":"$A30-$E36","v":-24},{"$f":"$A30-$F36","v":-9},{"$f":"$A30-$G36","v":1},{"$f":"$A30-$H36","v":-4},{"$f":"$A30-$I36","v":41},{"$f":"$A30-$J36","v":51},{"$f":"$A30-$K36","v":46},null,null,"delta b",{"$f":"$A30-O36","v":16},11,13.5,-9,1,-4,41,51,46,-29,-19,-24,-9,1,-4,-19,-24,-21.5,-48,0,-48,20.704000000000001,20.704000000000001,140,90,90,"22% α-folded T","Alpha Dominant Diorthopyramid",null,18.082999999999998,18.082999999999998,150,95,90,{"$f":"ROUND(((120-AU32)/60)*100,0)&\" % β-folded Orthogonal Y\"","v":"42 % β-folded Orthogonal Y"},null,19.201000000000001,19.201000000000001,135,105,100,{"$f":"ROUND(((120-BC32)/90)*100,0)&\" % β-folded Semi-Orthogonal γ-Expanded Y\"","v":"22 % β-folded Semi-Orthogonal γ-Expanded Y"},null,null,16.390999999999998,16.390999999999998,165,100,75,"67 % β-folded Semi-Orthogonal γ-Compressed Y",null,null,44.744,44.744,105,90,15,"near 2/9 α-Expanded Arrow (71.43 % oblique)",null,93.331999999999994,93.331999999999994,30,21.090581178999109,21.090581178999109,"83 % closed T-shape",104.851,104.851,15,11.361057677906201,11.361057677906201,"91 % Closed 3/4  Expanded α-dominant Y",117.312,117.312,0,0,0,"Closed Arrow",null,{"$f":"IF(CP32=0,0.01,CP32)","v":23.896000000000001},{"$f":"ROUND((1/SQRT(3))*SQRT(($A$29-CQ32)^2+($A$30-CR32)^2+($A$31-CS32)^2),3)","v":23.896000000000001},{"$f":"2*DEGREES(ASIN(((SIN(RADIANS(CR32/2))*SIN(RADIANS($CQ$31/2))/SIN(RADIANS($CR$31/2))))))","v":131.06406831093406},110,110,{"$f":"ROUND(100*($CR$31-CR32)/$CR$31,0)&\" % Closed 1/4 Expanded α-dominant Y\"","v":"2 % Closed 1/4 Expanded α-dominant Y"},null,117.312,117.312,0,0,0,"Closed Arrow",null,49.366999999999997,49.366999999999997,79.545076203561266,70,55.851013418777541,"47 % closed orthogonal Y",150,90,"gamma<90",37.414000000000001,37.414000000000001,92.228321749786829,85,76.471470587491993,"32 % closed Semi-Orthogonal γ-Expanded Y",null,null,64.141000000000005,64.141000000000005,63.824513033769904,55,37.880293516101219,"54 % closed Semi-Orthogonal γ-Compressed Y",null,null,59.591999999999999,59.591999999999999,70.485537176548277,55,48.604641082834576,"48 % closed Semi-Orthogonal β-Compressed Y",76.122,76.122,51.075661722904229,40,30.429937775899521,"62 % closed Semi-Oblique T",null,79.537999999999997,79.537999999999997,46.523322053256599,40,22.777565582014702,"67 % closed Oblique T",null,81.129000000000005,81.129000000000005,43.455896694817881,40,21.33392157750853,"70 % closed Inclined Y",null,84.441000000000003,84.441000000000003,41.474790828199126,40,10.516386980434142,"73 % closed Oblique Y",null,86.260999999999996,86.260999999999996,40.360102498129663,40,5.1615516800422911,"76 % closed Semi-Oblique Y"]
[null,"delta g",{"$f":"$A31-$C37","v":-77},{"$f":"$A31-$D37","v":-67},{"$f":"$A31-$E37","v":-72},{"$f":"$A31-$F37","v":-57},{"$f":"$A31-$G37","v":-47},{"$f":"$A31-$H37","v":-52},{"$f":"$A31-$I37","v":-7},{"$f":"$A31-$J37","v":3},{"$f":"$A31-$K37","v":-2},null,null,"delta g",{"$f":"$A31-O37","v":-32},-37,-34.5,-57,-47,-52,-7,3,-2,13,-7,3,-27,-47,-37,-7,3,-2,0,48,0,21.378,21.378,135,90,90,"25% α-folded T","Alpha Dominant Diorthopyramid",null,20.542999999999999,20.542999999999999,150,90,90,{"$f":"ROUND(((180-AT33)/180)*100,0) &\"% α-folded T\"","v":"17% α-folded T"},null,16.940999999999999,16.940999999999999,135,105,95,{"$f":"ROUND(((120-BC33)/90)*100,0)&\" % β-folded Semi-Orthogonal γ-Expanded Y\"","v":"28 % β-folded Semi-Orthogonal γ-Expanded Y"},null,null,18.628,18.628,165,95,75,"83 % β-folded Semi-Orthogonal γ-Compressed Y",null,null,null,null,null,"b-fold",null,null,null,97.296000000000006,97.296000000000006,25,17.606966986614342,17.606966986614342,"86 % closed T-shape",108.996,108.996,10,7.579177487350222,7.579177487350222,"94 % Closed 3/4  Expanded α-dominant Y",null,null,null,"b/g ref",null,null,null,24.353999999999999,24.353999999999999,123.65423342842277,105,105,"7 % Closed 1/4 Expanded α-dominant Y",null,null,null,null,null,"gref",null,null,54.195999999999998,54.195999999999998,73.636675208614463,65,52.042350748673307,"51 % closed orthogonal Y","120<alpha<150",120,90,41.68,41.68,86.585855788849543,80,72.150663291571234,"36 % closed Semi-Orthogonal γ-Expanded Y",null,null,69.004999999999995,69.004999999999995,57.870728519570783,50,34.56389966173527,"58 % closed Semi-Orthogonal γ-Compressed Y",null,null,64.885999999999996,64.885999999999996,63.75991824660364,50,44.255731530514048,"52 % closed Semi-Orthogonal β-Compressed Y",81.31,81.31,44.547392158876249,35,26.68124686051522,"67 % closed Semi-Oblique T",null,84.275999999999996,84.275999999999996,40.635372853766434,35,19.995857228604795,"71 % closed Oblique T",null,85.649000000000001,85.649000000000001,37.989511699745954,35,18.732036719891791,"74 % closed Inclined Y",null,88.506,88.506,36.27681808410729,35,9.2431058124906453,"77 % closed Oblique Y",null,90.064999999999998,90.064999999999998,35.311903571964876,35,4.5377131877017769,"79 % closed Semi-Oblique Y"]
[null,null,null,null,null,null,null,null,null,null,null,null,null,null,null,null,null,null,null,null,null,null,null,null,null,null,null,null,null,null,null,null,null,null,null,22.405000000000001,22.405000000000001,130,90,90,"28% α-folded T","Alpha Dominant Diorthopyramid",null,19.329999999999998,19.329999999999998,150,90,85,{"$f":"ROUND(((120-AV34)/60)*100,0)&\" % β-folded Orthogonal Y\"","v":"58 % β-folded Orthogonal Y"},null,14.9,14.9,135,105,90,"33 % β-folded Semi-Orthogonal γ-Expanded Y",null,null,21.024000000000001,21.024000000000001,165,90,75,"near 8/9 α-Expanded Arrow (9.09 % oblique)",null,null,{"$f":"IF(BP34=0,0.01,BP34)","v":17.378},{"$f":"ROUND((1/SQRT(3))*SQRT(($A$29-BQ34)^2+($A$30-BR34)^2+($A$31-BS34)^2),3)","v":17.378},165,105,90,"Semi-Orthogonal β-Compressed Y",null,101.277,101.277,20,14.106044260566364,14.106044260566364,"89 % closed T-shape",113.15,113.15,5,3.7911255596216829,3.7911255596216829,"97 % Closed 3/4  Expanded α-dominant Y",{"$f":"IF(CI34=0,0.01,CI34)","v":20.785},{"$f":"ROUND((1/SQRT(3))*SQRT(($A$29-CJ34)^2+($A$30-CK34)^2+($A$31-CL34)^2),3)","v":20.785},150,105,105,"1/2  Expanded α-dominant Y",null,26.01,26.01,116.68114162046506,100,100,"11 % Closed 1/4 Expanded α-dominant Y",null,{"$f":"IF(CW34=0,0.01,CW34)","v":26.683},{"$f":"ROUND((1/SQRT(3))*SQRT(($A$29-CX34)^2+($A$30-CY34)^2+($A$31-CZ34)^2),3)","v":26.683},150,75,75,"2/3 α-Expanded Arrow",null,59.029000000000003,59.029000000000003,67.790671100326875,60,48.189685104221397,"55 % closed orthogonal Y",120,"90<beta<120",90,46.073999999999998,46.073999999999998,80.99716646257454,75,67.790671100326875,"40 % closed Semi-Orthogonal γ-Expanded Y",null,null,73.858000000000004,73.858000000000004,51.965991079324056,45,31.209825085650124,"63 % closed Semi-Orthogonal γ-Compressed Y",null,null,70.162999999999997,70.162999999999997,57.140411696960335,45,39.885542234055698,"57 % closed Semi-Orthogonal β-Compressed Y",86.48,86.48,38.080738860477574,30,22.91006972754889,"71 % closed Semi-Oblique T",null,89.006,89.006,34.778108668096692,30,17.187703901309966,"75 % closed Oblique T",null,90.17,90.17,32.537564589993288,30,16.104008742827446,"78 % closed Inclined Y",null,92.587999999999994,92.587999999999994,31.084536446754296,30,7.9533491412051074,"80 % closed Oblique Y",null,93.896000000000001,93.896000000000001,30.265032141053734,30,3.9053686577510045,"82 % closed Semi-Oblique Y"]
[null,"alpha",{"$f":"ROUNDUP(A29,-1)","v":150},{"$f":"ROUNDDOWN(A29,-1)","v":140},{"$f":"(C35+D35)/2","v":145},{"$f":"ROUNDUP($A30,-1)","v":130},{"$f":"ROUNDDOWN($A30,-1)","v":120},{"$f":"(F35+G35)/2","v":125},{"$f":"ROUNDUP($A31,-1)","v":80},{"$f":"ROUNDDOWN($A31,-1)","v":70},{"$f":"(I35+J35)/2","v":75},null,null,"alpha",{"$f":"ROUNDUP(A29,-1)","v":150},{"$f":"ROUNDDOWN(A29,-1)","v":140},{"$f":"(O35+P35)/2","v":145},{"$f":"(360-R36-R37)","v":100},120,110,200,220,210,{"$f":"ROUNDUP(A29,-1)","v":150},{"$f":"ROUNDDOWN(A29,-1)","v":140},{"$f":"(X35+Y35)/2","v":145},{"$f":"AA36","v":130},120,125,140,145,142.5,{"$f":"$A29","v":146},{"$f":"AH36+AH37","v":242},{"$f":"AI36+AI37","v":146},25.338000000000001,25.338000000000001,120,90,90,"33% α-folded T","Alpha Dominant Diorthopyramid",null,18.492999999999999,18.492999999999999,150,90,80,{"$f":"ROUND(((120-AV35)/60)*100,0)&\" % β-folded Orthogonal Y\"","v":"67 % β-folded Orthogonal Y"},null,13.178000000000001,13.178000000000001,135,105,85,"39 % β-folded Semi-Orthogonal γ-Expanded Y",null,null,null,null,null,null,"g-fold",null,null,null,{"$f":"IF(BP35=0,0.01,BP35)","v":19.07},{"$f":"ROUND((1/SQRT(3))*SQRT(($A$29-BQ35)^2+($A$30-BR35)^2+($A$31-BS35)^2),3)","v":19.07},165,100,90,{"$f":"ROUND(((105-BR35)/30)*100,0)&\" % β-folded Semi-Orthogonal β-Compressed Y\"","v":"17 % β-folded Semi-Orthogonal β-Compressed Y"},null,105.271,105.271,15,10.59141113481019,10.59141113481019,"92 % closed T-shape",117.312,117.312,0,0,0,"Closed Arrow",{"$f":"IF(CI35=0,0.01,CI35)","v":20.32},{"$f":"ROUND((1/SQRT(3))*SQRT(($A$29-CJ35)^2+($A$30-CK35)^2+($A$31-CL35)^2),3)","v":20.32},{"$f":"2*DEGREES(ASIN(((SIN(RADIANS(CK35/2))*SIN(RADIANS($CJ$34/2))/SIN(RADIANS($CK$34/2))))))","v":137.7119420881242},100,100,{"$f":"ROUND(100*($CK$34-CK35)/$CK$34,0)&\" % Closed 1/2  Expanded α-dominant Y\"","v":"5 % Closed 1/2  Expanded α-dominant Y"},null,28.606999999999999,28.606999999999999,110.01331459659491,95,95,"16 % Closed 1/4 Expanded α-dominant Y",null,{"$f":"IF(CW35=0,0.01,CW35)","v":30.734999999999999},{"$f":"ROUND((1/SQRT(3))*SQRT(($A$29-CX35)^2+($A$30-CY35)^2+($A$31-CZ35)^2),3)","v":30.734999999999999},{"$f":"2*DEGREES(ASIN(((SIN(RADIANS(CY35/2))*SIN(RADIANS($CX$34/2))/SIN(RADIANS($CY$34/2))))))","v":131.03767509371892},70,70,{"$f":"ROUND(100*($CY$34-CY35)/$CY$34,0)&\" % Closed 2/3 α-Expanded Arrow\"","v":"7 % Closed 2/3 α-Expanded Arrow"},null,63.865000000000002,63.865000000000002,61.996735767024248,55,44.297958022385984,"59 % closed orthogonal Y",120,90,"gamma<90",50.564,50.564,75.453119134998516,70,63.396420392849521,"44 % closed Semi-Orthogonal γ-Expanded Y",null,null,78.700999999999993,78.700999999999993,46.102227159660771,40,27.822503205166015,"67 % closed Semi-Orthogonal γ-Compressed Y",null,null,75.426000000000002,75.426000000000002,50.607720726726967,40,35.496914156645403,"62 % closed Semi-Orthogonal β-Compressed Y",91.637,91.637,31.663827792589558,25,19.119954215228198,"76 % closed Semi-Oblique T",null,93.730999999999995,93.730999999999995,28.94590429226524,25,14.357061384912132,"79 % closed Oblique T",null,94.691999999999993,94.691999999999993,27.097491948554655,25,13.453715021068044,"81 % closed Inclined Y",null,96.683999999999997,96.683999999999997,25.896955372401671,25,6.6494478284043366,"83 % closed Oblique Y",null,97.753,97.753,25.219259660461617,25,3.2657073971897956,"85 % closed Semi-Oblique Y"]
[null,"Beta",{"$f":"C35","v":150},140,145,130,120,125,80,{"$f":"J35","v":70},{"$f":"K35","v":75},null,null,"Beta",{"$f":"(360-O35)/2","v":105},{"$f":"(360-P35)/2","v":110},{"$f":"(360-Q35)/2","v":107.5},{"$f":"ROUNDUP($A30,-1)","v":130},{"$f":"ROUNDDOWN($A30,-1)","v":120},{"$f":"(R36+S36)/2","v":125},{"$f":"U37","v":80},{"$f":"V37","v":70},{"$f":"W37","v":75},{"$f":"X35","v":150},{"$f":"Y35","v":140},{"$f":"Z35","v":145},{"$f":"ROUNDUP($A30,-1)","v":130},{"$f":"ROUNDDOWN($A30,-1)","v":120},{"$f":"(AA36+AB36)/2","v":125},{"$f":"(360-AD37)/2","v":140},{"$f":"(360-AE37)/2","v":145},{"$f":"(360-AF37)/2","v":142.5},{"$f":"(AG35/2)","v":73},{"$f":"$A30","v":121},{"$f":"AI37","v":73},{"$f":"IF(AK36=0,0.01,AK36)","v":29.132000000000001},29.132000000000001,110,90,90,"39% α-folded T","Alpha Dominant Diorthopyramid",null,18.082999999999998,18.082999999999998,150,90,75,"75 % β-folded Orthogonal Y",null,11.916,11.916,135,105,80,"44 % β-folded Semi-Orthogonal γ-Expanded Y",null,null,{"$f":"IF(BH36=0,0.01,BH36)","v":11.045},{"$f":"ROUND((1/SQRT(3))*SQRT(($A$29-BI36)^2+($A$30-BJ36)^2+($A$31-BK36)^2),3)","v":11.045},165,120,75,"Semi-Orthogonal γ-Compressed Y",null,null,21.024000000000001,21.024000000000001,165,95,90,{"$f":"ROUND(((105-BR36)/30)*100,0)&\" % β-folded Semi-Orthogonal β-Compressed Y\"","v":"33 % β-folded Semi-Orthogonal β-Compressed Y"},null,109.276,109.276,10,7.0665743892616089,7.0665743892616089,"94 % closed T-shape",null,null,null,"b/g ref",null,null,22.321999999999999,22.321999999999999,127.70226101265871,95,95,"10 % Closed 1/2  Expanded α-dominant Y",null,31.887,31.887,103.56999834767713,90,90,"20 % Closed 1/4 Expanded α-dominant Y",null,36.707000000000001,36.707000000000001,116.97735145613878,65,65,"13 % Closed 2/3 α-Expanded Arrow",null,68.704999999999998,68.704999999999998,56.246450853351064,50,40.3716940606162,"63 % closed orthogonal Y",null,null,null,55.127000000000002,55.127000000000002,69.946436178565804,65,58.972199917500475,"48 % closed Semi-Orthogonal γ-Expanded Y",null,null,83.537999999999997,83.537999999999997,40.272599550756809,35,24.406152893049853,"71 % closed Semi-Orthogonal γ-Compressed Y",null,null,80.677000000000007,80.677000000000007,44.146135288885077,35,31.092440862427718,"67 % closed Semi-Orthogonal β-Compressed Y",96.781999999999996,96.781999999999996,25.286368816172764,20,15.314290204201386,"81 % closed Semi-Oblique T",null,98.451999999999998,98.451999999999998,23.13376036455519,20,11.507804074967583,"83 % closed Oblique T",null,99.213999999999999,99.213999999999999,21.666979193159996,20,10.784968093395609,"85 % closed Inclined Y",null,100.791,100.791,20.713171728716691,20,5.3337436459418157,"87 % closed Oblique Y",null,101.631,101.631,20.174376646278354,20,2.619930661198258,"88 % closed Semi-Oblique Y"]
[null,"gamma",{"$f":"C35","v":150},140,145,130,120,125,80,{"$f":"J35","v":70},{"$f":"K35","v":75},null,null,"gamma",{"$f":"O36","v":105},110,107.5,130,120,125,{"$f":"ROUNDUP($A31,-1)","v":80},{"$f":"ROUNDDOWN($A31,-1)","v":70},{"$f":"(U37+V37)/2","v":75},{"$f":"(360-(X35+X36))","v":60},{"$f":"(360-(Y35+Y36))","v":80},{"$f":"(360-(Z35+Z36))","v":70},{"$f":"360-(AA35+AA36)","v":100},{"$f":"360-(AB35+AB36)","v":120},{"$f":"360-(AC35+AC36)","v":110},{"$f":"ROUNDUP($A31,-1)","v":80},{"$f":"ROUNDDOWN($A31,-1)","v":70},{"$f":"(AD37+AE37)/2","v":75},{"$f":"(AG35/2)","v":73},{"$f":"AH36","v":121},{"$f":"$A31","v":73},33.496000000000002,33.496000000000002,100,90,90,"44% α-folded T","Alpha Dominant Diorthopyramid",null,18.129000000000001,18.129000000000001,150,90,70,"83 % β-folded Orthogonal Y",null,11.269,11.269,135,105,75,"50 % β-folded Semi-Orthogonal γ-Expanded Y",null,null,{"$f":"IF(BH37=0,0.01,BH37)","v":11.121},{"$f":"ROUND((1/SQRT(3))*SQRT(($A$29-BI37)^2+($A$30-BJ37)^2+($A$31-BK37)^2),3)","v":11.121},165,120,70,{"$f":"ROUND(((75-BK37)/30)*100,0)&\" % γ-folded Semi-Orthogonal γ-Compressed Y\"","v":"17 % γ-folded Semi-Orthogonal γ-Compressed Y"},null,null,23.172999999999998,23.172999999999998,165,90,90,"50 % β-folded Semi-Orthogonal β-Compressed Y",null,113.291,113.291,5,3.5349727892151459,3.5349727892151459,"97 % closed T-shape",{"$f":"IF(CC37=0,0.01,CC37)","v":22.460999999999999},{"$f":"ROUND((1/SQRT(3))*SQRT(($A$29-CD37)^2+($A$30-CE37)^2+($A$31-CF37)^2),3)","v":22.460999999999999},165,{"$f":"(360-165)/2","v":97.5},{"$f":"(360-165)/2","v":97.5}," 3/4 Expanded α-dominant Y",25.74,25.74,118.83977602042297,90,90,"14 % Closed 1/2  Expanded α-dominant Y",null,35.646000000000001,35.646000000000001,97.297871907113233,85,85,"24 % Closed 1/4 Expanded α-dominant Y",null,43.093000000000004,43.093000000000004,104.99999999999999,60,60,"20 % Closed 2/3 α-Expanded Arrow",null,73.549000000000007,73.549000000000007,50.532837873487331,45,36.415053948436899,"66 % closed orthogonal Y",null,null,null,59.747999999999998,59.747999999999998,64.471220634490692,60,54.521765238054229,"52 % closed Semi-Orthogonal γ-Expanded Y",null,null,88.369,88.369,34.471220634490685,30,20.964804569366603,"75 % closed Semi-Orthogonal γ-Compressed Y",null,null,85.92,85.92,37.742577324536761,30,26.674508930857051,"71 % closed Semi-Orthogonal β-Compressed Y",101.92,101.92,18.939244779695731,15,11.496338524637084,"86 % closed Semi-Oblique T",null,103.17,103.17,17.337152998569962,15,8.6437379080912979,"88 % closed Oblique T",null,103.738,103.738,16.243903816118998,15,8.1015256167932375,"89 % closed Inclined Y",null,104.90900000000001,104.90900000000001,15.532350513880326,15,4.0085871294994373,"90 % closed Oblique Y",null,105.52800000000001,105.52800000000001,15.130188549803281,15,1.9692496443180518,"91 % closed Semi-Oblique Y"]
[null,null,null,null,null,null,null,null,null,null,null,null,null,"folding",{"$f":"ROUND(((O35-$A29)/O35)*100,0)","v":3},{"$f":"ROUND(((P35-$A29)/P35)*100,0)","v":-4},-1,{"$f":"ROUND(((R35-$A29)/R35)*100,0)","v":-46},-22,-33,{"$f":"ROUND(((U35-$A29)/U35)*100,0)","v":27},34,30,{"$f":"ROUND((1-($A31/X37))*100,0)","v":-22},9,-4,27,39,34,{"$f":"ROUND((1-($A30/AD36))*100,0)","v":14},{"$f":"ROUND((1-($A30/AE36))*100,0)","v":17},{"$f":"ROUND((1-($A30/AF36))*100,0)","v":15},{"$f":"ROUND(((AG35-$A29)/AG35)*100,0)","v":0},{"$f":"ROUND(((AH36-$A30)/AH36)*100,0)","v":0},{"$f":"ROUND(((AI36-$A30)/AI36)*100,0)","v":-66},38.235999999999997,38.235999999999997,90,90,90,"Orthopyramidal",null,null,18.628,18.628,150,90,65,"92 % β-folded Orthogonal Y",null,11.343,11.343,135,105,70,"56 % β-folded Semi-Orthogonal γ-Expanded Y",null,null,11.916,11.916,165,120,65,{"$f":"ROUND(((75-BK38)/30)*100,0)&\" % γ-folded Semi-Orthogonal γ-Compressed Y\"","v":"33 % γ-folded Semi-Orthogonal γ-Compressed Y"},null,null,22.106000000000002,22.106000000000002,165,90,85,{"$f":"ROUND(((105-BS38)/30)*100,0)&\" % β-folded Semi-Orthogonal β-Compressed Y\"","v":"67 % β-folded Semi-Orthogonal β-Compressed Y"},null,117.312,117.312,0,0,0,"Closed Arrow",{"$f":"IF(CC38=0,0.01,CC38)","v":20.068000000000001},{"$f":"ROUND((1/SQRT(3))*SQRT(($A$29-CD38)^2+($A$30-CE38)^2+($A$31-CF38)^2),3)","v":20.068000000000001},{"$f":"2*DEGREES(ASIN(((SIN(RADIANS(CE38/2))*SIN(RADIANS($CD$2/2))/SIN(RADIANS($CE$2/2))))))","v":152.93701127808279},95,95,{"$f":"ROUND(100*($CE$2-CE38)/$CE$2,0)&\" % Closed 3/4  Expanded α-dominant Y\"","v":"3 % Closed 3/4  Expanded α-dominant Y"},29.93,29.93,110.68105739395439,85,85,"19 % Closed 1/2  Expanded α-dominant Y",null,39.738,39.738,91.159822632958992,80,80,"29 % Closed 1/4 Expanded α-dominant Y",null,49.534999999999997,49.534999999999997,94.219648702235119,55,55,"27 % Closed 2/3 α-Expanded Arrow",null,78.397000000000006,78.397000000000006,44.850018854383869,40,32.431882795683158,"70 % closed orthogonal Y",null,null,null,64.415000000000006,64.415000000000006,59.022620144648116,55,50.048425511618092,"56 % closed Semi-Orthogonal γ-Expanded Y",null,null,93.197000000000003,93.197000000000003,28.692934959358261,25,17.502325679115422,"79 % closed Semi-Orthogonal γ-Compressed Y",null,null,91.156000000000006,91.156000000000006,31.385923060653781,25,22.245333332956118,"76 % closed Semi-Orthogonal β-Compressed Y",107.053,107.053,12.61419183514974,10,7.6692584608768959,"90 % closed Semi-Oblique T",null,107.88500000000001,{"$f":"ROUND((1/SQRT(3))*SQRT(($A$29-EQ38)^2+($A$30-ER38)^2+($A$31-ES38)^2),3)","v":107.88500000000001},11.551911245237752,10,5.7686136687328968,"92 % closed Oblique T",null,108.262,108.262,10.826287695660136,10,5.407100809366634,"93 % closed Inclined Y",null,109.036,109.036,10.353708339700491,10,2.6763356090379005,"93 % closed Oblique Y",null,109.441,109.441,10.086512184727411,10,1.314883480612566,"94 % closed Semi-Oblique Y"]
[null,"folding?",null,null,null,null,null,null,null,null,null,null,null,null,{"$f":"O38&\" % folded (alpha)\"","v":"3 % folded (alpha)"},"-4 % folded (alpha)","-1 % folded (alpha)","-46 % folded (alpha)","-22 % folded (alpha)","-33 % folded (alpha)","27 % folded (alpha)","34 % folded (alpha)","30 % folded (alpha)",{"$f":"X38&\" % gamma folded\"","v":"-22 % gamma folded"},{"$f":"Y38&\" % gamma folded\"","v":"9 % gamma folded"},{"$f":"Z38&\" % gamma folded\"","v":"-4 % gamma folded"},{"$f":"AA38&\" % folded (gamma)\"","v":"27 % folded (gamma)"},"39 % folded (gamma)","34 % folded (gamma)",{"$f":"AD38&\" % folded (beta)\"","v":"14 % folded (beta)"},"17 % folded (gamma)","15 % folded (gamma)",{"$f":"ROUND((1-$A31/AG37)*100, 0)&\" % gamma folded\"","v":"0 % gamma folded"},null,{"$f":"ROUND((1-$A29/AI35)*100,0)&\" % Alpha folded\"","v":"0 % Alpha folded"},37.174999999999997,37.174999999999997,90,90,80,{"$f":"ROUND(100-(AN39/180)*100,0) &\"% α-folded T\"","v":"56% α-folded T"},"Gamma Dominant Diorthopyramid",null,19.545000000000002,19.545000000000002,150,90,60,"20% oblique 2/3 α-Expanded Arrow",null,12.124000000000001,12.124000000000001,135,105,65,"61 % β-folded Semi-Orthogonal γ-Expanded Y",null,null,13.304,13.304,165,120,60,"50 % γ-folded Semi-Orthogonal γ-Compressed Y",null,null,21.378,21.378,165,90,80,{"$f":"ROUND(((105-BS39)/30)*100,0)&\" % β-folded Semi-Orthogonal β-Compressed Y\"","v":"83 % β-folded Semi-Orthogonal β-Compressed Y"},null,null,null,"b/g ref",null,null,null,20.975000000000001,20.975000000000001,{"$f":"2*DEGREES(ASIN(((SIN(RADIANS(CE39/2))*SIN(RADIANS($CD$2/2))/SIN(RADIANS($CE$2/2))))))","v":137.64184556261043},90,90,{"$f":"ROUND(100*($CE$2-CE39)/$CE$2,0)&\" % Closed 3/4  Expanded α-dominant Y\"","v":"8 % Closed 3/4  Expanded α-dominant Y"},34.54,34.54,103.00008298103053,80,80,"24 % Closed 1/2  Expanded α-dominant Y",null,44.064999999999998,44.064999999999998,85.128953002065344,75,75,"33 % Closed 1/4 Expanded α-dominant Y",null,55.936,55.936,84.222334192089065,50,50,"33 % Closed 2/3 α-Expanded Arrow",null,83.248000000000005,83.248000000000005,39.192965508898794,35,28.425753818880661,"74 % closed orthogonal Y",null,null,null,69.12,69.12,53.596584206145828,50,45.555115853735373,"60 % closed Semi-Orthogonal γ-Expanded Y",null,null,98.022000000000006,98.022000000000006,22.933150427296358,20,14.022445510476787,"83 % closed Semi-Orthogonal γ-Compressed Y",null,null,96.388000000000005,96.388000000000005,25.066506604301477,20,17.806988706729999,"81 % closed Semi-Orthogonal β-Compressed Y",112.18300000000001,112.18300000000001,6.3035410273030514,5,3.8361341279870489,"95 % closed Semi-Oblique T",null,112.598,112.598,5.7741139950949991,5,2.8861405666786117,"96 % closed Oblique T",null,112.786,112.786,5.4122559060750586,5,2.7053732601499014,"96 % closed Inclined Y",null,113.17,113.17,5.1764989265695842,5,1.339351382764586,"97 % closed Oblique Y",null,113.37,113.37,5.0431725604081716,5,0.65805725155047767,"97 % closed Semi-Oblique Y"]
[null,"name",{"$f":"IF(C35>120,\"Imaginary\",VLOOKUP(C35,$B$2:M26,4,FALSE))","v":"Imaginary"},{"$f":"IF(D35>120,\"Imaginary\",VLOOKUP(D35,$B$2:N26,4,FALSE))","v":"Imaginary"},{"$f":"IF(E35>120,\"Imaginary\",VLOOKUP(E35,$B$2:O26,4,FALSE))","v":"Imaginary"},{"$f":"IF(F35>120,\"Imaginary\",VLOOKUP(F35,$B$2:P26,4,FALSE))","v":"Imaginary"},{"$f":"IF(G35>120,\"Imaginary\",VLOOKUP(G35,$B$2:Q26,4,FALSE))","v":"Trigonal planar"},{"$f":"IF(H35>120,\"Imaginary\",VLOOKUP(H35,$B$2:R26,4,FALSE))","v":"Imaginary"},{"$f":"IF(I35>120,\"Imaginary\",VLOOKUP(I35,$B$2:S26,4,FALSE))","v":"27.3 % Closed  Trigonal Pyramid"},{"$f":"IF(J35>120,\"Imaginary\",VLOOKUP(J35,$B$2:T26,4,FALSE))","v":"36.4 % Closed  Trigonal Pyramid"},{"$f":"IF(K35>120,\"Imaginary\",VLOOKUP(K35,$B$2:U26,4,FALSE))","v":"31.8 % Closed  Trigonal Pyramid"},null,null,"name",{"$f":"IF(OR(O35<O36,O35>180),\"Err\",O39&\" Expanded α-dominant Y\")","v":"3 % folded (alpha) Expanded α-dominant Y"},{"$f":"IF(OR(P35<P36,P35>180),\"Err\",P39&\" Expanded α-dominant Y\")","v":"-4 % folded (alpha) Expanded α-dominant Y"},"-1 % folded (alpha) Expanded α-dominant Y","Err","-22 % folded (alpha) Expanded α-dominant Y","Err",{"$f":"IF(OR(U35<U36,U35>180),\"Err\",U39&\" Expanded α-dominant Y\")","v":"Err"},{"$f":"IF(OR(V35<V36,V35>180),\"Err\",V39&\" Expanded α-dominant Y\")","v":"Err"},{"$f":"IF(OR(W35<W36,W35>180),\"Err\",W39&\" Expanded α-dominant Y\")","v":"Err"},{"$f":"IF(OR(X35<X36,X35>180),\"Err\",X39&\" Constricted γ-dominant Y\")","v":"-22 % gamma folded Constricted γ-dominant Y"},{"$f":"IF(OR(Y35<Y36,Y35>180),\"Err\",Y39&\" Constricted γ-dominant Y\")","v":"9 % gamma folded Constricted γ-dominant Y"},"-4 % gamma folded Constricted γ-dominant Y","27 % folded (gamma) Constricted γ-dominant Y","39 % folded (gamma) Constricted γ-dominant Y","34 % folded (gamma) Constricted γ-dominant Y","14 % folded (beta) Constricted γ-dominant Y","17 % folded (gamma) Constricted γ-dominant Y","15 % folded (gamma) Constricted γ-dominant Y",{"$f":"IF(AG35>180,\"Err\",AG39&\" Arrow\")","v":"0 % gamma folded Arrow"},{"$f":"IF(AH35>180,\"Err\",AH39&\" Arrow\")","v":"Err"},{"$f":"IF(AI35>180,\"Err\",AI39&\" Arrow\")","v":"0 % Alpha folded Arrow"},36.994999999999997,36.994999999999997,90,90,70,{"$f":"ROUND(100-(AN40/180)*100,0) &\"% α-folded T\"","v":"61% α-folded T"},"Gamma Dominant Diorthopyramid",null,null,"gamma fold",null,null,null,null,null,13.491,13.491,135,105,60,"67 % β-folded Semi-Orthogonal γ-Expanded Y",null,null,15.122,15.122,165,120,55,"67 % γ-folded Semi-Orthogonal γ-Compressed Y",null,null,21.024000000000001,21.024000000000001,165,90,75,"near 8/9 α-Expanded Arrow (9.09 % oblique)",null,{"$f":"IF(BW40=0,0.01,BW40)","v":28.32},{"$f":"ROUND((1/SQRT(3))*SQRT(($A$29-BX40)^2+($A$30-BY40)^2+($A$31-BZ40)^2),3)","v":28.32},180,90,90,"T-Shape",24.773,24.773,125.97189541212059,85,85,"13 % Closed 3/4  Expanded α-dominant Y",39.386000000000003,39.386000000000003,95.664224404753838,75,75,"29 % Closed 1/2  Expanded α-dominant Y",null,48.56,48.56,79.18512854895215,70,70,"38 % Closed 1/4 Expanded α-dominant Y",null,62.271000000000001,62.271000000000001,74.775554939752155,45,45,"40 % Closed 2/3 α-Expanded Arrow",null,88.102999999999994,88.102999999999994,33.557309761920713,30,24.400008083626439,"78 % closed orthogonal Y",null,null,null,73.855999999999995,73.855999999999995,48.189685104221418,45,41.044457969176236,"64 % closed Semi-Orthogonal γ-Expanded Y",null,null,102.845,102.845,17.187703901309966,15,10.52877936550931,"88 % closed Semi-Orthogonal γ-Compressed Y",null,null,101.61799999999999,101.61799999999999,18.77574468707931,15,13.361437336823879,"86 % closed Semi-Orthogonal β-Compressed Y",117.312,117.312,0,0,0,"Closed Arrow",null,117.312,117.312,0,0,0,"Closed Arrow",null,117.312,117.312,0,0,0,"Closed Arrow",null,117.312,117.312,0,0,0,"Closed Arrow",null,117.312,117.312,0,0,0,"Closed Arrow"]
["OUTPUT","rmsd","name","alph","beta","gamma",null,null,null,null,null,null,null,null,null,null,null,null,null,null,null,null,null,null,null,null,null,null,null,null,null,null,null,null,null,37.709000000000003,37.709000000000003,90,90,60,"67% α-folded T","Gamma Dominant Diorthopyramid",null,10.1,10.1,150,120,90,"Orthogonal Y",null,15.286,15.286,135,105,55,"72 % β-folded Semi-Orthogonal γ-Expanded Y",null,null,17.234000000000002,17.234000000000002,165,120,50,"83 % γ-folded Semi-Orthogonal γ-Compressed Y",null,null,null,null,null,null,"g-fold",null,null,21.91,21.91,{"$f":"2*DEGREES(ASIN(((SIN(RADIANS(BY41/2))*SIN(RADIANS($BX$2/2))/SIN(RADIANS($BY$2/2))))))","v":145.65835833073035},85,85,{"$f":"ROUND(100*($BY$2-BY41)/$BY$2,0)&\" % closed T-shape\"","v":"6 % closed T-shape"},29.638000000000002,29.638000000000002,115.91151265539801,80,80,"18 % Closed 3/4  Expanded α-dominant Y",44.37,44.37,88.588334224783267,70,70,"33 % Closed 1/2  Expanded α-dominant Y",null,53.177,53.177,73.312869315511534,65,65,"42 % Closed 1/4 Expanded α-dominant Y",null,68.539000000000001,68.539000000000001,65.733300493458017,40,40,"47 % Closed 2/3 α-Expanded Arrow",null,92.962000000000003,92.962000000000003,27.939197536383514,25,20.357790769218131,"81 % closed orthogonal Y",null,null,null,78.617999999999995,78.617999999999995,42.798983244667333,40,36.518811242895318,"68 % closed Semi-Orthogonal γ-Expanded Y",null,null,107.667,107.667,11.452751222036218,10,7.0248521380115818,"92 % closed Semi-Orthogonal γ-Compressed Y",null,null,106.84699999999999,106.84699999999999,12.50584330554998,10,8.9105545366616887,"90 % closed Semi-Orthogonal β-Compressed Y",null,null,"a-ref",null,null,null,null,null,null,"a-ref",null,null,null,null,null,"a-ref",null,null,null,null,null,null,null,"a-ref"]
["Min 1 (Trig)",{"$f":"MIN(C29:K29,O29:AF29)","v":12.192894105447921},{"$f":"HLOOKUP($B42,C29:AI40,12,FALSE)","v":"9 % gamma folded Constricted γ-dominant Y"},{"$f":"HLOOKUP($B42,C29:AJ40,7,FALSE)","v":140},{"$f":"HLOOKUP($B42,D29:AJ40,8,FALSE)","v":140},{"$f":"HLOOKUP($B42,C29:AJ40,9,FALSE)","v":80},"METRICS","of Input Pyramid","a+b","a+g","b+g",null,null,null,null,null,null,null,null,null,null,null,null,null,null,null,null,null,null,null,null,null,null,null,null,39.268000000000001,39.268000000000001,90,90,50,"72% α-folded T","Gamma Dominant Diorthopyramid",null,7.3259999999999996,7.3259999999999996,150,120,85,{"$f":"ROUND(((90-AV42)/60)*100,0)&\" % γ-folded Orthogonal Y\"","v":"8 % γ-folded Orthogonal Y"},null,17.378,17.378,135,105,50,"78 % β-folded Semi-Orthogonal γ-Expanded Y",null,null,19.545000000000002,19.545000000000002,165,120,45,"near 8/9 α-Expanded Arrow (45.45 % oblique)",null,null,{"$f":"IF(BP42=0,0.01,BP42)","v":17.378},{"$f":"ROUND((1/SQRT(3))*SQRT(($A$29-BQ42)^2+($A$30-BR42)^2+($A$31-BS42)^2),3)","v":17.378},165,105,90,"Semi-Orthogonal β-Compressed Y",null,{"$f":"IF(BW42=0,0.01,BW42)","v":25.577999999999999},25.577999999999999,130.74575661832304,80,80,"11 % closed T-shape",34.915999999999997,34.915999999999997,106.79060717615928,75,75,"23 % Closed 3/4  Expanded α-dominant Y",49.439,49.439,81.714179845965646,65,65,"38 % Closed 1/2  Expanded α-dominant Y",null,57.886000000000003,57.886000000000003,67.5,60,60,"47 % Closed 1/4 Expanded α-dominant Y",null,74.748000000000005,74.748000000000005,56.996497766082641,35,35,"53 % Closed 2/3 α-Expanded Arrow",null,97.823999999999998,97.823999999999998,22.33517342977375,20,16.302084453367627,"85 % closed orthogonal Y",null,null,null,83.402000000000001,83.402000000000001,37.421924015232179,35,31.980316087005548,"72 % closed Semi-Orthogonal γ-Expanded Y",null,null,112.489,112.489,5.7246743355140071,5,3.5141213848838326,"96 % closed Semi-Orthogonal γ-Compressed Y",null,null,112.078,112.078,6.249559597776809,5,4.4561520469431031,"95 % closed Semi-Orthogonal β-Compressed Y",21.725999999999999,{"$f":"ROUND((1/SQRT(3))*SQRT(($A$29-EJ42)^2+($A$30-EK42)^2+($A$31-EL42)^2),3)","v":21.725999999999999},180,105,75,"Semi oblique T",null,21.024000000000001,{"$f":"ROUND((1/SQRT(3))*SQRT(($A$29-EQ42)^2+($A$30-ER42)^2+($A$31-ES42)^2),3)","v":21.024000000000001},180,120,60,"Oblique T",null,{"$f":"IF(EW42=0,0.01,EW42)","v":26.683},{"$f":"ROUND((1/SQRT(3))*SQRT(($A$29-EX42)^2+($A$30-EY42)^2+($A$31-EZ42)^2),3)","v":26.683},180,135,45,"Inclined Y",null,{"$f":"IF(FD42=0,0.01,FD42)","v":26.683},{"$f":"ROUND((1/SQRT(3))*SQRT(($A$29-FE42)^2+($A$30-FF42)^2+($A$31-FG42)^2),3)","v":26.683},180,135,45,"Oblique Y"]
["Min 2 (fold)",{"$f":"MIN(AJ2:AJ26,AJ28:AJ49)","v":15.067},{"$f":"VLOOKUP(B43,AJ2:AO48,6,FALSE)","v":"37 % folded Trigonal Plane"},{"$f":"VLOOKUP($B43,$AJ2:$AO48,3,FALSE)","v":120},{"$f":"VLOOKUP($B43,$AJ2:$AO48,4,FALSE)","v":120},{"$f":"VLOOKUP($B43,$AJ2:$AO48,5,FALSE)","v":75},null,null,{"$f":"$I49+$I50","v":267},{"$f":"$I49+$I51","v":219},{"$f":"$I50+$I51","v":194},null,null,null,null,null,null,null,null,null,null,null,null,null,null,null,null,null,null,null,null,null,null,null,null,40.335999999999999,40.335999999999999,90,90,45,"75% α-folded T","Gamma Dominant Diorthopyramid",null,4.6900000000000004,4.6900000000000004,150,120,80,{"$f":"ROUND(((90-AV43)/60)*100,0)&\" % γ-folded Orthogonal Y\"","v":"17 % γ-folded Orthogonal Y"},null,19.672000000000001,19.672000000000001,135,105,45,"83 % β-folded Semi-Orthogonal γ-Expanded Y",null,null,null,null,null,null,null,null,null,null,{"$f":"IF(BP43=0,0.01,BP43)","v":15.927},{"$f":"ROUND((1/SQRT(3))*SQRT(($A$29-BQ43)^2+($A$30-BR43)^2+($A$31-BS43)^2),3)","v":15.927},165,105,85,{"$f":"ROUND(((90-BS43)/30)*100,0)&\" % γ-folded Semi-Orthogonal β-Compressed Y\"","v":"17 % γ-folded Semi-Orthogonal β-Compressed Y"},null,30.864000000000001,30.864000000000001,118.83977602042299,75,75,"17 % closed T-shape",40.357999999999997,40.357999999999997,98.290521621446729,70,70,"28 % Closed 3/4  Expanded α-dominant Y",54.561999999999998,54.561999999999998,74.999999999999986,60,60,"43 % Closed 1/2  Expanded α-dominant Y",null,62.664000000000001,62.664000000000001,61.736751772439817,55,55,"51 % Closed 1/4 Expanded α-dominant Y",null,80.906000000000006,80.906000000000006,48.493848635992386,30,30,"60 % Closed 2/3 α-Expanded Arrow",null,102.69,102.69,16.742087601986405,15,12.235739897384926,"89 % closed orthogonal Y",null,null,null,88.206000000000003,88.206000000000003,32.056257377089032,30,27.430931015520716,"76 % closed Semi-Orthogonal γ-Expanded Y",null,null,117.312,117.312,{"$f":"2*DEGREES(ASIN(((SIN(RADIANS(DX43/2))*SIN(RADIANS($DN$2/2))/SIN(RADIANS($DP$2/2))))))","v":0},0,{"$f":"2*DEGREES(ASIN(((SIN(RADIANS(DW43/2))*SIN(RADIANS($DP$25/2))/SIN(RADIANS($DO$25/2))))))","v":0},"Closed Arrow",null,null,117.312,117.312,{"$f":"2*DEGREES(ASIN(((SIN(RADIANS(EE43/2))*SIN(RADIANS($DV$2/2))/SIN(RADIANS($DW$2/2))))))","v":0},0,0,"Closed Arrow",19.193999999999999,19.193999999999999,175,{"$f":"2*DEGREES(ASIN(((SIN(RADIANS(EJ43/2))*SIN(RADIANS($EK$2/2))/SIN(RADIANS($EJ$2/2))))))","v":104.85797737819989},{"$f":"2*DEGREES(ASIN(((SIN(RADIANS(EJ43/2))*SIN(RADIANS($EL$2/2))/SIN(RADIANS($EJ$2/2))))))","v":74.916334318134346},{"$f":"ROUND(100*($EJ$42-EJ43)/$EJ$42,0)&\" % closed Semi-Oblique T\"","v":"3 % closed Semi-Oblique T"},null,18.376000000000001,18.376000000000001,175,{"$f":"2*DEGREES(ASIN(((SIN(RADIANS(EQ43/2))*SIN(RADIANS($ER$2/2))/SIN(RADIANS($EQ$42/2))))))","v":119.81136138488367},{"$f":"2*DEGREES(ASIN(((SIN(RADIANS(EQ43/2))*SIN(RADIANS($ES$42/2))/SIN(RADIANS($EQ$42/2))))))","v":59.937040829170336},{"$f":"ROUND(100*($EQ$42-EQ43)/$EQ$42,0)&\" % closed Oblique T\"","v":"3 % closed Oblique T"},null,24.605,24.605,175,{"$f":"2*DEGREES(ASIN(((SIN(RADIANS(EX43/2))*SIN(RADIANS($EY$42/2))/SIN(RADIANS($EX$42/2))))))","v":134.73741801354652},{"$f":"2*DEGREES(ASIN(((SIN(RADIANS(EX43/2))*SIN(RADIANS($EZ$42/2))/SIN(RADIANS($EX$42/2))))))","v":44.954827164599372},{"$f":"ROUND(100*($EX$42-EX43)/$EX$42,0)&\" % closed Inclined Y\"","v":"3 % closed Inclined Y"},null,24.605,24.605,175,{"$f":"2*DEGREES(ASIN(((SIN(RADIANS(FE43/2))*SIN(RADIANS($FF$42/2))/SIN(RADIANS($FE$42/2))))))","v":134.73741801354652},{"$f":"2*DEGREES(ASIN(((SIN(RADIANS(FE43/2))*SIN(RADIANS($FG$42/2))/SIN(RADIANS($FE$42/2))))))","v":44.954827164599372},{"$f":"ROUND(100*($FE$42-FE43)/$FE$42,0)&\" % closed Oblique Y\"","v":"3 % closed Oblique Y"}]
["Min2 (folded Orthogonal Y)",{"$f":"MIN(AR2:AR53)","v":2.6459999999999999},{"$f":"VLOOKUP(B44,AR2:AW53,6,FALSE)","v":"25 % γ-folded Orthogonal Y"},{"$f":"VLOOKUP($B$44,$AR$2:$AW$53,3,FALSE)","v":150},{"$f":"VLOOKUP($B$44,$AR$2:$AW$53,4,FALSE)","v":120},{"$f":"VLOOKUP($B$44,$AR$2:$AW$53,5,FALSE)","v":75},null,null,{"$f":"IF($I43<180,\"Yes, vary gamma\",\"No Normal\")","v":"No Normal"},{"$f":"IF($J43<180,\"Yes, vary beta\",\"No Normal\")","v":"No Normal"},{"$f":"IF($K43<180,\"Yes, vary alpha\",\"No Normal\")","v":"No Normal"},null,null,null,null,null,null,null,null,null,null,null,null,null,null,null,null,null,null,null,null,null,null,null,null,41.576999999999998,41.576999999999998,90,90,40,"78% α-folded T","Gamma Dominant Diorthopyramid",null,2.6459999999999999,2.6459999999999999,150,120,75,"25 % γ-folded Orthogonal Y",null,22.106000000000002,22.106000000000002,135,105,40,"89 % β-folded Semi-Orthogonal γ-Expanded Y",null,null,null,null,null,null,null,null,null,null,14.9,14.9,165,105,80,{"$f":"ROUND(((90-BS44)/30)*100,0)&\" % γ-folded Semi-Orthogonal β-Compressed Y\"","v":"33 % γ-folded Semi-Orthogonal β-Compressed Y"},null,36.616999999999997,36.616999999999997,108.41876052950059,70,70,"22 % closed T-shape",45.863,45.863,90.231280600576468,65,65,"33 % Closed 3/4  Expanded α-dominant Y",59.72,59.72,68.414702596978856,55,55,"48 % Closed 1/2  Expanded α-dominant Y",null,67.495999999999995,67.495999999999995,56.015144844572042,50,50,"56 % Closed 1/4 Expanded α-dominant Y",null,87.024000000000001,87.024000000000001,40.171507199255238,25,25,"67 % Closed 2/3 α-Expanded Arrow",null,107.56,107.56,11.157018616542256,10,8.1615047910495875,"93 % closed orthogonal Y",null,null,null,93.025999999999996,93.025999999999996,26.699974036339647,25,22.872464657684304,"80 % closed Semi-Orthogonal γ-Expanded Y",null,null,null,null,"aref",null,null,null,null,null,null,null,"aref",null,null,null,16.864000000000001,16.864000000000001,170,{"$f":"2*DEGREES(ASIN(((SIN(RADIANS(EJ44/2))*SIN(RADIANS($EK$2/2))/SIN(RADIANS($EJ$2/2))))))","v":104.43354373452671},{"$f":"2*DEGREES(ASIN(((SIN(RADIANS(EJ44/2))*SIN(RADIANS($EL$2/2))/SIN(RADIANS($EJ$2/2))))))","v":74.665776389596729},"6 % closed Semi-Oblique T",null,15.861000000000001,15.861000000000001,170,119.24898694941369,59.748402516505493,"6 % closed Oblique T",null,22.643000000000001,{"$f":"ROUND((1/SQRT(3))*SQRT(($A$29-EX44)^2+($A$30-EY44)^2+($A$31-EZ44)^2),3)","v":22.643000000000001},170,133.95867711182106,44.819438756043155,"6 % closed Inclined Y",null,22.643000000000001,{"$f":"ROUND((1/SQRT(3))*SQRT(($A$29-FE44)^2+($A$30-FF44)^2+($A$31-FG44)^2),3)","v":22.643000000000001},170,133.95867711182106,44.819438756043155,"6 % closed Oblique Y"]
["Min 2(fold Semi1)",{"$f":"MIN(AY2:AY66)","v":6.4809999999999999},{"$f":"VLOOKUP($B45,$AY2:$BD66,6,FALSE)","v":"33 % γ-folded Semi-Orthogonal γ-Expanded Y"},{"$f":"VLOOKUP($B45,$AY2:$BD66,3,FALSE)","v":135},{"$f":"VLOOKUP($B45,$AY2:$BD66,4,FALSE)","v":120},{"$f":"VLOOKUP($B45,$AY2:$BD66,5,FALSE)","v":75},null,"normal b",{"$f":"SQRT($K54^2+$M54^2)","v":2.1083957741312789},{"$f":"SQRT($I54^2+$M54^2)","v":2.2524057662118984},{"$f":"SQRT($I54^2+$K54^2)","v":2.5861460312461459},null,null,null,null,null,null,null,null,null,null,null,null,null,null,null,null,null,null,null,null,null,null,null,null,44.52,44.52,90,90,30,"83% α-folded T","Gamma Dominant Diorthopyramid",null,2.944,2.944,150,120,70,"33 % γ-folded Orthogonal Y",null,24.637,24.637,135,105,35,"94 % β-folded Semi-Orthogonal γ-Expanded Y",null,null,null,null,null,null,null,null,null,null,14.387,14.387,165,105,75,"50 % γ-folded Semi-Orthogonal β-Compressed Y",null,42.497999999999998,42.497999999999998,98.903078929008501,65,65,"28 % closed T-shape",51.387999999999998,51.387999999999998,82.499999999999986,60,60,"38 % Closed 3/4  Expanded α-dominant Y",64.903000000000006,64.903000000000006,61.934413923698266,50,50,"52 % Closed 1/2  Expanded α-dominant Y",null,72.372,72.372,50.328551936388131,45,45,"60 % Closed 1/4 Expanded α-dominant Y",null,93.111000000000004,93.111000000000004,31.987050210830628,20,20,"73 % Closed 2/3 α-Expanded Arrow",null,112.434,112.434,5.5772075817656521,5,4.0820508950774039,"96 % closed orthogonal Y",null,null,null,97.86,97.86,21.351253803674407,20,18.306603712406687,"84 % closed Semi-Orthogonal γ-Expanded Y",null,null,{"$f":"IF(DU45=0,0.01,DU45)","v":11.045},{"$f":"ROUND((1/SQRT(3))*SQRT(($A$29-DV45)^2+($A$30-DW45)^2+($A$31-DX45)^2),3)","v":11.045},165,120,75,"Semi-Orthogonal γ-Compressed Y",null,null,{"$f":"IF(EC45=0,0.01,EC45)","v":17.378},{"$f":"ROUND((1/SQRT(3))*SQRT(($A$29-ED45)^2+($A$30-EE45)^2+($A$31-EF45)^2),3)","v":17.378},165,105,90,"Semi-Orthogonal β-Compressed Y",14.840999999999999,14.840999999999999,165,103.73151111353212,74.249633316911243,"8 % closed Semi-Oblique T",null,13.567,13.567,165,118.32317916126388,59.434799044077678,"8 % closed Oblique T",null,20.853000000000002,20.853000000000002,165,132.68931887227737,44.594223851475142,"8 % closed Inclined Y",null,20.853000000000002,20.853000000000002,165,132.68931887227737,44.594223851475142,"8 % closed Oblique Y"]
["Min 2(fold Semi2)",{"$f":"MIN(BG2:BG42)","v":1.4139999999999999},{"$f":"VLOOKUP($B46,$BG2:$BL42,6,FALSE)","v":"17 % α-folded Semi-Orthogonal γ-Compressed Y"},{"$f":"VLOOKUP($B46,$BG2:$BL42,3,FALSE)","v":145},{"$f":"VLOOKUP($B46,$BG2:$BL42,4,FALSE)","v":120},{"$f":"VLOOKUP($B46,$BG2:$BL42,5,FALSE)","v":75},null,"normal lim",{"$f":"IF(I45>2,\"No Normal\",2*DEGREES(ASIN(I45/2)))","v":"No Normal"},{"$f":"IF(J45>2,\"No Normal\",2*DEGREES(ASIN(J45/2)))","v":"No Normal"},{"$f":"IF(K45>2,\"No Normal\",2*DEGREES(ASIN(K45/2)))","v":"No Normal"},null,null,null,null,null,null,null,null,null,null,null,null,null,null,null,null,null,null,null,null,null,null,null,null,47.978999999999999,47.978999999999999,90,90,20,"89% α-folded T","Gamma Dominant Diorthopyramid",null,5.1959999999999997,5.1959999999999997,150,120,65,"42 % γ-folded Orthogonal Y",null,27.24,27.24,135,105,30," 5/9 α-Expanded Arrow (55.56 % oblique)",null,null,null,null,null,null,null,null,null,null,14.445,14.445,165,105,70,"67 % γ-folded Semi-Orthogonal β-Compressed Y",null,48.393999999999998,48.393999999999998,90,60,60,"33 % closed T-shape",56.914999999999999,56.914999999999999,75.020598857421717,55,55,"44 % Closed 3/4  Expanded α-dominant Y",70.102000000000004,70.102000000000004,55.540312809594077,45,45,"57 % Closed 1/2  Expanded α-dominant Y",null,77.281999999999996,77.281999999999996,44.671381862088836,40,40,"64 % Closed 1/4 Expanded α-dominant Y",null,99.174999999999997,99.174999999999997,23.905711781403909,15,15,"80 % Closed 2/3 α-Expanded Arrow",null,117.312,117.312,0,0,0,"closed arrow",null,null,null,102.70699999999999,102.70699999999999,16.008422936254838,15,13.734937681555767,"88 % closed Semi-Orthogonal γ-Expanded Y",null,null,8.2330000000000005,8.2330000000000005,160,{"$f":"2*DEGREES(ASIN(((SIN(RADIANS(DV46/2))*SIN(RADIANS($DW$2/2))/SIN(RADIANS($DV$2/2))))))","v":118.68436245215953},{"$f":"2*DEGREES(ASIN(((SIN(RADIANS(DV46/2))*SIN(RADIANS($DX$2/2))/SIN(RADIANS($DV$2/2))))))","v":74.412521531076379},{"$f":"ROUND(100*($DV$2-DV46)/$DV$2,0)&\" % closed Semi-Orthogonal γ-Compressed Y\"","v":"3 % closed Semi-Orthogonal γ-Compressed Y"},null,null,15.794,15.794,160,{"$f":"2*DEGREES(ASIN(((SIN(RADIANS(ED46/2))*SIN(RADIANS($EE$2/2))/SIN(RADIANS($ED$2/2))))))","v":104.00587776243741},{"$f":"2*DEGREES(ASIN(((SIN(RADIANS(ED46/2))*SIN(RADIANS($EF$2/2))/SIN(RADIANS($ED$2/2))))))","v":89.235425595568032},{"$f":"ROUND(100*($ED$2-ED46)/$ED$2,0)&\" % closed Semi-Orthogonal β-Compressed Y\"","v":"3 % closed Semi-Orthogonal β-Compressed Y"},13.281000000000001,13.281000000000001,160,102.75960906152322,73.670050016795017,"11 % closed Semi-Oblique T",null,11.657,11.657,160,117.05010222162898,58.997408462207304,"11 % closed Oblique T",null,19.324000000000002,19.324000000000002,160,130.96752922461013,44.279826891529908,"11 % closed Inclined Y",null,19.324000000000002,19.324000000000002,160,130.96752922461013,44.279826891529908,"11 % closed Oblique Y"]
["Min 2(fold Semi3)",{"$f":"MIN(BO2:BO48)","v":13.491},{"$f":"VLOOKUP($B47,$BO2:$BT48,6,FALSE)","v":"13 % α-folded Semi-Orthogonal β-Compressed Y"},{"$f":"VLOOKUP($B47,$BO2:$BT48,3,FALSE)","v":145},{"$f":"VLOOKUP($B47,$BO2:$BT48,4,FALSE)","v":105},{"$f":"VLOOKUP($B47,$BO2:$BT48,5,FALSE)","v":90},null,null,null,null,null,null,null,null,null,null,null,null,null,null,null,null,null,null,null,null,null,null,null,null,null,null,null,null,null,51.851999999999997,51.851999999999997,90,90,10,"94% α-folded T","Gamma Dominant Diorthopyramid",null,7.8739999999999997,7.8739999999999997,150,120,60,"50 % γ-folded Orthogonal Y",null,null,null,null,null,"g-fold",null,null,null,null,null,null,null,null,null,null,null,15.067,15.067,165,105,65,"83 % γ-folded Semi-Orthogonal β-Compressed Y",null,54.268999999999998,54.268999999999998,81.538032775144586,55,55,"39 % closed T-shape",62.436,62.436,67.738996024001764,50,50,"49 % Closed 3/4  Expanded α-dominant Y",75.314999999999998,75.314999999999998,49.217210085950562,40,40,"62 % Closed 1/2  Expanded α-dominant Y",null,82.221000000000004,82.221000000000004,39.038844920227476,35,35,"69 % Closed 1/4 Expanded α-dominant Y",null,105.224,105.224,15.897885300863708,10,10,"87 % Closed 2/3 α-Expanded Arrow",null,null,null,"alpha ref",null,null,null,null,null,null,107.565,107.565,10.669918064949965,10,9.1589810910041116,"92 % closed Semi-Orthogonal γ-Expanded Y",null,null,5.6909999999999998,5.6909999999999998,155,117.03350631308741,73.662438958126714,"6 % closed Semi-Orthogonal γ-Compressed Y",null,null,14.686999999999999,14.686999999999999,155,102.74689041585594,88.262200044571856,"6 % closed Semi-Orthogonal β-Compressed Y",12.385,12.385,155,101.52808665659484,72.929960793277488,"14 % closed Semi-Oblique T",null,10.39,10.39,155,115.45047980551863,58.437855484148237,"14 % closed Oblique T",null,18.170999999999999,18.170999999999999,155,128.83909786641314,43.87714175681463,"14 % closed Inclined Y",null,18.170999999999999,18.170999999999999,155,128.83909786641314,43.87714175681463,"14 % closed Oblique Y"]
["Min 3 (closed Triclinic1)",{"$f":"MIN(DC2:DC78)","v":9.2219999999999995},{"$f":"VLOOKUP(B48,DC3:DH78,6,FALSE)","v":"3 % closed orthogonal Y"},{"$f":"VLOOKUP($B48,DC3:DH78,3,FALSE)","v":145},{"$f":"VLOOKUP($B48,DC3:DH78,4,FALSE)","v":117.53697673898455},{"$f":"VLOOKUP($B48,DC3:DH78,5,FALSE)","v":88.560615424704551},null,"sorted",null,null,null,null,null,null,null,null,null,null,null,null,null,null,null,null,null,null,null,null,null,null,null,null,null,null,null,{"$f":"IF(AK48=0,0.01,AK48)","v":56.054000000000002},{"$f":"ROUND((1/SQRT(3))*SQRT(($A$29-AL48)^2+($A$30-AM48)^2+($A$31-AN48)^2),3)","v":56.054000000000002},90,90,0,"Orthogonal Arrow","(Folded T)",null,{"$f":"IF(AS48=0,0.01,AS48)","v":10.661},{"$f":"ROUND((1/SQRT(3))*SQRT(($A$29-AT48)^2+($A$30-AU48)^2+($A$31-AV48)^2),3)","v":10.661},150,120,55,"58 % γ-folded Orthogonal Y",null,{"$f":"IF(AZ48=0,0.01,AZ48)","v":19.545000000000002},{"$f":"ROUND((1/SQRT(3))*SQRT(($A$29-BA48)^2+($A$30-BB48)^2+($A$31-BC48)^2),3)","v":19.545000000000002},135,120,105,"Semi-Orthogonal γ-Expanded Y",null,null,null,null,null,null,null,null,null,null,16.186,16.186,165,105,60," 8/9 α-Expanded Arrow (27.27 % oblique)",null,60.11,60.11,73.406764727021425,50,50,"44 % closed T-shape",67.947000000000003,67.947000000000003,60.615106394196658,45,45,"54 % Closed 3/4  Expanded α-dominant Y",80.537000000000006,80.537000000000006,42.952581503967558,35,35,"67 % Closed 1/2  Expanded α-dominant Y",null,87.183000000000007,87.183000000000007,33.42677517506322,30,30,"73 % Closed 1/4 Expanded α-dominant Y",null,111.267,111.267,7.9373617835883712,5,5,"93 % Closed 2/3 α-Expanded Arrow",null,10.1,10.1,150,120,90,"Orthogonal Y",null,null,null,112.434,112.434,5.3342548643624621,5,4.5801938093175814,"96 % closed Semi-Orthogonal γ-Expanded Y",null,null,4.1310000000000002,4.1310000000000002,150,115.07321587136525,72.753521795712118,"9 % closed Semi-Orthogonal γ-Compressed Y",null,null,14.202,14.202,150,101.23601591983461,87.087205023158575,"9 % closed Semi-Orthogonal β-Compressed Y",12.327,12.327,150,100.04922260876954,72.033025252124986,"17 % closed Semi-Oblique T",null,10.064,10.064,150,113.54811559342484,57.758188034855209,"17 % closed Oblique T",null,17.527000000000001,17.527000000000001,150,126.35256472443714,43.387303686765904,"17 % closed Inclined Y",null,17.527000000000001,17.527000000000001,150,126.35256472443714,43.387303686765904,"17 % closed Oblique Y"]
["Min4 (Cl.Tricl.2)",{"$f":"MIN(DL2:DL78)","v":15.340999999999999},{"$f":"VLOOKUP(B49,DL2:DQ78,6,FALSE)","v":"4 % closed Semi-Orthogonal γ-Expanded Y"},{"$f":"VLOOKUP($B49,$DL2:$DQ78,3,FALSE)","v":130},{"$f":"VLOOKUP($B49,$DL2:$DQ78,4,FALSE)","v":116.32638960652207},{"$f":"VLOOKUP($B49,$DL2:$DQ78,5,FALSE)","v":93.693774327697326},null,"alpha",{"$f":"SMALL($A29:$A31,3)","v":146},"max alpha",{"$f":"$I50+$I51","v":194},null,null,null,null,null,null,null,null,null,null,null,null,null,null,null,null,null,null,null,null,null,null,null,null,null,null,null,null,null,null,null,null,13.491,13.491,150,120,50,"67 % γ-folded Orthogonal Y",null,{"$f":"IF(AZ49=0,0.01,AZ49)","v":16.841999999999999},{"$f":"ROUND((1/SQRT(3))*SQRT(($A$29-BA49)^2+($A$30-BB49)^2+($A$31-BC49)^2),3)","v":16.841999999999999},135,120,100,{"$f":"ROUND(((105-BC49)/90)*100,0)&\" % γ-folded Semi-Orthogonal γ-Expanded Y\"","v":"6 % γ-folded Semi-Orthogonal γ-Expanded Y"},null,null,null,null,null,null,null,null,null,null,null,null,null,null,null,null,null,65.918000000000006,65.918000000000006,65.530199479297821,45,45,"50 % closed T-shape",73.448999999999998,73.448999999999998,53.618174379754201,40,40,"59 % Closed 3/4  Expanded α-dominant Y",85.768000000000001,85.768000000000001,36.735887479092852,30,30,"71 % Closed 1/2  Expanded α-dominant Y",null,92.165999999999997,92.165999999999997,27.831492972488917,25,25,"78 % Closed 1/4 Expanded α-dominant Y",null,117.312,117.312,0,0,0,"Closed Arrow",null,9.2219999999999995,9.2219999999999995,145,{"$f":"2*DEGREES(ASIN(((SIN(RADIANS(DE49/2))*SIN(RADIANS(60))/SIN(RADIANS(75))))))","v":117.53697673898455},{"$f":"2*DEGREES(ASIN(((SIN(RADIANS(DE49/2))*SIN(RADIANS(45))/SIN(RADIANS(75))))))","v":88.560615424704551},{"$f":"ROUND((150-DE49)/1.5,0)&\" % closed orthogonal Y\"","v":"3 % closed orthogonal Y"},null,null,null,117.312,117.312,0,0,0,"closed arrow",null,null,4.8109999999999999,4.8109999999999999,145,112.83083859098731,71.690204384323209,"12 % closed Semi-Orthogonal γ-Compressed Y",null,null,14.44,14.44,145,99.487768484207848,85.718378503377409,"12 % closed Semi-Orthogonal β-Compressed Y",13.148999999999999,13.148999999999999,145,98.33679390149409,70.983551840037876,"19 % closed Semi-Oblique T",null,10.817,10.817,145,111.36844946722589,56.960848597505716,"19 % closed Oblique T",null,17.501000000000001,17.501000000000001,145,123.55542569200357,42.811679241360743,"19 % closed Inclined Y",null,17.501000000000001,17.501000000000001,145,123.55542569200357,42.811679241360743,"19 % closed Oblique Y"]
["Min4 (Cl.Tricl.3)",{"$f":"MIN(DT2:DT78)","v":4.1120000000000001},{"$f":"VLOOKUP(B50,DT2:DY78,6,FALSE)","v":"4 % closed Semi-Orthogonal γ-Compressed Y"},{"$f":"VLOOKUP($B50,$DT2:$DY78,3,FALSE)","v":149.82657129347095},{"$f":"VLOOKUP($B50,$DT2:$DY78,4,FALSE)","v":115},{"$f":"VLOOKUP($B50,$DT2:$DY78,5,FALSE)","v":72.719197305802297},null,"beta",{"$f":"SMALL($A$29:$A$31,2)","v":121},"sum angles",{"$f":"SUM($I49:$I51)","v":340},null,null,null,null,null,null,null,null,null,null,null,null,null,null,null,null,null,null,null,null,null,null,null,null,null,null,null,null,null,null,null,null,16.34,16.34,150,120,45,"75 % γ-folded Orthogonal Y",null,14.212999999999999,14.212999999999999,135,120,95,{"$f":"ROUND(((105-BC50)/90)*100,0)&\" % γ-folded Semi-Orthogonal γ-Expanded Y\"","v":"11 % γ-folded Semi-Orthogonal γ-Expanded Y"},null,null,null,null,null,null,null,null,null,null,null,null,null,null,null,null,null,71.692999999999998,71.692999999999998,57.853298599519889,40,40,"56 % closed T-shape",78.941999999999993,78.941999999999993,46.723887101270698,35,35,"64 % Closed 3/4  Expanded α-dominant Y",91.007000000000005,91.007000000000005,30.558080047928641,25,25,"76 % Closed 1/2  Expanded α-dominant Y",null,97.167000000000002,97.167000000000002,22.249696259923212,20,20,"82 % Closed 1/4 Expanded α-dominant Y",null,null,null,"Monoclinic ","Arrow","a-ref",null,null,9.4570000000000007,9.4570000000000007,140,{"$f":"2*DEGREES(ASIN(((SIN(RADIANS(DE50/2))*SIN(RADIANS(60))/SIN(RADIANS(75))))))","v":114.81126457765264},{"$f":"2*DEGREES(ASIN(((SIN(RADIANS(DE50/2))*SIN(RADIANS(45))/SIN(RADIANS(75))))))","v":86.928642299568907},{"$f":"ROUND((150-DE50)/1.5,0)&\" % closed orthogonal Y\"","v":"7 % closed orthogonal Y"},null,null,null,null,null,"aref",null,null,null,null,null,7.2140000000000004,7.2140000000000004,140,110.33390850259664,70.477496626453288,"15 % closed Semi-Orthogonal γ-Compressed Y",null,null,15.406000000000001,15.406000000000001,140,97.517630288497685,84.164488257576537,"15 % closed Semi-Orthogonal β-Compressed Y",14.733000000000001,14.733000000000001,140,96.405549767442665,69.786412689207907,"22 % closed Semi-Oblique T",null,12.500999999999999,12.500999999999999,140,108.93730447439162,56.04864134720939,"22 % closed Oblique T",null,18.146000000000001,18.146000000000001,140,120.49167887788096,42.151854548173219,"22 % closed Inclined Y",null,18.146000000000001,18.146000000000001,140,120.49167887788096,42.151854548173219,"22 % closed Oblique Y"]
["Min4 (Cl.Tricl.42)",{"$f":"MIN(EB2:EB78)","v":14.202},{"$f":"VLOOKUP(B51,EB2:EG78,6,FALSE)","v":"9 % closed Semi-Orthogonal β-Compressed Y"},{"$f":"VLOOKUP($B51,$EB2:$EG78,3,FALSE)","v":150},{"$f":"VLOOKUP($B51,$EB2:$EG78,4,FALSE)","v":101.23601591983461},{"$f":"VLOOKUP($B51,$EB2:$EG78,5,FALSE)","v":87.087205023158575},null,"gamma",{"$f":"SMALL($A$29:$A$31,1)","v":73},null,null,null,null,null,null,null,null,null,null,null,null,null,null,null,null,null,null,null,null,null,null,null,null,null,null,null,null,null,null,null,null,null,null,19.201000000000001,19.201000000000001,150,120,40,"83 % γ-folded Orthogonal Y",null,11.705,11.705,135,120,90,"17 % γ-folded Semi-Orthogonal γ-Expanded Y",null,null,null,null,null,null,null,null,null,null,null,null,null,null,null,null,null,77.441999999999993,77.441999999999993,50.334524413475251,35,35,"61 % closed T-shape",84.429000000000002,84.429000000000002,39.912499606474817,30,30,"69 % Closed 3/4  Expanded α-dominant Y",96.253,96.253,24.41123505691235,20,20,"81 % Closed 1/2  Expanded α-dominant Y",null,102.18300000000001,102.18300000000001,16.678372662250318,15,15,"87 % Closed 1/4 Expanded α-dominant Y",null,{"$f":"IF(CW51=0,0.01,CW51)","v":39.012999999999998},{"$f":"ROUND((1/SQRT(3))*SQRT(($A$29-CX51)^2+($A$30-CY51)^2+($A$31-CZ51)^2),3)","v":39.012999999999998},120,60,60,"1/3 α-Expanded Arrow",null,10.823,10.823,135,111.85467303480671,85.114531017712451,"10 % closed orthogonal Y",null,null,null,{"$f":"IF(DM51=0,0.01,DM51)","v":19.545000000000002},{"$f":"ROUND((1/SQRT(3))*SQRT(($A$29-DN51)^2+($A$30-DO51)^2+($A$31-DP51)^2),3)","v":19.545000000000002},135,120,105,"Semi-Orthogonal γ-Expanded Y",null,null,10.253,10.253,135,107.60909857000006,69.120889776646237,"18 % closed Semi-Orthogonal γ-Compressed Y",null,null,17.013000000000002,17.013000000000002,135,95.341534277772595,82.434905725098361,"18 % closed Semi-Orthogonal β-Compressed Y",16.893999999999998,16.893999999999998,135,94.270728098305753,68.446953547755967,"25 % closed Semi-Oblique T",null,14.840999999999999,14.840999999999999,135,106.27990624703311,55.02469614890267,"25 % closed Oblique T",null,19.437000000000001,19.437000000000001,135,117.20057038016191,41.409622109270863,"25 % closed Inclined Y",null,19.437000000000001,19.437000000000001,135,117.20057038016191,41.409622109270863,"25 % closed Oblique Y"]
["Min 5 (Cl. Mon. Arrow)",{"$f":"MIN(CV2:CV155)","v":26.683},{"$f":"VLOOKUP(B52,CV2:DA155,6,FALSE)","v":"2/3 α-Expanded Arrow"},{"$f":"VLOOKUP($B52,$CV2:$DA155,3,FALSE)","v":150},{"$f":"VLOOKUP($B52,$CV2:$DA155,4,FALSE)","v":75},{"$f":"VLOOKUP($B52,$CV2:$DA155,5,FALSE)","v":75},{"$f":"IF(OR($I49>$K49,$I54>($K54+$M54)),\"Not Pyramid, alpha too large\",IF(SUM($I49:$I51)>360,\"Not Pyramid, >360o\",IF(AND($I49=$I50,$I49=$I51),\"Right \",IF(OR(ROUNDDOWN($I66,2)=0,SUM($I49:$I51)=360),\"Planar\",IF(AND($I45>2,$J45>2,$K45>2),\"Acute \",IF(OR(ROUND($I58,0)=90,$I49=ROUND($I46,0)),\"Normal \",IF($I49<ROUND($I46,0),\"Acute \",\"Obtuse \")))))))","v":"Acute "},{"$f":"IF(AND($I49=$I50,$I49=$I51),\"Trigonal \",IF(AND($I49=$I50,$I50>$I51),\"Monoclinic \",IF(AND($I50=$I51,$I49>$I50),\"Monoclinic \",\"Triclinic \")))","v":"Triclinic "},{"$f":"IF(OR(G52=\"Obtuse \",G52=\"Normal \", G52=\"Acute \",G52=\"Right \"),\"Pyramid\",\"\")","v":"Pyramid"},null,null,null,null,null,null,null,null,null,null,null,null,null,null,null,null,null,null,null,null,null,null,null,null,null,null,null,null,null,null,null,null,null,null,22.068000000000001,22.068000000000001,150,120,35,"92 % γ-folded Orthogonal Y",null,9.4160000000000004,9.4160000000000004,135,120,85,"22 % γ-folded Semi-Orthogonal γ-Expanded Y",null,null,null,null,null,null,null,null,null,null,null,null,null,null,null,null,null,83.168999999999997,83.168999999999997,42.941402864879912,30,30,"67 % closed T-shape",89.91,89.91,33.167565407342458,25,25,"74 % Closed 3/4  Expanded α-dominant Y",101.506,101.506,18.28826958610151,15,15,"86 % Closed 1/2  Expanded α-dominant Y",null,107.21299999999999,107.21299999999999,11.114726492808327,10,10,"91 % Closed 1/4 Expanded α-dominant Y",null,{"$f":"IF(CW52=0,0.01,CW52)","v":41.277999999999999},{"$f":"ROUND((1/SQRT(3))*SQRT(($A$29-CX52)^2+($A$30-CY52)^2+($A$31-CZ52)^2),3)","v":41.277999999999999},115,{"$f":"2*DEGREES(ASIN(((SIN(RADIANS(CX52/2))*SIN(RADIANS($CY$51/2))/SIN(RADIANS($CX$51/2))))))","v":58.2782955409835},{"$f":"2*DEGREES(ASIN(((SIN(RADIANS(CX52/2))*SIN(RADIANS($CY$51/2))/SIN(RADIANS($CX$51/2))))))","v":58.2782955409835},{"$f":"ROUND(100*($CX$51-CX52)/$CX$51,0)&\" % Closed 1/3 α-Expanded Arrow\"","v":"4 % Closed 1/3 α-Expanded Arrow"},null,13.038,13.038,130,108.69624061974568,83.129090635438516,"13 % closed orthogonal Y",null,null,null,{"$f":"IF(DM52=0,0.01,DM52)","v":15.340999999999999},{"$f":"ROUND((1/SQRT(3))*SQRT(($A$29-DN52)^2+($A$30-DO52)^2+($A$31-DP52)^2),3)","v":15.340999999999999},130,{"$f":"2*DEGREES(ASIN(((SIN(RADIANS(DN52/2))*SIN(RADIANS($DO$51/2))/SIN(RADIANS($DN$51/2))))))","v":116.32638960652207},{"$f":"2*DEGREES(ASIN(((SIN(RADIANS(DO52/2))*SIN(RADIANS($DP$51/2))/SIN(RADIANS($DN$51/2))))))","v":93.693774327697326},{"$f":"ROUND(100*($DN$2-DN52)/$DN$2,0)&\" % closed Semi-Orthogonal γ-Expanded Y\"","v":"4 % closed Semi-Orthogonal γ-Expanded Y"},null,null,13.554,13.554,130,104.68150932952756,67.626261107827361,"21 % closed Semi-Orthogonal γ-Compressed Y",null,null,19.132999999999999,19.132999999999999,130,92.975423951663004,80.539391432496785,"21 % closed Semi-Orthogonal β-Compressed Y",19.463000000000001,19.463000000000001,130,91.947638882662758,66.970902406394401,"28 % closed Semi-Oblique T",null,17.608000000000001,17.608000000000001,130,103.42019173650297,53.892430525255357,"28 % closed Oblique T",null,21.289000000000001,21.289000000000001,130,113.71621728405312,40.586966463645169,"28 % closed Inclined Y",null,21.289000000000001,21.289000000000001,130,113.71621728405312,40.586966463645169,"28 % closed Oblique Y"]
["Min 6 (cl.Mon.180)",{"$f":"MIN(BV2:BV58)","v":21.626000000000001},{"$f":"VLOOKUP(B53,BV2:CA58,6,FALSE)","v":"17 % closed T-shape"},{"$f":"VLOOKUP($B53,$BV2:$CA58,3,FALSE)","v":150},{"$f":"VLOOKUP($B53,$BV2:$CA58,4,FALSE)","v":86.159034283741875},{"$f":"VLOOKUP($B53,$BV2:$CA58,5,FALSE)","v":86.159034283741875},null,"s1",{"$f":"COS(RADIANS($I49/2))","v":0.29237170472273677},"s2",{"$f":"COS(RADIANS($I50/2))","v":0.49242356010346711},"s3",{"$f":"COS(RADIANS($I51/2))","v":0.80385686061721728},null,null,null,null,null,null,null,null,null,null,null,null,null,null,null,null,null,null,null,null,null,null,null,null,null,null,null,null,null,null,24.94,24.94,150,120,30,"60% oblique 2/3 α-Expanded Arrow",null,7.55,7.55,135,120,80,"28 % γ-folded Semi-Orthogonal γ-Expanded Y",null,null,null,null,null,null,null,null,null,null,null,null,null,null,null,null,null,88.876999999999995,88.876999999999995,35.647727039738363,25,25,"72 % closed T-shape",95.387,95.387,26.475043724655279,20,20,"79 % Closed 3/4  Expanded α-dominant Y",106.76600000000001,106.76600000000001,12.182717868436368,10,10,"90 % Closed 1/2  Expanded α-dominant Y",null,112.256,{"$f":"ROUND((1/SQRT(3))*SQRT(($A$29-CQ53)^2+($A$30-CR53)^2+($A$31-CS53)^2),3)","v":112.256},5.5561163585513844,5,5,"96 % Closed 1/4 Expanded α-dominant Y",null,43.728999999999999,43.728999999999999,110,56.450311123019411,56.450311123019411,"8 % Closed 1/3 α-Expanded Arrow",null,15.804,15.804,125,105.36193815722203,80.983265807043665,"17 % closed orthogonal Y",null,null,null,16.75,16.75,125,112.499142321249,91.121886020485107,"7 % closed Semi-Orthogonal γ-Expanded Y",null,null,17.004000000000001,17.004000000000001,125,101.57425222606102,65.999780846250957,"24 % closed Semi-Orthogonal γ-Compressed Y",null,null,21.643999999999998,21.643999999999998,125,90.434901982929574,78.487900342586443,"24 % closed Semi-Orthogonal β-Compressed Y",22.321000000000002,22.321000000000002,125,89.45132685728997,65.364280044505378,"31 % closed Semi-Oblique T",null,20.655999999999999,20.655999999999999,125,100.3803800296436,52.655510674624814,"31 % closed Oblique T",null,23.596,23.596,125,110.06777739940705,39.686049011108103,"31 % closed Inclined Y",null,23.596,23.596,125,110.06777739940705,39.686049011108103,"31 % closed Oblique Y"]
["Min 6 (cl.Mon.165)",{"$f":"MIN(CB2:CB100)","v":19.864000000000001},{"$f":"VLOOKUP(B54,CB2:CG100,6,FALSE)","v":"9 % Closed 3/4  Expanded α-dominant Y"},{"$f":"VLOOKUP($B54,$CB2:$CG100,3,FALSE)","v":150},{"$f":"VLOOKUP($B54,$CB2:$CG100,4,FALSE)","v":94.190762835720577},{"$f":"VLOOKUP($B54,$CB2:$CG100,5,FALSE)","v":94.190762835720577},null,"b1",{"$f":"2*SIN(RADIANS($I49/2))","v":1.9126095119260709},"b2",{"$f":"2*SIN(RADIANS($I50/2))","v":1.7407113918797994},"b3",{"$f":"2*SIN(RADIANS($I51/2))","v":1.1896455735026825},null,null,null,null,null,null,null,null,null,null,null,null,null,null,null,null,null,null,null,null,null,null,null,null,null,null,null,null,null,null,null,null,null,null,null,null,null,6.4809999999999999,6.4809999999999999,135,120,75,"33 % γ-folded Semi-Orthogonal γ-Expanded Y",null,null,null,null,null,null,null,null,null,null,null,null,null,null,null,null,null,94.572999999999993,94.572999999999993,28.431705820552306,20,20,"78 % closed T-shape",100.864,100.864,19.822648256701907,15,15,"85 % Closed 3/4  Expanded α-dominant Y",112.035,112.035,6.0885471452608533,5,5,"95 % Closed 1/2  Expanded α-dominant Y",null,117.312,117.312,0,0,0,"Closed Arrow",null,46.338999999999999,46.338999999999999,105,54.521765238054229,54.521765238054229,"13 % Closed 1/3 α-Expanded Arrow",null,18.922000000000001,18.922000000000001,120,101.87465779704645,78.687947218832221,"20 % closed orthogonal Y",null,null,null,18.867999999999999,18.867999999999999,120,108.54319391585541,88.390144249853108,"11 % closed Semi-Orthogonal γ-Expanded Y",null,null,20.555,20.555,120,98.308264281715026,64.247824181096433,"27 % closed Semi-Orthogonal γ-Compressed Y",null,null,24.45,24.45,120,87.734968086095577,76.290412529380319,"27 % closed Semi-Orthogonal β-Compressed Y",25.388000000000002,25.388000000000002,120,86.796315218331344,63.633315182382717,"33 % closed Semi-Oblique T",null,23.899000000000001,23.899000000000001,120,97.180755781458259,51.317812546510545,"33 % closed Oblique T",null,26.259,26.259,120,106.27990624703311,38.709192303300902,"33 % closed Inclined Y",null,26.259,26.259,120,106.27990624703311,38.709192303300902,"33 % closed Oblique Y"]
["Min 6 (cl.Mon.150)",{"$f":"MIN(CH2:CH101)","v":13.766},{"$f":"VLOOKUP(B55,CH2:CM101,6,FALSE)","v":"10 % Closed 1/2 Constricted γ-dominant Y"},{"$f":"VLOOKUP($B55,$CH2:$CM101,3,FALSE)","v":135},{"$f":"VLOOKUP($B55,$CH2:$CM101,4,FALSE)","v":135},{"$f":"VLOOKUP($B55,$CH2:$CM101,5,FALSE)","v":57.140411696960335},null,"p",{"$f":"$I54+$K54+$M54","v":4.8429664773085523},null,null,null,null,null,null,null,null,null,null,null,null,null,null,null,null,null,null,null,null,null,null,null,null,null,null,null,null,null,null,null,null,null,null,null,null,null,null,null,null,null,6.6079999999999997,6.6079999999999997,135,120,70,"39 % γ-folded Semi-Orthogonal γ-Expanded Y",null,null,null,null,null,null,null,null,null,null,null,null,null,null,null,null,null,100.26,100.26,21.274681745521328,15,15,"83 % closed T-shape",106.342,106.342,13.199353774732421,10,10,"90 % Closed 3/4  Expanded α-dominant Y",117.312,{"$f":"ROUND((1/SQRT(3))*SQRT(($A$29-CJ55)^2+($A$30-CK55)^2+($A$31-CL55)^2),3)","v":117.312},0,0,0,"Closed Arrow",null,null,null,"Monoclinic","g-dominant","a-ref",null,null,49.088000000000001,49.088000000000001,100,52.498374187983863,52.498374187983863,"17 % Closed 1/3 α-Expanded Arrow",null,22.277999999999999,22.277999999999999,115,98.254378102449664,76.253817618902303,"23 % closed orthogonal Y",null,null,null,21.529,21.529,115,104.47903449150299,85.513044560409398,"15 % closed Semi-Orthogonal γ-Expanded Y",null,null,24.186,24.186,115,94.902288368409401,62.376890489402193,"30 % closed Semi-Orthogonal γ-Compressed Y",null,null,27.481999999999999,27.481999999999999,115,84.889838693147396,73.956791817697436,"30 % closed Semi-Orthogonal β-Compressed Y",28.613,28.613,115,83.996424865800506,61.784366311345465,"36 % closed Semi-Oblique T",null,27.283000000000001,27.283000000000001,115,93.839610389376759,49.883383872878625,"36 % closed Oblique T",null,29.193999999999999,29.193999999999999,115,102.37332751572464,37.658864097596819,"36 % closed Inclined Y",null,29.193999999999999,29.193999999999999,115,102.37332751572464,37.658864097596819,"36 % closed Oblique Y"]
["Min 6 (cl.Mon.135)",{"$f":"MIN(CO2:CO103)","v":13.629},{"$f":"VLOOKUP(B56,CO2:CT103,6,FALSE)","v":"4 % Closed 1/4 Constricted γ-dominant Y"},{"$f":"VLOOKUP($B56,$CO2:$CT103,3,FALSE)","v":130},{"$f":"VLOOKUP($B56,$CO2:$CT103,4,FALSE)","v":130},{"$f":"VLOOKUP($B56,$CO2:$CT103,5,FALSE)","v":87.840738742209027},null,"phalf",{"$f":"$I55/2","v":2.4214832386542762},null,null,null,null,null,null,null,null,null,null,null,null,null,null,null,null,null,null,null,null,null,null,null,null,null,null,null,null,null,null,null,null,null,null,null,null,null,null,null,null,null,7.8739999999999997,7.8739999999999997,135,120,65,"44 % γ-folded Semi-Orthogonal γ-Expanded Y",null,null,null,null,null,null,null,null,null,null,null,null,null,null,null,null,null,105.943,105.943,14.160202469479856,10,10,"89 % closed T-shape",111.824,111.824,6.5950063138767119,5,5,"95 % Closed 3/4  Expanded α-dominant Y",null,null,"Monoclinic","g-dominant","a-ref",null,null,{"$f":"IF(CP56=0,0.01,CP56)","v":14.212999999999999},{"$f":"ROUND((1/SQRT(3))*SQRT(($A$29-CQ56)^2+($A$30-CR56)^2+($A$31-CS56)^2),3)","v":14.212999999999999},135,135,{"$f":"(360-CQ56-CR56)","v":90},"1/4 Constricted γ-dominant Y",null,51.957999999999998,51.957999999999998,95,50.385813332146064,50.385813332146064,"21 % Closed 1/3 α-Expanded Arrow",null,25.805,25.805,110,94.518422909387937,73.691232737177472,"27 % closed orthogonal Y",null,null,null,24.588999999999999,24.588999999999999,110,100.32350323944081,82.504132850260305,"19 % closed Semi-Orthogonal γ-Expanded Y",null,null,27.885000000000002,27.885000000000002,110,91.372961755888653,60.393531242047366,"33 % closed Semi-Orthogonal γ-Compressed Y",null,null,30.692,30.692,110,81.912836573890672,71.496672732255504,"33 % closed Semi-Orthogonal β-Compressed Y",31.960999999999999,31.960999999999999,110,81.064659275415465,59.823851644027116,"39 % closed Semi-Oblique T",null,30.774999999999999,30.774999999999999,110,90.373290803348922,48.356407919582317,"39 % closed Oblique T",null,32.341000000000001,32.341000000000001,110,98.365414320082834,36.537661451576987,"39 % closed Inclined Y",null,32.341000000000001,32.341000000000001,110,98.365414320082834,36.537661451576987,"39 % closed Oblique Y"]
["Min 7 (cl.tri180105)",{"$f":"MIN(EH2:EH40)","v":12.339},{"$f":"VLOOKUP(B57,EH2:EM40,6,FALSE)","v":"5 % closed Semi-Oblique T"},{"$f":"VLOOKUP($B57,$EH2:$EM40,3,FALSE)","v":149.84633576201102},{"$f":"VLOOKUP($B57,$EH2:$EM40,4,FALSE)","v":100},{"$f":"VLOOKUP($B57,$EH2:$EM40,5,FALSE)","v":72.003020268088946},null,"Rcc",{"$f":"($I54*$K54*$M54)/(SQRT(($I55)*($I54+$K54-$M54)*($I54+$M54-$K54)*($M54+$K54-$I54)))","v":0.97406379943504973},"Dcc",{"$f":"2*$I57","v":1.9481275988700995},null,null,null,null,null,null,null,null,null,null,null,null,null,null,null,null,null,null,null,null,null,null,null,null,null,null,null,null,null,null,null,null,null,null,null,null,null,null,null,9.8490000000000002,9.8490000000000002,135,120,60,"50 % γ-folded Semi-Orthogonal γ-Expanded Y",null,null,null,null,null,null,null,null,null,null,null,null,null,null,null,null,null,111.625,111.625,7.0733151690270537,5,5,"94 % closed T-shape",117.312,117.312,0,0,0,"Closed Arrow",{"$f":"IF(CI57=0,0.01,CI57)","v":18.492999999999999},{"$f":"ROUND((1/SQRT(3))*SQRT(($A$29-CJ57)^2+($A$30-CK57)^2+($A$31-CL57)^2),3)","v":18.492999999999999},150,150,{"$f":"(360-CJ57-CK57)","v":60},"1/2 Constricted γ-dominant Y",null,{"$f":"IF(CP57=0,0.01,CP57)","v":13.629},{"$f":"ROUND((1/SQRT(3))*SQRT(($A$29-CQ57)^2+($A$30-CR57)^2+($A$31-CS57)^2),3)","v":13.629},130,130,{"$f":"2*DEGREES(ASIN(((SIN(RADIANS(CQ57/2))*SIN(RADIANS($CS$56/2))/SIN(RADIANS($CQ$56/2))))))","v":87.840738742209027},{"$f":"ROUND(100*($CR$56-CR57)/$CR$56,0)&\" % Closed 1/4 Constricted γ-dominant Y\"","v":"4 % Closed 1/4 Constricted γ-dominant Y"},null,54.933,54.933,90,48.189685104221397,48.189685104221397,"25 % Closed 1/3 α-Expanded Arrow",null,29.463000000000001,29.463000000000001,105,90.68175792184941,71.01013442559416,"30 % closed orthogonal Y",null,null,null,27.940999999999999,27.940999999999999,105,96.090470248510925,79.375957309238572,"22 % closed Semi-Orthogonal γ-Expanded Y",null,null,31.640999999999998,31.640999999999998,105,87.734968086095577,58.304287426708399,"36 % closed Semi-Orthogonal γ-Compressed Y",null,null,34.045000000000002,34.045000000000002,105,78.816336893435249,68.919374380811846,"36 % closed Semi-Orthogonal β-Compressed Y",35.408000000000001,35.408000000000001,105,78.013143209355604,57.758188034855209,"42 % closed Semi-Oblique T",null,34.353000000000002,34.353000000000002,105,86.796315218331344,46.741169574292769,"42 % closed Oblique T",null,35.652000000000001,35.652000000000001,105,94.270728098305753,35.348295111015801,"42 % closed Inclined Y",null,35.652000000000001,35.652000000000001,105,94.270728098305753,35.348295111015801,"42 % closed Oblique Y"]
["Min 7 (cl.tri180120)",{"$f":"MIN(EO2:EO40)","v":10.209},{"$f":"VLOOKUP(B58,EO2:ET40,6,FALSE)","v":"4 % closed Oblique T"},{"$f":"VLOOKUP($B58,$EO2:$ET40,3,FALSE)","v":153.74373173870143},{"$f":"VLOOKUP($B58,$EO2:$ET40,4,FALSE)","v":115},{"$f":"VLOOKUP($B58,$EO2:$ET40,5,FALSE)","v":58.2782955409835},null,"ALPHA'",{"$f":"DEGREES(ASIN(ROUND($I54,3)/ROUND($K57,3)))","v":79.122487740890605},"anew",{"$f":"ROUND(2*$I58,0)","v":158},{"$f":"DEGREES(ACOS((2-$I$54^2)/2))","v":146},null,null,null,null,null,null,null,null,null,null,null,null,null,null,null,null,null,null,null,null,null,null,null,null,null,null,null,null,null,null,null,null,null,null,null,null,null,null,12.193,12.193,135,120,55,"56 % γ-folded Semi-Orthogonal γ-Expanded Y",null,null,null,null,null,null,null,null,null,null,null,null,null,null,null,null,null,117.312,117.312,0,0,0,"Closed Arrow",null,null,"Monoclinic","g-dominant","a-ref",null,{"$f":"IF(CI58=0,0.01,CI58)","v":16.004000000000001},{"$f":"ROUND((1/SQRT(3))*SQRT(($A$29-CJ58)^2+($A$30-CK58)^2+($A$31-CL58)^2),3)","v":16.004000000000001},145,145,{"$f":"2*DEGREES(ASIN(((SIN(RADIANS(CJ58/2))*SIN(RADIANS($CL$57/2))/SIN(RADIANS($CJ$57/2))))))","v":59.165520424855686},{"$f":"ROUND(100*($CK$57-CK58)/$CK$57,0)&\" % Closed 1/2 Constricted γ-dominant Y\"","v":"3 % Closed 1/2 Constricted γ-dominant Y"},null,14.301,14.301,125,125,85.513726176141773,"7 % Closed 1/4 Constricted γ-dominant Y",null,58.000999999999998,58.000999999999998,85,45.915493487616402,45.915493487616402,"29 % Closed 1/3 α-Expanded Arrow",null,33.223999999999997,33.223999999999997,100,86.757290083194661,68.219992166864756,"33 % closed orthogonal Y",null,null,null,31.512,31.512,100,91.791402468396257,76.140064328842499,"26 % closed Semi-Orthogonal γ-Expanded Y",null,null,35.448999999999998,35.448999999999998,100,84.001220425193381,56.115636776562404,"39 % closed Semi-Orthogonal γ-Compressed Y",null,null,37.514000000000003,37.514000000000003,100,75.611756475816492,66.233838751482551,"39 % closed Semi-Orthogonal β-Compressed Y",38.938000000000002,38.938000000000002,100,74.853103391991695,55.593739201443491,"44 % closed Semi-Oblique T",null,38.002000000000002,38.002000000000002,100,83.121525140318681,45.042024236221991,"44 % closed Oblique T",null,39.091000000000001,39.091000000000001,100,90.101492731848353,34.093574414660182,"44 % closed Inclined Y",null,39.091000000000001,39.091000000000001,100,90.101492731848353,34.093574414660182,"44 % closed Oblique Y"]
["Min 7 (cl.tri180135)",{"$f":"MIN(EV2:EV40)","v":9.3520000000000003},{"$f":"VLOOKUP(B59,EV2:FA40,6,FALSE)","v":"7 % closed Inclined Y"},{"$f":"VLOOKUP($B59,$EV2:$FA40,3,FALSE)","v":147.51792191713673},{"$f":"VLOOKUP($B59,$EV2:$FA40,4,FALSE)","v":125},{"$f":"VLOOKUP($B59,$EV2:$FA40,5,FALSE)","v":57.376917763895854},null,"BETA'",{"$f":"DEGREES(ASIN(ROUND($K54,2)/ROUND($K57,2)))","v":63.164678353283001},"bnew",{"$f":"ROUND(2*$I59,0)","v":126},{"$f":"DEGREES(ACOS((2-$K$54^2)/2))","v":121},null,null,null,null,null,null,null,null,null,null,null,null,null,null,null,null,null,null,null,null,null,null,null,null,null,null,null,null,null,null,null,null,null,null,null,null,null,null,14.731,14.731,135,120,50,"61 % γ-folded Semi-Orthogonal γ-Expanded Y",null,null,null,null,null,null,null,null,null,null,null,null,null,null,null,null,null,null,null,null,null,null,null,{"$f":"IF(CC59=0,0.01,CC59)","v":37.174999999999997},{"$f":"ROUND((1/SQRT(3))*SQRT(($A$29-CD59)^2+($A$30-CE59)^2+($A$31-CF59)^2),3)","v":37.174999999999997},165,165,{"$f":"(360-CD59-CE59)","v":30},"3/4 Constricted γ-dominant Y",14.326000000000001,14.326000000000001,140,140,58.211188769455752,"7 % Closed 1/2 Constricted γ-dominant Y",null,16.100000000000001,16.100000000000001,120,120,83.031690523992424,"11 % Closed 1/4 Constricted γ-dominant Y",null,61.15,61.15,80,43.568624494286063,43.568624494286063,"33 % Closed 1/3 α-Expanded Arrow",null,37.069000000000003,37.069000000000003,95,82.756149929480401,65.329768566561313,"37 % closed orthogonal Y",null,null,null,35.25,35.25,95,87.435824615648116,72.80702585621718,"30 % closed Semi-Orthogonal γ-Expanded Y",null,null,39.304000000000002,39.304000000000002,95,80.183053645303318,53.83395064936505,"42 % closed Semi-Orthogonal γ-Compressed Y",null,null,41.081000000000003,41.081000000000003,95,72.309574450298513,63.448590267610761,"42 % closed Semi-Orthogonal β-Compressed Y",42.537999999999997,42.537999999999997,95,71.594880304496598,53.336773151654342,"47 % closed Semi-Oblique T",null,41.71,41.71,95,79.360252495860536,43.263369827131179,"47 % closed Oblique T",null,42.634999999999998,42.634999999999998,95,85.867998822495451,32.776392906257882,"47 % closed Inclined Y",null,42.634999999999998,42.634999999999998,95,85.867998822495451,32.776392906257882,"47 % closed Oblique Y"]
["Min 7 (cl.tri180150)",{"$f":"MIN(FC2:FC40)","v":26.696000000000002},{"$f":"VLOOKUP(B60,FC2:FH40,6,FALSE)","v":"13 % closed Oblique Y"},{"$f":"VLOOKUP($B60,$FC2:$FH40,3,FALSE)","v":139.52898852650523},{"$f":"VLOOKUP($B60,$FC2:$FH40,4,FALSE)","v":130},{"$f":"VLOOKUP($B60,$FC2:$FH40,5,FALSE)","v":28.108965035272579},null,"GAMMA'",{"$f":"DEGREES(ASIN(ROUND($M54,2)/ROUND($K57,2)))","v":37.608045405312055},"gnew",{"$f":"ROUND(2*$I60,0)","v":75},{"$f":"DEGREES(ACOS((2-$M$54^2)/2))","v":73},null,null,null,null,null,null,null,null,null,null,null,null,null,null,null,null,null,null,null,null,null,null,null,null,null,null,null,null,null,null,null,null,null,null,null,null,null,null,17.378,17.378,135,120,45,"67 % γ-folded Semi-Orthogonal γ-Expanded Y",null,null,null,null,null,null,null,null,null,null,null,null,null,null,null,null,null,null,null,null,null,null,null,{"$f":"IF(CC60=0,0.01,CC60)","v":34.563000000000002},{"$f":"ROUND((1/SQRT(3))*SQRT(($A$29-CD60)^2+($A$30-CE60)^2+($A$31-CF60)^2),3)","v":34.563000000000002},160,160,{"$f":"2*DEGREES(ASIN(((SIN(RADIANS(CD60/2))*SIN(RADIANS($CF$59/2))/SIN(RADIANS($CD$59/2))))))","v":29.794500237449309},{"$f":"ROUND(100*($CE$59-CE60)/$CE$59,0)&\" % Closed  3/4 Constricted γ-dominant Y\"","v":"3 % Closed  3/4 Constricted γ-dominant Y"},13.766,13.766,135,135,57.140411696960335,"10 % Closed 1/2 Constricted γ-dominant Y",null,18.725000000000001,18.725000000000001,115,115,80.406928351187474,"15 % Closed 1/4 Constricted γ-dominant Y",null,64.37,64.37,75,41.154332100584504,41.154332100584504,"38 % Closed 1/3 α-Expanded Arrow",null,40.987000000000002,40.987000000000002,90,78.687947218832221,62.347904392294232,"40 % closed orthogonal Y",null,null,null,39.118000000000002,39.118000000000002,90,83.031690523992424,69.386487845503694,"33 % closed Semi-Orthogonal γ-Expanded Y",null,null,43.2,43.2,90,76.290412529380319,51.465460066261741,"45 % closed Semi-Orthogonal γ-Compressed Y",null,null,44.731999999999999,44.731999999999999,90,68.919374380811846,60.571713211165793,"45 % closed Semi-Orthogonal β-Compressed Y",46.198999999999998,46.198999999999998,90,68.247961839989387,50.993428395322205,"50 % closed Semi-Oblique T",null,45.469000000000001,45.469000000000001,90,75.522487814070075,41.409622109270849,"50 % closed Oblique T",null,46.262,46.262,90,81.578941881850582,31.39971480991904,"50 % closed Inclined Y",null,46.262,46.262,90,81.578941881850582,31.39971480991904,"50 % closed Oblique Y"]
["Min 7 (cl.tri180165)",{"$f":"MIN(FJ2:FJ40)","v":35.371000000000002},{"$f":"VLOOKUP(B61,FJ2:FO40,6,FALSE)","v":"18 % closed Semi-Oblique Y"},{"$f":"VLOOKUP($B61,$FJ2:$FO40,3,FALSE)","v":137.45063650895736},{"$f":"VLOOKUP($B61,$FJ2:$FO40,4,FALSE)","v":135},{"$f":"VLOOKUP($B61,$FJ2:$FO40,5,FALSE)","v":13.972488686468861},null,"Area",{"$f":"SQRT(($I56)*($I56-$I54)*($I56-$K54)*($I56-$M54))","v":1.0165372116392934},null,null,null,null,null,null,null,null,null,null,null,null,null,null,null,null,null,null,null,null,null,null,null,null,null,null,null,null,null,null,null,null,null,null,null,null,null,null,null,null,null,20.091000000000001,20.091000000000001,135,120,40,"72 % γ-folded Semi-Orthogonal γ-Expanded Y",null,null,null,null,null,null,null,null,null,null,null,null,null,null,null,null,null,null,null,null,null,null,null,32.283000000000001,32.283000000000001,155,155,29.531100799073702,"6 % Closed  3/4 Constricted γ-dominant Y",14.462,14.462,130,130,55.956899392247067,"13 % Closed 1/2 Constricted γ-dominant Y",null,21.899000000000001,21.899000000000001,110,110,77.651181102288504,"19 % Closed 1/4 Constricted γ-dominant Y",null,67.653000000000006,67.653000000000006,70,38.677729046839467,38.677729046839467,"42 % Closed 1/3 α-Expanded Arrow",null,44.966000000000001,44.966000000000001,85,74.560996402684609,59.282318995647088,"43 % closed orthogonal Y",null,null,null,43.091000000000001,43.091000000000001,85,78.585680751113287,65.887231682598383,"37 % closed Semi-Orthogonal γ-Expanded Y",null,null,47.134,47.134,85,72.332027821546575,49.016230188247164,"48 % closed Semi-Orthogonal γ-Compressed Y",null,null,48.454999999999998,48.454999999999998,85,65.449900002772168,57.610843686287943,"48 % closed Semi-Orthogonal β-Compressed Y",49.912999999999997,49.912999999999997,85,64.821031317556134,48.569688290618004,"53 % closed Semi-Oblique T",null,49.271000000000001,49.271000000000001,85,71.61704098477631,39.485193378470939,"53 % closed Oblique T",null,49.959000000000003,49.959000000000003,85,77.241701993007652,29.966562490439561,"53 % closed Inclined Y",null,49.959000000000003,49.959000000000003,85,77.241701993007652,29.966562490439561,"53 % closed Oblique Y"]
[null,null,null,null,null,null,"Alt X1","Ric",{"$f":"2*$I61/$I55","v":0.41979940038908858},null,null,null,null,null,null,null,null,null,null,null,null,null,null,null,null,null,null,null,null,null,null,null,null,null,null,null,null,null,null,null,null,null,null,null,null,null,null,null,null,null,22.847000000000001,22.847000000000001,135,120,35,"78 % γ-folded Semi-Orthogonal γ-Expanded Y",null,null,null,null,null,null,null,null,null,null,null,null,null,null,null,null,null,null,null,null,null,null,null,30.411000000000001,30.411000000000001,150,150,29.210406683729531,"9 % Closed  3/4 Constricted γ-dominant Y",16.260000000000002,16.260000000000002,125,125,54.664620873979153,"17 % Closed 1/2 Constricted γ-dominant Y",null,25.431000000000001,25.431000000000001,105,105,74.775554939752155,"22 % Closed 1/4 Constricted γ-dominant Y",null,70.992999999999995,70.992999999999995,65,36.143781895973383,36.143781895973383,"46 % Closed 1/3 α-Expanded Arrow",null,48.997999999999998,48.997999999999998,80,70.382512137817514,56.140422412149888,"47 % closed orthogonal Y",null,null,null,47.15,47.15,80,74.103440669904472,62.317242479201724,"41 % closed Semi-Orthogonal γ-Expanded Y",null,null,51.101999999999997,51.101999999999997,80,68.315576387828031,46.492142368420659,"52 % closed Semi-Orthogonal γ-Compressed Y",null,null,52.241,52.241,80,61.90911856979173,54.573173046271151,"52 % closed Semi-Orthogonal β-Compressed Y",53.673999999999999,53.673999999999999,80,61.322024036608369,46.071362732449025,"56 % closed Semi-Oblique T",null,53.112000000000002,53.112000000000002,80,67.651689941139423,37.494474502075001,"56 % closed Oblique T",null,53.713000000000001,53.713000000000001,80,72.862573571284386,28.480004986899388,"56 % closed Inclined Y",null,53.713000000000001,53.713000000000001,80,72.862573571284386,28.480004986899388,"56 % closed Oblique Y"]
[null,null,null,null,null,null,{"$f":"$I57*SIN(RADIANS(DEGREES(ACOS(($I54/2)/$I57))))","v":0.18515263728157938},"X1",{"$f":"SQRT(ROUND($I57,5)^2-(ROUND($I54,5)/2)^2)","v":0.18513138733072818},"X2",{"$f":"SQRT($I57^2-(K54/2)^2)","v":0.4373571171420646},"X3",{"$f":"SQRT($I57^2-($M54/2)^2)","v":0.77135344540049411},null,null,null,null,null,null,null,null,null,null,null,null,null,null,null,null,null,null,null,null,null,null,null,null,null,null,null,null,null,null,null,null,null,null,null,null,null,25.632000000000001,25.632000000000001,135,120,30,"83 % γ-folded Semi-Orthogonal γ-Expanded Y",null,null,null,null,null,null,null,null,null,null,null,null,null,null,null,null,null,null,null,null,null,null,null,29.027000000000001,29.027000000000001,145,145,28.833150889757196,"12 % Closed  3/4 Constricted γ-dominant Y",18.853000000000002,18.853000000000002,120,120,53.267759674877063,"20 % Closed 1/2 Constricted γ-dominant Y",null,29.202999999999999,29.202999999999999,100,100,71.79047651109812,"26 % Closed 1/4 Constricted γ-dominant Y",null,74.382000000000005,74.382000000000005,60,33.557309761920713,33.557309761920713,"50 % Closed 1/3 α-Expanded Arrow",null,53.076999999999998,53.076999999999998,75,66.158776955322253,52.929135978774241,"50 % closed orthogonal Y",null,null,null,51.28,51.28,75,69.589771077954126,58.683779839016424,"44 % closed Semi-Orthogonal γ-Expanded Y",null,null,55.101999999999997,55.101999999999997,75,64.247824181096433,43.898882854232895,"55 % closed Semi-Orthogonal γ-Compressed Y",null,null,56.082000000000001,56.082000000000001,75,58.304287426708399,51.465460066261741,"55 % closed Semi-Orthogonal β-Compressed Y",57.475999999999999,57.475999999999999,75,57.758188034855209,43.50407632002122,"58 % closed Semi-Oblique T",null,56.987000000000002,56.987000000000002,75,63.633315182382717,35.44182019257731,"58 % closed Oblique T",null,57.515000000000001,57.515000000000001,75,68.446953547755967,26.943147676640177,"58 % closed Inclined Y",null,57.515000000000001,57.515000000000001,75,68.446953547755967,26.943147676640177,"58 % closed Oblique Y"]
["Min",{"$f":"MIN(B42:B61)","v":1.4139999999999999},null,null,null,null,null,"Y1",{"$f":"$I62/TAN(RADIANS($I59/2))","v":0.68284571554600293},"Y2",{"$f":"$I62/TAN(RADIANS($I60/2))","v":1.232868897410992},"Y3",{"$f":"$I62/TAN(RADIANS($I58/2))","v":0.50814975617009728},null,null,null,null,null,null,null,null,null,null,null,null,null,null,null,null,null,null,null,null,null,null,null,null,null,null,null,null,null,null,null,null,null,null,null,null,null,28.437000000000001,28.437000000000001,135,120,25,"89 % γ-folded Semi-Orthogonal γ-Expanded Y",null,null,null,null,null,null,null,null,null,null,null,null,null,null,null,null,null,null,null,null,null,null,null,28.202000000000002,28.202000000000002,140,140,28.400190711253252,"15 % Closed  3/4 Constricted γ-dominant Y",21.966999999999999,21.966999999999999,115,115,51.77067093454135,"23 % Closed 1/2 Constricted γ-dominant Y",null,33.143000000000001,33.143000000000001,95,95,68.705677260201853,"30 % Closed 1/4 Constricted γ-dominant Y",null,77.814999999999998,77.814999999999998,55,30.922986152942453,30.922986152942453,"54 % Closed 1/3 α-Expanded Arrow",null,57.197000000000003,57.197000000000003,70,61.895284061140778,49.654918865403424,"53 % closed orthogonal Y",null,null,null,55.47,55.47,70,65.048781160126808,54.99344806854451,"48 % closed Semi-Orthogonal γ-Expanded Y",null,null,59.13,59.13,70,60.134752233910142,41.241937208884067,"58 % closed Semi-Orthogonal γ-Compressed Y",null,null,59.972000000000001,59.972000000000001,70,54.642020739079804,48.294049547293511,"58 % closed Semi-Orthogonal β-Compressed Y",61.316000000000003,61.316000000000003,70,54.136145944544062,40.873262127351701,"61 % closed Semi-Oblique T",null,60.892000000000003,60.892000000000003,70,59.568019681783916,33.331537348116228,"61 % closed Oblique T",null,61.359000000000002,61.359000000000002,70,63.999495399747701,25.359123098325348,"61 % closed Inclined Y",null,61.359000000000002,61.359000000000002,70,63.999495399747701,25.359123098325348,"61 % closed Oblique Y"]
["Name",{"$f":"VLOOKUP(B64,B42:C61,2,FALSE)","v":"17 % α-folded Semi-Orthogonal γ-Compressed Y"},null,null,null,null,null,"Z1",{"$f":"($I54/2)-$I64","v":0.27345904041703251},"Z2",{"$f":"SQRT($I65^2+$M65^2)","v":0.36034556073103358},"Z3",{"$f":"IF(G52=\"obtuse\",($I62+$I63),($I62-$I63))","v":0.23466801305836041},null,null,null,null,null,null,null,null,null,null,null,null,null,null,null,null,null,null,null,null,null,null,null,null,null,null,null,null,null,null,null,null,null,null,null,null,null,31.257000000000001,31.257000000000001,135,120,20,"94 % γ-folded Semi-Orthogonal γ-Expanded Y",null,null,null,null,null,null,null,null,null,null,null,null,null,null,null,null,null,null,null,null,null,null,null,27.986999999999998,27.986999999999998,135,135,27.912503502801233,"18 % Closed  3/4 Constricted γ-dominant Y",25.416,25.416,110,110,50.177840774342052,"27 % Closed 1/2 Constricted γ-dominant Y",null,37.206000000000003,37.206000000000003,90,90,65.530199479297806,"33 % Closed 1/4 Constricted γ-dominant Y",null,81.286000000000001,81.286000000000001,50,28.245343421484449,28.245343421484449,"58 % Closed 1/3 α-Expanded Arrow",null,61.353000000000002,61.353000000000002,65,57.596858482375872,46.32379844128598,"57 % closed orthogonal Y",null,null,null,59.710999999999999,59.710999999999999,65,60.484011684733204,51.25226386017092,"52 % closed Semi-Orthogonal γ-Expanded Y",null,null,63.183999999999997,63.183999999999997,65,55.981666759004746,38.526589558840776,"61 % closed Semi-Orthogonal γ-Compressed Y",null,null,63.905000000000001,63.905000000000001,65,50.928354335135239,45.064895441513265,"61 % closed Semi-Orthogonal β-Compressed Y",65.188999999999993,65.188999999999993,65,50.46195582149079,38.184160229226407,"64 % closed Semi-Oblique T",null,64.822999999999993,64.822999999999993,65,55.46123469868099,31.167876248880489,"64 % closed Oblique T",null,65.236999999999995,65.236999999999995,65,59.524235369348709,23.731082937642167,"64 % closed Inclined Y",null,65.236999999999995,65.236999999999995,65,59.524235369348709,23.731082937642167,"64 % closed Oblique Y"]
["a",{"$f":"ROUND(VLOOKUP($B64,$B$42:$F$61,3,FALSE),0)","v":145},null,null,null,null,null,"h",{"$f":"SQRT(ROUND($I53,3)^2-ROUND($I63,3)^2)","v":0.22591812676277218},null,{"$f":"($K54/2)-($I62/TAN(RADIANS($I58/2)))","v":0.36220593976980242},null,null,null,null,null,null,null,null,null,null,null,null,null,null,null,null,null,null,null,null,null,null,null,null,null,null,null,null,null,null,null,null,null,null,null,null,null,null,null,34.088000000000001,34.088000000000001,135,120,15,"near 5/9 α-Expanded Arrow (77.78 % oblique)",null,null,null,null,null,null,null,null,null,null,null,null,null,null,null,null,null,null,null,null,null,null,null,28.396000000000001,28.396000000000001,130,130,27.371181976473732,"21 % Closed  3/4 Constricted γ-dominant Y",29.084,29.084,105,105,48.493848635992386,"30 % Closed 1/2 Constricted γ-dominant Y",null,41.360999999999997,41.360999999999997,85,85,62.272418193705121,"37 % Closed 1/4 Constricted γ-dominant Y",null,84.792000000000002,84.792000000000002,45,25.528779365509308,25.528779365509308,"63 % Closed 1/3 α-Expanded Arrow",null,65.542000000000002,65.542000000000002,60,53.267759674877063,42.941402864879898,"60 % closed orthogonal Y",null,null,null,63.994999999999997,63.994999999999997,60,55.898534677261701,47.465720260957987,"56 % closed Semi-Orthogonal γ-Expanded Y",null,null,67.262,67.262,60,51.793294857216416,35.757925840952076,"64 % closed Semi-Orthogonal γ-Compressed Y",null,null,67.876000000000005,67.876000000000005,60,47.168807390144096,41.783586966327547,"64 % closed Semi-Orthogonal β-Compressed Y",69.091999999999999,69.091999999999999,60,46.741169574292769,35.44182019257731,"67 % closed Semi-Oblique T",null,68.778999999999996,68.778999999999996,60,51.317812546510545,28.955024371859842,"67 % closed Oblique T",null,69.146000000000001,69.146000000000001,60,55.02469614890267,22.062191157541474,"67 % closed Inclined Y",null,69.146000000000001,69.146000000000001,60,55.02469614890267,22.062191157541474,"67 % closed Oblique Y"]
["b",{"$f":"ROUND(VLOOKUP($B64,$B$42:$F$61,4,FALSE),0)","v":120},null,null,null,null,null,"(f1)incl",{"$f":"IF(G52=\"Obtuse \",180-DEGREES(ASIN($I66/$I53)),IF(G52=\"Normal \",90,DEGREES(ASIN($I66/$I53))))","v":50.597744553505287},"(f2)incl",{"$f":"DEGREES(ASIN($I66/$K53))","v":27.308940915979541},"(f3)incl",{"$f":"DEGREES(ASIN($I66/$M53))","v":16.322447953510842},null,null,null,null,null,null,null,null,null,null,null,null,null,null,null,null,null,null,null,null,null,null,null,null,null,null,null,null,null,null,null,null,null,null,null,null,null,null,null,null,null,null,null,null,null,null,null,null,null,null,null,null,null,null,null,null,null,null,null,null,null,null,null,null,null,null,29.402999999999999,29.402999999999999,125,125,26.777429099723484,"24 % Closed  3/4 Constricted γ-dominant Y",32.901000000000003,32.901000000000003,100,100,46.723333077553271,"33 % Closed 1/2 Constricted γ-dominant Y",null,45.588000000000001,45.588000000000001,80,80,58.940073980056951,"41 % Closed 1/4 Constricted γ-dominant Y",null,88.328999999999994,88.328999999999994,40,22.777565582014702,22.777565582014702,"67 % Closed 1/3 α-Expanded Arrow",null,{"$f":"IF(DD67=0,0.01,DD67)","v":69.759},{"$f":"ROUND((1/SQRT(3))*SQRT(($A$29-DE67)^2+($A$30-DF67)^2+($A$31-DG67)^2),3)","v":69.759},55,48.91176844268351,39.512994685474389,"63 % closed orthogonal Y",null,null,null,68.317999999999998,68.317999999999998,55,51.295034490193686,43.638846307694244,"59 % closed Semi-Orthogonal γ-Expanded Y",null,null,71.361000000000004,71.361000000000004,55,47.573867482387534,32.940840306194502,"67 % closed Semi-Orthogonal γ-Compressed Y",null,null,71.882000000000005,71.882000000000005,55,43.368440249452561,38.455376511883372,"67 % closed Semi-Orthogonal β-Compressed Y",73.021000000000001,73.021000000000001,55,42.978888182278112,32.651106818402795,"69 % closed Semi-Oblique T",null,72.754999999999995,72.754999999999995,55,47.1421076177609,26.697102572771769,"69 % closed Oblique T",null,73.08,73.08,55,50.503972360807239,20.355618236758531,"69 % closed Inclined Y",null,73.08,73.08,55,50.503972360807239,20.355618236758531,"69 % closed Oblique Y"]
["g",{"$f":"ROUND(VLOOKUP($B64,$B$42:$F$61,5,FALSE),0)","v":75},null,null,null,null,null,null,null,null,null,null,null,null,null,null,null,null,null,null,null,null,null,null,null,null,null,null,null,null,null,null,null,null,null,null,null,null,null,null,null,null,null,null,null,null,null,null,null,null,null,null,null,null,null,null,null,null,null,null,null,null,null,null,null,null,null,null,null,null,null,null,null,null,null,null,null,null,null,30.949000000000002,30.949000000000002,120,120,26.132552665862221,"27 % Closed  3/4 Constricted γ-dominant Y",36.825000000000003,36.825000000000003,95,95,44.870961343311592,"37 % Closed 1/2 Constricted γ-dominant Y",null,49.872999999999998,49.872999999999998,75,75,55.540312809594077,"44 % Closed 1/4 Constricted γ-dominant Y",null,91.891999999999996,91.891999999999996,35,19.995857228604795,19.995857228604795,"71 % Closed 1/3 α-Expanded Arrow",null,74.001999999999995,74.001999999999995,50,44.532260689892304,36.043504576677464,"67 % closed orthogonal Y",null,null,null,72.673000000000002,72.673000000000002,50,46.675874134741143,39.776262105598676,"63 % closed Semi-Orthogonal γ-Expanded Y",null,null,75.478999999999999,75.478999999999999,50,43.32719130357507,30.080044628546339,"70 % closed Semi-Orthogonal γ-Compressed Y",null,null,75.918000000000006,75.918000000000006,50,39.531908088683714,35.085208435731161,"70 % closed Semi-Orthogonal β-Compressed Y",76.974999999999994,76.974999999999994,50,39.179813297329169,29.816708503381264,"72 % closed Semi-Oblique T",null,76.75,76.75,50,42.938047039557816,24.398163380897614,"72 % closed Oblique T",null,77.037000000000006,77.037000000000006,50,45.964801346868938,18.614536465591989,"72 % closed Inclined Y",null,77.037000000000006,77.037000000000006,50,45.964801346868938,18.614536465591989,"72 % closed Oblique Y"]
[null,null,null,null,null,null,null,null,null,null,null,null,null,null,null,null,null,null,null,null,null,null,null,null,null,null,null,null,null,null,null,null,null,null,null,null,null,null,null,null,null,null,null,null,null,null,null,null,null,null,null,null,null,null,null,null,null,null,null,null,null,null,null,null,null,null,null,null,null,null,null,null,null,null,null,null,null,null,null,32.96,32.96,115,115,25.437959610192163,"30 % Closed  3/4 Constricted γ-dominant Y",40.826999999999998,40.826999999999998,90,90,42.941402864879898,"40 % Closed 1/2 Constricted γ-dominant Y",null,54.204999999999998,54.204999999999998,70,70,52.079729905668934,"48 % Closed 1/4 Constricted γ-dominant Y",null,95.477999999999994,95.477999999999994,30,17.187703901309966,17.187703901309966,"75 % Closed 1/3 α-Expanded Arrow",null,78.268000000000001,78.268000000000001,45,40.132270186962884,32.537564589993288,"70 % closed orthogonal Y",null,null,null,77.055999999999997,77.055999999999997,45,42.043149914000161,35.882229396561875,"67 % closed Semi-Orthogonal γ-Expanded Y",null,null,79.614000000000004,79.614000000000004,45,39.056711008990284,27.180079060151115,"73 % closed Semi-Orthogonal γ-Compressed Y",null,null,79.980999999999995,79.980999999999995,45,35.663510386523541,31.677748080442267,"73 % closed Semi-Orthogonal β-Compressed Y",80.948999999999998,80.948999999999998,45,35.348295111015801,26.943147676640177,"75 % closed Semi-Oblique T",null,80.762,80.762,45,38.709192303300902,22.062191157541474,"75 % closed Oblique T",null,81.013000000000005,81.013000000000005,45,41.409622109270863,16.842116236298846,"75 % closed Inclined Y",null,81.013000000000005,81.013000000000005,45,41.409622109270863,16.842116236298846,"75 % closed Oblique Y"]
[null,null,null,null,null,null,null,null,null,null,null,null,null,null,null,null,null,null,null,null,null,null,null,null,null,null,null,null,null,null,null,null,null,null,null,null,null,null,null,null,null,null,null,null,null,null,null,null,null,null,null,null,null,null,null,null,null,null,null,null,null,null,null,null,null,null,null,null,null,null,null,null,null,null,null,null,null,null,null,35.356999999999999,35.356999999999999,110,110,24.695150144574054,"33 % Closed  3/4 Constricted γ-dominant Y",44.887999999999998,44.887999999999998,85,85,40.939306714752028,"43 % Closed 1/2 Constricted γ-dominant Y",null,58.578000000000003,58.578000000000003,65,65,48.564415374279761,"52 % Closed 1/4 Constricted γ-dominant Y",null,99.084000000000003,99.084000000000003,25,14.357061384912132,14.357061384912132,"79 % Closed 1/3 α-Expanded Arrow",null,82.554000000000002,82.554000000000002,40,35.714542215754513,28.999540528800029,"73 % closed orthogonal Y",null,null,null,81.465000000000003,81.465000000000003,40,37.398736752782334,31.960697837166137,"70 % closed Semi-Orthogonal γ-Expanded Y",null,null,83.763999999999996,83.763999999999996,40,34.765563459070044,24.245325163091341,"76 % closed Semi-Orthogonal γ-Compressed Y",null,null,84.067999999999998,84.067999999999998,40,31.767236369385323,28.237410547552212,"76 % closed Semi-Orthogonal β-Compressed Y",84.942999999999998,84.942999999999998,40,31.48837656384438,24.034792851064559,"78 % closed Semi-Oblique T",null,84.787999999999997,84.787999999999997,40,34.458793125917786,19.693103879668154,"78 % closed Oblique T",null,85.006,85.006,40,36.840624697259578,15.041523256668286,"78 % closed Inclined Y",null,85.006,85.006,40,36.840624697259578,15.041523256668286,"78 % closed Oblique Y"]
[null,null,null,null,null,null,null,null,null,null,null,null,null,null,null,null,null,null,null,null,null,null,null,null,null,null,null,null,null,null,null,null,null,null,null,null,null,null,null,null,null,null,null,null,null,null,null,null,null,null,null,null,null,null,null,null,null,null,null,null,null,null,null,null,null,null,null,null,null,null,null,null,null,null,null,null,null,null,null,38.067,38.067,105,105,23.905711781403909,"36 % Closed  3/4 Constricted γ-dominant Y",48.996000000000002,48.996000000000002,80,80,38.869282922618162,"47 % Closed 1/2 Constricted γ-dominant Y",null,62.984000000000002,62.984000000000002,60,60,44.999999999999986,"56 % Closed 1/4 Constricted γ-dominant Y",null,102.706,102.706,20,11.507804074967583,11.507804074967583,"83 % Closed 1/3 α-Expanded Arrow",null,86.858000000000004,86.858000000000004,35,31.281579674114344,25.433563207606664,"77 % closed orthogonal Y",null,null,null,85.894999999999996,85.894999999999996,35,32.744326119107825,28.015347313881026,"74 % closed Semi-Orthogonal γ-Expanded Y",null,null,87.927999999999997,87.927999999999997,35,30.456624945591784,21.280019730744677,"79 % closed Semi-Orthogonal γ-Compressed Y",null,null,88.176000000000002,88.176000000000002,35,27.846806703789927,24.768388919462502,"79 % closed Semi-Orthogonal β-Compressed Y",88.953000000000003,88.953000000000003,35,27.603834101832373,21.095871906976932,"81 % closed Semi-Oblique T",null,88.826999999999998,88.826999999999998,35,30.189834689065052,17.294756325044844,"81 % closed Oblique T",null,89.013000000000005,89.013000000000005,35,32.259791892958916,13.215916608997624,"81 % closed Inclined Y",null,89.013000000000005,89.013000000000005,35,32.259791892958916,13.215916608997624,"81 % closed Oblique Y"]
[null,null,null,null,null,null,null,null,null,null,null,null,null,null,null,null,null,null,null,null,null,null,null,null,null,null,null,null,null,null,null,null,null,null,null,null,null,null,null,null,null,null,null,null,null,null,null,null,null,null,null,null,null,null,null,null,null,null,null,null,null,null,null,null,null,null,null,null,null,null,null,null,null,null,null,null,null,null,null,41.027999999999999,41.027999999999999,100,100,23.071313314785126,"39 % Closed  3/4 Constricted γ-dominant Y",53.142000000000003,53.142000000000003,75,75,36.735887479092852,"50 % Closed 1/2 Constricted γ-dominant Y",null,67.418999999999997,67.418999999999997,55,55,41.391700104498284,"59 % Closed 1/4 Constricted γ-dominant Y",null,106.343,106.343,15,8.6437379080912979,8.6437379080912979,"88 % Closed 1/3 α-Expanded Arrow",null,91.177000000000007,91.177000000000007,30,26.8356829759249,21.843558486937212,"80 % closed orthogonal Y",null,null,null,90.343999999999994,90.343999999999994,30,28.081458044742739,24.049626683297223,"78 % closed Semi-Orthogonal γ-Expanded Y",null,null,92.103999999999999,92.103999999999999,30,26.132552665862221,18.28826958610151,"82 % closed Semi-Orthogonal γ-Compressed Y",null,null,92.302000000000007,92.302000000000007,30,23.905711781403909,21.274681745521328,"82 % closed Semi-Orthogonal β-Compressed Y",92.977000000000004,92.977000000000004,30,23.698215265919014,18.130486297144721,"83 % closed Semi-Oblique T",null,92.876000000000005,92.876000000000005,30,25.905079284444721,14.870944452263702,"83 % closed Oblique T",null,93.031999999999996,93.031999999999996,30,27.668934698206765,11.36844757241691,"83 % closed Inclined Y",null,93.031999999999996,93.031999999999996,30,27.668934698206765,11.36844757241691,"83 % closed Oblique Y"]
[null,null,null,null,null,null,null,null,null,null,null,null,null,null,null,null,null,null,null,null,null,null,null,null,null,null,null,null,null,null,null,null,null,null,null,null,null,null,null,null,null,null,null,null,null,null,null,null,null,null,null,null,null,null,null,null,null,null,null,null,null,null,null,null,null,null,null,null,null,null,null,null,null,null,null,null,null,null,null,44.19,44.19,95,95,22.193698822311003,"42 % Closed  3/4 Constricted γ-dominant Y",57.317999999999998,57.317999999999998,70,70,34.543610789661493,"53 % Closed 1/2 Constricted γ-dominant Y",null,71.879000000000005,71.879000000000005,50,50,37.74436075627154,"63 % Closed 1/4 Constricted γ-dominant Y",null,109.991,109.991,10,5.7686136687328968,5.7686136687328968,"92 % Closed 1/3 α-Expanded Arrow",null,95.51,95.51,25,22.378984875690499,18.233276068267354,"83 % closed orthogonal Y",null,null,null,94.808999999999997,94.808999999999997,25,23.411548452371516,20.06678935432998,"81 % closed Semi-Orthogonal γ-Expanded Y",null,null,{"$f":"IF(DU73=0,0.01,DU73)","v":96.289000000000001},{"$f":"ROUND((1/SQRT(3))*SQRT(($A$29-DV73)^2+($A$30-DW73)^2+($A$31-DX73)^2),3)","v":96.289000000000001},25,21.795821384471161,15.27406700980122,"85 % closed Semi-Orthogonal γ-Compressed Y",null,null,96.444000000000003,96.444000000000003,25,19.94724697832774,17.760119705047135,"85 % closed Semi-Orthogonal β-Compressed Y",97.013999999999996,97.013999999999996,25,19.774873446396224,15.142625924949105,"86 % closed Semi-Oblique T",null,96.935000000000002,96.935000000000002,25,21.607103279152678,12.425410787016478,"86 % closed Oblique T",null,97.061999999999998,97.061999999999998,25,23.069722845717191,9.5022591239027214,"86 % closed Inclined Y",null,97.061999999999998,97.061999999999998,25,23.069722845717191,9.5022591239027214,"86 % closed Oblique Y"]
[null,null,null,null,null,null,null,null,null,null,null,null,null,null,null,null,null,null,null,null,null,null,null,null,null,null,null,null,null,null,null,null,null,null,null,null,null,null,null,null,null,null,null,null,null,null,null,null,null,null,null,null,null,null,null,null,null,null,null,null,null,null,null,null,null,null,null,null,null,null,null,null,null,null,null,null,null,null,null,47.512999999999998,47.512999999999998,90,90,21.274681745521328,"45 % Closed  3/4 Constricted γ-dominant Y",61.518999999999998,61.518999999999998,65,65,32.296869301075574,"57 % Closed 1/2 Constricted γ-dominant Y",null,76.361000000000004,76.361000000000004,45,45,34.062496916446854,"67 % Closed 1/4 Constricted γ-dominant Y",null,113.648,113.648,5,2.8861405666786117,2.8861405666786117,"96 % Closed 1/3 α-Expanded Arrow",null,99.853999999999999,99.853999999999999,20,17.91348117516446,14.606317102825061,"87 % closed orthogonal Y",null,null,null,99.289000000000001,99.289000000000001,20,18.735912765598361,16.069926138149388,"85 % closed Semi-Orthogonal γ-Expanded Y",null,null,100.483,100.483,20,17.448756134130331,12.241305606855788,"88 % closed Semi-Orthogonal γ-Compressed Y",null,null,100.599,100.599,20,15.974545285499714,14.228391433763553,"88 % closed Semi-Orthogonal β-Compressed Y",101.06,101.06,20,15.837000158456926,12.136184501904102,"89 % closed Semi-Oblique T",null,101.001,101.001,20,17.298330210575152,9.9618506438577423,"89 % closed Oblique T",null,101.101,101.101,20,18.463711338363616,7.6204860320105974,"89 % closed Inclined Y",null,101.101,101.101,20,18.463711338363616,7.6204860320105974,"89 % closed Oblique Y"]
[null,null,null,null,null,null,null,null,null,null,null,null,null,null,null,null,null,null,null,null,null,null,null,null,null,null,null,null,null,null,null,null,null,null,null,null,null,null,null,null,null,null,null,null,null,null,null,null,null,null,null,null,null,null,null,null,null,null,null,null,null,null,null,null,null,null,null,null,null,null,null,null,null,null,null,null,null,null,null,50.966000000000001,50.966000000000001,85,85,20.316139100980742,"48 % Closed  3/4 Constricted γ-dominant Y",65.742000000000004,65.742000000000004,60,60,29.999999999999993,"60 % Closed 1/2 Constricted γ-dominant Y",null,80.861999999999995,80.861999999999995,40,40,30.350332324657675,"70 % Closed 1/4 Constricted γ-dominant Y",null,117.312,117.312,0,0,0,"Closed Arrow",null,104.208,104.208,15,13.441058129472795,10.966160718389629,"90 % closed orthogonal Y",null,null,null,103.78100000000001,103.78100000000001,15,14.055786600028298,12.061995788197397,"89 % closed Semi-Orthogonal γ-Expanded Y",null,null,104.684,104.684,15,13.093561703279144,9.193796468356485,"91 % closed Semi-Orthogonal γ-Compressed Y",null,null,104.76600000000001,104.76600000000001,15,11.990607709016693,10.683068555545178,"91 % closed Semi-Orthogonal β-Compressed Y",105.11499999999999,105.11499999999999,15,11.887655204124828,9.1149752366980348,"92 % closed Semi-Oblique T",null,105.074,105.074,15,12.981060728736578,7.4839190296030642,"92 % closed Oblique T",null,105.14700000000001,105.14700000000001,15,13.852363848613924,5.7262554569917761,"92 % closed Inclined Y",null,105.14700000000001,105.14700000000001,15,13.852363848613924,5.7262554569917761,"92 % closed Oblique Y"]
[null,null,null,null,null,null,null,null,null,null,null,null,null,null,null,null,null,null,null,null,null,null,null,null,null,null,null,null,null,null,null,null,null,null,null,null,null,null,null,null,null,null,null,null,null,null,null,null,null,null,null,null,null,null,null,null,null,null,null,null,null,null,null,null,null,null,null,null,null,null,null,null,null,null,null,null,null,null,null,54.524000000000001,54.524000000000001,80,80,19.320005867261184,"52 % Closed  3/4 Constricted γ-dominant Y",69.983000000000004,69.983000000000004,55,55,27.657257476095864,"63 % Closed 1/2 Constricted γ-dominant Y",null,85.379000000000005,85.379000000000005,35,35,26.611836087506415,"74 % Closed 1/4 Constricted γ-dominant Y",null,null,null,null,null,"gref",null,null,108.57,108.57,10,8.9635172578528479,7.3161896040646015,"93 % closed orthogonal Y",null,null,null,108.283,108.283,10,9.3723441977912483,8.04585364268776,"93 % closed Semi-Orthogonal γ-Expanded Y",null,null,108.89,108.89,10,8.7323495715124277,6.135284523419303,"94 % closed Semi-Orthogonal γ-Compressed Y",null,null,108.941,108.941,10,7.9983318335166,7.1276300023946222,"94 % closed Semi-Orthogonal β-Compressed Y",109.17700000000001,109.17700000000001,10,7.929795086066906,6.0827467459434388,"94 % closed Semi-Oblique T",null,109.15,109.15,10,8.657500026310375,4.9952380898397966,"94 % closed Oblique T",null,109.19799999999999,109.19799999999999,10,9.2370736770524111,3.8226879712323329,"94 % closed Inclined Y",null,109.19799999999999,109.19799999999999,10,9.2370736770524111,3.8226879712323329,"94 % closed Oblique Y"]
[null,null,null,null,null,null,null,null,null,null,null,null,null,null,null,null,null,null,null,null,null,null,null,null,null,null,null,null,null,null,null,null,null,null,null,null,null,null,null,null,null,null,null,null,null,null,null,null,null,null,null,null,null,null,null,null,null,null,null,null,null,null,null,null,null,null,null,null,null,null,null,null,null,null,null,null,null,null,null,58.167000000000002,58.167000000000002,75,75,18.28826958610151,"55 % Closed  3/4 Constricted γ-dominant Y",74.239999999999995,74.239999999999995,50,50,25.272813245628111,"67 % Closed 1/2 Constricted γ-dominant Y",null,89.911000000000001,89.911000000000001,30,30,22.850757044085842,"78 % Closed 1/4 Constricted γ-dominant Y",null,{"$f":"IF(CW77=0,0.01,CW77)","v":39.012999999999998},{"$f":"ROUND((1/SQRT(3))*SQRT(($A$29-CX77)^2+($A$30-CY77)^2+($A$31-CZ77)^2),3)","v":39.012999999999998},120,60,60,"1/3 α-Expanded Arrow",null,112.93899999999999,112.93899999999999,5,4.4825981759890432,3.6597148179993053,"97 % closed orthogonal Y",null,null,null,112.794,112.794,5,4.6867151654603685,4.0242787693941109,"96 % closed Semi-Orthogonal γ-Expanded Y",null,null,113.1,113.1,5,4.3671628838032968,3.0694650078375281,"97 % closed Semi-Orthogonal γ-Compressed Y",null,null,113.124,113.124,5,4.0005389325619571,3.5654857353436116,"97 % closed Semi-Orthogonal β-Compressed Y",113.24299999999999,113.24299999999999,5,3.9663000342499974,3.043199107387653,"97 % closed Semi-Oblique T",null,113.23,113.23,5,4.3297833328684163,2.4994049733265769,"97 % closed Oblique T",null,113.253,113.253,5,4.619182867394156,1.9128989145919708,"97 % closed Inclined Y",null,113.253,113.253,5,4.619182867394156,1.9128989145919708,"97 % closed Oblique Y"]
[null,null,null,null,null,null,null,null,null,null,null,null,null,null,null,null,null,null,null,null,null,null,null,null,null,null,null,null,null,null,null,null,null,null,null,null,null,null,null,null,null,null,null,null,null,null,null,null,null,null,null,null,null,null,null,null,null,null,null,null,null,null,null,null,null,null,null,null,null,null,null,null,null,null,null,null,null,null,null,61.881999999999998,61.881999999999998,70,70,17.222965208854511,"58 % Closed  3/4 Constricted γ-dominant Y",78.510999999999996,78.510999999999996,45,45,22.850757044085842,"70 % Closed 1/2 Constricted γ-dominant Y",null,94.454999999999998,94.454999999999998,25,25,19.070656060063353,"81 % Closed 1/4 Constricted γ-dominant Y",null,{"$f":"IF(CW78=0,0.01,CW78)","v":45.69},{"$f":"ROUND((1/SQRT(3))*SQRT(($A$29-CX78)^2+($A$30-CY78)^2+($A$31-CZ78)^2),3)","v":45.69},{"$f":"2*DEGREES(ASIN(((SIN(RADIANS(CY78/2))*SIN(RADIANS($CX$77/2))/SIN(RADIANS($CY$77/2))))))","v":106.21668209760679},55,55,{"$f":"ROUND(100*($CY$77-CY78)/$CY$77,0)&\" % Closed 1/3 α-Expanded Arrow\"","v":"8 % Closed 1/3 α-Expanded Arrow"},null,{"$f":"IF(DD78=0,0.01,DD78)","v":117.312},{"$f":"ROUND((1/SQRT(3))*SQRT(($A$29-DE78)^2+($A$30-DF78)^2+($A$31-DG78)^2),3)","v":117.312},0,{"$f":"2*DEGREES(ASIN(((SIN(RADIANS(DE78/2))*SIN(RADIANS(60))/SIN(RADIANS(75))))))","v":0},{"$f":"2*DEGREES(ASIN(((SIN(RADIANS(DE78/2))*SIN(RADIANS(45))/SIN(RADIANS(75))))))","v":0},"closed arrow",null,null,null,117.312,117.312,0,0,0,"closed arrow",null,null,{"$f":"IF(DU78=0,0.01,DU78)","v":117.312},{"$f":"ROUND((1/SQRT(3))*SQRT(($A$29-DV78)^2+($A$30-DW78)^2+($A$31-DX78)^2),3)","v":117.312},0,0,0,"Closed Arrow",null,null,{"$f":"IF(EC78=0,0.01,EC78)","v":117.312},{"$f":"ROUND((1/SQRT(3))*SQRT(($A$29-ED78)^2+($A$30-EE78)^2+($A$31-EF78)^2),3)","v":117.312},0,{"$f":"2*DEGREES(ASIN(((SIN(RADIANS(ED78/2))*SIN(RADIANS($DW$2/2))/SIN(RADIANS($DV$2/2))))))","v":0},{"$f":"2*DEGREES(ASIN(((SIN(RADIANS(ED78/2))*SIN(RADIANS($DX$2/2))/SIN(RADIANS($DV$2/2))))))","v":0},"Closed Arrow",117.312,117.312,0,0,0,"Closed Arrow",null,117.312,117.312,0,0,0,"Closed Arrow",null,117.312,117.312,0,0,0,"Closed Arrow",null,117.312,117.312,0,0,0,"Closed Arrow"]
[null,null,null,null,null,null,null,null,null,null,null,null,null,null,null,null,null,null,null,null,null,null,null,null,null,null,null,null,null,null,null,null,null,null,null,null,null,null,null,null,null,null,null,null,null,null,null,null,null,null,null,null,null,null,null,null,null,null,null,null,null,null,null,null,null,null,null,null,null,null,null,null,null,null,null,null,null,null,null,65.655000000000001,65.655000000000001,65,65,16.126170212185233,"61 % Closed  3/4 Constricted γ-dominant Y",82.793000000000006,82.793000000000006,40,40,20.395099814522133,"73 % Closed 1/2 Constricted γ-dominant Y",null,99.01,99.01,20,20,15.274936453239512,"85 % Closed 1/4 Constricted γ-dominant Y",null,52.481000000000002,52.481000000000002,94.108026326238928,50,50,"17 % Closed 1/3 α-Expanded Arrow"]
[null,null,null,null,null,null,null,null,null,null,null,null,null,null,null,null,null,null,null,null,null,null,null,null,null,null,null,null,null,null,null,null,null,null,null,null,null,null,null,null,null,null,null,null,null,null,null,null,null,null,null,null,null,null,null,null,null,null,null,null,null,null,null,null,null,null,null,null,null,null,null,null,null,null,null,null,null,null,null,69.477000000000004,69.477000000000004,60,60,14.999999999999996,"64 % Closed  3/4 Constricted γ-dominant Y",87.085999999999999,87.085999999999999,35,35,17.90977814009403,"77 % Closed 1/2 Constricted γ-dominant Y",null,103.575,103.575,15,15,11.466872786548752,"89 % Closed 1/4 Constricted γ-dominant Y",null,59.231000000000002,59.231000000000002,83.031690523992452,45,45,"25 % Closed 1/3 α-Expanded Arrow"]
[null,null,null,null,null,null,null,null,null,null,null,null,null,null,null,null,null,null,null,null,null,null,null,null,null,null,null,null,null,null,null,null,null,null,null,null,null,null,null,null,null,null,null,null,null,null,null,null,null,null,null,null,null,null,null,null,null,null,null,null,null,null,null,null,null,null,null,null,null,null,null,null,null,null,null,null,null,null,null,73.34,73.34,55,55,13.846603601884439,"67 % Closed  3/4 Constricted γ-dominant Y",91.387,91.387,30,30,15.398659892761778,"80 % Closed 1/2 Constricted γ-dominant Y",null,108.148,108.148,10,10,7.6496382847547233,"93 % Closed 1/4 Constricted γ-dominant Y",null,65.903000000000006,65.903000000000006,72.654478997801846,40,40,"33 % Closed 1/3 α-Expanded Arrow"]
[null,null,null,null,null,null,null,null,null,null,null,null,null,null,null,null,null,null,null,null,null,null,null,null,null,null,null,null,null,null,null,null,null,null,null,null,null,null,null,null,null,null,null,null,null,null,null,null,null,null,null,null,null,null,null,null,null,null,null,null,null,null,null,null,null,null,null,null,null,null,null,null,null,null,null,null,null,null,null,77.238,77.238,50,50,12.668159672004487,"70 % Closed  3/4 Constricted γ-dominant Y",95.695999999999998,95.695999999999998,25,25,12.865550893824183,"83 % Closed 1/2 Constricted γ-dominant Y",null,112.727,112.727,5,5,3.8263311428008158,"96 % Closed 1/4 Constricted γ-dominant Y",null,72.494,72.494,62.776922163078581,35,35,"42 % Closed 1/3 α-Expanded Arrow"]
[null,null,null,null,null,null,null,null,null,null,null,null,null,null,null,null,null,null,null,null,null,null,null,null,null,null,null,null,null,null,null,null,null,null,null,null,null,null,null,null,null,null,null,null,null,null,null,null,null,null,null,null,null,null,null,null,null,null,null,null,null,null,null,null,null,null,null,null,null,null,null,null,null,null,null,null,null,null,null,81.165000000000006,81.165000000000006,45,45,11.466872786548755,"73 % Closed  3/4 Constricted γ-dominant Y",100.011,100.011,20,20,10.314202404802497,"87 % Closed 1/2 Constricted γ-dominant Y",null,117.312,117.312,0,0,0,"Closed Arrow",null,79.013000000000005,79.013000000000005,53.26775967487707,30,30,"50 % Closed 1/3 α-Expanded Arrow"]
[null,null,null,null,null,null,null,null,null,null,null,null,null,null,null,null,null,null,null,null,null,null,null,null,null,null,null,null,null,null,null,null,null,null,null,null,null,null,null,null,null,null,null,null,null,null,null,null,null,null,null,null,null,null,null,null,null,null,null,null,null,null,null,null,null,null,null,null,null,null,null,null,null,null,null,null,null,null,null,85.117999999999995,85.117999999999995,40,40,10.244970032409448,"76 % Closed  3/4 Constricted γ-dominant Y",104.331,104.331,15,15,7.7483192883067593,"90 % Closed 1/2 Constricted γ-dominant Y",null,null,null,null,null,"gref",null,null,85.472999999999999,85.472999999999999,44.03433746889128,25,25,"58 % Closed 1/3 α-Expanded Arrow"]
[null,null,null,null,null,null,null,null,null,null,null,null,null,null,null,null,null,null,null,null,null,null,null,null,null,null,null,null,null,null,null,null,null,null,null,null,null,null,null,null,null,null,null,null,null,null,null,null,null,null,null,null,null,null,null,null,null,null,null,null,null,null,null,null,null,null,null,null,null,null,null,null,null,null,null,null,null,null,null,89.091999999999999,89.091999999999999,35,35,9.0046978749406605,"79 % Closed  3/4 Constricted γ-dominant Y",108.655,108.655,10,10,5.1715686973306552,"93 % Closed 1/2 Constricted γ-dominant Y",null,14.212999999999999,{"$f":"ROUND((1/SQRT(3))*SQRT(($A$29-CQ85)^2+($A$30-CR85)^2+($A$31-CS85)^2),3)","v":14.212999999999999},135,135,90,"1/4 Constricted γ-dominant Y",null,91.885999999999996,91.885999999999996,35.007409507895602,20,20,"67 % Closed 1/3 α-Expanded Arrow"]
[null,null,null,null,null,null,null,null,null,null,null,null,null,null,null,null,null,null,null,null,null,null,null,null,null,null,null,null,null,null,null,null,null,null,null,null,null,null,null,null,null,null,null,null,null,null,null,null,null,null,null,null,null,null,null,null,null,null,null,null,null,null,null,null,null,null,null,null,null,null,null,null,null,null,null,null,null,null,null,93.085999999999999,93.085999999999999,30,30,7.7483192883067611,"82 % Closed  3/4 Constricted γ-dominant Y",112.982,112.982,5,5,2.5875891675126401,"97 % Closed 1/2 Constricted γ-dominant Y",null,14.598000000000001,14.598000000000001,{"$f":"2*DEGREES(ASIN(((SIN(RADIANS(CS86/2))*SIN(RADIANS($CQ$85/2))/SIN(RADIANS($CS$85/2))))))","v":123.93987505374177},{"$f":"2*DEGREES(ASIN(((SIN(RADIANS(CS86/2))*SIN(RADIANS($CR$85/2))/SIN(RADIANS($CS$85/2))))))","v":123.93987505374177},85,{"$f":"ROUND(100*($CR$85-CR86)/$CR$85,0)&\" % Closed 1/2 Constricted γ-dominant Y\"","v":"8 % Closed 1/2 Constricted γ-dominant Y"},null,98.265000000000001,98.265000000000001,26.132552665862221,15,15,"75 % Closed 1/3 α-Expanded Arrow"]
[null,null,null,null,null,null,null,null,null,null,null,null,null,null,null,null,null,null,null,null,null,null,null,null,null,null,null,null,null,null,null,null,null,null,null,null,null,null,null,null,null,null,null,null,null,null,null,null,null,null,null,null,null,null,null,null,null,null,null,null,null,null,null,null,null,null,null,null,null,null,null,null,null,null,null,null,null,null,null,97.094999999999999,97.094999999999999,25,25,6.4781111281362689,"85 % Closed  3/4 Constricted γ-dominant Y",117.312,117.312,0,0,{"$f":"2*DEGREES(ASIN(((SIN(RADIANS(CJ87/2))*SIN(RADIANS($CF$59/2))/SIN(RADIANS($CD$59/2))))))","v":0},"Closed Arrow",null,19.172999999999998,19.172999999999998,114.24698034697555,114.24698034697555,80,"15 % Closed 1/2 Constricted γ-dominant Y",null,104.622,104.622,17.3649165017566,10,10,"83 % Closed 1/3 α-Expanded Arrow"]
[null,null,null,null,null,null,null,null,null,null,null,null,null,null,null,null,null,null,null,null,null,null,null,null,null,null,null,null,null,null,null,null,null,null,null,null,null,null,null,null,null,null,null,null,null,null,null,null,null,null,null,null,null,null,null,null,null,null,null,null,null,null,null,null,null,null,null,null,null,null,null,null,null,null,null,null,null,null,null,101.11799999999999,101.11799999999999,20,20,5.1963617229135757,"88 % Closed  3/4 Constricted γ-dominant Y",null,null,null,null,"gref",null,null,25.15,25.15,105.38329600987615,105.38329600987615,75,"22 % Closed 1/2 Constricted γ-dominant Y",null,110.967,110.967,8.6657636494089747,5,5,"92 % Closed 1/3 α-Expanded Arrow"]
[null,null,null,null,null,null,null,null,null,null,null,null,null,null,null,null,null,null,null,null,null,null,null,null,null,null,null,null,null,null,null,null,null,null,null,null,null,null,null,null,null,null,null,null,null,null,null,null,null,null,null,null,null,null,null,null,null,null,null,null,null,null,null,null,null,null,null,null,null,null,null,null,null,null,null,null,null,null,null,105.152,105.152,15,15,3.9053686577510045,"91 % Closed  3/4 Constricted γ-dominant Y",18.492999999999999,{"$f":"ROUND((1/SQRT(3))*SQRT(($A$29-CJ89)^2+($A$30-CK89)^2+($A$31-CL89)^2),3)","v":18.492999999999999},150,150,60,"1/2 Constricted γ-dominant Y",null,31.488,31.488,97.079237607366366,97.079237607366366,70,"28 % Closed 1/2 Constricted γ-dominant Y",null,117.312,117.312,0,0,0,"Closed Arrow"]
[null,null,null,null,null,null,null,null,null,null,null,null,null,null,null,null,null,null,null,null,null,null,null,null,null,null,null,null,null,null,null,null,null,null,null,null,null,null,null,null,null,null,null,null,null,null,null,null,null,null,null,null,null,null,null,null,null,null,null,null,null,null,null,null,null,null,null,null,null,null,null,null,null,null,null,null,null,null,null,109.197,109.197,10,10,2.6074367218607453,"94 % Closed  3/4 Constricted γ-dominant Y",15.72,15.72,{"$f":"2*DEGREES(ASIN(((SIN(RADIANS(CL90/2))*SIN(RADIANS($CK$57/2))/SIN(RADIANS($CL$57/2))))))","v":126.25886414131578},{"$f":"2*DEGREES(ASIN(((SIN(RADIANS(CL90/2))*SIN(RADIANS($CK$57/2))/SIN(RADIANS($CL$57/2))))))","v":126.25886414131578},55,{"$f":"ROUND(100*($CK$57-CK90)/$CK$57,0)&\" % Closed 1/2 Constricted γ-dominant Y\"","v":"16 % Closed 1/2 Constricted γ-dominant Y"},null,37.883000000000003,37.883000000000003,89.177908032156452,89.177908032156452,65,"34 % Closed 1/2 Constricted γ-dominant Y",null,null,null,"Monoclinic ","Arrow","a-ref"]
[null,null,null,null,null,null,null,null,null,null,null,null,null,null,null,null,null,null,null,null,null,null,null,null,null,null,null,null,null,null,null,null,null,null,null,null,null,null,null,null,null,null,null,null,null,null,null,null,null,null,null,null,null,null,null,null,null,null,null,null,null,null,null,null,null,null,null,null,null,null,null,null,null,null,null,null,null,null,null,113.251,113.251,5,5,1.3048759891633379,"97 % Closed  3/4 Constricted γ-dominant Y",25.803000000000001,25.803000000000001,109.45915532125233,109.45915532125233,50,"27 % Closed 1/2 Constricted γ-dominant Y",null,44.246000000000002,44.246000000000002,81.578941881850582,81.578941881850582,60,"40 % Closed 1/2 Constricted γ-dominant Y",null,{"$f":"IF(CW91=0,0.01,CW91)","v":56.850999999999999},{"$f":"ROUND((1/SQRT(3))*SQRT(($A$29-CX91)^2+($A$30-CY91)^2+($A$31-CZ91)^2),3)","v":56.850999999999999},90,45,45,"Normal Arrow"]
[null,null,null,null,null,null,null,null,null,null,null,null,null,null,null,null,null,null,null,null,null,null,null,null,null,null,null,null,null,null,null,null,null,null,null,null,null,null,null,null,null,null,null,null,null,null,null,null,null,null,null,null,null,null,null,null,null,null,null,null,null,null,null,null,null,null,null,null,null,null,null,null,null,null,null,null,null,null,null,117.312,117.312,0,0,0,"Closed Arrow",36.554000000000002,36.554000000000002,95.34153427777261,95.34153427777261,45,"36 % Closed 1/2 Constricted γ-dominant Y",null,50.551000000000002,50.551000000000002,74.21374289215197,74.21374289215197,55,"45 % Closed 1/2 Constricted γ-dominant Y",null,{"$f":"IF(CW92=0,0.01,CW92)","v":59.8},{"$f":"ROUND((1/SQRT(3))*SQRT(($A$29-CX92)^2+($A$30-CY92)^2+($A$31-CZ92)^2),3)","v":59.8},85,{"$f":"2*DEGREES(ASIN(((SIN(RADIANS(CX92/2))*SIN(RADIANS($CY$91/2))/SIN(RADIANS($CX$91/2))))))","v":42.892322499291822},{"$f":"2*DEGREES(ASIN(((SIN(RADIANS(CX92/2))*SIN(RADIANS($CY$91/2))/SIN(RADIANS($CX$91/2))))))","v":42.892322499291822},{"$f":"ROUND(100*($CX$91-CX92)/$CX$91,0)&\" % Closed Normal Arrow\"","v":"6 % Closed Normal Arrow"}]
[null,null,null,null,null,null,null,null,null,null,null,null,null,null,null,null,null,null,null,null,null,null,null,null,null,null,null,null,null,null,null,null,null,null,null,null,null,null,null,null,null,null,null,null,null,null,null,null,null,null,null,null,null,null,null,null,null,null,null,null,null,null,null,null,null,null,null,null,null,null,null,null,null,null,null,null,null,null,null,null,null,null,null,"gref",null,46.762999999999998,46.762999999999998,82.711473721638171,82.711473721638171,40,"45 % Closed 1/2 Constricted γ-dominant Y",null,56.795999999999999,56.795999999999999,67.033036391480039,67.033036391480039,50,"50 % Closed 1/2 Constricted γ-dominant Y",null,62.832999999999998,62.832999999999998,80,40.714686980663799,40.714686980663799,"11 % Closed Normal Arrow"]
[null,null,null,null,null,null,null,null,null,null,null,null,null,null,null,null,null,null,null,null,null,null,null,null,null,null,null,null,null,null,null,null,null,null,null,null,null,null,null,null,null,null,null,null,null,null,null,null,null,null,null,null,null,null,null,null,null,null,null,null,null,null,null,null,null,null,null,null,null,null,null,null,null,null,null,null,null,null,null,37.174999999999997,{"$f":"ROUND((1/SQRT(3))*SQRT(($A$29-CD94)^2+($A$30-CE94)^2+($A$31-CF94)^2),3)","v":37.174999999999997},165,165,30,"3/4 Constricted γ-dominant Y",56.454999999999998,56.454999999999998,71.030411782764759,71.030411782764759,35,"53 % Closed 1/2 Constricted γ-dominant Y",null,62.984000000000002,62.984000000000002,60.000000000000021,60.000000000000021,45,"56 % Closed 1/2 Constricted γ-dominant Y",null,65.94,65.94,75,38.471922366237152,38.471922366237152,"17 % Closed Normal Arrow"]
[null,null,null,null,null,null,null,null,null,null,null,null,null,null,null,null,null,null,null,null,null,null,null,null,null,null,null,null,null,null,null,null,null,null,null,null,null,null,null,null,null,null,null,null,null,null,null,null,null,null,null,null,null,null,null,null,null,null,null,null,null,null,null,null,null,null,null,null,null,null,null,null,null,null,null,null,null,null,null,34.35,34.35,{"$f":"2*DEGREES(ASIN(((SIN(RADIANS(CF95/2))*SIN(RADIANS($CE$59/2))/SIN(RADIANS($CF$59/2))))))","v":112.01364338812986},{"$f":"2*DEGREES(ASIN(((SIN(RADIANS(CF95/2))*SIN(RADIANS($CE$59/2))/SIN(RADIANS($CF$59/2))))))","v":112.01364338812986},25,{"$f":"ROUND(100*($CF$59-CF95)/$CF$59,0)&\" % Closed 3/4 Constricted γ-dominant Y\"","v":"17 % Closed 3/4 Constricted γ-dominant Y"},65.742000000000004,65.742000000000004,60.000000000000007,60.000000000000007,30,"60 % Closed 1/2 Constricted γ-dominant Y",null,69.123999999999995,69.123999999999995,53.086195267082275,53.086195267082275,40,"61 % Closed 1/2 Constricted γ-dominant Y",null,69.111000000000004,69.111000000000004,70,36.168765111980896,36.168765111980896,"22 % Closed Normal Arrow"]
[null,null,null,null,null,null,null,null,null,null,null,null,null,null,null,null,null,null,null,null,null,null,null,null,null,null,null,null,null,null,null,null,null,null,null,null,null,null,null,null,null,null,null,null,null,null,null,null,null,null,null,null,null,null,null,null,null,null,null,null,null,null,null,null,null,null,null,null,null,null,null,null,null,null,null,null,null,null,null,52.098999999999997,52.098999999999997,83.393067126489925,83.393067126489925,20,{"$f":"ROUND(100*($CF$59-CF96)/$CF$59,0)&\" % Closed 3/4 Constricted γ-dominant Y\"","v":"33 % Closed 3/4 Constricted γ-dominant Y"},74.724000000000004,{"$f":"ROUND((1/SQRT(3))*SQRT(($A$29-CJ96)^2+($A$30-CK96)^2+($A$31-CL96)^2),3)","v":74.724000000000004},49.433067845881737,49.433067845881737,25,"67 % Closed 1/2 Constricted γ-dominant Y",null,75.221999999999994,75.221999999999994,46.269019375896484,46.269019375896484,35,"66 % Closed 1/2 Constricted γ-dominant Y",null,72.338999999999999,72.338999999999999,65,33.809851778823692,33.809851778823692,"28 % Closed Normal Arrow"]
[null,null,null,null,null,null,null,null,null,null,null,null,null,null,null,null,null,null,null,null,null,null,null,null,null,null,null,null,null,null,null,null,null,null,null,null,null,null,null,null,null,null,null,null,null,null,null,null,null,null,null,null,null,null,null,null,null,null,null,null,null,null,null,null,null,null,null,null,null,null,null,null,null,null,null,null,null,null,null,69.477000000000004,69.477000000000004,60.000000000000007,60.000000000000007,15,{"$f":"ROUND(100*($CF$59-CF97)/$CF$59,0)&\" % Closed 3/4 Constricted γ-dominant Y\"","v":"50 % Closed 3/4 Constricted γ-dominant Y"},83.477999999999994,83.477999999999994,39.201331865051039,39.201331865051039,20,"74 % Closed 1/2 Constricted γ-dominant Y",null,81.286000000000001,81.286000000000001,39.530033267516906,39.530033267516906,30,"71 % Closed 1/2 Constricted γ-dominant Y",null,75.619,75.619,60,31.399714809919047,31.399714809919047,"33 % Closed Normal Arrow"]
[null,null,null,null,null,null,null,null,null,null,null,null,null,null,null,null,null,null,null,null,null,null,null,null,null,null,null,null,null,null,null,null,null,null,null,null,null,null,null,null,null,null,null,null,null,null,null,null,null,null,null,null,null,null,null,null,null,null,null,null,null,null,null,null,null,null,null,null,null,null,null,null,null,null,null,null,null,null,null,85.906000000000006,85.906000000000006,39.00682968485264,39.00682968485264,10,{"$f":"ROUND(100*($CF$59-CF98)/$CF$59,0)&\" % Closed 3/4 Constricted γ-dominant Y\"","v":"67 % Closed 3/4 Constricted γ-dominant Y"},92.066999999999993,92.066999999999993,29.210406683729538,29.210406683729538,15,"81 % Closed 1/2 Constricted γ-dominant Y",null,87.322999999999993,{"$f":"ROUND((1/SQRT(3))*SQRT(($A$29-CQ98)^2+($A$30-CR98)^2+($A$31-CS98)^2),3)","v":87.322999999999993},32.85381986196326,32.85381986196326,25,"76 % Closed 1/2 Constricted γ-dominant Y",null,78.944000000000003,78.944000000000003,55,28.94278111886241,28.94278111886241,"39 % Closed Normal Arrow"]
[null,null,null,null,null,null,null,null,null,null,null,null,null,null,null,null,null,null,null,null,null,null,null,null,null,null,null,null,null,null,null,null,null,null,null,null,null,null,null,null,null,null,null,null,null,null,null,null,null,null,null,null,null,null,null,null,null,null,null,null,null,null,null,null,null,null,null,null,null,null,null,null,null,null,null,null,null,null,null,101.732,101.732,19.237401104307637,19.237401104307637,5,{"$f":"ROUND(100*($CF$59-CF99)/$CF$59,0)&\" % Closed 3/4 Constricted γ-dominant Y\"","v":"83 % Closed 3/4 Constricted γ-dominant Y"},100.541,100.541,19.386350351752242,19.386350351752242,10,"87 % Closed 1/2 Constricted γ-dominant Y",null,93.338999999999999,93.338999999999999,26.227175199496941,26.227175199496941,20,"81 % Closed 1/2 Constricted γ-dominant Y",null,82.308999999999997,82.308999999999997,50,26.443373110506329,26.443373110506329,"44 % Closed Normal Arrow"]
[null,null,null,null,null,null,null,null,null,null,null,null,null,null,null,null,null,null,null,null,null,null,null,null,null,null,null,null,null,null,null,null,null,null,null,null,null,null,null,null,null,null,null,null,null,null,null,null,null,null,null,null,null,null,null,null,null,null,null,null,null,null,null,null,null,null,null,null,null,null,null,null,null,null,null,null,null,null,null,117.312,117.312,0,0,0,"Closed Arrow",108.94199999999999,108.94199999999999,9.6676580152639158,9.6676580152639158,5,"94 % Closed 1/2 Constricted γ-dominant Y",null,99.34,99.34,19.638514637032518,19.638514637032518,15,"85 % Closed 1/2 Constricted γ-dominant Y",null,85.71,85.71,45,23.905711781403916,23.905711781403916,"50 % Closed Normal Arrow"]
[null,null,null,null,null,null,null,null,null,null,null,null,null,null,null,null,null,null,null,null,null,null,null,null,null,null,null,null,null,null,null,null,null,null,null,null,null,null,null,null,null,null,null,null,null,null,null,null,null,null,null,null,null,null,null,null,null,null,null,null,null,null,null,null,null,null,null,null,null,null,null,null,null,null,null,null,null,null,null,null,null,null,null,null,null,117.312,117.312,0,0,0,"Closed Arrow",null,105.33199999999999,105.33199999999999,13.077420435952011,13.077420435952011,10,"90 % Closed 1/2 Constricted γ-dominant Y",null,89.141999999999996,89.141999999999996,40,21.333921577508537,21.333921577508537,"56 % Closed Normal Arrow"]
[null,null,null,null,null,null,null,null,null,null,null,null,null,null,null,null,null,null,null,null,null,null,null,null,null,null,null,null,null,null,null,null,null,null,null,null,null,null,null,null,null,null,null,null,null,null,null,null,null,null,null,null,null,null,null,null,null,null,null,null,null,null,null,null,null,null,null,null,null,null,null,null,null,null,null,null,null,null,null,null,null,null,null,null,null,null,null,null,null,null,null,null,111.321,111.321,6.5342826120056801,6.5342826120056801,5,"95 % Closed 1/2 Constricted γ-dominant Y",null,92.600999999999999,92.600999999999999,35,18.732036719891795,18.732036719891795,"61 % Closed Normal Arrow"]
[null,null,null,null,null,null,null,null,null,null,null,null,null,null,null,null,null,null,null,null,null,null,null,null,null,null,null,null,null,null,null,null,null,null,null,null,null,null,null,null,null,null,null,null,null,null,null,null,null,null,null,null,null,null,null,null,null,null,null,null,null,null,null,null,null,null,null,null,null,null,null,null,null,null,null,null,null,null,null,null,null,null,null,null,null,null,null,null,null,null,null,null,117.312,117.312,0,0,0,"Closed Arrow",null,96.084000000000003,96.084000000000003,30,16.104008742827453,16.104008742827453,"67 % Closed Normal Arrow"]
[null,null,null,null,null,null,null,null,null,null,null,null,null,null,null,null,null,null,null,null,null,null,null,null,null,null,null,null,null,null,null,null,null,null,null,null,null,null,null,null,null,null,null,null,null,null,null,null,null,null,null,null,null,null,null,null,null,null,null,null,null,null,null,null,null,null,null,null,null,null,null,null,null,null,null,null,null,null,null,null,null,null,null,null,null,null,null,null,null,null,null,null,null,null,null,null,null,null,null,99.587000000000003,99.587000000000003,25,13.453715021068048,13.453715021068048,"72 % Closed Normal Arrow"]
[null,null,null,null,null,null,null,null,null,null,null,null,null,null,null,null,null,null,null,null,null,null,null,null,null,null,null,null,null,null,null,null,null,null,null,null,null,null,null,null,null,null,null,null,null,null,null,null,null,null,null,null,null,null,null,null,null,null,null,null,null,null,null,null,null,null,null,null,null,null,null,null,null,null,null,null,null,null,null,null,null,null,null,null,null,null,null,null,null,null,null,null,null,null,null,null,null,null,null,103.108,103.108,20,10.78496809339561,10.78496809339561,"78 % Closed Normal Arrow"]
[null,null,null,null,null,null,null,null,null,null,null,null,null,null,null,null,null,null,null,null,null,null,null,null,null,null,null,null,null,null,null,null,null,null,null,null,null,null,null,null,null,null,null,null,null,null,null,null,null,null,null,null,null,null,null,null,null,null,null,null,null,null,null,null,null,null,null,null,null,null,null,null,null,null,null,null,null,null,null,null,null,null,null,null,null,null,null,null,null,null,null,null,null,null,null,null,null,null,null,106.64400000000001,106.64400000000001,15,8.101525616793241,8.101525616793241,"83 % Closed Normal Arrow"]
[null,null,null,null,null,null,null,null,null,null,null,null,null,null,null,null,null,null,null,null,null,null,null,null,null,null,null,null,null,null,null,null,null,null,null,null,null,null,null,null,null,null,null,null,null,null,null,null,null,null,null,null,null,null,null,null,null,null,null,null,null,null,null,null,null,null,null,null,null,null,null,null,null,null,null,null,null,null,null,null,null,null,null,null,null,null,null,null,null,null,null,null,null,null,null,null,null,null,null,110.19199999999999,110.19199999999999,10,5.4071008093666348,5.4071008093666348,"89 % Closed Normal Arrow"]
[null,null,null,null,null,null,null,null,null,null,null,null,null,null,null,null,null,null,null,null,null,null,null,null,null,null,null,null,null,null,null,null,null,null,null,null,null,null,null,null,null,null,null,null,null,null,null,null,null,null,null,null,null,null,null,null,null,null,null,null,null,null,null,null,null,null,null,null,null,null,null,null,null,null,null,null,null,null,null,null,null,null,null,null,null,null,null,null,null,null,null,null,null,null,null,null,null,null,null,113.748,113.748,5,2.7053732601499019,2.7053732601499019,"94 % Closed Normal Arrow"]
[null,null,null,null,null,null,null,null,null,null,null,null,null,null,null,null,null,null,null,null,null,null,null,null,null,null,null,null,null,null,null,null,null,null,null,null,null,null,null,null,null,null,null,null,null,null,null,null,null,null,null,null,null,null,null,null,null,null,null,null,null,null,null,null,null,null,null,null,null,null,null,null,null,null,null,null,null,null,null,null,null,null,null,null,null,null,null,null,null,null,null,null,null,null,null,null,null,null,null,117.312,117.312,0,0,0,"Closed Arrow"]
[null,null,null,null,null,null,null,null,null,null,null,null,null,null,null,null,null,null,null,null,null,null,null,null,null,null,null,null,null,null,null,null,null,null,null,null,null,null,null,null,null,null,null,null,null,null,null,null,null,null,null,null,null,null,null,null,null,null,null,null,null,null,null,null,null,null,null,null,null,null,null,null,null,null,null,null,null,null,null,null,null,null,null,null,null,null,null,null,null,null,null,null,null,null,null,null,null,null,null,null,null,null,null,"b/g-ref"]
[null,null,null,null,null,null,null,null,null,null,null,null,null,null,null,null,null,null,null,null,null,null,null,null,null,null,null,null,null,null,null,null,null,null,null,null,null,null,null,null,null,null,null,null,null,null,null,null,null,null,null,null,null,null,null,null,null,null,null,null,null,null,null,null,null,null,null,null,null,null,null,null,null,null,null,null,null,null,null,null,null,null,null,null,null,null,null,null,null,null,null,null,null,null,null,null,null,null,null,{"$f":"IF(CW111=0,0.01,CW111)","v":56.850999999999999},{"$f":"ROUND((1/SQRT(3))*SQRT(($A$29-CX111)^2+($A$30-CY111)^2+($A$31-CZ111)^2),3)","v":56.850999999999999},90,45,45,"Normal Arrow"]
[null,null,null,null,null,null,null,null,null,null,null,null,null,null,null,null,null,null,null,null,null,null,null,null,null,null,null,null,null,null,null,null,null,null,null,null,null,null,null,null,null,null,null,null,null,null,null,null,null,null,null,null,null,null,null,null,null,null,null,null,null,null,null,null,null,null,null,null,null,null,null,null,null,null,null,null,null,null,null,null,null,null,null,null,null,null,null,null,null,null,null,null,null,null,null,null,null,null,null,{"$f":"IF(CW112=0,0.01,CW112)","v":63.825000000000003},{"$f":"ROUND((1/SQRT(3))*SQRT(($A$29-CX112)^2+($A$30-CY112)^2+($A$31-CZ112)^2),3)","v":63.825000000000003},{"$f":"2*DEGREES(ASIN(((SIN(RADIANS(CY112/2))*SIN(RADIANS($CX$111/2))/SIN(RADIANS($CY$111/2))))))","v":78.391352432419737},40,40,{"$f":"ROUND(100*($CY$111-CY112)/$CY$111,0)&\" % Closed Normal Arrow\"","v":"11 % Closed Normal Arrow"}]
[null,null,null,null,null,null,null,null,null,null,null,null,null,null,null,null,null,null,null,null,null,null,null,null,null,null,null,null,null,null,null,null,null,null,null,null,null,null,null,null,null,null,null,null,null,null,null,null,null,null,null,null,null,null,null,null,null,null,null,null,null,null,null,null,null,null,null,null,null,null,null,null,null,null,null,null,null,null,null,null,null,null,null,null,null,null,null,null,null,null,null,null,null,null,null,null,null,null,null,70.712999999999994,70.712999999999994,{"$f":"2*DEGREES(ASIN(((SIN(RADIANS(CY113/2))*SIN(RADIANS($CX$111/2))/SIN(RADIANS($CY$111/2))))))","v":67.508494479794791},35,35,{"$f":"ROUND(100*($CY$111-CY113)/$CY$111,0)&\" % Closed Normal Arrow\"","v":"22 % Closed Normal Arrow"}]
[null,null,null,null,null,null,null,null,null,null,null,null,null,null,null,null,null,null,null,null,null,null,null,null,null,null,null,null,null,null,null,null,null,null,null,null,null,null,null,null,null,null,null,null,null,null,null,null,null,null,null,null,null,null,null,null,null,null,null,null,null,null,null,null,null,null,null,null,null,null,null,null,null,null,null,null,null,null,null,null,null,null,null,null,null,null,null,null,null,null,null,null,null,null,null,null,null,null,null,77.516000000000005,77.516000000000005,57.140411696960335,30,30,"33 % Closed Normal Arrow"]
[null,null,null,null,null,null,null,null,null,null,null,null,null,null,null,null,null,null,null,null,null,null,null,null,null,null,null,null,null,null,null,null,null,null,null,null,null,null,null,null,null,null,null,null,null,null,null,null,null,null,null,null,null,null,null,null,null,null,null,null,null,null,null,null,null,null,null,null,null,null,null,null,null,null,null,null,null,null,null,null,null,null,null,null,null,null,null,null,null,null,null,null,null,null,null,null,null,null,null,84.245000000000005,84.245000000000005,47.147387318616993,25,25,"44 % Closed Normal Arrow"]
[null,null,null,null,null,null,null,null,null,null,null,null,null,null,null,null,null,null,null,null,null,null,null,null,null,null,null,null,null,null,null,null,null,null,null,null,null,null,null,null,null,null,null,null,null,null,null,null,null,null,null,null,null,null,null,null,null,null,null,null,null,null,null,null,null,null,null,null,null,null,null,null,null,null,null,null,null,null,null,null,null,null,null,null,null,null,null,null,null,null,null,null,null,null,null,null,null,null,null,90.917000000000002,90.917000000000002,37.429883335754376,20,20,"56 % Closed Normal Arrow"]
[null,null,null,null,null,null,null,null,null,null,null,null,null,null,null,null,null,null,null,null,null,null,null,null,null,null,null,null,null,null,null,null,null,null,null,null,null,null,null,null,null,null,null,null,null,null,null,null,null,null,null,null,null,null,null,null,null,null,null,null,null,null,null,null,null,null,null,null,null,null,null,null,null,null,null,null,null,null,null,null,null,null,null,null,null,null,null,null,null,null,null,null,null,null,null,null,null,null,null,97.543999999999997,97.543999999999997,27.912503502801226,15,15,"67 % Closed Normal Arrow"]
[null,null,null,null,null,null,null,null,null,null,null,null,null,null,null,null,null,null,null,null,null,null,null,null,null,null,null,null,null,null,null,null,null,null,null,null,null,null,null,null,null,null,null,null,null,null,null,null,null,null,null,null,null,null,null,null,null,null,null,null,null,null,null,null,null,null,null,null,null,null,null,null,null,null,null,null,null,null,null,null,null,null,null,null,null,null,null,null,null,null,null,null,null,null,null,null,null,null,null,104.143,104.143,18.534860061273001,10,10,"78 % Closed Normal Arrow"]
[null,null,null,null,null,null,null,null,null,null,null,null,null,null,null,null,null,null,null,null,null,null,null,null,null,null,null,null,null,null,null,null,null,null,null,null,null,null,null,null,null,null,null,null,null,null,null,null,null,null,null,null,null,null,null,null,null,null,null,null,null,null,null,null,null,null,null,null,null,null,null,null,null,null,null,null,null,null,null,null,null,null,null,null,null,null,null,null,null,null,null,null,null,null,null,null,null,null,null,110.727,110.727,9.2458928373323346,5,5,"89 % Closed Normal Arrow"]
[null,null,null,null,null,null,null,null,null,null,null,null,null,null,null,null,null,null,null,null,null,null,null,null,null,null,null,null,null,null,null,null,null,null,null,null,null,null,null,null,null,null,null,null,null,null,null,null,null,null,null,null,null,null,null,null,null,null,null,null,null,null,null,null,null,null,null,null,null,null,null,null,null,null,null,null,null,null,null,null,null,null,null,null,null,null,null,null,null,null,null,null,null,null,null,null,null,null,null,117.312,117.312,0,0,0,"Closed Arrow"]
[null,null,null,null,null,null,null,null,null,null,null,null,null,null,null,null,null,null,null,null,null,null,null,null,null,null,null,null,null,null,null,null,null,null,null,null,null,null,null,null,null,null,null,null,null,null,null,null,null,null,null,null,null,null,null,null,null,null,null,null,null,null,null,null,null,null,null,null,null,null,null,null,null,null,null,null,null,null,null,null,null,null,null,null,null,null,null,null,null,null,null,null,null,null,null,null,null,null,null,null,null,"Monoclinic ","Arrow","a-ref"]
[null,null,null,null,null,null,null,null,null,null,null,null,null,null,null,null,null,null,null,null,null,null,null,null,null,null,null,null,null,null,null,null,null,null,null,null,null,null,null,null,null,null,null,null,null,null,null,null,null,null,null,null,null,null,null,null,null,null,null,null,null,null,null,null,null,null,null,null,null,null,null,null,null,null,null,null,null,null,null,null,null,null,null,null,null,null,null,null,null,null,null,null,null,null,null,null,null,null,null,{"$f":"IF(CW122=0,0.01,CW122)","v":76.433000000000007},{"$f":"ROUND((1/SQRT(3))*SQRT(($A$29-CX122)^2+($A$30-CY122)^2+($A$31-CZ122)^2),3)","v":76.433000000000007},60,30,30,"1/3 α-Constricted Arrow"]
[null,null,null,null,null,null,null,null,null,null,null,null,null,null,null,null,null,null,null,null,null,null,null,null,null,null,null,null,null,null,null,null,null,null,null,null,null,null,null,null,null,null,null,null,null,null,null,null,null,null,null,null,null,null,null,null,null,null,null,null,null,null,null,null,null,null,null,null,null,null,null,null,null,null,null,null,null,null,null,null,null,null,null,null,null,null,null,null,null,null,null,null,null,null,null,null,null,null,null,{"$f":"IF(CW123=0,0.01,CW123)","v":79.686999999999998},{"$f":"ROUND((1/SQRT(3))*SQRT(($A$29-CX123)^2+($A$30-CY123)^2+($A$31-CZ123)^2),3)","v":79.686999999999998},55,{"$f":"2*DEGREES(ASIN(((SIN(RADIANS(CX123/2))*SIN(RADIANS($CY$122/2))/SIN(RADIANS($CX$122/2))))))","v":27.657257476095872},{"$f":"2*DEGREES(ASIN(((SIN(RADIANS(CX123/2))*SIN(RADIANS($CY$122/2))/SIN(RADIANS($CX$122/2))))))","v":27.657257476095872},{"$f":"ROUND(100*($CX$122-CX123)/$CX$122,0)&\" % Closed 1/3 α-Constricted Arrow\"","v":"8 % Closed 1/3 α-Constricted Arrow"}]
[null,null,null,null,null,null,null,null,null,null,null,null,null,null,null,null,null,null,null,null,null,null,null,null,null,null,null,null,null,null,null,null,null,null,null,null,null,null,null,null,null,null,null,null,null,null,null,null,null,null,null,null,null,null,null,null,null,null,null,null,null,null,null,null,null,null,null,null,null,null,null,null,null,null,null,null,null,null,null,null,null,null,null,null,null,null,null,null,null,null,null,null,null,null,null,null,null,null,null,82.980999999999995,82.980999999999995,50,{"$f":"2*DEGREES(ASIN(((SIN(RADIANS(CX124/2))*SIN(RADIANS($CY$122/2))/SIN(RADIANS($CX$122/2))))))","v":25.272813245628118},{"$f":"2*DEGREES(ASIN(((SIN(RADIANS(CX124/2))*SIN(RADIANS($CY$122/2))/SIN(RADIANS($CX$122/2))))))","v":25.272813245628118},{"$f":"ROUND(100*($CX$122-CX124)/$CX$122,0)&\" % Closed 1/3 α-Constricted Arrow\"","v":"17 % Closed 1/3 α-Constricted Arrow"}]
[null,null,null,null,null,null,null,null,null,null,null,null,null,null,null,null,null,null,null,null,null,null,null,null,null,null,null,null,null,null,null,null,null,null,null,null,null,null,null,null,null,null,null,null,null,null,null,null,null,null,null,null,null,null,null,null,null,null,null,null,null,null,null,null,null,null,null,null,null,null,null,null,null,null,null,null,null,null,null,null,null,null,null,null,null,null,null,null,null,null,null,null,null,null,null,null,null,null,null,86.311999999999998,86.311999999999998,45,22.850757044085849,22.850757044085849,"25 % Closed 1/3 α-Constricted Arrow"]
[null,null,null,null,null,null,null,null,null,null,null,null,null,null,null,null,null,null,null,null,null,null,null,null,null,null,null,null,null,null,null,null,null,null,null,null,null,null,null,null,null,null,null,null,null,null,null,null,null,null,null,null,null,null,null,null,null,null,null,null,null,null,null,null,null,null,null,null,null,null,null,null,null,null,null,null,null,null,null,null,null,null,null,null,null,null,null,null,null,null,null,null,null,null,null,null,null,null,null,89.674999999999997,89.674999999999997,40,20.395099814522137,20.395099814522137,"33 % Closed 1/3 α-Constricted Arrow"]
[null,null,null,null,null,null,null,null,null,null,null,null,null,null,null,null,null,null,null,null,null,null,null,null,null,null,null,null,null,null,null,null,null,null,null,null,null,null,null,null,null,null,null,null,null,null,null,null,null,null,null,null,null,null,null,null,null,null,null,null,null,null,null,null,null,null,null,null,null,null,null,null,null,null,null,null,null,null,null,null,null,null,null,null,null,null,null,null,null,null,null,null,null,null,null,null,null,null,null,93.064999999999998,93.064999999999998,35,17.909778140094037,17.909778140094037,"42 % Closed 1/3 α-Constricted Arrow"]
[null,null,null,null,null,null,null,null,null,null,null,null,null,null,null,null,null,null,null,null,null,null,null,null,null,null,null,null,null,null,null,null,null,null,null,null,null,null,null,null,null,null,null,null,null,null,null,null,null,null,null,null,null,null,null,null,null,null,null,null,null,null,null,null,null,null,null,null,null,null,null,null,null,null,null,null,null,null,null,null,null,null,null,null,null,null,null,null,null,null,null,null,null,null,null,null,null,null,null,96.480999999999995,96.480999999999995,30,15.398659892761781,15.398659892761781,"50 % Closed 1/3 α-Constricted Arrow"]
[null,null,null,null,null,null,null,null,null,null,null,null,null,null,null,null,null,null,null,null,null,null,null,null,null,null,null,null,null,null,null,null,null,null,null,null,null,null,null,null,null,null,null,null,null,null,null,null,null,null,null,null,null,null,null,null,null,null,null,null,null,null,null,null,null,null,null,null,null,null,null,null,null,null,null,null,null,null,null,null,null,null,null,null,null,null,null,null,null,null,null,null,null,null,null,null,null,null,null,99.917000000000002,99.917000000000002,25,12.865550893824185,12.865550893824185,"58 % Closed 1/3 α-Constricted Arrow"]
[null,null,null,null,null,null,null,null,null,null,null,null,null,null,null,null,null,null,null,null,null,null,null,null,null,null,null,null,null,null,null,null,null,null,null,null,null,null,null,null,null,null,null,null,null,null,null,null,null,null,null,null,null,null,null,null,null,null,null,null,null,null,null,null,null,null,null,null,null,null,null,null,null,null,null,null,null,null,null,null,null,null,null,null,null,null,null,null,null,null,null,null,null,null,null,null,null,null,null,103.371,103.371,20,10.314202404802501,10.314202404802501,"67 % Closed 1/3 α-Constricted Arrow"]
[null,null,null,null,null,null,null,null,null,null,null,null,null,null,null,null,null,null,null,null,null,null,null,null,null,null,null,null,null,null,null,null,null,null,null,null,null,null,null,null,null,null,null,null,null,null,null,null,null,null,null,null,null,null,null,null,null,null,null,null,null,null,null,null,null,null,null,null,null,null,null,null,null,null,null,null,null,null,null,null,null,null,null,null,null,null,null,null,null,null,null,null,null,null,null,null,null,null,null,106.84099999999999,106.84099999999999,15,7.7483192883067629,7.7483192883067629,"75 % Closed 1/3 α-Constricted Arrow"]
[null,null,null,null,null,null,null,null,null,null,null,null,null,null,null,null,null,null,null,null,null,null,null,null,null,null,null,null,null,null,null,null,null,null,null,null,null,null,null,null,null,null,null,null,null,null,null,null,null,null,null,null,null,null,null,null,null,null,null,null,null,null,null,null,null,null,null,null,null,null,null,null,null,null,null,null,null,null,null,null,null,null,null,null,null,null,null,null,null,null,null,null,null,null,null,null,null,null,null,110.322,110.322,10,5.1715686973306569,5.1715686973306569,"83 % Closed 1/3 α-Constricted Arrow"]
[null,null,null,null,null,null,null,null,null,null,null,null,null,null,null,null,null,null,null,null,null,null,null,null,null,null,null,null,null,null,null,null,null,null,null,null,null,null,null,null,null,null,null,null,null,null,null,null,null,null,null,null,null,null,null,null,null,null,null,null,null,null,null,null,null,null,null,null,null,null,null,null,null,null,null,null,null,null,null,null,null,null,null,null,null,null,null,null,null,null,null,null,null,null,null,null,null,null,null,113.813,113.813,5,2.587589167512641,2.587589167512641,"92 % Closed 1/3 α-Constricted Arrow"]
[null,null,null,null,null,null,null,null,null,null,null,null,null,null,null,null,null,null,null,null,null,null,null,null,null,null,null,null,null,null,null,null,null,null,null,null,null,null,null,null,null,null,null,null,null,null,null,null,null,null,null,null,null,null,null,null,null,null,null,null,null,null,null,null,null,null,null,null,null,null,null,null,null,null,null,null,null,null,null,null,null,null,null,null,null,null,null,null,null,null,null,null,null,null,null,null,null,null,null,117.312,117.312,0,0,0,"Closed Arrow"]
[null,null,null,null,null,null,null,null,null,null,null,null,null,null,null,null,null,null,null,null,null,null,null,null,null,null,null,null,null,null,null,null,null,null,null,null,null,null,null,null,null,null,null,null,null,null,null,null,null,null,null,null,null,null,null,null,null,null,null,null,null,null,null,null,null,null,null,null,null,null,null,null,null,null,null,null,null,null,null,null,null,null,null,null,null,null,null,null,null,null,null,null,null,null,null,null,null,null,null,null,null,null,null,"gref"]
[null,null,null,null,null,null,null,null,null,null,null,null,null,null,null,null,null,null,null,null,null,null,null,null,null,null,null,null,null,null,null,null,null,null,null,null,null,null,null,null,null,null,null,null,null,null,null,null,null,null,null,null,null,null,null,null,null,null,null,null,null,null,null,null,null,null,null,null,null,null,null,null,null,null,null,null,null,null,null,null,null,null,null,null,null,null,null,null,null,null,null,null,null,null,null,null,null,null,null,{"$f":"IF(CW136=0,0.01,CW136)","v":76.433000000000007},{"$f":"ROUND((1/SQRT(3))*SQRT(($A$29-CX136)^2+($A$30-CY136)^2+($A$31-CZ136)^2),3)","v":76.433000000000007},60,30,30,"1/3 α-Constricted Arrow"]
[null,null,null,null,null,null,null,null,null,null,null,null,null,null,null,null,null,null,null,null,null,null,null,null,null,null,null,null,null,null,null,null,null,null,null,null,null,null,null,null,null,null,null,null,null,null,null,null,null,null,null,null,null,null,null,null,null,null,null,null,null,null,null,null,null,null,null,null,null,null,null,null,null,null,null,null,null,null,null,null,null,null,null,null,null,null,null,null,null,null,null,null,null,null,null,null,null,null,null,{"$f":"IF(CW137=0,0.01,CW137)","v":83.356999999999999},{"$f":"ROUND((1/SQRT(3))*SQRT(($A$29-CX137)^2+($A$30-CY137)^2+($A$31-CZ137)^2),3)","v":83.356999999999999},{"$f":"2*DEGREES(ASIN(((SIN(RADIANS(CY137/2))*SIN(RADIANS($CX$136/2))/SIN(RADIANS($CY$136/2))))))","v":49.433067845881716},25,25,{"$f":"ROUND(100*($CY$136-CY137)/$CY$136,0)&\" % Closed 1/3 α-Constricted Arrow\"","v":"17 % Closed 1/3 α-Constricted Arrow"}]
[null,null,null,null,null,null,null,null,null,null,null,null,null,null,null,null,null,null,null,null,null,null,null,null,null,null,null,null,null,null,null,null,null,null,null,null,null,null,null,null,null,null,null,null,null,null,null,null,null,null,null,null,null,null,null,null,null,null,null,null,null,null,null,null,null,null,null,null,null,null,null,null,null,null,null,null,null,null,null,null,null,null,null,null,null,null,null,null,null,null,null,null,null,null,null,null,null,null,null,90.213999999999999,90.213999999999999,{"$f":"2*DEGREES(ASIN(((SIN(RADIANS(CY138/2))*SIN(RADIANS($CX$136/2))/SIN(RADIANS($CY$136/2))))))","v":39.201331865051031},20,20,{"$f":"ROUND(100*($CY$136-CY138)/$CY$136,0)&\" % Closed 1/3 α-Constricted Arrow\"","v":"33 % Closed 1/3 α-Constricted Arrow"}]
[null,null,null,null,null,null,null,null,null,null,null,null,null,null,null,null,null,null,null,null,null,null,null,null,null,null,null,null,null,null,null,null,null,null,null,null,null,null,null,null,null,null,null,null,null,null,null,null,null,null,null,null,null,null,null,null,null,null,null,null,null,null,null,null,null,null,null,null,null,null,null,null,null,null,null,null,null,null,null,null,null,null,null,null,null,null,null,null,null,null,null,null,null,null,null,null,null,null,null,97.022000000000006,97.022000000000006,29.210406683729524,15,15,"50 % Closed 1/3 α-Constricted Arrow"]
[null,null,null,null,null,null,null,null,null,null,null,null,null,null,null,null,null,null,null,null,null,null,null,null,null,null,null,null,null,null,null,null,null,null,null,null,null,null,null,null,null,null,null,null,null,null,null,null,null,null,null,null,null,null,null,null,null,null,null,null,null,null,null,null,null,null,null,null,null,null,null,null,null,null,null,null,null,null,null,null,null,null,null,null,null,null,null,null,null,null,null,null,null,null,null,null,null,null,null,103.79600000000001,103.79600000000001,19.386350351752238,10,10,"67 % Closed 1/3 α-Constricted Arrow"]
[null,null,null,null,null,null,null,null,null,null,null,null,null,null,null,null,null,null,null,null,null,null,null,null,null,null,null,null,null,null,null,null,null,null,null,null,null,null,null,null,null,null,null,null,null,null,null,null,null,null,null,null,null,null,null,null,null,null,null,null,null,null,null,null,null,null,null,null,null,null,null,null,null,null,null,null,null,null,null,null,null,null,null,null,null,null,null,null,null,null,null,null,null,null,null,null,null,null,null,110.554,110.554,9.667658015263914,5,5,"83 % Closed 1/3 α-Constricted Arrow"]
[null,null,null,null,null,null,null,null,null,null,null,null,null,null,null,null,null,null,null,null,null,null,null,null,null,null,null,null,null,null,null,null,null,null,null,null,null,null,null,null,null,null,null,null,null,null,null,null,null,null,null,null,null,null,null,null,null,null,null,null,null,null,null,null,null,null,null,null,null,null,null,null,null,null,null,null,null,null,null,null,null,null,null,null,null,null,null,null,null,null,null,null,null,null,null,null,null,null,null,117.312,117.312,{"$f":"2*DEGREES(ASIN(((SIN(RADIANS(CY142/2))*SIN(RADIANS($CX$136/2))/SIN(RADIANS($CY$136/2))))))","v":0},0,0,"Closed Arrow"]
[null,null,null,null,null,null,null,null,null,null,null,null,null,null,null,null,null,null,null,null,null,null,null,null,null,null,null,null,null,null,null,null,null,null,null,null,null,null,null,null,null,null,null,null,null,null,null,null,null,null,null,null,null,null,null,null,null,null,null,null,null,null,null,null,null,null,null,null,null,null,null,null,null,null,null,null,null,null,null,null,null,null,null,null,null,null,null,null,null,null,null,null,null,null,null,null,null,null,null,null,null,"Monoclinic ","Arrow","a-ref"]
[null,null,null,null,null,null,null,null,null,null,null,null,null,null,null,null,null,null,null,null,null,null,null,null,null,null,null,null,null,null,null,null,null,null,null,null,null,null,null,null,null,null,null,null,null,null,null,null,null,null,null,null,null,null,null,null,null,null,null,null,null,null,null,null,null,null,null,null,null,null,null,null,null,null,null,null,null,null,null,null,null,null,null,null,null,null,null,null,null,null,null,null,null,null,null,null,null,null,null,{"$f":"IF(CW144=0,0.01,CW144)","v":96.706000000000003},{"$f":"ROUND((1/SQRT(3))*SQRT(($A$29-CX144)^2+($A$30-CY144)^2+($A$31-CZ144)^2),3)","v":96.706000000000003},30,15,15,"2/3 α-Constricted Arrow"]
[null,null,null,null,null,null,null,null,null,null,null,null,null,null,null,null,null,null,null,null,null,null,null,null,null,null,null,null,null,null,null,null,null,null,null,null,null,null,null,null,null,null,null,null,null,null,null,null,null,null,null,null,null,null,null,null,null,null,null,null,null,null,null,null,null,null,null,null,null,null,null,null,null,null,null,null,null,null,null,null,null,null,null,null,null,null,null,null,null,null,null,null,null,null,null,null,null,null,null,{"$f":"IF(CW145=0,0.01,CW145)","v":100.104},{"$f":"ROUND((1/SQRT(3))*SQRT(($A$29-CX145)^2+($A$30-CY145)^2+($A$31-CZ145)^2),3)","v":100.104},25,{"$f":"2*DEGREES(ASIN(((SIN(RADIANS(CX145/2))*SIN(RADIANS($CY$144/2))/SIN(RADIANS($CX$144/2))))))","v":12.533056880346878},{"$f":"2*DEGREES(ASIN(((SIN(RADIANS(CX145/2))*SIN(RADIANS($CY$144/2))/SIN(RADIANS($CX$144/2))))))","v":12.533056880346878},{"$f":"ROUND(100*($CX$144-CX145)/$CX$144,0)&\" % Closed 2/3 α-Constricted Arrow\"","v":"17 % Closed 2/3 α-Constricted Arrow"}]
[null,null,null,null,null,null,null,null,null,null,null,null,null,null,null,null,null,null,null,null,null,null,null,null,null,null,null,null,null,null,null,null,null,null,null,null,null,null,null,null,null,null,null,null,null,null,null,null,null,null,null,null,null,null,null,null,null,null,null,null,null,null,null,null,null,null,null,null,null,null,null,null,null,null,null,null,null,null,null,null,null,null,null,null,null,null,null,null,null,null,null,null,null,null,null,null,null,null,null,103.52,103.52,20,{"$f":"2*DEGREES(ASIN(((SIN(RADIANS(CX146/2))*SIN(RADIANS($CY$144/2))/SIN(RADIANS($CX$144/2))))))","v":10.048031096407087},{"$f":"2*DEGREES(ASIN(((SIN(RADIANS(CX146/2))*SIN(RADIANS($CY$144/2))/SIN(RADIANS($CX$144/2))))))","v":10.048031096407087},{"$f":"ROUND(100*($CX$144-CX146)/$CX$144,0)&\" % Closed 2/3 α-Constricted Arrow\"","v":"33 % Closed 2/3 α-Constricted Arrow"}]
[null,null,null,null,null,null,null,null,null,null,null,null,null,null,null,null,null,null,null,null,null,null,null,null,null,null,null,null,null,null,null,null,null,null,null,null,null,null,null,null,null,null,null,null,null,null,null,null,null,null,null,null,null,null,null,null,null,null,null,null,null,null,null,null,null,null,null,null,null,null,null,null,null,null,null,null,null,null,null,null,null,null,null,null,null,null,null,null,null,null,null,null,null,null,null,null,null,null,null,106.952,106.952,15,7.5485906419743305,7.5485906419743305,"50 % Closed 2/3 α-Constricted Arrow"]
[null,null,null,null,null,null,null,null,null,null,null,null,null,null,null,null,null,null,null,null,null,null,null,null,null,null,null,null,null,null,null,null,null,null,null,null,null,null,null,null,null,null,null,null,null,null,null,null,null,null,null,null,null,null,null,null,null,null,null,null,null,null,null,null,null,null,null,null,null,null,null,null,null,null,null,null,null,null,null,null,null,null,null,null,null,null,null,null,null,null,null,null,null,null,null,null,null,null,null,110.396,110.396,10,5.0383694806402159,5.0383694806402159,"67 % Closed 2/3 α-Constricted Arrow"]
[null,null,null,null,null,null,null,null,null,null,null,null,null,null,null,null,null,null,null,null,null,null,null,null,null,null,null,null,null,null,null,null,null,null,null,null,null,null,null,null,null,null,null,null,null,null,null,null,null,null,null,null,null,null,null,null,null,null,null,null,null,null,null,null,null,null,null,null,null,null,null,null,null,null,null,null,null,null,null,null,null,null,null,null,null,null,null,null,null,null,null,null,null,null,null,null,null,null,null,113.85,113.85,5,2.5209757055071087,2.5209757055071087,"83 % Closed 2/3 α-Constricted Arrow"]
[null,null,null,null,null,null,null,null,null,null,null,null,null,null,null,null,null,null,null,null,null,null,null,null,null,null,null,null,null,null,null,null,null,null,null,null,null,null,null,null,null,null,null,null,null,null,null,null,null,null,null,null,null,null,null,null,null,null,null,null,null,null,null,null,null,null,null,null,null,null,null,null,null,null,null,null,null,null,null,null,null,null,null,null,null,null,null,null,null,null,null,null,null,null,null,null,null,null,null,117.312,117.312,0,0,0,"Closed Arrow"]
[null,null,null,null,null,null,null,null,null,null,null,null,null,null,null,null,null,null,null,null,null,null,null,null,null,null,null,null,null,null,null,null,null,null,null,null,null,null,null,null,null,null,null,null,null,null,null,null,null,null,null,null,null,null,null,null,null,null,null,null,null,null,null,null,null,null,null,null,null,null,null,null,null,null,null,null,null,null,null,null,null,null,null,null,null,null,null,null,null,null,null,null,null,null,null,null,null,null,null,null,null,null,null,"b/g-ref"]
[null,null,null,null,null,null,null,null,null,null,null,null,null,null,null,null,null,null,null,null,null,null,null,null,null,null,null,null,null,null,null,null,null,null,null,null,null,null,null,null,null,null,null,null,null,null,null,null,null,null,null,null,null,null,null,null,null,null,null,null,null,null,null,null,null,null,null,null,null,null,null,null,null,null,null,null,null,null,null,null,null,null,null,null,null,null,null,null,null,null,null,null,null,null,null,null,null,null,null,{"$f":"IF(CW152=0,0.01,CW152)","v":96.706000000000003},{"$f":"ROUND((1/SQRT(3))*SQRT(($A$29-CX152)^2+($A$30-CY152)^2+($A$31-CZ152)^2),3)","v":96.706000000000003},30,15,15,"2/3 α-Constricted Arrow"]
[null,null,null,null,null,null,null,null,null,null,null,null,null,null,null,null,null,null,null,null,null,null,null,null,null,null,null,null,null,null,null,null,null,null,null,null,null,null,null,null,null,null,null,null,null,null,null,null,null,null,null,null,null,null,null,null,null,null,null,null,null,null,null,null,null,null,null,null,null,null,null,null,null,null,null,null,null,null,null,null,null,null,null,null,null,null,null,null,null,null,null,null,null,null,null,null,null,null,null,{"$f":"IF(CW153=0,0.01,CW153)","v":103.586},{"$f":"ROUND((1/SQRT(3))*SQRT(($A$29-CX153)^2+($A$30-CY153)^2+($A$31-CZ153)^2),3)","v":103.586},{"$f":"2*DEGREES(ASIN(((SIN(RADIANS(CY153/2))*SIN(RADIANS($CX$152/2))/SIN(RADIANS($CY$152/2))))))","v":19.903667303317292},10,10,{"$f":"ROUND(100*($CY$152-CY153)/$CY$152,0)&\" % Closed 2/3 α-Constricted Arrow\"","v":"33 % Closed 2/3 α-Constricted Arrow"}]
[null,null,null,null,null,null,null,null,null,null,null,null,null,null,null,null,null,null,null,null,null,null,null,null,null,null,null,null,null,null,null,null,null,null,null,null,null,null,null,null,null,null,null,null,null,null,null,null,null,null,null,null,null,null,null,null,null,null,null,null,null,null,null,null,null,null,null,null,null,null,null,null,null,null,null,null,null,null,null,null,null,null,null,null,null,null,null,null,null,null,null,null,null,null,null,null,null,null,null,110.449,110.449,{"$f":"2*DEGREES(ASIN(((SIN(RADIANS(CY154/2))*SIN(RADIANS($CX$152/2))/SIN(RADIANS($CY$152/2))))))","v":9.9237023945752547},5,5,{"$f":"ROUND(100*($CY$152-CY154)/$CY$152,0)&\" % Closed 2/3 α-Constricted Arrow\"","v":"67 % Closed 2/3 α-Constricted Arrow"}]
[null,null,null,null,null,null,null,null,null,null,null,null,null,null,null,null,null,null,null,null,null,null,null,null,null,null,null,null,null,null,null,null,null,null,null,null,null,null,null,null,null,null,null,null,null,null,null,null,null,null,null,null,null,null,null,null,null,null,null,null,null,null,null,null,null,null,null,null,null,null,null,null,null,null,null,null,null,null,null,null,null,null,null,null,null,null,null,null,null,null,null,null,null,null,null,null,null,null,null,117.312,117.312,{"$f":"2*DEGREES(ASIN(((SIN(RADIANS(CY155/2))*SIN(RADIANS($CX$152/2))/SIN(RADIANS($CY$152/2))))))","v":0},0,0,"Closed Arrow"]