##TITLE=	R8
##JCAMPDX=	6.0	$$ NMR Plug-in v.1.10 of MestReNova 9.0.0-12821
##DATATYPE=	LINK
##BLOCKS=	2
##ORIGIN=	Bruker BioSpin GmbH
##OWNER=	nmrsu
##TITLE=	R8
##JCAMPDX=	6.0	$$ NMR Plug-in 1.10 of MestReNova 9.0.0-12821
##BLOCKID=	1
##DATATYPE=	NMRSPECTRUM
##DATACLASS=	XYDATA
##NUMDIM=	1
##ORIGIN=	Bruker BioSpin GmbH
##OWNER=	nmrsu
##.OBSERVEFREQUENCY=	400.029998779296875
##.OBSERVENUCLEUS=	^1H
##.SOLVENTNAME=	CDCl3
##.PULSESEQUENCE=	zg30
##LONGDATE=	2014/05/01 13:32:00.000
##.ACQUISITIONMODE=	SIMULTANEOUS (DQD)
##$ORIGINALFORMAT=	Bruker XWIN-NMR
##$PARAMETERFILE=	(acqus, ASCII, C:/Users/Administrator/Desktop/1/20140502LV/R8/1/acqus, 0)
$$ ##TITLE= Parameter file, TOPSPIN		Version 3.2
$$ ##JCAMPDX= 5.0
$$ ##DATATYPE= Parameter Values
$$ ##NPOINTS= 11	$$ modification sequence number
$$ ##ORIGIN= Bruker BioSpin GmbH
$$ ##OWNER= nmrsu
$$ $$ 2014-05-01 13:32:13.422 +0800  nmrsu@CZC2222X4G
$$ $$ D:/data/xu/nmr/R8/1/acqus
$$ $$ process C:\Bruker\TOPSPIN\prog\mod\shimcntl.exe
$$ ##$ACQT0= -1.94957977583428
$$ ##$AMP= (0..31)
$$ 100 100 100 100 100 100 100 100 100 100 100 100 100 100 100 100 100 100
$$ 100 100 100 100 100 100 100 100 100 100 100 100 100 100
$$ ##$AMPCOIL= (0..19)
$$ 0 0 0 0 0 0 0 0 0 0 0 0 0 0 0 0 0 0 0 0
$$ ##$ANAVPT= -1
$$ ##$AQSEQ= 0
$$ ##$AQ_mod= 3
$$ ##$AUNM= <au_zg>
$$ ##$AUTOPOS= <7 >
$$ ##$BF1= 400.03
$$ ##$BF2= 400.03
$$ ##$BF3= 400.03
$$ ##$BF4= 400.03
$$ ##$BF5= 400.03
$$ ##$BF6= 400.03
$$ ##$BF7= 400.03
$$ ##$BF8= 400.03
$$ ##$BYTORDA= 0
$$ ##$CAGPARS= (0..11)
$$ 0 0 0 0 0 0 0 0 0 0 0 0
$$ ##$CFDGTYP= 0
$$ ##$CFRGTYP= 9
$$ ##$CHEMSTR= <none>
$$ ##$CNST= (0..63)
$$ 1 1 1 1 1 1 1 1 1 1 1 1 1 1 1 1 1 1 1 1 1 1 1 1 1 1 1 1 1 1 1 1 1 1 1 1
$$ 1 1 1 1 1 1 1 1 1 1 1 1 1 1 1 1 1 1 1 1 1 1 1 1 1 1 1 1
$$ ##$CPDPRG= (0..8)
$$ <> <> <> <> <> <> <> <> <>
$$ ##$D= (0..63)
$$ 0 1 0 0 0 0 0 0 0 0 0 0 0 0 0 0 0.0002 0 0 0 0 0 0 0 0 0 0 0 0 0 0 0 0
$$ 0 0 0 0 0 0 0 0 0 0 0 0 0 0 0 0 0 0 0 0 0 0 0 0 0 0 0 0 0 0 0
$$ ##$DATE= 1398922332
$$ ##$DE= 6.5
$$ ##$DECBNUC= <off>
$$ ##$DECIM= 2496
$$ ##$DECNUC= <off>
$$ ##$DECSTAT= 4
$$ ##$DIGMOD= 1
$$ ##$DIGTYP= 12
$$ ##$DQDMODE= 0
$$ ##$DR= 22
$$ ##$DS= 0
$$ ##$DSPFIRM= 0
$$ ##$DSPFVS= 20
$$ ##$DTYPA= 0
$$ ##$EXP= <PROTON-8>
$$ ##$F1LIST= <>
$$ ##$F2LIST= <>
$$ ##$F3LIST= <>
$$ ##$FCUCHAN= (0..9)
$$ 0 2 0 0 0 0 0 0 0 0
$$ ##$FL1= 90
$$ ##$FL2= 90
$$ ##$FL3= 90
$$ ##$FL4= 90
$$ ##$FOV= 20
$$ ##$FQ1LIST= <>
$$ ##$FQ2LIST= <>
$$ ##$FQ3LIST= <>
$$ ##$FQ4LIST= <>
$$ ##$FQ5LIST= <>
$$ ##$FQ6LIST= <>
$$ ##$FQ7LIST= <>
$$ ##$FQ8LIST= <>
$$ ##$FRQLO3= 16627.9599999785
$$ ##$FRQLO3N= 2
$$ ##$FS= (0..7)
$$ 83 83 83 83 83 83 83 83
$$ ##$FTLPGN= 0
$$ ##$FW= 125000
$$ ##$FnMODE= 0
$$ ##$FnTYPE= 0
$$ ##$GPNAM= (0..31)
$$ <> <> <> <> <> <> <> <> <> <> <> <> <> <> <> <> <> <> <> <> <> <> <> <>
$$ <> <> <> <> <> <> <> <>
$$ ##$GPX= (0..31)
$$ 0 0 0 0 0 0 0 0 0 0 0 0 0 0 0 0 0 0 0 0 0 0 0 0 0 0 0 0 0 0 0 0
$$ ##$GPY= (0..31)
$$ 0 0 0 0 0 0 0 0 0 0 0 0 0 0 0 0 0 0 0 0 0 0 0 0 0 0 0 0 0 0 0 0
$$ ##$GPZ= (0..31)
$$ [...]
$$ 130000 130000 130000 130000 130000 130000 130000 130000 130000 130000 130000
$$ 130000 130000 130000 130000 130000 130000 130000 130000 130000 130000 130000
$$ 130000 130000 130000 130000 130000 130000 130000 130000 130000 130000 130000
$$ 130000 130000 130000 130000 130000 130000 130000 0 0 0 0 0 0 0 0 0 0 0
$$ 0 0 0 0 0 0 0 0 0 0 0 0 0
$$ ##$ShimPowMaxUC= (0..63)
$$ 130000 130000 130000 130000 130000 130000 130000 130000 130000 130000 130000
$$ 130000 130000 130000 130000 130000 130000 130000 130000 130000 130000 130000
$$ 130000 130000 130000 130000 130000 130000 130000 130000 130000 130000 130000
$$ 130000 130000 130000 130000 130000 130000 130000 0 0 0 0 0 0 0 0 0 0 0
$$ 0 0 0 0 0 0 0 0 0 0 0 0 0
$$ ##$ShimPowMaxUG= (0..63)
$$ 524287 524287 524287 524287 524287 524287 524287 524287 524287 524287 524287
$$ 524287 524287 524287 524287 524287 524287 524287 524287 524287 524287 524287
$$ 524287 524287 524287 524287 524287 524287 524287 524287 524287 524287 524287
$$ 524287 524287 524287 524287 524287 524287 0 0 0 0 0 0 0 0 0 0 0 0 0 0 0
$$ 0 0 0 0 0 0 0 0 0 0
$$ ##$ShimPowRcbType= 3
$$ ##$ShimPowRes= (0..63)
$$ 1e-020 1e-020 1e-020 1e-020 1e-020 1e-020 1e-020 1e-020 1e-020 1e-020 1e-020
$$ 1e-020 1e-020 1e-020 1e-020 1e-020 1e-020 1e-020 1e-020 1e-020 1e-020 1e-020
$$ 1e-020 1e-020 1e-020 1e-020 1e-020 1e-020 1e-020 1e-020 1e-020 1e-020 1e-020
$$ 1e-020 1e-020 1e-020 1e-020 1e-020 1e-020 1e-020 0 0 0 0 0 0 0 0 0 0 0
$$ 0 0 0 0 0 0 0 0 0 0 0 0 0
$$ ##$ShimPowRng0= (0..63)
$$ 1 1 1 1 1 1 1 1 1 1 1 1 1 1 1 1 1 1 1 1 1 1 1 1 1 1 1 1 1 1 1 1 1 1 1 1
$$ 1 1 1 1 0 0 0 0 0 0 0 0 0 0 0 0 0 0 0 0 0 0 0 0 0 0 0 0
$$ ##$ShimPowRng1= (0..63)
$$ 1 1 1 1 1 1 1 1 1 1 1 1 1 1 1 1 1 1 1 1 1 1 1 1 1 1 1 1 1 1 1 1 1 1 1 1
$$ 1 1 1 1 0 0 0 0 0 0 0 0 0 0 0 0 0 0 0 0 0 0 0 0 0 0 0 0
$$ ##$ShimPowRng2= (0..63)
$$ 1 1 1 1 1 1 1 1 1 1 1 1 1 1 1 1 1 1 1 1 1 1 1 1 1 1 1 1 1 1 1 1 1 1 1 1
$$ 1 1 1 1 0 0 0 0 0 0 0 0 0 0 0 0 0 0 0 0 0 0 0 0 0 0 0 0
$$ ##$ShimPowRng3= (0..63)
$$ 1 1 1 1 1 1 1 1 1 1 1 1 1 1 1 1 1 1 1 1 1 1 1 1 1 1 1 1 1 1 1 1 1 1 1 1
$$ 1 1 1 1 0 0 0 0 0 0 0 0 0 0 0 0 0 0 0 0 0 0 0 0 0 0 0 0
$$ ##$ShimSysFunc= (0..63)
$$ 1 2 3 4 5 6 7 8 9 10 0 37 38 35 16 15 14 13 12 11 28 27 26 25 24 23 36
$$ 22 30 29 20 21 34 33 32 31 17 18 19 0 0 0 0 0 0 0 0 0 0 0 0 0 0 0 0 0 0
$$ 0 0 0 0 0 0 0
$$ ##$ShimSysMatrix= 0
$$ ##$ShimSysType= 4
$$ ##$TFXNUM= 0
$$ ##$TRIPLO2= 0
$$ ##$VTU= 2
$$ ##$VTUETH= <149.236.99.20>
$$ ##$VTUTY= <no>
$$ ##$WBREFAM= (0..15)
$$ 140 110.6 100 100 100 100 100 100 100 100 100 100 100 100 100 100
$$ ##$WBREFLM= (0..15)
$$ 0 0 0 0 0 0 0 0 0 0 0 0 0 0 0 0
$$ ##$WBREFPH= (0..15)
$$ 72.2 -69.11 0 0 0 0 0 0 0 0 0 0 0 0 0 0
$$ ##$WBSGU= (0..15)
$$ 0 0 0 0 0 0 0 0 0 0 0 0 0 0 0 0
$$ ##$XFAC= 2
$$ ##END=
$$ 
##$DECIM=	2496
##$DSPFVS=	20
##XUNITS=	HZ
##YUNITS=	ARBITRARY UNITS
##FIRSTX=	6199.6488037109375
##LASTX=	-1813.0492428541183472
##XFACTOR=	-0.12226593494415283203
##YFACTOR=	0.024498808288574220465
##NPOINTS=	65536
##XYDATA=	(X++(Y..Y))
$$ [...]
-11124C38o2N5P1j63Q5l2J21j13J1J1m4m3N4N5LLLLn2n3POLKJ20j14J24j10n9N9J2J2K0J9
-11090C52k2k2k1k2K3K3k8R0j68O8JJK5K4l4l4K9K8o9o9Q0Q0L3q3J37r7l9l8Q2l5j01J34l1
-11057B97l0M3M3k8k8k7k8K9L0k2k2k5R2j72O2J02j6K0K1j18J16q2J53j03J5j18J18O2n5m0
-11027B89m1K7r0J73j78J21J21j8k14J02r4O2O3j0j0n8N8r7J77q0q0J27o9N3j42O3O2k5k6
-10998B66J00j73M7p1Q8Q7q0J14q9K8M0p7J8J9jkN1j46lJ14m5m5m4P2M6M6j8j35M2M1k4k5
-10966B41RQRQM6M6J4j04k7k8J46m9p9J16j52J22m4P4L0j66J08j0j17P8m3P4m5P2n2n1J4J4
-10934B62O7O7n1j67J31J5l2l2P9l9q2J14j0j0R0j84Q1l7J9r8K0J9P1m6Q1l7l6l7L2L1r0J05
-10902B96L6j59J61j12J36r8J7J7n3n3L7L8Q8k9j47Q8n1O6m4m4O7O8q2L6j37R8m1P6N8o0l7
$$ plain form
-11124 338 276 331 402 239 324 292 413 300 311 322 278 235 289 344 347 350 353 356 304 251 258 264 267 269 389 275 399 289 230 289 301 313 333 352
-11090 352 330 308 287 265 288 311 283 373 205 273 274 275 300 324 290 256 285 313 244 175 255 335 368 285 422 325 286 248 330 295 194 328 297
-11057 297 267 310 353 325 297 270 242 271 301 279 257 232 324 152 214 316 300 320 341 223 339 257 410 307 322 204 322 384 329 289
-11027 289 248 275 185 358 180 301 422 404 190 292 198 260 323 313 303 245 303 206 383 303 223 350 281 334 192 255 317 292 266
-10998 266 366 193 240 169 257 344 264 378 289 317 357 280 298 317 316 314 365 219 216 330 285 240 196 268 314 360 342 207 249 290 266 241
-10966 241 250 258 267 275 321 367 381 277 250 222 368 319 240 356 204 326 282 356 386 220 328 318 201 279 236 310 265 337 285 234 248 262
-10934 262 329 396 345 178 309 324 292 260 339 300 218 332 322 312 402 218 299 262 281 183 203 222 293 247 328 291 255 218 250 281 191 296
-10902 296 332 173 334 222 358 260 277 294 241 188 225 263 351 322 175 263 212 278 234 190 257 325 243 279 142 240 199 275 333 273 236
-10871B36Q0j22J13j2j1OONOnnr5K1J84k08R3j42J05J06j79N7K8K9M3M4m4m3r2J42R0j44K
-10839B94j15Q9k9k8Q9k6R1j58P6%jj03J32j35J00j8j8JJJ%qqN0N0m8m9J8J7NJ23k27QJ77
-10805C51n9k8j46J70N3j31j3M8M8J38k52R2R2j47Q7q9J44q2L5j16J19j2j3L8p8J26j08r8
-10777A69K0J22j13Q5l2j12J22M6M7j51J22o1o1j2J06j0rJ0J1j14Q1q0J15l2l3R0j05J0J1
-10748B42J08q7%%j3j2K7K6L9j56N7N6q0L7M6M5K9q9n5O1j73J01Q4l2N5j40J32J5m1m1Q2j13
-10716B10M5p1J41j32R0R0j54J19m7m6Q9j06O3O2k0k1L9p9M7p0N5N4j01J5l6Q2j75J76j16
-10687B03P9o4N3M9o9J35j39J6J5n3O5kkQPj02R3k7k8k3R4mmLLj1j0o9M8n4O3o2N6J7J8p7
-10651B25J17j41k3J17JL6q1L6L6m7m7N0N1l4l4J13j22p9J56n0m9L1L1m3m2J42r2j9R8r5K1
$$ plain form
-10871 236 316 194 307 295 284 290 296 301 307 302 297 202 223 407 199 292 150 255 361 182 239 267 296 339 383 339 296 204 346 436 292 294
-10839 294 179 268 239 211 300 274 365 207 283 283 282 179 311 176 276 258 240 241 242 243 243 235 227 277 327 279 230 248 265 270 393 166 174 351
-10805 351 292 264 118 288 341 210 197 245 293 431 179 271 363 216 303 214 358 276 311 195 314 302 289 327 249 375 267 169
-10777 169 189 311 198 283 251 139 261 307 354 203 325 264 203 191 297 287 278 288 299 185 266 186 301 269 236 326 221 231 242
-10748 242 350 263 263 263 250 238 265 291 330 174 231 287 207 244 290 335 364 275 220 281 108 209 293 261 316 176 308 323 282 241 323 210
-10716 210 255 184 325 193 283 373 219 338 291 245 334 228 291 353 333 312 351 272 319 249 304 358 257 272 236 318 143 319 203
-10687 203 282 218 271 320 251 386 247 263 278 225 290 288 286 294 301 199 292 265 237 214 308 304 300 303 306 295 285 216 264 210 273 211 267 284 302 225
-10651 225 342 201 178 295 296 332 251 287 323 276 229 279 330 296 262 375 253 174 330 280 231 262 293 250 208 350 258 239 337 242 263
-10620B63K1K2k7k7L2L2j6j6j6j6K3K4l6l5j7j7J22j12j5J02K1K2j6j5j5j5llmlLLLLm1m1
-10584A90O3O4n3O3j41R3K7r1j0J08r6K2O1O1l0l1l0l1j0j0j0rL3L4L4L3k9l0l0l0J6J5J5
-10551B61J5onj3j3Q7k9P0j63K1K2PPk7k8N6N6J13j22m8m8Q6Q5n1n1M6M7j32j4J25j08J03
-10519C49j31L4L5j13J22n5n5N7N7j8j9R9r7o3N3P3P2p6p6O1O0l9m0m0l9K9K8J7J6L5j61N9
-10487B34N9p0J25k9j46J02r3P6m2QRJ11q5klR5j00J6J5MLl7l8O0O0j3j4j3j3n8n7M0M0%%
-10452B44j7j8J32j42J29o6p0M8P1j23J29J1r5R9j14LK1J37q8q9J7J7J0J1J1J0K2K3l7l6K6
-10421B76K6M5p2j25O9J2J1ooL3q4K43j87k6R2M1p6P1m7p6M0nJ89r9r8J1J1nonoL4L3l2l3
-10386B43N1o7o6N0K5K5q5L2rJ08p5M2J3J3r2K5l5J61m7m7L9p9L9L8L1q7L8L8m1m1O8j27Q4
$$ plain form
-10620 263 284 306 279 252 284 316 300 284 268 252 275 299 263 228 211 194 316 204 189 291 312 334 318 303 288 273 270 267 263 260 263 266 269 272 231 190
-10584 190 253 317 264 327 186 279 306 215 205 313 217 239 300 361 331 300 270 239 229 219 209 200 233 267 301 334 305 275 245 215 231 246 261
-10551 261 276 270 265 252 239 326 297 367 204 225 247 254 261 234 206 262 318 431 309 261 213 299 384 333 282 328 375 243 229 354 246 349
-10519 349 218 252 287 174 296 241 186 243 300 282 263 362 265 202 255 328 400 324 248 309 369 330 290 250 211 240 268 285 301 336 175 234
-10487 234 293 223 348 319 173 275 182 258 216 224 233 344 259 257 254 349 249 265 280 284 287 250 212 272 332 319 305 292 279 221 164 204 244 244 244
-10452 244 227 209 341 199 328 262 192 240 311 188 317 328 233 332 218 221 242 379 291 202 219 236 246 257 268 278 300 323 286 250 276
-10421 276 302 347 275 150 219 231 242 236 230 263 179 422 235 209 301 342 266 337 290 214 254 249 438 339 241 252 263 258 252 247 241 275 308 276 243
-10386 243 294 227 161 211 236 261 176 208 199 307 232 274 287 300 208 233 198 359 312 265 304 225 264 302 333 246 284 322 281 240 308 181 265
-10353B65Q4j19P7j44J30k3k4R2j04OJ23r5K1M2p6q0J15O3n3l1l0O0O0k5k5k5k5j1j0R2j04
-10322B26J06j1nmo2J32q9K7j38N7N6j38R1k6l1Q6l6Q1p5p4R2R2m4m5l6l6P6m1M4j51Q1Q1
-10290B86K7r0M1M1q1L5l8P9lkJ1J2p5M3k4k3kkJ09q7J9J9m7P1j27O9K5K5k0k1k0k0J7J7J7
-10255B81J6o6o6J93lj75K1R4j01R1j03P2J89j35j8j8j9J3J2r7R8M8M8k3j40J13q3K1K0L5
-10225C18L5j9R9j90OJJl7l7O1O1llklrrrrrrrrJ1J0J1J1%%j%j5j6M3M3m9m8M9M9q9r0Q6Q7
-10182C08K3K2Mj14o9J27p1p1K06j45N2N2n6n7M1M1JJ%Jjj%jo0n9L8L9M0M0l5l5J17j56J07
-10147C29q7M5M5j35O0ooOOM6M5k5k5Q9j05MML5L5k4k3l0l0m1J53p6p6J04r0O2O1m8m8QQJ
-10111B71%K0r7J06j2q8J08j02J5J73k56J93kL0q8M0p8L6J53k16J36n1n1R6k2rj0rj0k6R0
$$ plain form
-10353 265 349 230 307 163 293 270 246 338 234 240 363 268 289 331 255 175 290 353 300 269 239 299 359 334 309 284 259 248 238 330 226
-10322 226 332 321 316 312 250 382 293 320 182 239 295 157 248 222 191 277 241 322 247 173 265 357 313 268 232 196 272 231 275 124 205 286
-10290 286 313 223 264 305 224 259 221 300 297 295 306 318 243 286 262 239 237 235 344 257 276 295 248 319 192 261 286 311 291 270 250 230 247 264 281
-10255 281 297 231 165 358 355 180 201 295 194 285 182 254 443 308 290 272 253 266 278 181 279 327 375 352 212 325 242 263 283 318
-10225 318 353 334 433 243 249 250 251 214 177 238 299 296 293 291 288 279 270 261 252 243 234 225 216 227 237 248 259 259 259 258 258 243 227 270 313 264 216 265 314 225 135 221 308
-10182 308 331 353 357 243 174 301 230 159 365 220 272 324 268 211 252 293 294 295 295 296 295 294 294 293 233 174 212 251 291 331 296 261 378 222 329
-10147 329 242 287 332 197 257 251 245 251 257 303 348 323 298 387 282 286 290 325 360 336 313 283 253 212 365 289 213 317 227 289 350 302 254 262 270 271
-10111 271 271 291 194 300 288 200 308 206 221 394 138 331 329 359 271 311 233 269 422 206 342 291 240 336 314 305 295 286 276 250 340
-10080C40q5J10k7k7k2k2Q2l5k3R4j20P6j9k0k2R6o1o0j2J05p0J25q4q5K6K6J5J4kkJ32j41
-10048C02J2J3j2j2N4o3rrN7o1n3O5N6o0JKooK4K5p4J23j72K3R4j01O6O6j54M2O4O5r9R6l0
-10013C29j48J85j1q4L4n2O5L7L7o5N2j50Q5m0l9J8J9l2Q5j13J21Mj13N9O0P1j63J05j30M7
-9983B73M6J1J1l3l3j17J17q1L6j4j5K3K2N6N5j27J07j22nJ07rK8K8l7l7N7N8j25J09n0O7
-9952D06q1q2J11J11j04j04N1N2QPM0j94L5L5n4n4J61p3Q0j54Q8l0N1N0n5n4J1J2Mj14J81
-9921C41n5l9P7r4J40q3q2L2L1k0R8j46Q9j82K09j67O9m7P1L3L2P4j61rqN7o0J02j31N1N2
-9890B74K8K8k3k4o3N4J35j00N6j79L6L6L5L6o9o9R9j8J9J9m4m4J75r8j10PK21n1j31j4N7
-9859B78N6j49J23K9q9O9m9J0J0j4j4M4p3P9l8m5P1jjK6r2J04j71J45n0k3k2J02j6q4J10J
$$ plain form
-10080 340 255 365 338 311 289 267 349 314 291 385 265 341 322 302 280 376 315 255 243 348 278 403 319 234 260 286 301 315 313 311 443 302
-10048 302 314 327 315 303 357 294 285 276 333 272 219 284 340 280 281 283 277 271 295 320 246 369 197 220 314 213 279 345 191 233 297 362 263 359 329
-10013 329 181 366 355 271 305 253 318 355 392 327 379 229 314 274 235 253 272 240 325 212 333 337 224 283 343 414 251 356 226 273
-9983 273 319 330 341 308 275 158 275 194 230 216 201 224 246 302 357 230 337 215 210 317 308 336 364 327 290 347 405 280 389 339 406
-9952 406 325 243 354 465 361 257 308 360 368 375 415 221 256 291 237 183 344 271 351 197 285 255 306 356 301 247 258 270 274 160 341
-9921 341 286 247 324 230 370 287 205 237 268 248 346 200 289 107 316 149 218 171 242 275 307 381 220 211 203 260 200 302 171 222 274
-9890 274 302 330 307 283 220 274 409 309 365 186 222 258 293 329 260 191 290 272 291 310 266 222 397 299 189 196 417 366 235 221 278
-9859 278 334 185 308 337 248 317 268 278 288 274 260 304 231 310 272 227 298 297 296 322 230 334 163 308 258 235 213 315 299 215 325 326
-9827C26Jr0K8l3Q4j78J7N9N9p0M6ppJ46j28J66j86l0l0O5n2J21Ll5l5K4K4n0O9j88J65j9
-9795B65j8j9R8r9R6r3K5l7Q1l5l5o7J29q4J13llq2J14n5n5j1j0N5N6p0M7k6k6P5m1m7m7J72
-9761C63k3o2o2O1j34J30j44P7P7K2r6N1o5pJ89j52M4NOj4j3j3j4J7J6n4n5J96%j75K0M6M6
-9728B83%%nnn9N8r4J00jkl7l7J4J4M4p3J03r3P0P0p9p9P3P3j34O1j2j1KJN5N5q2q2O5O4n0
-9691B70n0J18j56J08q8lmL1L1P8j17M2J58k35L8J6J6J00r5K2K2n5O2M8j48N1N1P7j18R5j01
-9660B64p6M1P9l8L5L5p5p5J1J1J12q3O1j34K15n8j5j5m4m5J4J3l2l3P8P7j32O3o1N7O7n0
-9628B67m3P4l4l5L1L1L4L3j79R5QRL2L3j11Oq0J55j58P7P7j58J44r1R3k5k8k9k1k1r2J42
-9596B36J1J28j36j9q5L3Q5Q5n2n2L6q1J17j17L7L7j09J26k1k1poNNMNN8N9k21J71k0k0NM
$$ plain form
-9827 326 327 237 265 232 316 138 155 214 273 203 249 242 235 381 253 419 233 203 173 238 186 307 310 275 240 264 288 238 307 119 284 265
-9795 265 247 228 326 227 323 230 255 218 299 264 229 162 291 207 320 317 314 232 346 291 236 225 215 270 326 256 303 277 251 326 285 238 191 363
-9761 363 340 278 216 277 143 273 129 206 283 305 209 260 195 188 377 225 269 274 280 266 253 240 226 243 259 205 150 346 346 171 191 237 283
-9728 283 283 283 278 273 214 272 178 278 277 275 238 201 215 229 273 200 303 210 280 350 271 192 265 338 204 265 253 242 244 245 300 355 273 191 256 320 270
-9691 270 220 338 182 290 202 199 195 226 257 335 218 260 418 183 221 237 253 353 258 280 302 247 309 357 209 260 311 388 270 365 264
-9660 264 188 229 308 270 305 340 265 190 201 212 324 241 302 168 383 325 310 295 251 206 220 233 201 168 246 323 191 254 193 250 317 267
-9628 267 224 298 264 229 260 291 325 358 179 274 282 291 323 356 245 251 171 326 168 245 322 164 308 217 310 285 257 228 207 186 94 236
-9596 236 247 375 239 220 135 168 253 338 286 234 270 189 306 189 226 263 154 280 259 238 231 225 230 235 239 244 302 361 140 311 291 271 276 280
-9562B80L3L3j50Q4k0R8q6L2Oj11O0O0n3n4j0rJ33j00q6J48j60P4M0M0N9j74j1J06KLm2P6
-9530C01j56P8J2J2NNNNJ5J5m3m4K4K4RRQ6j49j6j7N2N2l9l8j9R8N9j75J02j6Nj13L8L8M5
-9495B69M6k28OK21j3kkj6j7k1k1L7L7rrqrJ3J3J3J3J9J9p9p9M3M4q9J46p6p6n6J78m9m9K4
-9459B33K5K2K3j09J25l7l7l7l7J42r3L9L9j9j9k0j9J7J6J7J7m1m0J8J8JJJJL7L8l6l6J11
-9425C61j25QQj1j0k5k6J25j11K2K1K2K1K2K1JKj31J04m7m6J00j34O7O7non0n0RRJ4J3J4J4
-9390B68l4l4J0J0J40r5k1k1O3O3j27J07k4k5j0rnnnnJ4J4M8j86J24J24p4p4M9o8J0J0r5J01
-9356B38N6o1L3L2l3l3K0K0j33J40l8l8j7J01j54M2O3n4P1P2l3l3RJ0o9M8K0j75J17J18m8
-9325B91m7o4o5J34j39K12j40K3K3JJJ3J3Rj09J47m7j7j6Q2j14Q8j07J62j11L0L0n5n4N1N1
$$ plain form
-9562 280 313 346 196 280 260 358 272 304 310 199 259 319 266 212 202 193 326 226 140 288 128 202 242 282 341 167 156 262 264 267 225 301
-9530 301 145 223 235 247 252 257 262 267 282 297 254 210 234 258 267 276 362 213 197 180 232 284 245 207 188 286 345 170 272 256 261 148 186 224 269
-9495 269 315 87 93 314 301 299 297 281 264 243 222 259 296 287 278 270 261 274 287 300 313 332 351 272 193 236 280 191 337 261 185 129 307 258 209 233
-9459 233 258 280 303 194 319 282 245 208 171 313 220 259 298 279 260 240 221 238 254 271 288 247 207 225 243 244 245 246 247 284 322 286 250 361
-9425 361 236 244 252 241 231 206 180 305 194 216 237 259 280 302 323 324 326 195 299 252 206 306 172 239 306 301 295 245 195 204 213 227 240 254 268
-9390 268 234 200 210 220 360 265 244 223 286 349 222 329 305 280 270 261 256 251 246 241 255 269 317 131 255 379 305 231 280 212 222 232 137 238
-9356 238 294 233 266 298 265 232 252 272 139 279 241 203 186 287 133 175 238 184 255 327 294 261 270 280 211 259 279 104 221 339 291
-9325 291 244 180 115 249 110 322 182 205 228 229 230 243 256 265 156 303 256 239 223 305 191 279 172 334 223 253 283 228 174 225 276
-9294B76j03J4noJ30o5O6O6j76J75q1q2N7N7m8m8L1q6N3o4lJ14m4m5m8J47j4j4jJ15k51J79
-9262B96n8n8J06j2p6J19l0j47M9N0M2M2q2q2J19p7P4m2J8J8m9O8j15Kk3R3M3p5M6M6k0k0
-9230B65k4k4L5L5kjJ3J3j16J19k0k0L6q1J17j18K5K5mnO8j67K3K4L0L1p9L8j20J13M8o9Q0
-9197B88l6L7q1j2J05j59P6kjJ3J4k5k4Q5l1J00j34M8M9j5j5L6q1J07j28M8o9J51q4Jj16J30
-9165B75J2j05J30m5J90k84J07m3m2Q0Q0p4p4j5j6P8P7R7j37P2j63j4J03J5J5l6l6L8L9k1
-9135C03k0noj3j3L3q4J14j21P2P2p9p9R5R5j59P6j02J33l5Q1j22J12j52l5J30j04l1Q6mn
-9104B33LKrj0O4O4j68O7M7M8j73O2j1j2M6M6j2j3J6J7o6o7K50j40p7M0j8J00nj22J09j25
-9072A86K12j79L5q2LLJ66o8rj0R1j44M7M7n0n0QRK4K5j08J27J1J2l3l3K2K2J02j32q1L7J4
$$ plain form
-9294 276 173 187 182 176 306 241 307 373 197 372 291 209 266 323 275 227 258 172 225 161 158 272 228 183 135 282 268 254 253 368 117 296
-9262 296 238 180 286 274 198 317 287 140 189 239 281 323 241 159 278 201 275 233 251 269 220 288 173 175 152 245 288 213 259 305 285 265
-9230 265 241 217 252 287 285 284 297 310 194 313 293 273 309 228 345 227 252 277 273 268 336 169 192 216 246 277 198 236 116 229 277 208 288
-9197 288 252 289 208 196 301 142 218 216 215 228 242 217 193 278 247 347 213 261 310 295 280 316 235 342 214 262 193 344 260 261 145 275
-9165 275 287 182 312 267 457 173 280 237 195 275 355 281 207 192 176 254 331 428 291 363 200 186 289 304 319 283 247 285 324 303
-9135 303 283 278 272 259 246 279 195 309 188 260 332 253 174 269 364 205 281 179 312 277 358 236 348 196 161 291 187 156 242 238 233
-9104 233 236 238 229 219 283 347 179 246 293 341 168 230 219 207 253 299 287 274 290 307 241 174 424 284 207 247 229 329 324 202 311 186
-9072 186 398 219 254 172 175 178 344 276 267 257 348 204 251 298 248 198 206 215 239 264 156 283 294 306 273 240 262 284 386 254 173 210 224
-9039B24J4J8J7m0m1J8J7j14J21K4K3k0k0m2m3N5N5lmmlj1j2j1j1M4M4o9o9J53q2j6J01j8
-9005B95j8j1j2O3O2k07K8klJ3J2J0J1J7J8j04J3m8J86p9q0J9J8J73o0j74O1R7j39J41r5m5
-8973A60m6J23j11J25Qp2J62p7p6llO3O3l5l5%j%jKLj3j2J28j07r2J43p0J63j24pQ1l6k2k1
-8938B60L0L1j82K08q0L7nnJ2J2J3J2j24j23K24j1k6k6m0m0K7K7K7K6j0rMNj12J21rj0poj14
-8903A37J21j27K64j64P0q9K8J9r9J95j95P6m2Q1l6Q9k9q6q6J60p3J40r4L1L1n7O0O7j67K9
-8873B54K9j24J09Q1l7q8K9P1m6K8K7k8k8J7J6Q1j53J03j4l7l7P0j64K31m2p9L8Q6j10QQJ0
-8841C09Rj00R5m2m1O1O1j9j35J43j31P0O9j23P2k6j42J65M8K7j68J10pq2J12j14Q1k3k3Q7
-8811C43j08J09q6J2J2p0p0L9M0p9J17POllllrj0o0o1rJ08J06r0o7J28r7R9q9K8p0M8j20K32
$$ plain form
-9039 224 238 256 273 233 192 210 227 113 234 258 281 261 241 199 156 211 266 263 259 255 252 241 229 218 207 251 295 226 157 310 228 212 313 295
-9005 295 277 266 254 317 379 172 200 198 195 208 220 230 241 258 276 172 185 137 323 244 164 183 201 374 314 140 201 298 159 300 205 160
-8973 160 114 237 126 251 259 187 349 272 196 193 190 253 316 281 246 246 245 245 244 246 249 236 224 352 245 153 296 226 389 265 258 339 303 281 260
-8938 260 290 321 139 347 267 304 299 294 306 318 331 343 219 96 320 309 283 257 217 177 204 231 258 284 274 265 269 274 162 283 274 264 257 251 137
-8903 137 258 131 395 231 301 212 240 259 160 355 160 236 194 275 239 328 299 213 127 287 214 354 260 291 322 265 325 392 225 254
-8873 254 283 159 268 349 312 224 253 324 278 306 333 305 277 294 310 391 238 341 327 290 253 323 159 390 348 269 307 393 283 291 299 309
-8841 309 318 218 313 271 230 291 352 333 198 341 210 280 349 226 298 272 130 295 343 370 202 312 305 223 335 221 302 279 256 343
-8811 343 235 344 258 270 282 212 142 181 221 142 259 266 272 269 266 263 260 251 241 181 120 111 219 325 235 168 296 199 298 209 237 167 215 95 327
-8776C27j7j7PPn1n1M0M0j06J67j20lK0J9j26O9K5K6m4P4K1j75N0N1N7n9q1J15kkJ2J3m7m6
-8742A93J1J1K3K3p0J26j31J42r6K0o7J27j45N0J0J1J4J5J4J4j0j0j7j35K01l3pom0l9N8N8
-8710C15o9o9o3J70j1j1mj20J95l9o6o6J21j14J50q4j7j7J9K0Pj11J85m9k4k4K0K1j8j7j7
-8679B13j7K1K1K1K1j5j5%%r6J37n2O5q5L3l4Q4m4m4K1K2qqO5j69M8M8j79K11m8O9l9P8j4
-8645C11j4o6o5N4N4nnp4p4J01J02k8k7k8k7L7L7k2k1m3m2N5N5n2n2Q4Q5n8n8JJJ7J7L1L1
-8610C12j65P0L5L5q8q8J68N1j69O4mJ14o7o6J32j03ONLMq6J09N8n9O6n0j02R3ONm1m1N1N1
-8576C09p4M3j4j4J47j27N9O0j26O9o9o9J0Rk6R1k2k1o7J29P0j25QRO3n5k9k9K2K2J2J2K6
-8543C03r1k9Q9K3r5J8J8kkQ4j12rrJ02j6m7m7j6j6J26Rj22J51j20P5n7n8J89oj8k13K07o7
$$ plain form
-8776 327 310 293 300 307 256 205 245 285 179 346 226 223 243 262 136 205 230 256 212 286 307 132 182 233 290 231 150 265 263 261 273 286 239 193
-8742 193 204 215 238 261 191 317 186 328 232 252 185 312 167 217 227 238 252 267 281 295 285 275 258 123 324 291 284 278 238 199 257 315
-8710 315 246 177 114 284 273 262 258 138 333 294 228 162 283 169 319 235 218 201 220 240 247 136 321 272 248 224 244 265 247 230 213
-8679 213 196 217 238 259 280 265 250 250 250 154 291 239 304 219 252 218 302 258 214 235 257 249 241 306 137 185 233 54 265 217 286 247 325 311
-8645 311 297 231 166 220 274 269 264 190 116 217 319 291 264 236 209 246 283 261 240 197 155 210 265 213 161 245 330 272 214 215 216 233 250 281 312
-8610 312 147 217 252 287 199 111 279 330 161 225 221 335 268 202 334 231 237 242 245 249 163 272 330 271 337 287 185 278 284 289 248 207 258 309
-8576 309 235 278 264 250 397 270 329 389 263 332 263 194 204 213 187 278 256 235 168 297 367 242 250 259 322 267 238 209 231 253 265 277 303
-8543 303 212 183 272 295 200 218 236 234 232 316 204 195 186 288 272 225 178 162 146 272 281 159 310 190 265 208 150 339 333 315 102 309 242
-8510B42Nj13J31o4J27o8Q1j15L0L0n6O1L5q2M5p3J04r2LJ21q0p9J68k8kj20R8j9j0j1L6q1
-8478B24R7r8J7J6p1J25m5m4M9M8k4k5J03j32%%j8j7M2M1J4J3J4J4k0j9L9M0N7N8jjKJJ6J7
-8442E32j36R9R9j36k9k9m4m4K2K3N6j77%%M5M4qpqqmmj9j9J03j32J31j03%%j5j5j3j4J25
-8407C15j08mJ13k6k6k8k8J8J36j43R2L3q5K3K2j10J25n2O5q4q4J4J5K1K2m6P2p5J60m2j58
-8376A47P3P4j38R7M5p2l5K00j03J3opJ5J5j35R9l2l3L0K9L0L0m6m6kkO7j68P6P6j18J17N0
-8343C40o6K6K6J2J1Kj16J70k5j70K5L9M0K2K1j7j34J04j2N4o4K7K7r0r1J76j9%%l9P8m0l9
-8310B78jJ15k1j38POjjLLJ20p5n1O6r0K6Q7j08J18p7k4k4nJ12RQj52M2L7L7q2L4R6k2q0L7
-8274B89J08rq0q0O5n2Q0l7J9K0J9r7N7N7j13MM1M2m8m9J6J7n0O7M0L9m4m3n5O3j6j6J11q5
$$ plain form
-8510 242 247 134 265 201 328 260 341 226 256 286 230 291 326 244 289 216 320 228 231 352 272 193 361 333 331 211 309 290 280 269 305 224
-8478 224 321 223 240 256 185 310 265 221 270 318 294 269 372 240 240 240 222 205 247 288 302 315 329 343 323 304 343 383 440 498 497 496 498 499 515 532
-8442 532 396 495 594 458 429 400 356 312 334 357 413 236 236 236 281 325 317 310 302 294 290 286 267 248 351 219 350 247 247 247 232 217 204 190 315
-8407 315 207 203 316 290 264 236 208 226 362 219 311 344 259 282 304 194 319 267 332 248 164 178 193 214 236 190 262 187 347 305 147
-8376 147 220 294 156 253 298 226 191 391 288 301 295 288 303 318 183 282 250 217 247 276 306 336 290 244 242 240 307 139 215 291 173 290 340
-8343 340 274 300 326 338 349 351 235 405 380 210 235 274 314 336 357 340 206 310 298 352 288 315 342 252 161 337 318 318 318 279 357 317 278
-8310 278 277 392 371 233 240 246 245 244 247 250 370 295 244 310 220 246 333 225 343 266 242 218 213 325 334 342 190 232 269 306 224 258 354 332 252 289
-8274 289 397 388 308 228 293 241 321 284 303 323 342 245 302 359 246 250 291 333 285 236 252 269 219 286 326 365 321 278 223 286 270 254 365 280
-8240B80L8L7j65L0j0rl5J61p4M3l2l1j2j2l1J64nnMMo2N5j3j4k8k8J80j70K6K7N3N2k41J50
-8206C27M1j94N9O0j%jjl6l6J01J01j03j03Q8Q8j38R6l5l5K4K5l3l4M1M1j8j8M0M0n8n8ll
-8172B64J1J2o9J66j13K78k02L3j6j6o9o8M5M4p7J58q1J52k56J34j3j2M8M9n0m9J3J2J44r1
-8142C81o2o2J53q2M9M9k4k4j5j4M4M5n8n8j4j4J26j08K4K3P3P2j57P7m3m4N4N4J00j35o1
-8111C49o1M7M8L2L3K6k09R8R9l0k9K9K9m4m4J5J5l3l3K6K6K1K1L6L6j40R4l8l7K9L0l0k9
-8078C82K2K2Q1j54J37r7Q5l1k2k1j5j4k7K07j22J12m3j60J35r9J51q4M1p7M3M3k2k3L8L8
-8048E26k0k1RRRRk3k3k3k3J16J15p3M4j11J23jjk0j9k0k0%jJ4J4r1J44P7m0K8K8K1K0k0k1
-8012G35M5M5r5K3o2J71j50Q3J06j28n0O7O7n0j17J18L6L7RJ0j23J12QQl6l6J33J32mnqqN1
$$ plain form
-8240 280 318 355 190 220 210 201 166 327 253 296 264 233 221 209 178 342 337 332 336 340 278 333 320 306 278 250 430 260 286 313 366 418 177 327
-8206 327 368 174 233 293 292 292 291 290 254 218 319 420 317 214 302 390 252 348 313 278 302 327 294 260 301 342 324 306 346 386 328 270 267 264
-8172 264 275 287 218 384 271 549 347 380 364 348 279 211 256 300 223 381 300 452 196 330 317 305 353 402 352 303 316 328 472 381
-8142 381 319 257 410 328 377 426 402 378 363 349 393 438 380 322 308 294 420 312 336 359 432 504 347 424 381 337 391 445 545 410 349
-8111 349 288 335 383 415 448 474 265 363 462 432 403 432 461 417 373 388 403 370 337 363 389 410 431 467 503 363 457 419 382 411 441 411 382
-8078 382 404 426 507 353 490 393 478 447 425 404 389 375 348 555 433 545 502 342 477 378 529 445 486 409 452 495 473 450 488 526
-8048 526 506 485 494 503 512 521 498 475 452 429 545 660 587 631 520 643 642 641 621 602 582 562 562 561 575 589 498 642 719 679 707 735 756 776 756 735
-8012 735 780 825 730 753 691 862 712 795 901 773 723 790 857 807 690 808 844 881 890 900 777 889 897 905 869 833 966 1098 1094 1089 1081 1073 1124
-7979A124N1K8K8K9K8N5N5N6N5j8j8J19J18J19J19M5M6K99O5J17K33L26R2J65K83K53K54L19
-7951D445L19L52L53O20O21Q51J084J305J539K176K722L275L822M081M081L968L735L194K804
-7932D5347J887Q70n03j675k690l394l542m089m068m184l758l366k861k158j609j374j027
-7915G806p94n44n44m32m32k24k24k05m39l3k68l41j06j23j22l20P0j78o2k42j24L5k00o0
-7891A894o0m5m5m5m6j9k0j58m2Q7j48J16j19N0o7p4p5rj0rj0jjp4p4J49q4j17J%jPPn9o0
-7856H39jjm3m2J6J6J9K0K0J9k6k7l4l4J27J0j53Q1j3j4j30J04l7l7k2k2O9O9o7o8QPL2L2
-7822G17k18J72J9r9K4K3L1L1j86M8R2j42J43r1L4q4N5N6n0m9M6M7j45R1j5j5%%J0J0J0J0
-7790E75K8K8l1l0qpqpl6l5K3K2M5M5o8o7J60p3K9k06K02j88J49q5l8l8Q4Q4j00j00P6P6j4
$$ plain form
-7979 1124 1175 1203 1231 1260 1288 1343 1398 1454 1509 1491 1473 1592 1710 1829 1948 1993 2039 2338 2403 2520 2753 3079 3171 3336 3619 3872 4126 4445
-7951 4445 4764 5116 5469 6089 6710 7561 8645 9950 11489 13665 16387 19662 23484 27565 31646 35614 39349 42543 45347
-7932 45347 47234 48104 47601 45926 43236 39842 36300 32211 28143 23959 20201 16835 13974 11816 10207 8833 7806
-7915 7806 7012 6468 5924 5492 5060 4836 4612 4407 3968 3935 3667 3326 3220 3097 2975 2655 2725 2547 2485 2243 2119 2154 1954 1894
-7891 1894 1834 1789 1744 1699 1653 1634 1614 1456 1414 1501 1353 1469 1350 1400 1333 1259 1184 1175 1165 1156 1146 1145 1144 1070 996 1145 1061 944 945 945 944 951 958 899 839
-7856 839 838 837 794 752 768 784 803 823 843 862 836 809 775 741 868 878 725 806 793 779 649 753 716 679 657 635 704 773 706 638 646 653 685 717
-7822 717 499 671 690 591 615 638 669 700 514 562 654 512 655 564 598 514 569 625 575 526 572 619 474 565 550 535 535 535 545 555 565 575
-7790 575 603 631 600 570 562 555 547 540 504 469 492 514 559 604 536 469 629 556 585 379 581 393 542 457 419 381 465 549 449 349 425 501 487
-7757D87j3n5O3j16K76j59P5j03J4m4P3l0l0J03j33N9n9N8n9N1N0l0l0O5j69O1O0J%j4j4Q5
-7725E23j49R9j35J42r3j07J27l4l5O4O3K3k12K31j61O9m8N2o5M6p1J34j00q8J46%j18J15
-7697D18kO9j27M8M8o2o2L1L1p9J17j1j0JKn1n1J25p1jJ16r9J9O8j27J65l0r8J9n9n9M1M1
-7664C60M1M2n8n8M0M0j5j5l2l2J37j37J7J7N6N6j63L1P5j21J19p7l1Q7RRj2j2j1j2L8L8k0
-7631D06k0kkkkj8j8j8j9K0K0J9K0l3l4K6K5kkj04R1j6J00j16%LLJ0J0l6l7O1O1n9o0K3J41
-7594D39j67K9N1o7L1L1q8K9PK02j79J7j1J05m5m6JJJ03r2N6o1P2m4j24J11m4m3J70o4RJ0
-7562C99n7n6J64k27R1R2l8l8L5q3J81n4r7K0N1N2j73O1l1Q6m7P0j20J14k8k8r4J40Nj13R3
-7531C70k4j6j5L6L6r2r2Q3Q4k7k7J05j30K5K4J0RJ3J2m6m6L5L6q9J45j21nmj22J61p4j5J01
$$ plain form
-7757 487 474 419 482 366 642 483 558 455 469 425 498 468 438 541 408 467 408 466 407 458 508 478 448 513 344 405 465 466 466 452 438 523
-7725 523 374 473 338 480 387 280 407 373 338 402 465 488 276 507 346 415 367 419 354 400 329 463 363 275 421 421 303 418
-7697 418 416 485 358 406 454 392 330 361 392 313 430 419 409 410 412 361 310 435 364 363 479 380 399 467 340 505 475 377 396 337 278 319 360
-7664 360 401 443 385 327 367 407 392 377 345 313 450 313 330 347 403 459 296 327 402 281 400 323 292 379 388 397 385 373 362 350 388 426 406
-7631 406 386 384 382 380 378 360 342 324 305 325 345 364 384 351 317 343 368 366 364 260 351 335 435 319 319 322 325 335 345 309 272 333 394 335 275 298 439
-7594 439 272 301 352 285 316 347 259 288 295 497 318 335 324 429 384 338 339 340 443 351 407 346 418 374 250 361 317 274 444 380 389 399
-7562 399 342 286 450 223 314 406 368 330 365 282 463 409 312 332 383 435 262 323 292 378 331 401 281 395 367 339 245 385 390 277 370
-7531 370 346 330 315 351 387 295 203 286 370 343 316 421 291 316 340 350 359 372 384 338 292 327 363 274 419 298 293 289 167 328 254 239 340
-7498C40N2N1k05J85j62P1J04j31n8N8k2k2L8L9L9L9l3l2l2l2M3M3j47Q8N1N1q4L4j24J09
-7468C51q1J54j39k1R1k6j9j9L2L3m6m5J3J3mnk6R2M7j87J35j00O8m9O8m9M2M2%%j86K04j47
-7435B36Q7j3j4JJO3O3r9J36o9o9M3M4m7m6j7j7L5L6OPK1K1n2J82j2j3KLM1M0j8j7l9l8k4
-7399D64k3N8j75J5J4m2m2J48q6k1k0K4K3KJm3m3o1J74n6n5K9L0%%l0l0O8O8k1k1k1k0ONK1
-7363C40K1j49Q6q1J54n0n0o9J65j03j03J81n4k6k6J9J8JKJJrj0J23j13L6L6j11J23o7o7R9
-7331C18R9j91M4J02j33Q5Q5o7o6j2j2M6M7o4o5L3L4rqJ23j11pqL6L6kkl1l1L4L4L4L4j10
-7297B95j11N0N1P2j63J75o1j16J17j16J17r7J37rj0l9m0P2P3j50Q5p6p7M6M7n2n1L9M0M0
-7267B88L9n1n0PQN6N6m1m2lmK6K6JKj02J34j2j1J7J8j40R4k4k3q2J53l8l8llK6K7k9k9J61
$$ plain form
-7498 340 392 443 238 423 261 332 436 305 247 305 283 261 299 338 377 416 383 351 319 287 330 373 226 314 365 416 332 366 242 351
-7468 351 270 424 285 264 355 329 310 291 323 356 310 265 278 291 287 282 256 348 395 208 343 243 311 262 330 281 323 365 365 365 179 383 236
-7435 236 323 310 296 297 298 361 424 325 461 392 323 366 410 363 317 300 283 318 354 360 367 388 409 357 539 527 514 516 519 560 600 582 565 526 488 464
-7399 464 441 499 324 339 353 311 269 417 331 310 290 314 337 339 340 297 254 193 367 311 256 285 315 315 315 285 255 323 391 370 349 328 308 314 319 340
-7363 340 361 212 298 217 371 321 271 202 367 264 161 342 288 262 236 255 273 274 276 277 278 269 259 382 269 305 341 230 353 286 219 318
-7331 318 417 226 270 372 239 324 409 342 276 264 252 298 345 281 216 249 283 274 266 389 278 271 263 299 335 333 331 300 269 303 337 371 405 295
-7297 295 184 234 285 357 194 369 308 192 309 193 310 213 350 341 331 292 252 324 397 247 332 256 179 225 272 220 169 208 248 288
-7267 288 327 276 226 233 241 297 353 312 270 267 263 289 315 316 318 216 350 338 327 344 362 222 316 292 269 187 340 302 264 261 258 284 311 282 253 414
-7231D14p3l9m0NN%%%%kjo0o0P5P5j16J19jjo0n9J71o4k9k9K0K0rj0K3K2k2k1p7J58l3l2K9
-7193B98K9j32J03mmj1j1j0J07j50Q5jjJ4J3l1l0l9l8P1m7J81k11M2M2L2L2r5J39o5o6R7j38
-7160B01J19j16J11pM4p3J6j02N5N5l0l1J09rj35R9p5J60q8q8K5K4K0J9K0K0k2k2k2k2J7J7
-7128B89n7n6J66o9klQ0l7j03J31n9n9J45q8mmj9j9j0j0M8M9l2l1K7K7rrj0rj6j6j6j6j5j5
-7092A69M4M4MMMMppk1k2J07j27J21j12J47q7J03j31J2J3K2K3j73K18j42R4j9j36L4L5J12
-7061C30oj76N8Q5l1N7o1M3M3j5j6m8O9p1M7jj18M3J60j77R7q9J06j45N0R4j79J34o0K4K5
-7030B72N7n9OPN2N2m6m5j3j3M6p1O6n1K4K5j37J37M9o9l5l5J49k04J30J3l4l3m4P4o6N2M0
-6997B96p6R4R4r5r6J00j7L1q5Q2j12L6L6p4J22o5J30r9J8M5p3opQ2l6q0J16o4o3pJ09j17
$$ plain form
-7231 414 341 302 262 267 272 272 272 272 272 270 269 209 149 224 299 183 302 301 300 240 181 352 288 259 230 250 270 261 251 274 296 274 253 176 334 301 269 298
-7193 298 327 195 298 294 290 279 268 258 365 215 300 299 298 312 325 294 264 225 187 258 211 392 181 223 265 297 329 234 373 308 242 339 201
-7160 201 320 204 315 308 352 279 295 193 248 303 273 242 351 342 207 306 231 391 303 215 240 264 284 303 323 343 321 299 277 255 272 289
-7128 289 232 176 342 273 271 268 348 311 208 339 280 221 366 278 274 270 251 232 222 212 260 309 277 246 273 300 291 282 272 263 247 231 215 199 184 169
-7092 169 213 257 261 265 269 273 266 259 238 216 323 196 317 205 352 265 368 237 249 262 284 307 134 352 210 304 285 149 183 218 330
-7061 330 324 148 206 291 260 317 256 299 342 327 311 263 332 261 308 307 189 232 392 215 312 223 329 184 234 328 149 283 223 247 272
-7030 272 329 270 276 283 335 387 341 296 283 270 316 245 311 260 284 309 172 309 358 289 254 219 368 164 294 307 273 240 196 270 204 256 296
-6997 296 220 314 408 313 217 317 300 331 246 328 216 252 288 214 336 271 401 302 320 365 292 286 279 361 325 245 361 297 234 227 336 219
-6965B19P8k4k5M9N0j7j7Qj10J61j12N8n9j1j0k6k5P3P2l3l2m0m0O6n1QQP4m3M0M0j43J30
-6932C16j41N5N7o0J0J0N6o2M9j47J11oM0M0pj24M6M7l7Q1j21nJ37n8J3J3n2J45n1n2j34O1
-6900B30rJ07n0O6m3m3qJ10n5n4L1L2j60J93j26rJ0J28k8j46J80r4J5J4j19P5Q0l9j8j9J6
-6869B67J5RQk5j43J14lQ8j07j2j2P0m8J7J8n0n1M8M7M1M1J0j08ooL7L8M6p1N4o3Kj14P3P3
-6834B97M8p0n7O0r0J05j44J29m5P2l6Q2j31j3N7N7j6j33N7o0N9N8pJ09j31j4l2l1J47j27
-6804B00K18j34j0j28O0O0l3Q5l3l2m7P0o1N6mmJ13q2KJmll2Q6m6P1n1n1N4N4k6k6J10j63
-6770B70J01j72J28J1q4q4J62l3n9N8M6p1mmj1j1KKKKL3L2m0P6j1j29k8J67o4o4J44n1N4j40
-6736B30P2P1j73J00J15q1j1j1k4k3K7K6p6J20o8M9nnJ6J6j81J69o3o3N6N6ooj52J21o0N6
$$ plain form
-6965 219 297 273 248 297 347 330 313 321 211 372 260 318 259 248 238 212 187 260 332 299 267 227 187 253 202 210 218 292 249 289 329 186 316
-6932 316 175 230 287 227 237 247 303 241 290 143 254 248 288 328 321 197 243 290 253 334 213 208 345 287 300 313 261 406 355 303 169 230
-6900 230 221 328 278 344 301 258 250 360 305 251 282 314 154 347 221 212 222 350 322 176 356 262 277 291 172 247 327 288 270 251 267
-6869 267 282 291 299 274 131 245 242 330 223 211 199 269 221 238 256 206 155 203 250 291 332 342 234 228 222 259 297 343 272 326 263 265 151 224 297
-6834 297 345 275 218 278 188 293 149 278 233 305 269 351 220 207 264 321 305 172 229 169 228 286 279 388 257 243 211 180 327 200
-6804 200 418 284 274 146 206 266 233 318 285 253 206 276 215 271 267 263 376 294 296 297 293 290 258 344 298 369 318 267 321 375 349 323 433 270
-6770 270 371 199 327 338 254 170 332 299 240 298 344 273 269 265 254 243 245 247 249 251 284 316 276 352 341 212 184 351 287 223 367 316 370 230
-6736 230 302 373 200 300 415 334 323 312 288 265 292 318 242 362 294 343 338 333 349 365 184 353 290 227 283 339 333 327 175 296 236 292
-6704B92rrJ63j11N8n9m3P3opK5r2J44K8o7N0r0K8M9M9j07RK1K1l1l0P5P6r3J03ppNOL7L7
-6668E81q7J47M6J64j2J05Q9R0J62p2Q7l1rk44J00k91L9p9m0l9j72O3j04J4m4P2k1k0JJj82
-6637C14N2rJ09k4k3rrm6P2j26J08n8n8N4N4n5n4R7R7j83N1O3O4j33j6p6J57j4j3%Jl1l1l0
-6603B95l1j4j3M6M5RRQRj05j06Q5Q6j09J25N9n7MNq3L4J29j05j7j7J3J29k29J61O2j74R3
-6571C46k4P9j56J33J5p4p4J6J7j1j0J29j06l9P7j34R9m5m6J67o7jJ15j62P2N4o3l6Q2q7J08
-6540C74j22P5J00j73o4K10o4o5J1J2n7n7Q0Q0n9n9R7k1O7n0n0n1P9P9j11Q4j06J68l2l3n7
-6509B85n6j3J82k34L9%J17N0o7J3J4r3K4rJ07LKLLl9j55K45j06l4l5O4O3l00N2O2O2L0q7
-6476A92k9Q9j9j8K8J45j43k6Q4j11j1j1J38n7N9n9mnN8N8m0m0J2J1MMP2m6l2l1o4N3n7J38
$$ plain form
-6704 292 283 274 437 326 384 325 282 355 349 342 367 275 419 447 380 430 340 368 417 466 359 368 389 410 379 349 424 500 407 510 503 496 501 507 544 581
-6668 581 494 641 687 851 839 944 1033 1123 1285 1213 1300 1269 1260 1016 1116 825 864 785 745 706 534 597 493 507 463 535 514 494 495 496 314
-6637 314 366 357 466 442 419 410 401 355 427 301 409 351 293 347 401 346 292 389 486 303 354 417 481 348 332 256 413 399 386 386 387 356 325 295
-6603 295 264 250 237 283 328 337 346 354 363 258 152 237 323 214 339 398 341 345 350 267 301 430 325 308 291 304 433 204 365 427 253 346
-6571 346 322 401 245 378 393 319 245 261 278 267 257 386 280 241 318 184 283 238 192 359 292 291 406 244 316 370 307 271 353 266 374
-6540 374 252 327 427 254 190 400 336 271 282 294 237 180 260 340 281 222 319 298 365 315 265 214 293 372 261 345 239 407 375 342 285
-6509 285 229 216 398 164 203 203 320 370 303 316 330 237 261 252 359 362 364 367 370 331 176 421 315 281 246 310 373 73 125 187 249 279 192
-6476 192 163 252 233 215 243 388 245 219 303 192 181 170 308 251 310 251 247 242 300 358 318 278 290 301 305 309 381 335 303 272 208 261 204 342
-6442C42j02J5J9K0NNo1N7k0j9N4o4POjjpoj4J03m6m5l8l9J2J3P1P0k8k8k77K70J2J2k0k0
-6406B57M0p7J28j06j2J06j13LJ54q1j32J02LLm1m1P4P3l1l1L3q4n9J74J7j01K3K4M5j88Q0
-6375B42Q0o7o6J6J7J18j16R6j38LJ21n7n8L5L5k3k3K4K4K5K4o4o4M9M8q2J53j70O4K1K1o2
-6343B26o3P5P4p6p7J54q0Q5j48M2M1l1l1N8N9l9l9M9M9M4j91Q1Q1j24j24J93m1m6m6N4N5
-6312B64m4m3J7J8J0J0O9m7j14J21MLo2N5Q4j49J21j14J0J0J28j08k6k6N7N7k8k7L8L9j24
-6281B03oJ19j16K2K1QPl0l0M3M3j22J13j9j9KKKLj6j7J09j26Q6l1m6m6O3n4K61k87J03J03
-6248C48j61P4k2k1J24j09klJ23j12o7N0Q7j47J56p8P3j61L5L5K1K1lllll0k9K9K9l0k9O9
-6215B61O8k6k7k7k6PQM9o9J52k39J95l9K4r3Q2l4llj1j0J0J0K5K4q4J51j87M8J02j31K1K2
$$ plain form
-6442 342 240 255 274 294 299 304 243 300 280 261 315 251 258 264 263 262 255 249 235 338 292 247 209 170 182 195 266 336 308 280 3 273 285 297 277 257
-6406 257 297 220 348 242 230 336 223 226 380 299 167 269 272 275 234 193 267 340 309 278 311 227 168 342 359 258 281 305 350 162 242
-6375 242 322 255 189 205 222 340 224 320 182 185 306 249 191 226 261 238 215 239 263 288 312 248 184 233 281 199 352 182 246 267 288 226
-6343 226 163 238 312 236 159 313 233 318 170 212 253 222 191 249 308 269 230 279 328 372 181 262 343 219 95 288 247 201 155 209 264
-6312 264 220 177 194 212 222 232 301 254 140 261 265 268 206 261 345 196 317 203 213 223 351 243 217 191 248 305 277 250 288 327 203
-6281 203 197 316 200 222 243 251 258 228 198 241 284 162 275 256 237 239 241 243 246 230 213 322 196 282 251 205 159 222 168 429 142 245 348
-6248 348 187 261 239 218 342 233 231 228 351 239 172 222 309 162 318 240 313 152 187 222 243 264 261 258 255 252 222 193 222 251 221 192 261
-6215 261 329 303 276 249 223 230 238 287 218 370 131 326 287 311 218 300 266 263 260 249 239 249 259 284 308 224 375 188 236 338 207 228 250
-6182B50o2N5r2J43J9r7L4L4J4j02Q7j46Q8k9P4m3J22j11NNP3m5j18J16L3q4M1M0M6j89P9
-6151B40Q0nmn6O1r4J41m3m2l2l1M1M2q5J49j00J7q1L5k3k3N6N6lln1n0QQl8l9O0N9QQQRk3
-6113B60k2J97j93j1j0K4K4J6J6Q9j45k5k6R2j43M5M4L0L0k7k8L1L1nnnojkrqP3m3j17J18
-6078B89K0r7M2M2K7K8p0p0K4K4j15J19N9n8n1n1J13j22J43r3L6L5M3p4r3J42j29J05k3k3
-6048B22qqOPOPJ6J6J7J6k8k7L0L1k6k5M5M5j17Q0m6P2j4j32R4j02J65j09M1p6J5J6r0J06
-6014B45j1J84j56l8LLJ8J8j08RJ50m4k0j9n6O1Q9j85RJ26mmMMo9o8J00J00J3j05r4J78j8
-5981C15j7o0n9L7L8p2J23m0m1k8k8P1P1k7k6ooooJJKJM0M0j35N9O4n3o0o1L0K25j39N7J7
-5945C22j00M9M8j02R3p1M6j17P8k4k5R6R5j51M4l9l9M0L9n4O2j57J17L1L1j20P5k8k9M2M3
$$ plain form
-6182 250 188 243 151 294 313 216 250 284 298 196 283 137 225 196 270 227 349 238 243 248 321 276 158 274 307 223 264 304 350 161 240
-6151 240 320 315 311 255 316 222 363 320 278 246 215 256 298 213 362 262 279 198 233 210 187 243 299 296 293 242 192 200 208 170 131 191 250 258 266 274 283 260
-6113 260 238 435 242 231 221 245 269 285 301 390 245 220 194 286 143 188 232 262 292 265 237 268 299 294 289 284 278 277 275 266 258 331 288 171 289
-6078 289 309 212 254 296 323 351 281 211 235 259 144 263 322 264 213 162 275 153 296 203 239 274 317 243 150 292 163 268 245 222
-6048 222 214 206 212 219 225 232 248 264 281 297 269 242 272 303 277 252 297 342 225 305 259 331 317 185 279 177 342 233 274 198 213 229 139 245
-6014 245 234 418 262 224 227 230 248 266 158 167 317 273 253 234 178 239 328 143 152 278 274 270 274 278 209 141 241 341 354 249 155 333 315
-5981 315 298 238 179 216 254 182 305 265 224 196 168 239 310 283 257 251 245 239 233 234 235 237 238 278 318 183 242 306 253 193 132 162 387 248 305 322
-5945 322 222 271 319 217 310 239 285 168 246 222 197 293 388 237 281 242 203 243 282 228 290 133 250 281 312 192 267 239 210 252 295
-5914B95n2n1M6M6nnnnJ%J47q8j55Q0rq%J%%MMMMKKKKj2j3j2j3M1M0j94J97Q0j55O0O0m5m6
-5872B45J3J3kkjkrrJ24j12J8J9n6n5Q1Q2r5r5N0M9q2J52JKj15J19j3j3p1J63q1q0opK1K1
-5836B67K1K2k0k0L9L9r4r4R6R7J06k85J64p0j2j3L2L1QQj24J10p2p3J71o2j0rk4k4J19J18
-5804D42j49j50K22j3j10J24n1n2R5j39J3J3j6j6J71o4l0k9k6k6J94j96K3K3p4J60l6l6j4
-5775B53j5k1R6j90K01o7o6N5N6j4j5j4j4K5K5k7R0j32J01j55Q0M3M3j21mJ47q8ppK3K4l6
-5743B69l5O3O2p4p5Q0P9p2p2J29j06K5K6j5j5J02j32J28j07J0J1K8K8l1l0RJ0m2P6j17J17
-5712C29N9n9j3j4J11j23L9M0p3p3R3R3m4m3J0J1J0J1m6m5K8K7j36R8Q4j51J31j03J4J4op
-5680B66ooN1N1%%q1L6J02j32noM6M6q1L5J09j26oJ12j01J33p8p7mmN6N5m2m2L4L4p1p1P0
$$ plain form
-5914 295 243 192 238 284 279 274 269 264 265 265 412 324 169 249 240 232 232 233 233 233 237 241 245 249 251 253 255 257 245 232 220 207 248 288 94 291 371 216 276 336 291 245
-5872 245 258 271 269 267 266 264 255 246 370 258 276 295 239 184 265 347 252 157 207 256 174 326 327 329 214 333 320 307 236 399 318 238 232 225 246 267
-5836 267 288 310 290 270 309 348 254 160 256 353 459 174 338 268 256 243 275 306 314 322 198 308 236 163 334 272 262 253 229 205 324 442
-5804 442 293 143 365 352 242 366 315 263 358 219 232 245 229 213 384 320 290 261 235 209 403 207 230 253 179 339 303 267 253
-5775 253 238 217 313 123 324 257 191 246 302 288 273 259 245 270 295 268 358 226 327 172 252 295 338 217 213 360 272 265 258 281 305 269
-5743 269 234 297 359 285 210 290 369 297 225 354 248 273 299 284 269 371 239 367 260 270 281 309 337 306 276 285 295 253 329 212 329
-5712 329 388 329 316 302 413 290 329 369 296 223 316 409 365 322 332 343 353 364 318 273 301 328 192 290 374 223 354 251 265 279 273 266
-5680 266 260 254 305 356 356 356 275 311 413 281 276 270 316 362 281 316 425 299 293 405 304 437 359 282 278 274 330 385 343 301 335 369 298 227 297
-5645B97m7P8j57J87m9L7q0K3K2J6J5MMMNj1j0j1j0JKRRq9K7J52q3QPppm0m0MMJ46q8j32J02
-5606C02q9J45N0o7j01J33N3o5Rj09O3O2j08J26j30J04j04J2P2m6J64p1r5K3r9J36l3l2q3
-5577B22J51r8J37j26J08j6J02j03j03M1M2j2j1mmm9O7P5j59K7K8J2J3RRRRn2n2M6M5l7l7
-5544B89J00J00n4n5NMk8k8J12oj72O2P5P4j74O1J2J1J08j26rrJ13j22J8j00N4N5N4N4j61
-5513C17m4J27j07j0J08K7K7j8j9q4q4J37K1m5J89q7q7K6K6l2l2J2J2J42r3q6L1LKJ0RJ8J8
-5480D34J1J0J2j05P7j56J93m2L6q1N6o1K17j73K1K1p6p6J56p7J35j00k3R3m5m6J0RRJ0L9
-5449D88M0n1n1k0R8j88K03n0n0J8J8R4j39J41K4k38J53q1L5k4k4M2M2j4j5L7q0J12j23K22
-5419F19j70K8K9J8J8j46Q8J4j02J50L3lj21j06J28p6J57r7J9L4q3N8N7jjj18%L1L1J1J1J0
$$ plain form
-5645 297 250 328 171 358 309 346 266 289 311 327 342 346 350 354 359 348 338 327 317 318 320 329 338 249 276 428 345 353 360 353 346 306 266 270 274 420 332 200 302
-5606 302 213 358 408 341 240 373 426 361 370 261 324 386 278 404 274 378 274 286 358 312 476 405 310 333 234 370 337 305 222
-5577 222 373 275 412 286 394 378 480 377 274 315 357 345 334 330 326 277 344 419 260 287 315 327 340 349 358 367 376 324 272 318 363 326 289
-5544 289 389 489 435 380 385 389 361 333 445 439 267 329 404 478 304 365 377 388 496 370 361 352 465 343 361 261 315 370 424 478 317
-5513 317 273 400 293 283 391 418 445 427 408 324 240 377 398 353 542 455 368 394 420 388 356 368 380 522 429 343 374 377 379 389 398 416 434
-5480 434 445 455 467 362 439 283 476 434 470 389 445 384 601 428 449 470 394 318 474 397 532 432 409 502 457 411 421 430 439 449 488
-5449 488 528 477 426 406 504 316 519 469 419 437 455 549 410 551 575 337 490 409 444 420 396 438 480 466 451 488 408 520 397 619
-5419 619 449 477 506 524 542 396 484 498 396 546 579 576 455 349 477 401 558 461 480 514 431 489 546 545 544 426 426 457 488 499 510 520
-5387E20J1m1m1N0N0Nj11k6R1R1j04P9l8K8K8n3O4J7j00MJ22jkk6j43J01J00j02J5j7J00L
-5355F74j15J11pj17P9noPOn8n9J05j3K3K3J6J6qpppnnj2J05l9l9K7K7o5o4P2P2MLj06Q8j0
-5317G04j0r3J81m4m3R8j9k0j9L2L3M5M5p9L8ooJJPPo0N8J1J0M0M0j77J75j27j28K19J02j64
-5283H52m7J43n3J48L1k13O1J08q8k7k7R3k5j7J00K7K7ONqrJ30j04J08rj22J12k6k7O3O2l8
-5251A236Q0k02J89M2p5K3K3M9N0J84k07P9l8O8O8j3j2Q9j46R7k1J69o5N3o5J36r8Q4Q5p3
-5221A789p2J42J42j9k0J86k04J85m8J83n1Q3l4J73N6Q5l2L4J51o3J72M7M7L2L3K23j2Q8Q8
-5192C384P3P4J01J01J02J01R7R7J48L1K51J7J41K58J16K34J16L51J3K47J30J30L49L49K12
-5167G223K12K55K54L92L92L00L00N17M00K22M56N73M57L06N41O56M21P17M82N41N41M87M86
$$ plain form
-5387 520 531 490 449 499 549 554 443 417 508 599 495 574 536 564 592 539 603 620 520 524 646 645 643 617 474 575 675 573 588 571 671 674
-5355 674 559 670 663 546 625 620 614 621 627 569 510 615 602 625 648 664 680 672 665 658 651 646 641 629 734 695 656 683 710 645 581 653 725 729 732 626 714 704
-5317 704 694 601 782 738 695 793 774 754 735 767 800 845 890 811 849 843 837 838 839 846 853 793 851 862 872 912 952 775 950 823 695 914 1016 852
-5283 852 805 948 895 1043 1074 861 922 1030 942 915 888 981 956 939 1039 1066 1093 1099 1104 1096 1087 1217 1113 1221 1212 1090 1202 1176 1149 1212 1274 1236
-5251 1236 1316 1114 1303 1345 1270 1293 1316 1365 1415 1599 1392 1471 1433 1501 1569 1556 1544 1633 1487 1584 1563 1732 1667 1720 1655 1791 1693 1777 1862 1789
-5221 1789 1717 1859 2001 1982 1962 2148 1944 2129 2081 2264 2213 2296 2262 2435 2491 2576 2544 2578 2729 2666 2838 2885 2932 2964 2997 3220 3208 3296 3384
-5192 3384 3457 3531 3632 3733 3835 3936 4033 4130 4278 4309 4560 4577 4718 4976 5092 5326 5442 5793 5806 6053 6183 6313 6662 7011 7223
-5167 7223 7435 7690 7944 8336 8728 9028 9328 9845 10245 10467 10923 11496 11953 12259 12800 13456 13877 14594 15076 15617 16158 16645 17131
-5144A7131M28M28M82M82L06L06K25K26J01j6L3k02j75j74l37l36l81l80n43l08o43n26n14
-5121A5613n14o31l96n35m18n58l22n56l21m82m82m01j67m63l45l00l00l23l22k08k09k13
-5099G147k14m05j4l15q0j52k69j30j30j82j83j24j25j34j35p6p6j32j33j62j62L5L5j82o5
-5074C637Jk33p9p9j05J29j65m9j8j9j59m3j06J28j33j33J6J5q2q2m5m5l7Q0j75N9j75O0L
-5045B166j15K5K5p4p4K3K4m6m7K8K7j61P4n9n8OONOm6m6j7j7o7o8L0L1K4K5m9m8N7j76P9
-5011A493l7k5k5m7m7J54q1pppol6l6K7K8ONn6O2j29J05p9L7oj23N5N6j35J00n3O5j6j6l7
-4977A182l7l8l7Q9R0o2o2J21j13J06j28M8j87K34j58J44r1j3j3mnKLp4M4J17j18m8O9m1m2
-4946I78M3M3m0m1n3J82j80N4L8L7ool7l6ppK1K1p6p7O1O1l7l7Q2Q2j79N6p9L8L8p9J28j07
$$ plain form
-5144 17131 17559 17987 18469 18951 19257 19563 19788 20014 20115 20099 20132 19930 19755 19581 19244 18908 18527 18147 17604 17296 16653 16127 15613
-5121 15613 15099 14468 14072 13537 13119 12561 12239 11683 11362 10880 10398 9997 9830 9367 9022 8722 8422 8099 7777 7569 7360 7147
-5099 7147 6933 6528 6514 6199 6119 5967 5698 5568 5438 5256 5073 4949 4824 4690 4555 4479 4403 4271 4138 3976 3814 3849 3884 3702 3637
-5074 3637 3638 3405 3326 3247 3142 3271 3106 3057 3039 3020 2861 2818 2712 2840 2707 2574 2590 2605 2523 2441 2396 2351 2314 2394 2219 2278 2103 2163 2166
-5045 2166 2051 2076 2101 2027 1953 1976 2000 1954 1907 1935 1962 1801 1875 1816 1758 1764 1770 1775 1781 1735 1689 1672 1655 1588 1520 1550 1581 1605 1630 1581 1533 1590 1414 1493
-5011 1493 1456 1431 1406 1359 1312 1466 1385 1378 1371 1364 1358 1322 1286 1313 1341 1347 1352 1296 1358 1229 1334 1255 1292 1286 1163 1218 1274 1139 1239 1186 1251 1235 1219 1182
-4977 1182 1145 1107 1070 1159 1249 1187 1125 1246 1133 1239 1111 1159 972 1206 1048 1192 1101 1088 1075 1071 1066 1068 1071 997 1041 1158 1040 992 1061 1020 978
-4946 978 1021 1064 1024 983 930 1112 932 986 1024 1061 1055 1049 1012 976 969 962 983 1004 928 851 912 973 936 899 981 1063 884 940 861 899 937 858 986 879
-4912H79P6m1M9o8R3k5m7P1n4n4q0L7m9J86j81N3N4o4P4m2R6j38m2P6J27j07l0k9J5J5k3k2
-4880H05j4j5j5J02j02J31Nj13K6K7o9o9L6L6p0M7J13j22k1k1N4o3j32K58k7k7mnmml0k9J02
-4847G86j33L4L3J9J9j7j7j7j7l2l2O6O6m2m3p0J65r2K6j72O2J29j06M1M1nmmnn0n0QQL8L7
-4812F70j67K23j83N1J34j01jjk4k3N9n7J25j09J16j19N7o0P1m6J2J2m2m3J6J6j3j2k7k7J63
-4781F70p1l7l6K4K3k7R0j18J17j47l0J62p3J5J32j77N6j02J32l2l3J14j21K1K1OOo1o0J29
-4751E93j05k0k1P7P7j12J22N7j79J10pj4j5n0n1RQrrJ96l8j61P4j4j4K8K9j5j6j21J13j9
-4719E03j8J6J7RRK9q8J83k07J36r8nnJ23j12Q6l2l5l5R7k1j42R3K6r1k9Q9J5J6j8j7j7j7
-4686D60rrqrM7M7m4m3k2R6j02J32J6J5p5p4M9o7K18j73J2J1M5M6q2q1J48q7L8L8j09J26r
$$ plain form
-4912 879 955 914 963 895 988 963 916 987 933 879 799 836 787 973 792 845 899 835 909 867 963 825 783 859 986 879 849 820 835 850 827 805
-4880 805 791 776 761 863 761 892 897 784 810 837 768 699 735 771 701 748 861 739 718 697 751 688 556 814 787 760 756 751 747 743 713 684 786
-4847 786 653 687 720 739 758 741 724 707 690 658 626 692 758 716 673 603 768 676 702 530 592 721 615 656 697 692 688 684 679 629 579 587 595 633 670
-4812 670 503 726 543 594 728 627 626 625 601 578 637 580 705 596 712 593 650 590 661 615 627 639 597 554 570 586 573 561 534 507 670
-4781 670 599 562 526 550 573 546 636 518 635 488 458 620 547 562 694 517 573 471 603 571 538 652 531 552 573 579 585 524 464 593
-4751 593 488 468 447 524 601 489 611 668 489 599 592 578 563 513 462 471 479 470 461 657 619 458 532 518 504 532 561 546 530 409 522 503
-4719 503 485 501 518 527 536 565 477 660 453 589 491 486 481 604 492 578 546 511 476 573 552 410 503 529 438 409 498 513 529 511 494 477 460
-4686 460 451 442 434 425 472 519 475 432 410 506 404 536 552 567 492 418 467 400 618 445 457 468 513 559 477 396 544 457 495 533 424 550 541
-4653E41qjk%j18J78n7o8o8J06j2R3j41N6N7j14J21q4L4P9l7mj20J13lQ9j45KKM1p6R5j00
-4620D49l4Q3K6K6r0K6poL7L7p5M1Q6j10L0K9m1m2J1J1n7J38j16P9j2j1n2O5j3j3R0j06K1
-4587E00K2j36J39N0o7J6J6lmP2j24Q8j07O2n6O9O9j08Q7j62J89KJo7o6mJ13j14Q2o2N5L8
-4555E90p9l8l8P9l9J7J7m8m9P1P1N2j44J0J27m8m9N0M9k6k6Q9j83o7N1L2L1J0J0K3K4k3k4
-4522E22p5J21n6n5P9l9rJ08n8n8N2o5o0N8P9l7J3J4j48J26j9j9N7N7p1p1J9K0Q4l3M0p7j5
-4489D84j4N2o5K6J43o7o6N2N2j48M8k0R8j25j25L10j99P0P0J08j66m5J49j97P6j26K25k5
-4461E75k5j34O0J28k25R1R1l2Q5p6M1kkJ2j04K6K6L9p9l6J59n5n6K1K0N0o7L9p8L9L9ppj9
-4427E37j9Q8j08Kj14J81O5q0L8o9o8M3M4r3K4J14q1J36n9m8m7n6J40j03R3q0L7J59j14L0
$$ plain form
-4653 541 533 532 530 530 412 590 533 465 397 503 491 584 443 499 556 442 563 479 513 592 555 551 431 544 541 630 485 487 489 530 454 549 449
-4620 449 415 498 524 550 460 486 479 473 510 547 472 513 599 489 519 548 507 465 476 487 430 568 452 531 519 508 456 521 508 495 585 479 500
-4587 500 522 386 525 575 508 524 540 537 533 605 481 569 462 524 468 537 606 498 585 423 612 614 615 548 482 478 591 477 559 497 552 590
-4555 590 511 473 435 514 475 492 509 461 412 483 554 606 462 472 599 551 502 552 601 575 549 638 455 388 439 471 502 512 522 545 569 546 522
-4522 522 447 568 512 457 536 497 488 596 538 480 532 467 407 465 544 507 520 534 386 512 493 474 531 588 517 446 465 485 569 536 576 499 484
-4489 484 470 522 457 483 626 559 493 545 597 449 497 477 575 450 325 635 436 506 576 684 518 473 622 425 501 375 600 575
-4461 575 550 416 476 604 379 470 561 529 614 538 579 577 575 587 483 509 535 574 495 459 618 563 507 528 548 598 531 570 492 531 570 563 556 537
-4427 537 518 606 498 500 386 567 632 552 590 521 453 496 540 447 471 585 504 640 581 533 486 430 570 467 560 480 517 676 562 592
-4397E92q7R3k4l4Q4o7M9Q0j15J9J9j33J40j3j4MLMLJ3J2%JP7j19J02r4N1N0n9n9%JP3P4j30
-4361E96J04j02J34j4j3KJM4M4pJ10j26J09j6j6OOn2n3j9k0j9k0L2L3M6M7j71O2j0j1K2K1
-4328G50PPJ07j28J36r8QQ%J18j83N2K5K4k1k0k1k1P4P4k3k4NMJ9J8o4J70j18J17J29k62K09
-4295A078k5L1J48O8O7l5l5K3k11R7j38j3j3rJ08j48Q6m8m8l4l3R9J00l8l7J6J6o4N3J81n4
-4264A188j45R1L8L9l7l6n4O4J15j19J01j33M3M3rj0L5L4Q8j46J25j10m7P1J28j05n5O3J22
-4235A382Mm0J95K4r4j4j4k27J65l9J96k19J6N0N1PPJ6J6m3m2L0L1J04J04j62P2j32J02K1
-4205A567K1J02j32O5n1J25PPPN9N8%%O5j69Q9k8P4m3J56p8M7p1J00j6K7K7J54q1n8N8o8J66
-4172B186q3J51n4O3J36J9k0k0Q5Q5p8J56r3J42j0K25j64K27k6R1M9N0J10J11J10J11M5M5
$$ plain form
-4397 592 505 598 574 540 624 557 606 686 571 590 609 476 616 603 589 593 596 600 603 616 628 628 629 706 587 689 595 646 696 637 578 578 579 652 726 596
-4361 596 700 598 732 718 705 707 708 752 796 789 899 773 882 866 850 856 862 810 757 738 718 699 679 711 744 790 837 666 728 718 707 729 750
-4328 750 757 764 871 743 879 781 789 797 797 915 732 784 809 833 812 792 771 750 824 898 875 851 856 860 879 897 833 1003 885 1002 1131 869 1078
-4295 1078 1053 1084 1232 1300 1367 1332 1297 1320 1109 1206 1068 1055 1042 1033 1141 993 1079 1031 983 949 916 1015 1115 1077 1040 1056 1072 1008 1061 1242 1188
-4264 1188 1043 1134 1172 1211 1174 1138 1084 1148 1263 1144 1245 1112 1155 1198 1189 1179 1214 1248 1336 1190 1315 1205 1158 1229 1357 1252 1197 1260 1382
-4235 1382 1386 1346 1541 1565 1471 1457 1443 1216 1381 1342 1538 1319 1335 1385 1436 1443 1450 1466 1482 1439 1397 1427 1458 1562 1666 1504 1576 1444 1546 1567
-4205 1567 1588 1690 1558 1623 1572 1697 1704 1711 1718 1777 1835 1835 1835 1900 1731 1820 1792 1866 1823 1979 1901 1948 1877 1977 1961 1988 2015 2169 2088 2030 2088 2020 2186
-4172 2186 2103 2254 2200 2263 2399 2418 2398 2378 2463 2548 2470 2626 2533 2675 2665 2890 2726 2953 2927 3018 3067 3117 3227 3338 3448 3559 3604 3649
-4144C649K35KK12K12J00J00K68K68K14K14k4O79J66M01L39N74O46O47O48Q82M72K38K66K66
-4120A1674N05N05P22P23R37R37J166J165J388J387J544J661J756J991J762J762J180O34k62
-4101C3137j278j939k330k473k355k215j825j535j535j061j061r42r43o50o49n99n98n01n00
-4082H148l62l62l54k37l59j25l08p4r6J38J07K23L66N99O46R9m99m99p60o43n77l43m62k28
-4058D038k16k16M3j91j94M1j14Mj32j33n2n1J60k30j0j1k7k8k7k8n3n3O4j70Q1j54K3K2m7
-4029B339m8N8N8j41k4J79n6k0k0K4K3P9P9P8P9J72J73L80K63L71j75k32k32l85j52k24k24
-4002B422j17j16j9j9o2o3mmo4o4L4L3m7m6J58p6j63P1j6j7J7J6l4l5n2O6j32J02PPk2k2j44
-3969A595R1%j17K04j87J1J2R0j44O1n7n8N8k2R5o1o1J9J9j27J07k4k5ooj45Q9N4o3n6O1k6
$$ plain form
-4144 3649 3884 3886 4098 4310 4410 4510 4778 5046 5260 5474 5450 6129 6295 6696 7035 7609 8255 8902 9550 10432 10904 11142 11408 11674
-4120 11674 12179 12684 13406 14129 15066 16003 17169 18334 19722 21109 22653 24314 26070 28061 29823 31585 32765 33399 33137
-4101 33137 31859 29920 27590 25117 22762 20547 18722 17187 15652 14591 13530 12588 11645 10995 10346 9747 9149 8648 8148
-4082 8148 7786 7424 7070 6833 6474 6349 6041 5967 5871 6009 6116 6339 6705 7304 7950 8049 7550 7051 6291 5648 5071 4728 4266 4038
-4058 4038 3822 3606 3649 3458 3264 3305 3191 3195 3063 2930 2878 2827 2987 2757 2747 2736 2709 2681 2654 2626 2573 2520 2584 2414 2495 2341 2364 2386 2339
-4029 2339 2291 2349 2407 2266 2242 2421 2365 2345 2325 2349 2372 2451 2530 2608 2687 2859 3032 3412 3675 4046 3871 3639 3407 3022 2870 2646 2422
-4002 2422 2305 2189 2170 2151 2089 2026 2022 2018 1954 1890 1924 1957 1910 1864 2022 1946 1783 1854 1838 1821 1838 1854 1820 1785 1733 1799 1667 1769 1776 1783 1761 1739 1595
-3969 1595 1686 1686 1569 1773 1586 1597 1609 1699 1555 1616 1559 1501 1559 1537 1632 1571 1510 1529 1548 1421 1528 1504 1479 1473 1467 1322 1411 1465 1402 1346 1407 1381
-3937A381j43Q2Q1j86M9J07j27OPJ53k38N6N5o7o7K8K7l1l1KKj3j3P0j65J30J3k8k9n0n0J22
-3905A133j12K7r0M3M3k3k3O8O8p6p6L1q7J11j23M9M9rrj26J08r7J37k9l0j4j5M0M0n7n7M1
-3873I35M2k4k4P9l9M7j87R4j41R4k3M8o9l6Q2P4j99Q6l1j6j7P4P4J8J8j39N7j02R4Lj14M3
-3841H01M3q9K9j5j4ppN1N1j64L2J05j2r8K0RRQ3l5l0l0l7l7Q1Q1pk02K04j47Q5Q4k8k24P1
-3807F56m5J79r5J16q0o9J26j20lP7P6j55L9n3O3J0Rk6k6O1n5L1q6K3K4M9o9J00j73J8J36
-3776G38JJj29j2J17p8J12q2PQM7p0J8J8P7m1r9J8j6j6N8N7r0K8m6P1l3l2M1p7O1O0K6j69
-3742E74M2M3j09Q7K4K5p5M2p2J23q9J06o0o0J1J1pqppRRQRj3j3m7J87n5n4J9J8l3l3J21j14
-3706F12M1p7J3J31r0K7o1o1J09J08k07K8P6m0P4j60J4J4J61p3l2l1J2J3K7K8M3M2j57P8m8
$$ plain form
-3937 1381 1238 1320 1401 1215 1264 1371 1244 1250 1257 1410 1172 1228 1283 1216 1149 1177 1204 1173 1142 1144 1146 1133 1120 1190 1025 1155 1168 1140 1111 1061 1011 1133
-3905 1133 1021 1048 958 1001 1044 1021 998 1066 1134 1058 982 1013 926 1037 914 963 1012 1003 994 868 976 879 1016 987 957 943 928 968 1008 951 894 935
-3873 935 977 953 929 1008 969 1016 829 923 782 876 853 901 832 796 878 952 753 839 808 792 775 849 923 941 959 820 877 775 869 872 758 801
-3841 801 844 755 784 769 755 748 741 792 843 679 711 816 804 706 726 735 744 827 792 762 732 695 658 739 820 813 611 815 668 753 837 809 585 656
-3807 656 611 790 695 811 731 662 788 668 665 742 818 663 702 649 712 722 731 705 679 740 685 716 630 653 677 726 657 757 584 602 738
-3776 738 739 740 611 599 716 638 750 668 675 683 730 660 678 696 773 732 633 651 635 619 677 734 644 672 626 697 664 632 673 596 657 717 743 574
-3742 574 616 659 550 637 661 686 611 653 581 704 615 721 661 601 612 623 616 608 601 594 603 612 620 629 616 603 556 743 688 634 653 671 638 605 726 612
-3706 612 653 576 589 720 630 657 596 535 644 752 545 573 649 609 683 523 537 551 712 639 607 576 588 601 628 656 699 741 584 662 614
-3675F14m7m4P3j03J31J2j05QJ24k7k8L8L9k8k7JKRJ0q6J48j13NllQ3j51N1J68m6m6n9J76
-3642G76j80N4mnn9n9P0P0N4o4J34j01jkj6j6j0rJ29j05k0R7j16J18l9l9m6P0O3j73J33j01
-3610F03J80k11J9J36nj23J24j11J53j21m1m0O8O9j76J76j08Q7J1J2j29O7q8J08m6P0j51M3
-3582E76PPN6N6q3L4kkl9l9J9K0j0rO1O2j53M2q7J09J6j01J09q6O4n3k8Q9j01J7R8r8J9K0
-3548E90j3J05J0j86J07j0r5J00o9o8M5J62j62m5J99p5N3j43R7k1k5J70Kj16j11Q5o2N6j60
-3519D20J93j10QO2O1k6k7l9m0J22p4POj3j4M5M5k7k7J4J5j27O8m9O9m2m2J02j5q7J09qqm0
-3485E31l9MJ21j36N9J6j02R7k0j2J82j14j15nm%JL0L0pqPQo0J75j18j18qK27q2q1POn2J82
-3450F02j54Q1j10J24k2k2PPj12J22j0j0L7L7o1o1nmK4K5j7j6M2M2j2j3j2j3qrJ16j19P4m3
$$ plain form
-3675 614 567 523 596 493 624 636 531 539 663 636 608 646 685 657 630 631 633 642 652 566 714 601 606 603 600 683 532 583 751 705 659 600 776
-3642 776 596 650 646 641 582 523 593 663 717 653 787 686 685 683 667 651 641 632 761 656 636 733 617 735 696 657 611 681 744 571 704 603
-3610 603 783 572 591 727 722 599 723 612 765 644 603 563 631 700 524 700 592 679 690 702 573 640 552 660 614 684 533 576
-3582 576 583 590 646 702 619 653 651 649 610 571 590 610 600 591 652 714 561 603 516 625 641 540 649 563 627 574 546 635 534 551 649 551 570 590
-3548 590 577 682 692 506 613 603 508 608 539 471 516 678 516 471 670 595 648 505 602 581 556 726 728 612 501 586 524 580 420
-3519 420 613 503 511 573 634 608 581 542 502 624 550 557 563 550 536 581 626 599 572 586 601 474 542 493 562 520 478 580 565 478 587 579 571 531
-3485 531 492 496 617 481 540 556 454 551 531 519 701 587 472 467 463 463 464 494 524 517 509 516 524 464 639 521 403 395 622 540 459 466 472 420 602
-3450 602 448 529 419 543 521 499 506 513 401 523 513 503 540 577 516 455 450 446 470 495 478 462 504 546 534 521 509 496 488 479 595 476 550 507
-3416E07QQ%JJ%j8j8j9j8L8L8j81K09k6k6j7j6p3J61r5K2l0k9L6L6j3j3j3j3kkK7K7RJ0n7
-3379D59n6O8m9J49q5k7k7J48q5J8J7LLo2o3lmL5L5NOOOn2n3P8P7p4p4R8j36O8O9j23J11j68
-3343C18O7J48q7J26j09N8o0J09j25J03j31L0K9O3j72l5J99n6n6Q3j51Q3l3P6P6o4o5noK7
-3313D40K8m6m6J58p7p6J58r1r1K1K2J%JJMNNNLMN4o2P9j56J33J5m6m5NOJ0RJ0Rnnnnl8l8
-3272C54P4P4j29J05R5k96P6P7pomnmmK9L0K9L0l8l8l7l8L8L9k0k0M0M0n8n8l1l1P4P3l8P8
-3236D93j19J15k6k6k6k7J18j17Q4l07K38MJ4J4PQJ5J5m5P2o5o5J10q5L2L2o7N0N1o7k3k3
-3204C84M1M1j19P6q4J10l4l5j5j5NJ22o8M8j3j4o4o5Q4Q5jjj17P9J22j51N6N6J4j03r4K3
-3172C53M0M0j5j32P8P8m6P2j48J26l1l0k8Q9O3n3O8k05J18JJ8r9O1O2J6j02M3p4J7J33o3
$$ plain form
-3416 507 515 523 523 524 525 525 507 489 470 452 490 528 347 556 530 504 487 471 398 559 464 486 456 427 463 499 486 473 460 447 445 443 470 497 506 516 459
-3379 459 403 471 422 571 486 459 432 580 495 513 530 533 536 474 411 408 404 439 474 479 485 491 497 445 392 470 547 473 399 497 361 429 498 375 486 318
-3343 318 385 533 446 572 463 521 461 570 445 548 417 447 476 539 367 332 531 475 419 502 351 434 401 477 553 489 424 419 413 440
-3313 440 468 422 376 534 457 381 539 448 357 378 400 401 401 402 403 407 412 417 422 425 429 483 421 500 344 477 492 446 401 406 412 422 431 441 450 445 440 435 430 392 354
-3272 354 428 502 373 478 573 277 353 430 423 417 413 408 404 400 429 459 488 518 480 442 405 367 405 444 424 404 444 484 426 368 337 306 380 453 415 493
-3236 493 374 489 463 437 411 384 502 385 469 162 400 404 418 432 439 447 462 477 432 504 439 374 484 399 431 463 396 446 497 430 407 384
-3204 384 425 466 347 423 339 449 415 380 365 350 355 477 409 457 444 430 366 301 385 470 469 468 351 430 552 401 457 513 527 424 330 353
-3172 353 393 433 418 286 364 442 396 468 320 446 415 385 357 446 509 456 524 319 437 438 456 357 418 480 496 394 437 363 380 513 450
-3141D50o3j6J00o9M8mlj9R8%j17k1k1L0L0p5p5K14j39J02j5K8q8M8o9J06q8l1Q7o5N2L0q6
-3108C59R6R6j95JP4P4p7M1j47M8N4j41J17J17m5m5K8K8j39R5K3K2l1l2K8K7n0n0Q7Q7m3m3
-3076D64j3j4l5l6K4K3PPPOJ%J%j4j4j5j4K3K4j09J26JKo5N3J11j24J6J5K1K1k6j43J70o3
-3040D38J27j08Mj13Q7l0J38r7p5M3L4q3J9J9RRQROPqqJ34j00k7k7JJN9O0q8q8J30J2j26J07
-3004D83l1l2K9K8q8J45j50Q3r2K5m8O8O9O9rrj41R4l1l0R7R7j15J20j66O9n6O1k0k0K1K0
-2972E40qrJ8J8M7M7j2j2J7J7jjjkO3O3p4p4K2K2L7L6j02J33%JPPL6L6M9N0NNl8J97kjN3o4
-2932A125J04j30N2N3j46Q9j18jQ7l0j21J13j43R2q7J48k8k8%%J25j09R5k1L7q1lmj1j1oo
-2900A036JJL4J50j45R0L6L6QPJ44q9K7K8J84n0J14K31J63J63Q0j55m1j59k02q6j07j07l4
$$ plain form
-3141 450 387 371 471 402 450 446 443 424 522 522 405 384 363 393 423 348 273 487 348 450 435 463 375 423 354 460 372 341 428 363 415 445 359
-3108 359 455 551 356 357 431 505 428 469 322 370 424 283 400 517 472 427 455 483 344 439 462 484 453 421 449 476 426 376 463 550 507 464
-3076 464 451 437 402 366 390 413 420 427 434 440 441 441 442 442 428 414 399 385 408 432 323 449 450 452 387 440 551 427 443 458 479 500 474 331 501 438
-3040 438 565 457 461 348 435 405 543 446 371 414 448 365 384 403 412 421 429 438 444 451 443 435 569 469 442 415 416 417 476 536 448 360 490 502 376 483
-3004 483 452 420 449 477 389 534 384 467 375 400 352 420 489 558 549 540 399 493 462 432 529 626 511 631 465 534 478 539 519 499 520 540
-2972 540 532 523 541 559 606 653 641 629 646 663 662 661 660 658 721 784 710 636 658 680 717 753 651 784 784 785 792 799 835 871 920 970 975 980 942 1139 1137 1136 1189 1125
-2932 1125 1229 1099 1151 1204 1058 1147 1029 1028 1115 1085 964 1077 934 1026 939 1087 1059 1031 1031 1031 1156 1047 1142 1121 1158 1077 1074 1070 1059 1048 1042 1036
-2900 1036 1037 1038 1072 1222 1077 1167 1203 1239 1247 1254 1398 1309 1336 1364 1548 1498 1612 1843 2006 2169 2249 2094 2053 1894 1692 1606 1499 1392 1358
-2871A358l4j36j8P7j58M1M1j8j8j37R7ono3o2P4P5k9k8JJl3l3J64p0k6R2j06J1q3L4p3J61
-2838A091k05J86j9k0M3M3M3M2n8n9R3R3r2J42n6O2l5l4L1L1q9q8l0l1j0j1p6p7Q8k9J05k85
-2806G89J65p0J19j16n9N9J02j32J32J5j05J2P0m8K6K6QPj29j29R1R1n3n3j2j30J65o9jjJ02
-2775H72j33R7j36R8j37J60p4M2M3l7l6n6J78j33J02j6j5J7J8N1j82M6M7j07J0J02j31PQj2
-2745F93j2j2j1M9M9j6j7K1r7J45q9J03j31M5M5N0M9q7q7L0L0k9k8j2j2M6M7K8K9l1l0k0j9
-2712G19k7k7R8k0p8J56r0K7k3R3r0K8j49M7P2m5L4q4J19Lj41k4LLJ14j60q5L3QQJ1J2O2j33
-2678D74J11J11j91Q2l9l9M9M8q4J11j96J55j7j6K0r8LJ20j1j2j4j3O9m8j28J45p4M2p5M2
-2648E27k4R3j%j04R2llj01R5k7k6N2o6K7K6l9m0K1K0q2J13o8M9p1M7ppPj09j4j4J47m8o9
$$ plain form
-2871 1358 1324 1188 1170 1247 1089 1130 1171 1153 1135 998 1095 1089 1084 1021 959 1033 1108 1079 1051 1052 1053 1020 987 1151 1081 1055 1147 1041 1052 969 1003 930 1091
-2838 1091 886 1072 1053 1033 1076 1119 1162 1204 1146 1087 1180 1273 1181 1323 1267 1329 1294 1260 1291 1322 1233 1145 1115 1084 1074 1063 987 910 998 969 1074 789
-2806 789 954 884 1003 887 828 887 989 857 989 1004 899 911 981 933 959 985 993 1000 871 742 833 924 871 818 806 676 841 772 771 770 872
-2775 872 739 836 700 798 661 821 747 789 832 795 759 703 881 748 850 834 819 836 854 905 723 769 816 709 719 821 690 697 705 693
-2745 693 681 669 658 707 756 740 723 744 647 792 703 806 675 720 765 815 864 777 690 720 750 721 693 681 669 715 762 790 819 788 758 738 719
-2712 719 692 665 763 743 665 821 731 758 735 828 738 766 617 664 736 691 725 641 760 763 622 598 601 604 718 558 473 506 514 522 533 545 607 474
-2678 474 585 696 505 587 548 509 558 606 522 633 437 592 575 559 579 481 484 604 593 581 567 554 623 575 447 592 518 560 485 527
-2648 527 503 596 595 595 491 583 580 577 476 571 544 518 570 504 531 557 518 478 499 519 437 550 482 531 460 507 500 493 500 391 377 363 510 462 393
-2613C93o9J92q1J26j47N6o1J3J3P1m5nmr0K8J25p1j1j2L1L1k8k7L2L2j36N9J4J3j16J58j24
-2581C60P1j0j0p7J17j46J28j4j4J5J5j07Q9M5p3OOj4j4J09q6J6J6j3j30J82j3k7k8N1N0l9
-2549D61j55J20Kn6O1j3j2L4L4n2n1o9J27n7O1M3p5rrQ9k8M5M5r9J8K6r2n8O0O0n8k1R6J4
-2515D82j04J27j46L2L2J37k93J96%k1k2kJ15o0n9mJ14j74R9J1j06P3m3PQK9q7L2q5J41n5
-2484C74M8M9m1m1J0J0R5k3m2m2m0J55j67J07j7j7%Jl5l5P0P0o9M8onp0J25j10QJ5J5l6Q1
-2450D85m6P2j49M7m7P0O8j28K8K7O7j29M8M7Lj14P8P7k59J4O8O7m4m5K1J38r1K5M6M5p2M5
-2418D62n3n3j4J03l4l5L8p8P3P3j06J2O7n0K3K3rrQ8j07P6j19L0L0Q0l7r6K2M0M0l8l9j14
-2385B89Q1P3j21P7m0O7m9Q1j14nmK0J38j44k6R4j01Q1Q2r1K5l3l3n3O3j0j0P3m6RQJ13q3
$$ plain form
-2613 393 324 516 435 561 414 470 409 422 435 506 461 456 452 362 390 515 444 433 421 452 483 455 428 460 492 356 415 429 442 326 484 360
-2581 360 431 421 411 334 451 305 433 419 405 420 435 328 417 462 389 395 401 387 373 482 396 412 428 415 285 467 454 427 399 450 500 461
-2549 461 306 426 428 372 433 420 408 442 476 424 373 304 431 374 435 478 403 394 385 474 446 491 536 437 455 481 389 331 391 451 393 372 468 482
-2515 482 378 505 359 391 423 560 267 463 463 442 420 418 533 473 414 410 524 350 449 460 354 427 384 391 399 428 341 373 288 429 374
-2484 374 422 471 430 389 399 409 504 481 439 397 357 512 345 452 435 418 418 419 384 349 419 489 420 468 462 457 387 512 402 410 425 440 404 485
-2450 485 439 511 362 409 362 432 500 372 400 427 494 365 413 460 463 349 427 504 245 259 327 394 350 305 326 464 373 398 444 489 417 462
-2418 462 409 356 342 445 411 376 414 336 409 482 376 388 455 405 428 451 442 433 521 414 490 371 401 431 511 474 378 400 440 480 442 403 289
-2385 289 370 443 322 399 359 426 377 458 344 339 335 355 493 349 323 417 316 397 479 388 413 380 347 294 357 347 337 410 364 373 381 494 411
-2352D11L9j56O7O8MLk4R3nj22K1K1m0P7q6J10l9m0o8J26j95P7JJR5k1j26O9K5K5j15J21j2
-2319D05j2l0l0Q0l7P2j62L6L6r6J39n2n2K7K8l1l1N9O0l8l9m2m2N6N6ONm5P1j53Q2J47q7
-2286C86l2l2N8N8j56l9K03l1%%j4j5NMj1j0Q9j46M4M5j9k0j9j9jjjjRQJKK8r0J82k09J40
-2249C96r4K8K8o1J75j07J1j35J00J36k54P0P1j3j2n5n5M3M3j5j6j6j5L0L0n0O7J62p2p0p0
-2218B80L6L5k3k3K3K3k0k1j19J15M2M2o4o4J80n4j25J10l7l7K5K4K4K5o2o2L5L6NNK0J9j39
-2185B54R4n2n2K07k8j64P0J3J2l1l1K4K5M4j90K01l3n3n3J7J8J8J8j6j6j5j6K2K3K2K2m3
-2153C11m3J6J6PPQPl1l1J00j33L8L9N8j77O4O4q3J52p1p0J73o0j6j5l0l1POPOK4K3l5l6L1
-2117C02L0k8k8K0K0NNR1j43M8M8o0o0L8L8l1l2M1M2j23J10k0k1M5M5j61P5R0j44J35j00J6
$$ plain form
-2352 411 450 294 361 429 433 436 412 505 500 378 399 420 380 457 371 481 442 402 334 460 265 342 343 344 439 418 292 361 386 411 296 417 405
-2319 405 393 363 333 413 376 448 286 322 358 262 401 349 297 324 352 321 290 349 409 371 332 290 248 304 360 366 371 326 397 244 326 473 386
-2286 386 354 322 380 438 282 243 446 415 415 415 401 386 391 395 384 374 463 317 361 406 387 367 348 329 328 327 326 325 334 342 343 345 373 283 465 256 396
-2249 396 302 330 358 297 472 365 376 241 341 477 223 293 364 351 339 284 229 272 315 300 284 268 253 283 313 263 330 492 420 350 280
-2218 280 316 351 328 305 328 351 331 310 191 306 348 390 326 262 442 388 263 373 336 299 324 348 372 397 335 273 308 344 349 354 374 393 254
-2185 254 348 296 244 451 423 259 329 342 354 323 292 316 341 385 195 396 363 310 257 274 292 310 328 312 296 281 265 287 310 332 354 311
-2153 311 268 284 300 307 314 322 329 298 267 367 234 272 311 369 192 256 320 237 389 318 248 421 361 345 330 300 269 276 282 289 295 319 342 307 271 302
-2117 302 332 304 276 296 316 321 326 417 274 322 370 310 250 288 326 295 263 304 346 223 333 313 292 337 382 221 296 386 242 377 277 293
-2085B93J6p2p2J96l8mlj3j2j2j3P5P5q6q6n7J78q7J49p0o9LMqrqrN4N3j37R7j7j6M2M2L0
-2049D09k04J18j17O3O3L1q6p6J59j05J29n5O3l3l3q0J55j60P5n2O6o6N1P0j64P2P3j8j8j8
-2019C12j8ppN2N2m1m1m1m1R0R1j38R5o0o1N9N9r8J9J73k18j5j6N9N8k1k0k1k0N5N6m3m2J4
-1985B75J4%%J14j20J29j05P5j59J56p9l1Q6j26J08k1k1ppllmlj9j8M7M7m8O9j28J05k7k8
-1952B68M5M6l1l2l1l2K9K9j02J31p2p2J25j09O6n1K25k05J90q3Nj12R9j8k6R2m9m8Q3l4m2
-1921B84m2JKO9m8J8J8KLm9m8j6J01o7J28q9K7k6k6L7L7p3J23m5m6m5m5J34o1M9M9p6p6K2
-1887B26K2%%N3o3J18p7K5r1J30J4pj23P1m6J%R1j05J3J2kJ14o8M8r5K2m4m5J46K8j09RM1
-1853C09M2l0j46J36J9M6p2K7K6r8J9m2P6m8m9R5k1qpk7R0p4p3L6L6k2k3M1M1J7j01l4Q2R
$$ plain form
-2085 293 309 237 165 361 323 319 316 303 291 279 266 341 416 330 244 187 365 278 427 357 288 291 295 287 278 270 261 315 368 231 328 311 295 337 379 409
-2049 409 205 323 206 269 332 363 277 201 360 255 384 329 392 359 326 246 401 241 316 264 330 264 315 385 221 293 366 348 330 312
-2019 312 294 287 280 332 384 343 302 261 220 310 401 263 358 298 237 296 355 257 276 449 231 216 200 259 317 296 276 255 235 290 346 303 261 275
-1985 275 289 289 289 403 283 412 307 382 223 379 300 269 355 229 337 316 295 288 281 278 275 271 268 249 231 278 325 277 346 218 323 296 268
-1952 268 313 359 328 296 265 233 262 291 189 320 248 176 301 192 258 207 432 227 417 334 339 227 326 308 282 374 325 277 360 326 284
-1921 284 242 243 245 314 266 284 302 304 307 258 210 194 295 228 356 267 294 268 242 279 316 243 366 321 275 230 185 319 258 307 356 280 204 226
-1887 226 248 248 248 301 238 356 279 304 213 343 357 350 227 298 252 253 253 344 239 252 264 262 376 308 356 261 283 239 194 340 368 259 268 309
-1853 309 351 321 175 311 330 376 304 331 357 259 278 236 312 264 215 310 289 281 274 247 337 263 190 226 262 240 217 258 299 316 215 181 263 272
-1819B72J0K4K3L2L1j30j3P3P3j74O1l9P8k9k8L7L8j8j9lmj07J27nnkkjkkkkkLLKL%Jqj24
-1778A70J69o6j4j5J31j03k3R4j76N9L1L2nnnnlmN5N5n1n1L1L2j70K20r7r8O9O9k9k9L7L8
-1744C43o1o0O8O8j6j5j08J27onk1k2r4J40p3p4P1P1j8j35K09j82L5L6J1J1MLo2o2R7k1j50
-1711A09K41j86K06j51K39j16j16O0N9j27J08k5k5l3l4K5K5O5O5p2p1K4K3l4l5O3O3j3j2j29
-1681A96K23j26rp3J21K7r1J5J5%%L4q4K8K8O4j31L0L0jj17N3N3o0N7MMq6J10M9o8J43j31
-1648C07J6J5o7o7l6Q2L1L1p4M4r5J01J08q8J8J7j26rL1q6J99p4opp5J21j1j2P4m3o3N4R0
-1615D00j05j3j3l3Q4k6k7k0j9J7J7m8O8L6L7l5j52J56L8o6o6n2J44p6J20p6p6J12nr9R5k1
-1583B96k1J1J2J9r8j1j1J38n8Q6j10pJ09j26O9q3L5n9K14o9o9m2m2R5R5m1m2J7J7o1o0L7
$$ plain form
-1819 272 282 306 329 361 392 262 249 322 395 221 282 243 321 292 264 301 339 321 302 299 295 188 315 310 305 303 301 300 298 296 294 292 290 293 296 298 301 301 302 294 170
-1778 170 339 273 259 244 375 272 249 343 167 226 257 289 284 279 274 269 266 262 317 372 321 270 301 333 163 383 286 188 257 326 297 268 305 343
-1744 343 282 222 290 358 342 327 219 346 340 335 314 292 198 338 265 191 262 333 315 180 389 207 242 278 289 300 304 307 245 183 280 259 109
-1711 109 350 164 370 219 458 342 226 286 345 218 326 301 276 243 209 234 259 324 389 317 246 270 293 259 224 287 350 337 325 196
-1681 196 419 293 284 211 332 359 268 283 298 298 298 332 248 276 304 368 237 267 297 296 179 232 285 225 282 286 290 204 314 363 295 438 307
-1648 307 323 338 271 204 168 250 281 312 238 282 187 288 396 308 326 343 217 208 239 153 352 278 272 265 190 311 300 288 362 319 256 310 400
-1615 400 295 282 269 236 320 294 267 247 228 245 262 214 282 318 355 320 168 324 362 296 230 178 322 246 366 290 214 326 321 222 317 296
-1583 296 275 286 298 317 219 208 197 335 277 363 253 246 355 229 298 215 250 191 405 336 267 225 183 278 373 332 290 307 324 263 203 240
-1551B40L7k3k3L6L5k3k4Q4j50K11j80J57p7K2K2n1n1K5K6J9J8K2r5J10j25n1O6j5j4J6J6
-1520B60qrJ76k14M6p0K46j45QRm5m5J46q9K8K7k8Q9k12J79l3l4M0L9j9j9k6k5J07j28J3J4
-1488B78rrP6m2j07J27KKm1m2RJ0J0RL4L4k3j39K15j75K3K3J24j11j98J93qqJ7J6j6j7j7j7
-1454B23%JN1o5J30j04R3k3q3L3Q5j49M7p0J71o2M2M2j78N7J02j33J46q9JJj4j5M4M3j47K04
-1422C84q3L3j7j8L9p8j2j3K5K4K5K4k4k4L5q3O1n5O9O8j68n0Q1Q1j67J84p1M6k1R7j30O5
-1390C27rro3o3J00j8J51j23o4N3L6L6q8L0J6j80P3P4J1J0PJ24j06J2k4k4rrl0Q8k9l0j8R8
-1356C50o5o5K6K5m0m0J33J5K4r4o1J35m1m1L0L0k9k9K6K7oj22R2R2m4m5k2R5r5K2N5N5j45
-1323B48N0OOONO2j33K8K8N1o6j03R3p8L9j5j4M6M7l4l4j08J65m8m7M4M4l4j51J55L8O5n3
$$ plain form
-1551 240 277 254 231 267 302 279 255 339 189 400 220 377 300 322 344 293 242 267 293 312 330 352 257 367 242 191 257 242 228 244 260
-1520 260 252 243 419 205 251 181 427 282 290 299 254 209 355 266 294 321 293 382 170 349 316 282 322 361 342 323 297 272 379 251 264 278
-1488 278 269 260 336 294 187 314 316 318 277 235 244 254 264 273 307 341 318 179 394 219 242 265 389 278 80 273 265 257 274 290 274 257 240 223
-1454 223 223 224 275 210 340 236 329 306 223 256 341 192 239 169 340 278 320 362 184 241 343 210 356 267 268 269 255 240 284 327 180 384
-1422 384 301 334 317 299 338 260 248 235 260 284 309 333 309 285 320 237 298 243 312 380 212 162 243 324 157 341 270 316 295 392 262 327
-1390 327 318 309 246 183 283 265 416 293 229 282 318 354 266 296 312 132 205 279 290 300 307 431 325 337 313 289 280 271 241 329 300 270 252 350
-1356 350 285 220 246 271 231 191 324 339 363 269 208 343 302 261 291 321 292 263 289 316 310 188 280 372 328 283 261 356 261 283 338 393 248
-1323 248 298 304 310 316 321 383 250 278 306 357 291 188 281 203 242 227 213 259 306 272 238 130 295 247 200 244 288 254 103 258 296 361 308
-1290C08k1k2L0q8Q2l5K4K3LKo3N3l3l3j3j4qJ87j4j3j05J2J10pn6n7P3m4p4J21o3o2P6m1
-1256B38p8J18l7P9L9j57O1O0p6M2poQRr2K5jJ15o7M9p4M2l9m0R3k4k5k5%J17n4n5Pj11J95
-1221C29jj45N1NNK5K5p4M3j6j5n9N8N0o7O6n2onJ12q2K7K7K3K4m3m2N2o5opO8m9r3J02j1
-1185B54j2QQn8N9%Jo4N4j3j2K3K3K3K3n0m9RRPPOPl9l9N9N8KJm5j63K01l4q8K9J26j09l5
-1147A87Q2mmO1O2%jj91M4K9L0j4j4p6p6O0O1J7J7KLN5j80J04J04j73O1M7p1R3k4k4k4M0M0
-1112C23n7n7N0N0L0k04J97l7j8j8N6N7j05j05K18j74M7M6l8l7n8J77j51Q3K4K4n5n5MLJ4
-1081B34J4J3J4l1l2J45r0Q8j46N4N4K9k06N1J67j32J01q8K8j9j9J06j29J41r4K4K4j5j6j5
-1051B55j5J8J8J8J8j9k0k0j9L3L2k5k6PPPQk6k5n0n0J99j91J60p5L5L5K0K0o5o6L3L2k9k9
$$ plain form
-1290 308 287 265 295 207 289 254 278 301 304 306 243 296 263 230 217 203 195 382 368 355 250 262 372 365 309 252 325 281 207 328 265 203 279 238
-1256 238 160 278 241 320 359 202 263 323 247 289 282 276 284 293 201 226 225 340 273 322 248 290 251 211 304 280 255 230 230 347 293 238 245 134 329
-1221 329 328 183 234 239 244 269 294 220 263 247 232 173 231 281 214 280 228 222 217 329 247 274 301 324 348 305 263 315 250 244 237 305 256 163 265 254
-1185 254 242 250 258 200 259 259 260 196 250 237 225 248 271 294 317 267 218 227 236 243 250 256 263 224 185 244 302 304 305 260 97 298 264 176 205 331 222 187
-1147 187 269 265 261 322 384 384 383 192 236 265 295 281 267 191 115 175 236 253 270 272 275 330 150 254 358 185 246 293 222 315 291 267 243 283 323
-1112 323 266 209 259 309 339 135 332 295 277 259 315 372 267 162 380 206 253 299 261 224 166 343 192 275 299 323 268 213 217 220 234
-1081 234 248 261 275 244 212 357 267 355 209 263 317 346 140 191 358 226 327 239 267 248 229 335 206 347 253 277 301 286 270 255
-1051 255 240 258 276 294 312 293 273 253 234 267 299 274 248 255 262 269 277 251 226 176 126 325 134 294 219 254 289 309 329 264 198 231 263 234 205
-1016B05K9L0j2j2J05j29J29j05J1J2J2J2J2J1l3l3l3l3O7O7RQm8m9K5K5j41R3K0K0M5M4r2
-983B71r3K6K6K6K7K4K5p3p3N8N7m0m0O8O9j96J96j85N0M0M1k0j9k0j9j3j4J19j16J9J9MN
-950B49j4j4q7J47kkJ3J3n7n6M1M1J9J9k5k5q1J53l7l7j7j6M2M2l4l3K5K5n3n2Q5Q4p9p9J50
-915C48q4K5K4p3p3n7J79j30J05o9J66p7M1mmJ0J0j74n7J85m9NNrrk5k4J08j27Q9R0j55P9
-882B69j3j4j4j3J16j19J3J4j6j5M3M3l8l9N9N9o4o3L4L4j9j8J21j14j2J04j58P5n4O4o2N6
-850B59Q3l4j9k0J0RJ0J0n1n1m4P4r0J44l9l9J2J1J1J1J7J6n7n8J39r7j03J31P6m1l4l4J37
-817C49r6J16j19l2Q5J9K0j72O3K9K9l0l0J02j32L1L2m1m2O1O1l7l7NMMMnoPOj01R3K8j68
-782A00J36J9l2l2N3o3P7P8j99P5Q4l4j2j2l1l2Q9j06O2O3n3n2jjJ09rqrK7r0Q0Q0r9J9K5
$$ plain form
-1016 205 234 264 252 240 345 216 345 240 251 263 275 287 299 310 277 244 211 178 245 312 321 329 281 232 257 282 141 234 254 274 319 363 271
-983 271 178 204 230 256 283 307 332 259 186 244 301 261 221 289 358 162 358 173 223 263 304 284 265 245 226 213 199 318 202 221 240 244 249
-950 249 235 221 134 281 279 277 290 303 246 190 231 272 291 310 285 260 179 332 295 258 241 225 267 309 275 242 267 292 239 187 272 356 277 198 348
-915 348 264 289 313 240 167 110 289 159 264 195 361 284 325 321 317 327 337 163 106 291 242 247 252 243 234 209 185 293 166 255 345 190 269
-882 269 256 242 228 215 331 212 225 239 223 208 251 294 256 217 276 335 271 208 242 276 257 239 360 246 234 338 180 255 201 265 203 259
-850 259 342 308 289 269 279 288 298 308 257 206 162 236 146 290 251 212 224 235 246 257 274 290 233 175 314 217 114 245 321 280 246 212 349
-817 349 253 369 250 218 303 322 342 170 233 262 291 261 231 333 201 232 264 223 181 242 303 266 229 234 238 242 246 241 235 242 248 147 240 268 100
-782 100 236 255 223 191 244 181 258 336 137 212 296 262 250 238 207 175 264 158 220 283 230 178 177 176 285 276 268 259 286 196 276 356 257 276 301
-747C01r2J1J28l5l6n9N9N1j44m7P0N1N1RRJ7j01M2M2j7j7r1K5j08J65P2j24J1J1k2R5M2j54
-714B15K5K4O4j31NNppK7K6R3k4o0o0l5Q1J4J4j33J41M0M1j18jO4j30N2o4K1K0q1J91k9l0
-680B53J34j39N6o1N3o3JJjJ17j44N1N9N9j43N2K4K3j35K18o4j81J23p2L0L0JJj97J55n7n8
-648A26R7k1l9P8klN1o6P2m4m8O9QQj09Q7rJ09k30J22p6M2L6L6q2L6mmmnPj10J06q8J99p3
-612B72m5P3j04R2JKj12Q3J5J5O3k09J51m3l6l5J73k3j10Q6q6L2q9J85q7L1J2J2l9l9L4L4
-580C09Kj15N2N2j5j4k9k9L7L7q8K9nJ12n3n3O5O4j21P4r5K2j6J01r0K7N6o1J2J3p6p6O1O1
-546B50J1J2LMO4n4J3J2j3j3p9L9N2N1L3j63K8K9J6J7ppopJ3J2j19J15k8k8O8n0q1J54j61
-511A80P3q5J49k7k7ONONk7k8R0j45J27j08J26j07J41r3L1L1j5J02j92K00J3j05Q4Q3qqJ10
$$ plain form
-747 301 209 220 348 313 277 218 277 328 184 137 207 258 309 318 327 344 243 285 327 310 293 202 227 119 284 356 232 243 254 232 327 369 215
-714 215 240 264 328 197 202 207 200 193 220 246 339 315 255 195 160 241 255 269 136 277 317 358 240 239 303 173 225 161 182 202 121 312 283 253
-680 253 387 248 304 243 296 233 234 235 234 351 207 258 317 376 233 285 309 332 197 415 351 170 293 221 251 281 282 283 86 241 184 126
-648 126 223 202 163 241 239 236 287 221 293 249 201 270 278 286 177 264 255 364 134 256 180 222 258 294 212 248 244 240 236 231 238 128 234 146 345 272
-612 272 227 300 196 288 289 291 179 262 277 292 355 146 297 254 218 183 356 333 223 309 223 255 166 351 264 295 307 319 280 241 275 309
-580 309 311 196 248 300 285 271 242 213 250 287 199 228 223 335 282 229 294 358 237 311 216 238 222 323 233 260 316 255 267 280 204 128 189 250
-546 250 261 273 276 280 344 290 303 315 302 289 210 249 301 352 385 222 250 279 295 312 305 298 292 285 298 310 191 306 278 250 318 268 187 341 180
-511 180 253 168 317 290 263 269 274 280 285 258 230 320 175 302 194 320 213 354 261 292 323 308 410 218 418 431 326 410 493 485 477 587
-479E87j25J44q9j19J15O8j66J05j29k3j40L3L3Q9j45J18j15J6J6JKm6m6N2N1J2J1llR9j35
-448B68O2n5K6K6m1m0K4K5l5l4J6J5J6J6o2o2L6L6j8j8M1M1J0J0j29J06L5q1N8n9Q3l4j07
-415A75J27LLj15J20j4j4poP7m0Q8j47R1j05rrL2L3l9l8J02r3J6J7L7L7k8k9L4q3J43n1P8
-381C86l9q3q4L0K9Q1j15L3L3K1K1kkJ3j05k4R4J2J3L7q0k1R6l1l1opj02J71j4j32Q0Q0o5
-347B87o4M2M3p4M2n6O1nmQ9k8j26qO2O2M3j52J8J9OPN6N7j51M4O3O3o9o9Q3l4r9J7O0n8Q
-311B35QN7o0J2J3oJ11n9o0O4n2Q7l1r9J8J01r5Q6j11J44n1M8j46M9M9j5j4lkr9R6jjk8J67
-276D12j50M6n3n2M3M3j43K48j35j8M1M0j1j0k1k0L8L8MMo1o2J23Oj05J30j38R5k9k9J31J4
-244D19j8k52K29oJ07j28P9P8J3J30p5J59R4R3j03j03m4m4p9p8K0J9q7q7J1J1LKLLm2m1R8
$$ plain form
-479 587 462 606 517 398 513 581 415 520 391 368 228 261 294 383 238 356 241 257 273 274 276 230 184 236 287 299 310 307 304 403 268
-448 268 330 275 301 327 286 246 270 295 260 226 242 257 273 289 227 165 201 237 219 201 242 283 293 303 174 280 315 234 292 233 316 282 175
-415 175 302 305 308 193 313 299 285 278 272 349 309 397 250 341 236 227 218 250 283 244 206 308 215 231 248 285 322 294 265 299 216 359 308 386
-381 386 347 264 180 210 239 320 205 238 271 292 313 311 309 322 217 193 287 299 312 349 269 248 344 313 282 276 269 167 338 324 192 272 352 287
-347 287 223 265 308 234 276 220 281 276 272 361 333 207 199 261 323 366 214 232 251 257 264 320 377 226 270 333 396 327 258 341 307 208 225 285 227 235
-311 235 243 300 240 252 265 259 370 311 251 315 263 350 319 220 238 339 244 330 219 363 312 360 214 263 312 297 283 280 278 179 275 274 273 245 412
-276 412 262 308 255 203 246 289 146 394 259 241 282 322 311 301 280 260 298 336 340 344 283 221 344 350 245 375 237 332 303 274 405 419
-244 419 401 149 378 372 479 351 430 508 521 651 576 735 829 922 819 716 672 628 549 471 491 510 423 336 347 358 361 363 366 369 327 286 384
-211C84j37N3J71j59m2Q0l7R5k3nj23qJ10J45r0q7q7P7P8n9n9K8K7l1l1J8J8K5K5p1M6o9J66
-178D28k27J63j64K27k8k8mml0l0O8O8q0q0M2M2N2j82P9P9jj17J46q8m3P5ooooool3l2J37
-143C99n9J4J4O8m9m1m1J0J0L2L2j10J64j43N3L6L5j30J43j21P5J0J1j83R1k6R1L4L5k1j38
-112B95J24p2Q7j09M0M1M3p3qpJ1J2P8l9K1K1J3j04M3p4R4j02P3P3m5m4Q7l0k2R4q0L7j53
-79C25J98r0K7M9M9o0N6p5M2ooo4N3L0L1q0J16O5n3j20J52r2K6L0q7J44n2M4M3M8p0k8Q9J55
-45H89j18M3M2N2N3r5K58M3p3J19J19P9J95J25L20L40M56M69M0k14k14j17k33l8l9J84J84
-18B869J88M22K70N05N36P71R67J200J438J985K190L205M270O067R104J3244J7762J2839l791
0G6041j2620j2574j1245r087p134m714l385k369j667j595j205r05p87p36n02m23l07l74j41
$$ plain form
-211 384 247 300 471 312 270 350 313 408 385 380 257 249 359 504 414 327 240 317 395 336 277 305 332 301 270 288 306 331 356 285 331 262 428
-178 428 201 364 200 427 399 371 367 363 333 303 371 439 359 279 321 363 415 233 312 391 390 273 419 331 288 363 357 351 345 339 333 327 294 262 399
-143 399 340 354 368 436 387 346 305 315 325 357 389 279 443 300 353 389 424 294 437 316 391 401 412 229 320 294 385 419 454 433 295
-112 295 419 347 434 325 365 406 449 376 368 361 372 384 462 423 444 465 478 374 417 343 437 335 408 481 436 392 479 449 427 521 441 478 325
-79 325 523 433 460 509 558 498 554 479 521 515 509 445 498 528 559 479 595 660 607 487 639 547 573 603 516 660 608 652 695 743 673 645 734 889
-45 889 771 814 856 908 961 866 1124 1167 1094 1213 1332 1411 1606 1731 2051 2391 2847 3316 3356 3142 2928 2811 2578 2540 2501 2685 2869
-18 2869 3057 3479 3749 4254 4790 5561 6528 7728 9166 11151 13341 16546 20816 26883 35987 49231 66993 79832 76041
0 76041 63421 50847 39602 30515 23381 18667 15282 12913 11246 9651 8446 7541 6754 6018 5516 5093 4786 4412 4271
19D271j67j67n1n1K35J17M17j29l81l80m82k47l59j25k08K6k22J1j12j12r8r7MMp0o9O7j68
47A457L8q0pJ10j25j25m5J89j46k8L1L0j77N7j77N8O5n1l3l2r9J36j17J16n9n9o6o6K36j54
77H77O6j68L7L6POp4M3J41r3k7k7P5j61P0O9q0q0o4N4J12j23J6J6O2O2o0n9j19J16k3k3P7
110G61m0M1p7m4P4j4j32K46j06L3L3j41k3J58l8m8m8NOo6N0N8n9m2P4j30j3P9l8L6L5l2l2
143E66K6K7j0j1j7j8O4n3O4j31%%M7M7l7l6N6j39K57j6k48J04JJJ8j78K27m7O3n4l1l2k6k7
177D57n3J42p8J18r8r8N8N8n8N8M6p1Q1j14M7M7p6p6J14lN9j37J37K0o8M9k5k4l2l2L4q3j3
210C86j4J48m8lmJ02r3m6P1ppNNJ1J2j04J4J01j73O9O8p4M4kjJ08q6N2o5mmm8O9LMk4k5L5
248D75q3J08j0N7o1j8j9L3L3MMn5n5k0k1R7k0N7o0n6O2j10Q7p5J20K6r1L4L4O3j32R6k2k8
$$ plain form
19 4271 4104 3937 3886 3835 4070 4187 4604 4475 4094 3714 3232 2985 2626 2501 2293 2319 2097 2108 1996 1884 1786 1689 1693 1697 1627 1558 1625 1457
47 1457 1495 1415 1408 1518 1393 1268 1223 1412 1266 1238 1269 1299 1122 1179 1002 1060 1125 1074 1041 1009 910 1046 929 1045 986 927 861 795 1031 877
77 877 943 775 812 848 855 861 787 830 971 878 851 824 899 738 808 877 797 717 653 707 819 696 712 728 790 852 792 733 614 730 707 684 761
110 761 721 762 685 641 715 701 569 815 709 742 775 634 611 769 731 683 635 640 646 580 630 688 629 587 661 531 518 597 559 595 630 598 566
143 566 592 619 609 598 581 563 627 574 638 507 507 507 554 601 564 528 584 445 702 686 438 542 543 544 562 384 611 564 627 573 542 510 484 457
177 457 404 546 468 586 488 390 448 506 448 506 552 481 562 448 495 542 466 390 504 501 560 423 560 580 512 561 536 512 480 448 482 399 386
210 386 372 520 472 469 465 567 474 428 499 492 485 490 495 506 518 414 428 529 356 425 493 419 463 461 460 568 482 534 469 465 461 413 482 485 489 465 440 475
248 475 392 500 490 547 486 468 449 482 515 519 523 468 413 393 372 469 449 506 446 390 452 342 429 354 474 500 409 443 477 540 408 504 482 454
282D54j45J21p5N0M9o5J30p1M6j55J19m9O7m0P8r6K1l8l7J2J2J2J2j0j0M4p3P7j17M3p4P6
314C68m2J6J7J%O7n0QQO6n0MMk02J51ooQ9k8o3N3J34j39ppl2l2P5m2L6L6j12Q4j29J45M0p8
351C77ONJ7J7K8K9j27O8K5r3m8m8J01j6O0n7O8n0QQp3M4Q2l6N4N5j88Q7o8M9j5J01j13Mp0
386B91M8J07j1J6j01L3L3j63J10O1O1r3K5j15KR0k7N4N3j50l3J89j62P1m5P2m5j4J04k8k8
417D05j7j8nmq7J08j38J36j19J55r1J03k0k1p4M3OOJ4J3RRJJN2o6p8L9J9j76R2k5P2j24J40
452C60n5M3p4L9L9KKonO3n4MNL7p9k2R6%%onN7j38O9O9j8j9M1M0J7J7J7J7OPO5O4p6p7O3n5
493E50j34J01j78N7P2m4k3k3kkO4j71J10pL9j95R9R8l8l8j01J33JJ%%%%ooooN2N3m5m6j1j1
531C37j8j8J24Oj56P7k1k2opJ4J4J4J4J4J4K9K9j43R2m0m0K8K9l0l1J6J6m2m3P6P6k2k2qq
$$ plain form
282 454 309 430 355 405 454 389 519 448 494 339 458 409 476 436 514 418 439 401 364 376 388 400 412 402 392 436 363 440 323 366 292 368
314 368 326 342 359 360 360 427 377 385 393 459 409 413 417 215 366 360 354 443 415 352 405 539 400 393 386 354 322 397 355 391 427 315 399 270 415 455 377
351 377 383 388 405 422 450 479 352 420 445 352 304 256 357 341 401 344 412 362 370 378 305 349 431 395 449 504 316 403 335 384 369 470 357 361 291
386 291 339 446 435 451 350 383 416 253 363 424 485 392 417 302 304 394 367 421 474 324 291 480 318 389 344 416 371 357 461 433 405
417 405 388 370 365 361 274 382 244 380 261 416 325 428 408 387 313 356 362 368 382 395 404 413 414 415 467 401 323 362 381 205 297 272 344 220 360
452 360 305 348 274 313 352 354 356 350 345 408 354 358 363 400 321 299 395 395 395 389 384 441 303 372 441 423 404 445 485 502 519 536 553 559 566 631 695 619 542 605 550
493 550 416 517 339 396 468 424 401 378 376 374 438 267 377 370 409 214 313 411 373 335 234 367 368 369 369 369 369 369 363 357 351 345 397 450 405 359 348 337
531 337 319 301 425 431 275 352 331 309 303 296 310 324 338 352 366 380 409 438 295 387 347 307 335 364 334 303 319 335 293 250 326 402 380 358 350 342
567C42qqK1K0j19kJ79n6j62P4J63p0N1o6n2O5m9J84o3j80J03j4nnj2j2j1j1O9m7r8J36O3n4
601C66j7j8j0j0r3J42P6m2m1m2J0J0J9K0J00j34m7P1o8o9O7O7JKN2o5j1j1R6r8p2M5J58j16
635C38N8j38P0O9m0m0J9K0L4q3l0Q7m4P2j07J0O4n3R7r9lJ14j1j2QQj33O2j04J69m8m9l2Q5
669C58r0K7l9P8j7j6O3n3m6P2kkk5k5l2l2J28J0q0L7l4Q2l5l4N4N4m4m3PQQPj5j5N1o6j6j7
707B66J23Oj65J86r2K5L8p9J22p4j40J34Q5j11KJ19j15Q0j63L2J54m1j11Q3k6k6r5J00j0r
737B98N3N4j2j2J2j04QPP5j20M8M8JKnoL5q2M2M2l1l2l9P8n7n7P4m3K8K8J3J2M0p7p7L9O5
774C48O4j87Q6M2p5Q6l1o3J33m3m3k0k0R2k5P2j24L1L0K8r0Q7j09K2K1J0RPPj03R2k8k8J01
808C79r4oJ11q5L3j01J6n0O7j1j1N5o2Q5l2l2Q5l6Q1m3m4M8o9lml1l1J22j51O7O7j6J02m0
$$ plain form
567 342 334 326 347 367 248 246 425 369 207 281 444 374 425 359 307 372 323 507 444 264 367 353 348 343 331 319 308 297 366 319 221 357 420 366
601 366 349 331 321 311 218 360 436 394 353 311 321 331 350 370 470 336 289 360 292 223 290 357 358 360 412 347 336 325 421 323 251 296 454 338
635 338 396 258 328 397 357 317 336 356 390 307 277 364 320 392 285 295 359 306 403 304 301 415 404 392 400 408 275 337 233 402 354 305 273 358
669 358 268 295 256 334 317 301 364 311 265 337 335 333 308 283 251 219 347 357 277 314 280 362 327 293 347 401 357 314 321 329 337 344 329 314 365 299 283 266
707 266 389 395 230 416 324 349 387 308 430 356 216 350 435 324 326 445 330 410 247 279 433 392 281 364 338 312 217 317 307 298
737 298 351 405 393 381 393 289 297 304 379 259 307 355 356 358 353 347 382 300 342 384 353 321 282 360 303 246 320 277 305 333 346 358 398 321 244 283 348
774 348 412 225 311 353 278 364 333 270 403 360 317 297 277 369 344 416 292 323 353 381 291 378 269 291 312 322 331 338 345 242 334 306 278 379
808 379 285 279 390 305 338 237 253 203 270 259 248 303 241 326 294 262 347 311 392 349 305 353 284 281 277 246 215 337 186 253 320 304 406 366
842C66m1P0j26Q7l1o0N7J11j63R7r9J13q1n0O7k2k2N2o6L7L7Q1j15k5k5K1K1k2k1p3J22k6
874B71k7J10pn8n8J42n4J1J2jjn2n2M6M6j7j6N7o1o2N5J36j38L6L6r2J04j0j0p0M6P8l9r8
908B63K0J12mo8o8j%P7m0m6J50n8n7o3N4j1j2O7O6r8K0j6j7k4R3L4q3j0j0Q0P9r2K6l3j51
943A79K25j26jJ17j43k5Q1l6J03j5llj21P5j5j5j0rM8o8L6J54j22nq3J13Mj14lJ13k0k1Q0
976C70j16J21j52M7M8kkj5j4J05r0N1N1k87K20l4Q4k7k6q5L2N2N3j01R4q9K9M1p6NNm6P1O0
1010C77n8L0q7n7N9mJ13j93P9J09q6m4P4M1M2j56J18L0q7QQm3J52j81o3J68k7j7j6PQm9O9
1043C24j29O6k5R2jj18J04j4R6r9M1M0p0o9P2P2oj23J33J6n7N9k0j38N2o4O2n4MK00j98ll4
1076B11J61l8l7MMJ7J7J7J7o2o1N5o1J20KP1k03R1k6ppOPj6j5j2J05k6k7K3r5K9L0k5k4P0
$$ plain form
842 366 325 395 269 356 325 265 322 433 270 367 268 381 300 250 317 295 273 325 259 296 333 414 299 274 249 270 291 269 248 175 297 271
874 271 244 354 347 289 231 373 319 330 342 341 340 288 236 282 328 311 295 352 291 229 284 420 282 318 354 262 366 356 346 276 322 400 361 263
908 263 283 395 391 323 255 254 254 331 291 245 395 337 280 217 271 260 248 315 381 283 303 287 270 246 339 373 290 280 270 350 429 337 363 330 179
943 179 404 278 277 394 251 226 307 271 374 359 356 353 232 307 292 277 267 258 306 238 274 428 306 301 218 331 335 221 218 331 311 290 370
976 370 254 375 223 270 318 316 314 299 285 390 300 351 402 115 335 301 385 358 332 247 279 331 384 283 377 288 317 358 282 287 292 246 317 377
1010 377 319 349 262 205 264 260 373 180 259 368 282 238 312 353 395 239 357 387 300 308 316 273 425 244 181 349 322 305 289 296 304 255 324
1043 324 195 261 236 328 327 209 313 299 395 296 337 377 307 238 310 382 376 253 386 402 345 404 384 246 298 234 296 242 246 446 248 245 211
1076 211 372 334 297 301 305 322 339 356 373 311 250 305 244 364 366 437 234 325 299 292 285 291 298 282 267 255 360 334 307 330 235 264 294 269 245 315
1112C15m7K9K8k6k5p3J23J01j73O4n2m8P0M4p3O6n1L2L2m2P5j6j7LLj34O1O2j34L1L0J2J1
1145B81R0k7j00R5n4n4LJ97j84R0k3k2QPL8L7o7o6L1L1mnmnRRQRk3k4k4k4N9O0l9l8j4j4M4
1184B91M5MNJ1J2j23nJ43n2o2N6k3k2L4L4o3o4j3j4NJ23Q7j08N3o4m1P7r3K5L2L2j9j9K0K1
1219C25l8l8K4K5L1L2j11PJ08q6L4L5l6l7j2j3j00R5L2q4R1R1l6l6K2K2j9k0k0j9l4l3J28
1252C30o7K7r0J25p0P4m2j9j8K6K7K7r1J04j3N8j37M4M4P6j19K4r4J41n5j11Q4K8r0L6L7K9
1284C25K9k4k3k3k3j0j0o1J34j0j1O1n7J2j06J53m2L3q5P9j16K7K8l3Q4j48J26o5J30j17%
1315B57j17J56J8r9Q2Q1k6k5j36O0mmJ18p7KKLKj08Q8L6L6l1l2m0l9J23Or6R9%%K4j71N9O0
1351C07mmn8N9poK1K1j76J75m8m9M5M4p8J17j46J27l9l9J24j49P1m7m9J46m6m7l9J56p9L8
$$ plain form
1112 315 268 297 325 299 274 201 324 425 252 316 264 216 286 330 257 323 272 304 336 294 369 353 336 339 342 208 269 331 197 228 258 270 281
1145 281 371 344 244 339 285 231 234 431 247 337 314 292 300 307 345 382 315 249 280 311 307 302 298 293 302 311 319 328 305 281 257 233 292 352 313 275 261 247 291
1184 291 336 340 345 356 368 245 240 383 331 269 325 302 280 314 348 285 221 208 194 199 322 409 301 354 290 249 326 233 258 290 322 303 284 304 325
1219 325 287 249 273 298 329 361 250 257 365 279 313 348 312 275 263 250 150 245 277 193 284 375 339 303 325 347 328 308 288 269 235 202 330
1252 330 263 290 200 325 255 329 287 268 250 276 303 330 239 343 330 388 251 295 339 415 296 320 226 367 312 201 285 313 223 259 296 325
1284 325 354 330 307 284 261 251 241 180 314 304 293 354 297 309 203 356 314 347 262 341 225 252 280 247 331 183 309 244 374 257 257
1315 257 140 296 314 215 297 378 352 327 191 251 247 243 361 284 286 288 291 293 185 273 309 345 314 282 242 203 326 332 236 335 335 335 359 188 247 307
1351 307 303 299 241 300 293 287 308 329 153 328 280 231 276 320 242 359 213 340 301 262 386 237 308 261 212 358 312 265 226 382 303 341
1383C41o9M8q0J15m5m6N1N2j77N6N0M9ONo5o4L3L3k1k0L7L8l9l9K0J9j0j0J22j12LKk7k7J07
1418C36j27J03J02n7n7JKj7j7j7j7P3P4k5k4l3l2K5K6J7J6q1q1O0O1JKK6K5l3l4j2j3j2j3
1453B48P6P5p6p6J18j16M0M0k07J83R6j38J0J0J28j07JJj4j3poooJKj30J04L1L1j3j3o1o1
1487A45J15J15k1k2k2k1J4J5j17J18l7l6L6L7MLp0J64p3p4%%qqqqK5K5M5j90J94l9r9J36j51
1522A87Q4J05j29m7O9J06j1M8o8r1K7Q0j54J18j18N2N1P1j64N9N8j5j5QRL2L3j90K00p8p9
1553B38L3L3jkj45K45j65O9rrONkkj7j7J51q2j0j0m4m5J21j13J65k25N3N3p1J63k7k8j3j4
1587B84j4j4N4N3nnn7n8M0M1J1J2r4r3J51L5J52k39l7Q0lmj05J1J51q4q7J47JJpqo6o6O0O0
1623B98l8l7jjjjK4K4L1L2r0K8o6J70q1L7j46Q8J3J4K8K8l1l2l2l2M9M8m8m9N9N9p8p7P3P4
$$ plain form
1383 341 272 320 240 355 310 264 315 367 190 246 296 345 351 356 291 227 260 293 272 252 289 327 288 249 269 288 278 268 390 278 281 283 256 229 336
1418 336 209 312 414 357 300 301 303 286 269 252 235 308 382 357 333 300 268 293 319 336 352 271 190 250 311 312 314 340 365 332 298 286 273 261 248
1453 248 324 399 323 247 365 249 289 329 122 305 401 263 273 283 411 304 305 306 292 279 272 266 260 254 255 257 127 231 262 293 280 267 206 145
1487 145 260 375 354 332 310 289 303 318 201 319 282 246 282 319 323 326 256 420 347 273 273 273 265 257 249 241 266 291 336 146 340 301 202 338 187
1522 187 271 376 247 200 269 375 364 412 344 253 280 360 206 324 206 258 309 380 216 275 333 318 303 311 320 352 385 195 395 317 238
1553 238 271 304 303 301 156 401 236 305 296 287 293 298 296 294 277 260 411 329 319 309 265 220 341 228 393 168 221 274 203 366 339 311 298 284
1587 284 270 256 310 363 358 353 296 238 278 319 330 342 248 155 306 341 493 254 217 297 294 290 185 196 347 263 176 323 324 325 318 310 244 178 238 298
1623 298 260 223 222 221 220 219 243 267 298 330 240 268 202 372 291 328 182 270 283 297 325 353 322 290 258 226 275 323 275 226 285 344 266 189 262 336
1659C36j17J18r2r1N9O0k8k8R3R4k32J59j10J24j91K00j37R8k7k8l7l7J90k00P8P7QPn1n2
1689B43NNo9J66m9n0RRJ05j29KLN5N4j75N9qqJ39r6lkj7j8N3N2m5m5J2J2J2J2mnnnk5k5r8
1728A26J36K3K3poj37R8%%J80k11RQN3N3j53Q2J01j34J2J3J3J4j03J31r9J35n6n6J11j24Q
1760B43QJ3J4J4J4j6j6j6j7L2L1k7k7MNNNn4n4J22J22n6n7p2p1J74o1J3J3J5J6m3m3R3R2j76
1796B42N9k2k3pqM5M5JJj46Q8J4J5j2j3O1j73P8P7N9j76P0P0m1m2P2P2j43j42Q9Q9q6J47j03
1830B57J31j62P3r9J36r8J35j28J05k6k7J02j33j%j9j9n3J82m1m1J06j29ppN2N1r8J35j13
1860B64J21j68O7n1n0J6J6J34j01R5j40K1K1J06j29J20j15J37r7J9K0k8k8L1L0J%JJj9j9l4
1892B42l4J73o1o6o7J06J06j62P1j9j8N4N5p0p0J01j6KJ20j68K7M5p2POo0o0R4R4j71J03n9
$$ plain form
1659 336 219 337 245 154 213 273 245 217 310 404 172 331 221 345 154 354 217 315 288 260 223 186 376 176 254 331 339 346 295 243
1689 243 248 253 184 350 301 251 260 269 374 245 247 250 305 359 184 243 235 227 366 270 267 265 248 230 283 335 290 245 257 269 281 293 289 284 279 274 249 224 126
1728 126 262 285 308 301 295 158 256 256 256 436 225 234 242 295 348 195 277 378 244 256 269 282 296 193 324 225 360 304 248 359 235 243
1760 243 251 264 278 292 306 290 274 258 241 273 304 277 250 254 259 264 269 215 161 283 405 349 292 220 149 323 262 275 288 303 319 276 233 326 418 242
1796 242 301 279 256 249 241 286 331 332 333 187 275 289 304 292 279 340 167 245 322 381 205 275 345 304 262 334 406 263 121 210 299 213 360 257
1830 257 388 226 299 200 336 238 373 245 350 324 297 399 266 265 265 246 227 174 356 315 274 380 251 244 237 289 340 242 377 264
1860 264 385 217 284 233 183 199 215 349 248 343 203 224 245 351 222 342 227 364 267 286 306 278 250 281 311 312 312 313 314 295 276 242
1892 242 208 381 320 254 187 293 399 237 308 289 271 325 380 310 240 341 325 327 447 279 306 351 279 286 292 232 172 266 360 189 292 233
1924B33n8P6m1J79r5k8k9J3J2P5P5j39j40J17J18n8n8J1J0J1J0pqN8n9j7j8L4q3J21Nk2k3
1957B75j33O2J65j09MLk0k1P7l9RJ0J18j56ONk2R5M3p3n8N9k1k1O6n2K2K2r6K2n6n7J72k5
1991B76j6J78j97q0Q1Q1n4n5N1N1n2O5n9n9M6M6nnk3R4k4k3q3L5Q6j09j3J05q4q3J42n3K5
2024B85r2N7N7l6j53K11k4l6l5M2M3j7j6M8M9q9q8P0P0j20J14m3m2M5M5j34J01r8K0J9J9l1
2056B41l2J2J2J2J2L0L0k9k8MMNMJ4J3J4J3m5m5J45q9%%j03J31M8j87M2M2J15j20j20J14K3
2090B82K3o0o0P2P2k5k6l4l4K5K4J6J6JJJ02j32%%k3k2Q4j49K57j34l9P9j02J32opP6j58l4
2124B17Q4l2l1l2l1P7m1J43r1J07j27j0j0N4N3L7q1q5J50J0j07M8o9J21j13L5L4J3j05J23
2154C41j12K0K0j7J00k4k4NNlkK8q9l8Q0N0o7o7N0K9q7J54m2j2j2k4k4N6N7j14LK1r6L6J53
$$ plain form
1924 233 175 251 210 389 294 266 237 250 262 337 412 273 133 250 368 310 252 263 273 284 294 287 279 337 278 261 243 277 194 315 320 298 275
1957 275 142 204 369 260 264 267 247 226 303 264 273 283 401 245 251 256 234 329 372 299 241 300 279 258 324 272 294 316 220 242 186 129 301 276
1991 276 260 438 241 161 242 323 269 214 265 316 264 329 270 211 257 303 298 293 270 364 340 317 234 269 355 246 233 338 254 171 313 260 285
2024 285 193 250 307 271 118 329 305 269 234 276 319 302 286 334 383 294 206 276 346 226 340 297 255 300 345 211 312 214 234 253 272 241
2056 241 209 221 233 245 257 287 317 288 260 264 268 273 277 291 304 318 331 286 241 386 297 297 297 194 325 373 186 228 270 385 265 145 259 282
2090 282 305 245 185 257 329 304 278 244 210 235 259 275 291 292 293 395 263 263 263 240 218 302 153 410 276 237 316 214 346 340 333 409 251 217
2124 217 301 269 238 206 175 252 211 354 263 370 243 233 223 277 330 367 286 201 351 361 254 302 233 354 241 276 310 323 218 341
2154 341 229 249 269 252 352 328 304 309 314 311 309 337 248 210 290 340 273 206 256 285 198 352 310 298 286 262 238 294 351 237 240 261 165 201 354
2189C54L0j65k9J66j5j32J1j05R9R9j09Q7o3N5KJj5j4l5J62j6j33P7m1j7J00j42N3J7J7l0
2220B69k9M3M4qqp6M1M9o9m7O9n7O0l9J57j7j34QQp7M0J26o8j0j0K8K8p0p0M9M9j7J00l8l8
2255B86j14K38j78R7j46N0L6L5o6o7K00p2j0rq8K9J39n7m4P3j2j3L8q0J40j33kjj1j29J11
2286B40J10o1N7k3k3N8n9k1R6j01J6rj0klK8K9r9R7O5k09N5N6l2l2J00j7n3O5j18P6j2j2M7
2320B99M7O8j26n6J39j38N7K5r2K8K7l8P9j10QM6M7m9m9LKQ1l6L7L7j07J0J57j17NNmnmJ13
2355C89j25oO0n7j00R4Q3l5r8J75j44N0m2P5n4O3j05Q9QQj04J3RJ0P5j20j1J07j5j32J24p2
2387B12K4J41o4o4noP3m4l8l7P0P1j1j0j40J34p4M4j11Q5M1p6O3n4O3O3n2n1PQmmlmj1j0O0
2424B86O0j27O9J7J8k3k2p4J22k1k1rrJ7J6m2m2QQN9N9K2r5m1J54m5m5k0k1l2J63j98P5J0
$$ plain form
2189 354 384 219 190 356 341 209 220 115 214 313 204 291 228 283 285 286 271 257 222 384 368 235 312 271 254 354 212 265 282 299 269
2220 269 240 283 327 319 311 235 276 325 256 209 278 221 281 242 399 382 248 256 264 187 227 353 285 275 265 293 321 251 181 230 279 262 362 324 286
2255 286 172 410 232 329 183 233 269 304 238 171 371 299 289 280 192 221 360 303 259 332 320 307 345 265 405 272 270 269 258 129 240
2286 240 350 289 346 323 300 358 299 278 374 273 289 280 270 268 265 293 322 223 320 385 176 231 287 255 223 323 306 253 318 200 276 264 252 299
2320 299 346 414 288 232 371 233 290 315 223 251 278 240 319 209 217 263 310 261 212 215 217 298 262 299 336 229 239 396 279 284 289 285 280 276 389
2355 389 264 258 318 261 161 255 338 303 205 380 236 286 244 319 265 328 223 312 320 328 224 237 246 256 331 211 200 307 292 160 284 212
2387 212 236 377 313 249 244 238 311 267 229 192 262 333 322 312 172 306 232 276 165 250 291 215 278 224 287 350 298 247 254 262 258 254 251 247 236 226 286
2424 286 346 219 288 305 323 300 278 204 326 305 284 275 266 283 299 257 215 223 231 290 349 371 276 235 389 344 299 279 258 226 389 191 266 276
2458B76RP8j18K1K1r3J01m8O9m4m4M8M7j1j2rqo3N5j03R2o9M9m8O9j28K23n2n2P3j22P3m5
2491B35o3N3R7k0m4m5mmJ06J06j59L8j5j4M1M1n7n7J9K0J2J2J4j04j1J84q4q3K6K6L5L4o2
2524B73o3K2K3n6O1P9j17J%j9j8M0L9P6P5j01j00J2J3P1P1l1l0l1l0L1L1k8k8NNNNLKLLl2
2562B65l1o6J69o6o6L1L2R0j44J93j98J30j06j2j2J13j21J35r9Mj14J08J08k81K65p6J59j03
2590C07j02M2M2L7q0K06j85J6J7j5j5L0q7J10j23N6N6p1p1J37r8L4L5m8m7N0N1K8K9l1l0J7
2622B97J7l5Q3j77N7J04j4p0M8j00J36j8j7o1o1M4M5q7J47j8j9mmm1m0J8J7N3N2poj9j9l3
2656B68l3Q5j49J73o1j8j7K6K7m9m9M1M1k5j42J70k5ppM7p0N9N9k9k8j10J64o0o1J11q4J8
2688B65J8M1p7M7o9J20Ll6l6L1L1q6L1q0L9M5M5r3K3RRJ5j02J5J5J34J6j57L8n6O0J4J5m5
$$ plain form
2458 276 285 363 245 266 287 194 295 247 316 272 228 276 323 312 300 291 283 220 275 172 264 195 244 196 265 137 360 308 256 329 207 280 235
2491 235 172 225 322 302 258 213 209 205 311 417 258 296 281 267 308 349 292 235 254 274 286 298 312 208 197 381 297 214 240 266 301 335 273
2524 273 210 232 255 199 260 339 222 223 223 204 186 226 265 341 416 315 215 227 240 311 382 351 321 290 260 291 322 294 266 271 276 281 286 289 291 294 297 265
2562 265 234 168 337 271 205 236 268 358 214 407 209 339 233 221 209 322 201 336 237 241 127 235 343 62 327 251 410 307
2590 307 205 247 289 326 246 452 267 283 300 285 270 300 213 323 200 256 312 241 170 307 209 243 278 230 183 233 284 312 341 310 280 297
2622 297 314 279 362 185 242 346 332 262 310 210 346 328 311 250 189 233 278 191 338 320 301 297 293 252 212 230 247 300 352 345 339 320 301 268
2656 268 235 320 171 344 283 265 248 274 301 252 203 244 285 260 118 288 263 256 249 296 226 285 344 315 287 177 341 281 220 331 247 265
2688 265 283 324 247 294 225 345 348 312 276 307 338 252 283 203 242 287 332 239 262 271 280 295 193 208 223 357 373 216 254 198 258 272 287 242
2722B42P3J9J9q3J12q9q8K6J42j82R2J1j07P5P5j9j8j8j36J33J5k3k4RRJ0Rl2l1M4M4j34J39
2755C14k1k2Q0l8mj20P2P2l2l3MMo9M8J4j03J21MQ3j12k2k2Q3j13O8O9j16P9l8l8Q5l2l1Q5
2789C19j7j8klm9O9lj20J59l7r7J9O0O0j58L8J17j56J19p6K0K1m3m3J2J29pj25M7M8M7o9R
2822B70RJKNOo1N7k6k5l6l5J63j11N9O0j30J43k01J50l1Q7j21lkjN2N3K8j68M8M7k1R6o0o0
2857B44o3N3R8r8qrK4J41j46M9J44k07M2M3m6P1n3n3oJ10r0K7K7K7j7j6j7j7LMP0m8K9K9m4
2892B97P3n7n8m5P1r6R8MLm9O8o8o8O9j25K03o9n4O4j4J03j65L1K6K6J6J6q7J09p5M3M0p7
2925B53J53q1n4n4k5k5N8N8P6j59J86k05J01j7J0J0M6j89O8n0R1R1j4j4k5k5L4L3o4o4m4J89
2957C48j58P5m8O8JJj30J03O5n3J0j06l0K05m7m6J47q7k8k8J01j33J30j03lkkkj00J34J0j07
$$ plain form
2722 242 315 334 353 270 382 293 205 231 373 191 283 294 187 262 337 318 300 282 146 279 294 271 247 256 265 275 284 252 221 265 309 175 314
2755 314 293 271 351 313 309 189 261 333 301 268 272 276 207 255 269 166 287 291 374 262 240 218 301 188 256 325 209 288 250 212 297 265 234 319
2789 319 302 284 282 279 230 299 296 176 335 298 201 220 280 340 182 220 337 181 300 224 244 265 222 179 191 320 313 188 235 283 330 261 270
2822 270 279 280 282 287 293 232 289 263 238 202 167 330 219 278 338 208 351 150 300 269 356 235 232 230 229 281 334 362 194 242 289 268 364 304 244
2857 244 181 234 332 234 226 217 241 382 236 285 429 222 264 307 261 332 279 226 220 330 240 267 294 321 304 288 271 254 257 261 331 283 312 341 297
2892 297 370 313 255 210 281 185 283 287 290 241 309 241 173 242 117 320 251 197 261 247 350 185 216 242 268 284 300 213 322 247 290 330 253
2925 253 406 325 271 217 192 167 225 283 359 200 386 181 282 265 275 285 331 142 210 160 251 342 328 314 289 264 298 331 267 203 159 348
2957 348 190 265 217 285 286 287 157 260 325 272 282 176 146 351 304 258 405 318 290 262 363 230 360 257 254 252 250 248 148 282 292 185
2989A85O7O8R5j40J4J3j08J26j82K09LMl9l9m0l9rj0Q9Q8l8l7J4j04J46q8L6L6m1m1k3R3R4
3022D02j41kkNMP8j57M9N0k4k4L2L2j51Q4p3M5j5J04j1j0llJ9K0l9l9K1K2QPO6j69Q7l0K2
3058B64K1PPk4j40J93m1J1J0j1j1J3j04J52q2OOj6j6J12mj14J20j33J02j6j5k1k0k1k0OPO5
3092B93O5o5o5j9R9j08J27j23J12j05J1J43r1L4q4K6K6PQj32J02K6r2M0M0M9o8J8k17J99l5
3123B21L6q2J39r6J61p3k0k0K4K4j1j1o2N5q5J50j13LJ17j19llJ72k18l3K02l6l5k1k0N8N9
3155C60p8p8L5L5k4k3%JQQk8Q9j02J33j9R7j02J4j20J14o2N6j38R7k8k7M8M8NMj29J06k7k6
3189B47j7j6J15j20J%M4M4m8m8N0N0l0l0k9l0M9M8j0j0MNMNK2K1j54Q1q8J46j02J31o8o9J36
3224C34r8nok0j9P2P2j1j1q4J50j72O2RRq4J50j86K04n9o0LLLLJ6J5J5J5L1L1K6k08j1j1Q2
$$ plain form
2989 185 252 320 415 275 289 302 194 320 138 347 350 354 315 276 236 197 188 178 267 355 317 280 294 190 336 248 284 320 279 238 215 308 402
3022 402 261 259 257 262 266 344 187 236 286 262 238 270 302 151 235 162 207 192 296 285 275 272 269 288 308 269 230 251 273 281 288 354 185 272 242 264
3058 264 285 292 299 275 135 328 287 298 308 297 286 299 195 347 265 271 277 261 245 357 353 239 359 226 328 312 297 276 256 235 215 221 228 293
3092 293 358 293 228 209 308 200 327 204 316 211 222 365 274 308 224 250 276 283 291 159 261 287 195 235 275 324 256 274 57 256 221
3123 221 257 175 314 218 379 306 286 266 290 314 303 292 230 285 200 350 237 240 357 238 235 232 404 186 153 355 319 284 263 243 301 360
3155 360 282 204 239 274 250 227 227 228 236 244 216 305 203 336 317 414 312 326 206 320 258 314 176 273 245 218 266 314 319 323 194 300 273 247
3189 247 230 214 329 209 210 210 254 298 250 202 252 302 272 242 213 183 232 280 270 260 264 269 273 278 300 321 167 248 160 306 204 335 267 198 334
3224 334 236 231 225 205 186 258 330 319 308 224 374 202 264 273 282 198 348 162 366 307 247 250 253 256 259 275 290 305 320 351 382 408 200 189 178 260
3260B60j52K23j68Q1Q1O2j71J8J9j3j3M5M5p2p1J18j16L7L8l7J99k04L1J2J1k3k2J09j26K8
3290B29K7J3J2J%j31J03mnJ1J0KKKKp6p6J39r6K18j6p8M0k35J56J6J7j05J31J3J3j08J27p1
3324B83M6m5m6Mj14K80j11j43R1J51q4l5l6j5j6M3M3l5l6K3K3ooooPPQPj1j1r9J35R7j38R
3360B58Rk1k1k0k1L8L9J04j31K2r6N3N2k5k6k5k5O1O1j54Q1LK38k27RKKR7k0j39R6J6J5l5
3394B70l6K3K3po%Jp6M1J22j13j05J30j0j0o7N0J16j18n5n5P5P4o8M9J00j34J30j04Q6l1p0
3426B25M8k6k6%JJJL4L4k5k5RRRRm2m2j1J07jkj04R2k1k1N0N0l6l6P4j21k0k0Q5l3J10qj25
3464B03qJ08q7K13k17J%k7k6L3L3L3L4m1m1P0j26M7M7N0o8k2R5j7j34J39K2q4L5J4J5L0q8
3497B36j1j1M8o9P8P8j25pL4J51j93KK3K4K3K3N5j40K8K9nmO1n6j4j4k2k1N8N8o0N8q1L5q8
$$ plain form
3260 260 108 331 163 244 325 387 216 234 253 240 227 272 317 245 174 292 176 213 251 214 413 209 240 252 263 240 218 327 201 229
3290 229 256 269 281 282 282 151 254 250 245 256 266 268 270 272 274 198 122 261 165 383 367 289 329 94 250 266 283 178 309 322 335 227 354 283
3324 283 329 284 238 242 128 408 297 154 245 396 312 277 241 226 210 253 296 261 225 248 271 265 259 253 247 254 261 269 276 265 254 155 290 387 249 258
3360 258 267 246 225 205 184 222 261 365 234 256 160 213 265 240 214 189 164 225 286 132 213 216 454 227 236 238 240 337 317 178 274 290 305 270
3394 270 234 257 280 273 267 267 268 192 233 355 242 137 267 257 247 180 230 346 228 173 118 193 267 199 248 348 214 344 240 326 295 225
3426 225 273 247 221 221 222 223 224 258 292 267 242 251 260 269 278 236 194 183 290 289 287 183 275 254 233 283 333 297 261 335 214 194 174 259 226 336 328 203
3464 203 195 303 216 429 212 213 213 186 160 193 226 259 293 252 211 281 155 202 249 299 231 209 304 287 153 292 314 230 265 279 294 324 236
3497 236 225 214 262 193 271 349 224 217 251 402 209 211 234 258 281 304 359 219 247 276 271 267 328 272 258 244 222 201 259 317 257 315 234 269 181
3532A81K8L9L9j9k0L2q6L9L9jkj3j4J05r0J9J37j54l7LKj4j5N1o6M7M7p0J25k9l0o9J26l0
3566C00l1j8j9j1j1j1j1P9P9j04j04J26J0q6J09o0N7K3r5l0J64j60L5k6k6o5J31j5j4J00j8
3597B98J48k03j3j3k4k4M6M7p2J24k8k7j40J33L8p9M9o9J17p8q9J86j42N3l1Q5j9k0m0P7r2
3628A98J04n5O2o7o7K19n4j78J7mJ13j6j6J07j67L6q1K07o8j23oK2K2K9K9LKLKK7K7l2l2m0
3662B23m0N7N8l8l7k8Q9j73J00nmJ23j50M3J60r2K5k1k1q4J12KKj8j7j06J2J84j68J03j4m1
3694B36m1J42r3L2L2N2j83L1L0J7J6k0j9M0L9m4m4J4J5j5j5j5j5M0M1r2J43l8l9J24j12j01
3726A58J33j3j4k5k6P2P2l4l4J0RO8j68K4K3j2j2k7k6J81n3j12J22k6k6k6k6J17j17J4J4J6
3758B56J5J6J5l2l2J2J2R8j35J13j21J32j03J5J5j5j5j5j5K0J9J9K0nnnonnnnnnnnJ3J3j2
$$ plain form
3532 181 209 248 287 268 248 280 194 233 272 271 269 256 242 347 257 276 413 259 222 225 227 213 198 249 183 230 277 207 332 303 273 204 330 300
3566 300 269 251 232 221 210 199 188 267 346 242 138 264 274 188 297 237 294 317 222 192 356 196 231 205 179 114 245 230 216 316 298
3597 298 446 243 230 217 193 169 215 262 190 314 286 259 119 252 290 211 260 191 308 230 141 327 185 238 207 292 273 253 213 290 198
3628 198 302 247 309 242 175 394 340 162 179 175 288 272 256 363 196 232 151 358 290 167 161 183 205 234 263 266 268 271 273 300 327 295 263 223
3662 223 183 240 298 260 223 195 284 111 211 206 202 325 175 218 378 286 311 290 269 185 297 299 301 283 266 160 172 356 188 291 277 236
3694 236 195 337 244 276 308 360 177 208 238 255 271 251 232 272 311 267 223 237 252 237 222 207 192 232 273 181 324 286 247 371 259 158
3726 158 291 278 264 239 213 285 357 323 289 299 308 376 208 232 255 243 231 204 178 359 306 194 316 290 264 238 212 329 212 226 240 256
3758 256 271 287 302 270 238 250 262 360 225 338 217 349 246 261 276 261 246 231 216 236 255 274 294 289 284 279 273 268 263 258 253 248 243 238 233 246 259 247
3796B47j1J59k31O1O1j09J24ppl7l8K1K1M2M3n5n5J5J4J5J4k5k4L4L4j1j1j0j1ppppRQQQj6
3834B52j6j6j6J9J9L3L4j32J02l0l0QQQQn5n4Q3Q2l0l0l0l0Q0Q0p2p1R3j40J23j11O7O7m5
3868B58m6qrrrK0J9J9K0J2J3j19J15n1n1O2O1l9l9N8N9q6q5L6L7J46q9j5j5J1J2J1J2j3j3
3903B85j3j3JKj30J04K3K3p9J55j43R1k6k6rrOOj12J23NOj03J32%%m5m4j17J17L2L1o6o6J76
3938C17n9j0j0p1J64j44R0j14J21P7j58QQN9n8J8J9J9J9p3M4k2k2kkJ95j56LLj9j9%j%jM6
3974B69M6n2n2OOJ08q8P7m0K1K0r0K7l2l2k8Q9L0q7Q1Q2r7K0N0o7OOj5j4p4M4k8Q9k7Q9q9
4010B54K8k3k3k5R1q4J11q4q5J68j06Q4j11j8R9n1O7P1j24p2J23j25J48k24K05j9j9J5J5r4
4040A92J00L1L2n5n4k0k0M5p1P4P4j41N4J3J3oj24O6O6o7N1j7j7M9o9R9j8l1l1P6j19R5R6
$$ plain form
3796 247 236 395 164 225 286 177 301 294 287 250 212 233 254 296 339 284 229 244 258 273 287 262 238 272 306 295 284 274 263 256 249 242 235 244 252 260 268 252
3834 252 236 220 204 223 242 275 309 177 279 249 219 227 235 243 251 196 142 225 307 277 247 217 187 267 347 275 204 297 157 280 169 236 303 258
3868 258 212 204 195 186 177 197 216 235 255 267 280 161 276 225 174 236 297 258 219 277 336 250 165 201 238 384 295 280 265 276 288 299 311 298 285
3903 285 272 259 260 262 132 236 259 282 203 358 215 306 280 254 245 236 242 248 136 259 264 270 167 299 299 299 254 210 93 210 242 273 207 141 317
3938 317 258 248 238 167 331 187 277 163 284 361 203 211 219 278 220 238 257 276 295 222 266 244 222 220 218 413 257 260 263 244 225 225 224 224 223 269
3974 269 315 263 211 217 223 331 243 320 280 301 321 231 258 226 194 166 255 285 198 279 361 264 284 334 267 273 279 264 250 176 220 192 281 254 343 254
4010 254 282 259 236 211 302 218 329 245 160 328 222 306 195 177 276 225 292 363 239 167 290 165 313 89 294 275 256 271 286 192
4040 192 292 323 355 300 246 226 206 251 180 254 328 187 241 254 267 261 137 203 269 202 253 236 219 268 199 298 280 249 218 294 175 270 366
4073C66n5O3p0M8l1l2r7J37m2m3k7k8L8L8N2N3k21J3R7R6m8m8J1J1K4K4l4l5j8j9J13j21J8
4106B33J8MLK9K8l0l0POK2K1j65P0J28j06QPpprj0J22j12k0k1n5J80j37R8k0k0O0O0l8l8l2
4142B47l3M1M1j47Q8N3N3p5p5K03j88L1L1n2J82j60P3m3m4M2M2j7j7k8k9J04j31Q2Q1j63P2
4173B64k7k7j2j2P7P6p4p5Q3j52J70o4J7J8p0J64m5m5m5m6J34j02L1L1n6n5R5R6j56P7l9m0
4205A91q5J50J8J8k4k5L4L4k0k0k0k0KLKKmmN5N5k6k6k6k5J4J4l0l0n5J79q9r0Q3Q4j95J95
4241C19MMj77N8J20j14L2L2jjjjj1j1j1j1K2K2l7l6rrJ23j11kjK7K8J02j33J4J3j08J26on
4277B50L2L3m1m0J06j29p0J65l0l0J17j17J8J7MLj5j4l0k9J71o4j22J12n6n6N6N6n4n4M4M3
4309B76n6n7KKN6N6m2m2N3N3q4q3Q2Q3j5j5m0m0N8N8o1o2J29j05NON0N0o3o2M2M2j17jJ63
$$ plain form
4073 366 311 374 304 352 321 289 192 329 287 244 217 189 227 265 317 370 149 162 259 355 307 259 270 281 305 329 295 260 242 223 336 215 233
4106 233 251 255 258 287 315 285 255 262 268 290 311 146 216 344 238 246 253 246 239 230 220 342 230 210 189 134 314 177 275 255 235 295 355 317 279 247
4142 247 214 255 296 149 237 290 343 268 193 396 208 239 270 218 400 240 313 270 226 268 310 293 276 248 219 323 192 274 355 192 264
4173 264 237 210 198 186 263 339 265 190 273 121 291 227 244 262 192 356 311 266 221 175 309 207 238 269 213 158 253 349 193 270 231 191
4205 191 106 256 274 292 268 243 277 311 291 271 251 231 233 236 238 240 236 232 287 342 316 290 264 239 253 267 237 207 152 331 242 152 235 319 124 319
4241 319 323 327 150 208 328 214 246 278 277 276 275 274 263 252 241 230 252 274 237 201 192 183 306 195 193 192 219 247 349 216 230 243 135 261 255 250
4277 250 282 315 274 234 340 211 141 306 276 246 363 246 264 281 285 288 273 259 229 200 371 307 185 297 241 185 241 297 243 189 233 276
4309 276 220 163 165 167 223 279 237 195 248 301 217 134 216 299 284 269 229 189 247 305 244 182 311 206 211 217 267 317 254 192 234 276 159 158 321
4344C21p1MMj0j1pqJ16j17M7p0L9M0j1j0j1j0m4m3J71o3j55K36J0j09j0j0J21j13l4Q4LLj4
4378B68j4J%r9J36MLk6k7J20j15j10J25j02J32J4j02R5j39J51q4M1p7P4P4j17J17j26rO4n4
4409B18l4l3R5R6p7p8K0K0M6M6j38R7r0K8J07j26Q2Q2p0o9L1L1m3m2J11j23O8O7m7m8N0N0
4441C27m8m9J7J7l9P8j20J15pql4Q3k64J27P8l9M8M7m0m1j01J72k4k3j37J36j7j7J9J9m0m0
4473A95j0j0J80j72J22Mm9n0K8K7l1l1L1L1l5l5O8m9n7O0Q7l1p4J20P1m7j36N8%JP9l9m2m3
4507B21J19p6kkq3J13R1j83J45n1Qj10J47K9j06j06J16jQ3j13j0j1M6M6j3j2k3k3R5j01k4
4538B09R3r0r0J09qjjmlJJ19j43N2O7n0Rj08O1O1q7J08o7N0J7J7k2k2r6R9L3j62J03j4j2j2
4573B16l7Q1QQJ6j01P5P4j60L5m0J54r4K3l1l1K7K6K6K7o3o3L5L5j1j1llr4K4J70k21J53L7
$$ plain form
4344 321 250 254 258 248 237 230 222 338 221 268 198 237 277 266 256 245 235 191 148 319 256 101 337 347 238 228 218 339 226 192 276 279 282 268
4378 268 254 255 255 156 292 296 299 273 246 366 251 141 266 164 296 310 208 303 164 315 231 272 195 269 343 226 343 217 208 272 218
4409 218 184 151 246 342 265 187 207 227 273 319 181 278 188 216 323 197 279 361 291 222 253 284 241 199 310 187 255 322 275 227 277 327
4441 327 279 230 247 264 225 303 183 298 291 283 249 332 68 195 273 234 282 329 289 248 147 319 295 272 135 271 254 237 256 275 235 195
4473 195 185 175 355 183 305 309 260 210 238 265 234 203 234 265 230 195 263 214 157 217 304 273 199 319 390 343 207 265 265 266 345 306 264 221
4507 221 340 264 262 260 177 290 381 198 343 292 300 190 337 366 260 154 270 269 352 239 229 218 264 310 297 285 262 239 334 233 209
4538 209 302 212 122 231 223 222 221 217 214 215 334 191 243 310 260 269 161 222 283 196 304 237 287 304 321 299 277 181 280 313 151 254 240 228 216
4573 216 179 260 268 276 292 191 266 340 180 215 175 329 235 258 227 196 223 249 275 302 239 176 211 246 235 224 221 218 124 148 318 97 250 287
4607B87p9L9j1J06o6o5R5j40J82n2k3k3K1K1r0q9J79n5MLj1j1J9J9J9J9MLj14J20j25J09p4
4640B21J60j15Kl5l5o8J66j14Ll6J98k4k4k3k3K8q9J17j17QPNNNNM2M2n6n6M3M4j5j5llJ2
4676B62J2j16J18j4j4JJJJrqj6j6O4n3Q7j48N7N7j7j6l3l4O4O5l0l0k6K10o1o1m6m6L2L1l5
4712B34l4M9o7J30j05J3J3J07q7kkM4M4q3q4N3N3J6J6r4J02l4l4k2k1J8J9J8J9K1K1l8l7J0
4746B56J0K2K2r9R6q0L8n3n3J06j2L1j64J13J14o8o8j0rJ8J8J8J8MLK1K0j23J50o3o2J8J8
4779B50J8J8ONn3n3L0L0L0K9n4n5N1N0n8N8j16P8J4J4K7K6o0o0kjJ4J4J3J4n5n6J25p0m2J53
4815C32j37N9n6n5J72k4n9N7p4M3q9J06MMm8m8N0M9J4J5q4q3J10J10o6o6L6L5k3k3opopNM
4851B44NMj7j7j7j7K1K0OOQ8j48K9K9J06j27MMO1O0l7l8r6r5K11k2PPqpj1j1LMr6J40o6N1
$$ plain form
4607 287 208 247 236 342 276 211 306 166 348 296 273 250 271 292 202 113 292 237 241 244 233 222 241 260 279 298 302 305 191 311 186 295 221
4640 221 381 266 268 233 198 130 296 182 185 149 347 323 299 276 253 281 192 309 192 200 207 212 217 222 227 269 311 255 199 242 286 271 256 253 250 262
4676 262 274 158 276 262 248 249 250 251 252 243 235 219 203 267 214 301 153 210 267 250 234 201 167 231 296 266 236 210 420 359 298 252 206 238 269 234
4712 234 200 249 182 312 207 220 233 340 253 251 249 293 337 254 170 223 276 292 308 214 316 282 248 226 205 223 242 260 279 300 321 283 246 256
4746 256 266 288 310 211 307 227 265 212 159 265 253 284 120 233 347 279 211 201 192 210 228 246 264 268 271 292 312 189 339 276 214 232 250
4779 250 268 286 292 297 244 191 221 251 281 310 256 201 252 302 244 302 186 264 278 292 319 345 285 225 223 222 236 250 263 277 222 166 291 221 179 332
4815 332 195 254 198 143 315 291 232 289 215 258 169 275 279 283 235 187 237 286 300 315 231 148 258 368 302 236 272 307 284 261 255 248 242 235 240 244
4851 244 249 253 236 219 202 185 206 226 232 238 326 178 207 236 342 215 219 223 284 344 307 269 173 78 289 267 274 281 273 266 255 244 247 251 155 295 229 280
4889B80P4m4m4m4j34K56j53Q0k9k9J02j32J19j15P5m2l2Q5J1J2k2k2k1k2O2O3p7M1O7j67J11
4920C09j23JJ19k1k0j1j1j1j1M2M3j6j6j5j5j5j5OOONPPPOPPPOj7j7J07j27N2o5j4j4j7j7
4959A62Q0Q0o7o7L0L0k7k7P1P1m5m5m5m5M6M7j2j3j8j8M0M1N0N0j72O3k2R5n4n3L0K9k1R6
4993C60j56P8J3J3popoL0L0j53Q1n8N9PQJ1J1m7m7M1M2r5r5P5P4L1L1j34J01l2l1k3k2N0N1
5029B78r7J38kj18J16j19J45q9n0O7KJj29J05r3K5R4R3r9j00p9J54K3K3n3n3M4M5l6l6P4m3
5061B31J12j23O8n0j2j2n3J81q8q9N5N6jj18J23j10J72o2j28J07n4O2j20J14n8n8Q9j46Q9
5090A77Q9k3k4m1m1O9m8J45r0N2N2j81R2o9o9J65M7l6l6J09q5L6L6j65L0N7N7n9n9M0L9pq
5123B51%%n9N7j6j5N8n8m7P1n7J38j3j30J44j29J20p6O1n6j5j5P6j20R3j03P2m5n0O7p4M4
$$ plain form
4889 280 354 310 266 222 88 344 191 271 242 213 315 183 302 187 262 220 188 273 284 296 274 252 231 209 271 334 257 298 365 198 309
4920 309 186 187 306 285 265 254 243 232 221 263 306 290 274 259 244 229 214 220 226 232 237 244 251 258 264 271 278 285 291 274 257 364 237 289 224 210 196 179 162
4959 162 242 322 255 188 218 248 221 194 265 336 291 246 201 156 202 249 237 224 206 188 228 269 319 369 197 260 238 333 279 226 256 285 264 360
4993 360 204 282 295 308 301 295 288 282 312 342 189 270 212 271 278 286 297 308 261 214 255 297 202 107 182 256 287 318 184 285 253 222 199 177 227 278
5029 278 181 319 317 199 315 196 341 252 202 269 271 272 143 248 155 180 274 367 268 168 89 243 266 289 236 183 227 272 236 200 274 231
5061 231 343 220 288 238 226 214 161 342 254 165 220 276 275 157 280 170 342 280 152 259 205 267 147 261 203 145 234 88 177
5090 177 266 243 219 178 137 206 158 303 213 265 317 136 228 159 90 255 302 266 230 339 254 290 326 161 191 248 305 246 187 227 266 259 251
5123 251 251 251 192 249 233 218 276 218 171 242 185 323 310 180 324 195 315 239 300 244 229 214 290 170 263 160 232 187 137 204 130 174
5155A74R5j01M3M2k9k8J1J2Q5l2q0L7L0q8J8J7n5O1POP2m5O9m9K7K8j88Q5L7L7o8N1rqn8O0
5191B66ooN8N7p2p2p4M2M3M2o1N6KLo3J33j02J6l8l8K8K8NNJ3J2o3N4O1n5j23oN7N8j2j2j2
5228B24j2%J%%lkN6N7o2o1L6L6j5j5j6j5M7M7p8J57j47k9k1k2Q1Q1n6n6mnJ35j00m7P0M1p6
5265B27J32j02QQO4j71K0K0J5J5l7Q1n8J76j58m1N8n9P9l7K8K9K1K1p7p7J14j21O2O2r2K5
5297B35j46K43q1q0J48q7j3J04q9K8n4n5K51j41lmj60P5M0M1j8j7j8j8P2P1p9q0J92m3m7m7
5329B20J3J4l8Q0j07J27j30J05L6L5j40R3k3k3qrj2j3j2j2K4K4K3K4l3l4J3J3Q6j09JKL0L0
5363B90l5Q2m3m3O2O2n0n0mmO7j28J04r2o4J30o9M7O0j35k5R1k0k1k0R7l3l2J29j45PPj0j1
5397B01P2P1j24P1j12Q3M5p3K6r1L3L4l4Q3m1m1O9O9j41k4P3m3L7L7n3O4j00R6q9J07j37J36
$$ plain form
5155 174 269 168 211 253 224 196 207 219 304 272 192 229 259 171 189 206 151 212 219 225 297 252 321 272 299 327 139 224 261 298 230 281 272 264 206 266
5191 266 260 254 312 369 297 225 151 193 236 278 217 273 275 278 215 348 246 262 224 186 214 242 247 252 265 277 214 268 329 274 151 145 202 260 248 236 224
5228 224 212 212 213 213 213 210 208 264 321 259 198 234 270 255 240 224 209 256 303 225 382 235 206 185 163 244 325 269 213 209 204 339 239 192 262 303 227
5265 227 359 257 265 273 337 166 186 206 221 236 199 280 222 398 240 199 257 198 277 240 268 297 318 339 262 185 299 178 240 302 210 235
5297 235 89 332 251 171 319 232 219 323 234 262 208 153 404 263 260 256 96 171 211 252 234 217 199 181 253 324 245 165 357 314 267 220
5329 220 233 247 209 289 182 309 179 284 320 355 215 308 285 262 254 245 233 220 208 196 220 244 267 291 258 224 237 250 336 227 228 230 260 290
5363 290 255 337 294 251 313 375 325 275 271 267 334 206 310 218 154 284 215 262 322 187 162 253 233 212 192 289 256 224 353 208 215 222 212 201
5397 201 273 344 220 291 179 262 307 234 260 169 202 236 202 285 244 203 272 341 200 176 249 206 243 280 227 291 191 287 198 305 168 304
5429C04o0N7j16JJ0RJ0J0N1o5j2j1J16p8l5Q2l1l1N6N7j77J73M3p6m4m5O5n2O9m9J8j00O8
5462B17O8KLp6p6J31o3PPO5O6r2J03p7p8J06q9QQO2j33P4P4k8k7k7k7M3M4p4J61j78N6L6L7
5497C33n1n1k1k1M6M6n1n1LMJ06j28Q5Q4j20J14m8m7lmJ0J0RJ0POl7l7q5J50n6n5J54q1qq
5533B14L9L9j81K10o1o0ppO3O3l5l5J7J7j74K17m5m5K3K4j42R3k4k5J11j24J10j24K6K6lm
5565A96r0J44l2l2R6j38O6O7j07J26nnl1l2kkL3L2k6k5J5J6m3m3K5K5mmJ1J1J13j21kkJ15
5600C45j19rrK0K0q7J47m4m4opN3N2o0n9L8L9j3j3j3j3PQppJ14j20J1J2j8j8M0M1k5k5k5k6
5637A80M6M5j3j3RRRRo0o0J30j04N0M9N0N0j99L5j4j3J40r4k1k0K1K2K2K1J8J8J8J8l8l9l8
5672B43l9k5k5P3P3k7k6k6k6P1P2o6o5K2K3K2K2l7l8POJ45r0j7j7j0rj0rNNNOk8k8J6J6J20
$$ plain form
5429 304 244 301 185 186 196 205 215 225 276 211 199 188 304 226 191 273 242 211 267 324 147 320 363 287 243 198 263 211 280 231 249 149 217
5462 217 285 287 290 214 138 269 206 213 220 285 351 259 362 285 207 313 224 232 240 302 169 243 317 289 262 235 208 251 295 221 382 204 260 296 333
5497 333 282 231 210 189 235 281 230 179 182 186 292 164 249 333 213 327 279 232 229 225 235 245 254 264 271 277 240 203 118 268 212 157 311 230 222 214
5533 214 253 292 111 321 260 200 193 186 249 312 277 242 259 276 102 319 274 229 252 276 134 227 203 178 289 165 275 151 177 203 200 196
5565 196 106 250 218 186 282 144 210 277 170 296 291 286 255 223 221 219 252 284 258 233 248 264 221 178 203 228 224 220 231 242 355 234 232 230 345
5600 345 226 217 208 228 248 161 308 264 220 214 207 260 312 252 193 231 270 257 244 231 218 225 233 226 219 333 213 224 236 218 200 240 281 256 231 206 180
5637 180 226 271 258 245 254 263 272 281 221 161 291 187 237 286 336 386 187 222 208 195 335 241 220 200 221 243 265 286 304 322 340 358 320 281 243
5672 243 204 179 154 227 300 273 247 221 195 266 338 272 207 229 252 274 296 259 221 228 234 379 289 272 255 245 236 226 217 222 227 232 238 210 182 198 214 334
5710C34j16L2L1j48Q7J3J3L5L5rrr6J37j99L5J74o0r0q9P9P9Q8j45n8J76k8k9KKKKn5n5M2
5744B12M3KKn6n6O1O2J7J8p9J55p4p4K9K9j04J32l4l3L9M0p5p5K3K2K8K7l1l1L4L5o4o3J05
5778B66J05j09j10N7N8jjj1j1M8M8n9n9J5J4j35R8R9j36N8N8j47Q7LLj15J20j0j0NMl7l7K2
5812A80K1O4O4p2p3O3O3l5l5MLj0j1R6j37N2N3RRRRl6l6l7l6J1J1j22J14N9O0k4k3L8L8o0
5848B83n9j1j0j1j1J4J4K8K8j14J20O1j73N6N6r1J44m5m6j70O5R2k4J2J29k49J03K2K2p5J20
5879B80J05j68j7j7K5K5K2K3q2q2J40K3p5M3m5m5J70k5m6m7K8K7R0j04n4O4j04J4m5P2k8Q9
5911B56l5l6J26Qj28j1N9N9j15Q1M3j52J50L3j65J08o0o0Q1l6M3M2j27O7q6J10m6P2j00R6
5941B77L9p9J2J1n9J36j10PM7j48Q9Q9k25J26R8r8L8L8j64J87p0M8qqN2j43J7J8R0k7L8p8
$$ plain form
5710 334 218 250 281 133 220 233 246 281 316 307 298 202 339 140 175 349 289 199 110 189 268 356 211 153 329 301 272 274 276 278 280 225 170 212
5744 212 255 257 259 203 147 208 270 287 305 226 381 307 233 262 291 187 319 285 252 291 331 256 181 204 226 254 281 250 219 253 288 224 161 266
5778 266 371 262 152 209 267 266 265 254 243 291 339 280 221 236 250 115 213 312 176 234 292 145 232 235 238 123 243 233 223 228 232 195 158 180
5812 180 201 265 329 257 184 247 310 275 240 244 247 237 226 322 185 237 290 299 308 317 326 290 254 217 181 192 203 81 195 254 314 290 267 305 343 283
5848 283 224 213 203 192 181 195 209 237 265 151 271 332 159 215 271 180 324 279 233 63 128 220 196 208 337 88 191 213 235 160 280
5879 280 385 217 200 183 208 233 255 278 196 114 254 277 202 245 200 155 325 300 254 207 235 262 352 248 194 258 154 168 123 195 167 256
5911 256 221 185 311 319 191 180 239 298 183 264 307 155 305 338 173 281 221 161 242 206 249 291 164 231 145 255 209 281 181 277
5941 277 316 237 249 260 201 337 227 234 281 133 222 311 86 212 310 212 250 288 124 311 241 289 281 273 325 182 199 217 307 280 318 240
5973B40O2n6o2o3J25Ql6l6J35o2k2k2Q7j09J11q5L3L2j17JJ61l4j4j4ooR2j04Q1j15k9k9J10
6006B57q5K5K4ONo8M9Q2l6p3J23k7k7qqk7R0r3K5l5Q3m1m2O3n5m2P5p6J20n6O2K7r0R3j02
6041B18L4L3n5n4J41j32J88q6j21P4o7N0Q7k9j5j5J5J4L1L2j59J15m0l9nnJ17p8q6J09j16
6072A56Q0p2M6N8N8o3N5q2q2J10q5R0k7K5K5l3l3j9R8m3m3J24j50MMl7l6J40n6lJ14j77R7
6105B43J3J3q5q5J71j02J17jk2k2j25J49k4k4M6p0P5j19M2M1OOOOmmo2N4oJ11n7n7J10q6L2
6140B86q5N5N4n0n0qpN1N1k7k7P5j20N2o5M7M7q5q4R9R9r6K2J4J5MLJ2J1q6L2n3O3N8j37R0
6176B60R0j30O6o9M9P3k00R3k4j2J05j2j29J72k4q9J06p8p7O7n0k5R2k7k7k0J76p2p1L4L4
6207B81pqj41J33M5p2l1l1J3J4O3n4P8m0mmONj36J38Q6j09O6n1j08Q8J4J4L3L3j21lQJ26j17
$$ plain form
5973 240 302 246 184 121 246 254 218 182 317 255 233 211 298 189 300 215 248 280 163 164 325 291 277 263 257 251 343 239 320 205 176 147 257
6006 257 172 197 221 227 232 164 213 295 259 186 309 282 255 247 239 212 302 209 234 199 282 241 199 262 207 165 240 164 284 228 290 317 227 320 218
6041 218 252 285 230 176 317 185 373 287 166 240 173 223 310 281 266 251 266 280 311 343 184 299 259 220 215 210 327 249 163 272 156
6072 156 236 164 210 268 326 263 318 236 154 264 179 269 242 267 292 259 226 207 305 262 219 343 193 197 201 164 128 268 212 209 323 146 243
6105 243 256 269 184 99 270 168 285 284 262 240 115 264 240 216 262 192 267 148 190 231 237 243 249 255 251 247 185 239 233 344 287 230 340 254 286
6140 286 201 256 310 260 210 202 195 246 297 270 243 318 198 250 185 232 279 194 110 209 308 212 234 248 263 267 270 282 293 207 239 186 249 307 170 260
6176 260 350 220 286 217 266 339 139 232 208 196 301 289 160 332 308 219 325 247 170 237 187 162 254 227 200 180 356 284 213 247 281
6207 281 274 266 125 258 303 231 200 169 182 196 259 205 283 243 239 235 241 246 110 248 334 225 291 240 132 220 234 248 281 314 193 190 198 324 207
6242B07%P9P8q6q5P8P8J1j85O7n0J79j73K4K5o9M8R2j04K4K4m1P5j44N1j3J05j07J1J1J1j5
6274B06j5J03j5M7p1j1j2lmj05Q9j6J02r4J79j67K8Q2j92R8j9n3O4J11j63J22On4n4k2R5q6
6306A76L0L0L1j8j7j8j7M3M4qpp0M8k5k5J18%l1l2j4j5L1L2O4j31j3j4l5Q2J5j01R5k2M4M4
6341C14j03J4J02j72J0J1N9N9o9M8j0j1q9K7q7K64j80J6R1k6k7k7K4K4j3j3p1M6m4P2K2K1
6373B82o4N2j3J04j11OM0p6j45K85o9o9P5m2Q2l5oj24J91j60O3O3j7j8q3q4N2N3J3J2r0J06
6405B73l8Q0p1p1O6O7L5q3j9k0L2L2MMn0O7j28O7q7J09n1n0J09rJ00j73l4l4J00j7M9M9ml
6439C01Mj13LLP3m3q7J09k5k5J48j26l7Q0k1k0j2j3K2K3Q1j14n3O4k2k1J03j4p3M5J7J8L2
6472C07L2q7L0l7l6j5j5J10qnnk0j9Mj12P7l9jkJ72j80J69j05K6K7l1l0Q6j08MJ21k7k8R9
$$ plain form
6242 207 207 286 364 278 193 271 349 360 175 242 192 371 198 222 247 178 226 318 214 238 262 221 296 152 203 190 295 188 199 210 221 206
6274 206 191 294 279 326 255 244 232 229 225 120 209 193 295 201 380 213 241 323 131 229 210 157 221 332 169 291 297 243 189 167 262 176
6306 176 206 236 267 249 232 214 197 240 284 276 269 199 247 222 197 315 315 284 252 238 223 254 286 350 219 206 192 157 239 254 153 248 226 270 314
6341 314 211 225 327 155 165 176 235 294 225 273 263 252 163 190 103 367 187 203 294 268 241 214 238 262 249 236 165 211 167 239 261 282
6373 282 218 270 257 361 250 256 296 220 75 360 291 222 297 255 337 302 296 172 363 203 266 329 312 294 211 127 179 232 245 257 167 273
6405 273 235 315 244 173 239 306 341 258 239 219 251 283 287 291 241 308 180 247 160 269 218 168 277 268 368 195 161 127 227 210 259 308 304 301
6439 301 305 192 195 198 271 228 141 250 225 200 348 222 185 265 244 224 212 199 221 244 325 211 158 222 200 179 282 268 195 240 257 275 307
6472 307 339 252 282 245 209 194 179 289 281 276 271 251 232 236 124 201 162 161 159 331 151 320 215 241 268 237 207 293 185 189 310 283 255 354
6506C54r6m4P2p7L9r2J81k43J08P8l8J01r4J6J5q9K8K1K1QRj02R4o6o6J15q1Q2Q2q0p9J44
6538C21n2J2J3r1J05p1M6qpp9L9J08q8r5K2N1N1p8L9Q4j11J8J7p1J24j22nJ26o9j1j0J3J2
6571B33J%M2j53J64l1k8k9J01j7j27J47q8K9L2q6N9N9j12Q4r2K5L2L3j9j9J7J8l6Q0j31O4
6603B52K7K7q8K9L6q1m6P1ONo8M9N0o8O7O8j04J4j7j7N6o1M2M3o2o2Q7Q8r6r6Q6l2M8J66k21
6638A98J31q4L3J50j23l3l2N8j37J04j2o4N4j9j9N3N4j74J78j04j04J21LL8L8m7P0j55J18
6667B94j6j6j21P5K4K4NMp5J19n4n5J14lk0j36J24Pk9k9n2O6Kj16P4m2Q8k8L0L1m6m5kJ16
6701C12j28O8L0q6J2J2M1M1j23nK6K6M6M6o4o4J34o2N5o1k9k9K2K3LMO2n6j8j36J26QmnM7
6736B74p1M5p2J5J6n0m9J65l0o4N2m0P7N0o7o0N8l8l8J89q4q6L0N8j38O1O1p6M2m3m3J55j19
$$ plain form
6506 354 258 214 286 209 248 156 337 94 202 280 242 343 249 265 280 191 219 240 261 269 278 176 270 204 138 253 172 254 336 256 177 321
6538 321 269 281 294 203 308 237 283 275 268 189 228 336 248 153 175 226 277 199 238 322 211 229 246 175 299 177 172 298 229 218 208 221 233
6571 233 234 234 276 123 287 256 228 199 300 283 156 303 215 244 276 190 249 308 196 280 188 213 245 278 259 240 257 275 239 319 188 252
6603 252 279 306 218 247 283 202 156 227 233 238 170 219 269 201 268 336 232 246 229 212 268 207 249 292 230 168 255 343 247 151 237 205 253 419 198
6638 198 329 245 278 428 305 272 240 298 161 265 253 189 243 224 205 258 312 138 316 212 108 229 232 270 308 261 331 176 294
6667 294 278 262 141 216 240 264 269 273 198 317 263 208 322 319 299 163 287 294 265 236 184 250 252 136 210 168 256 228 258 289 243 198 196 312
6701 312 184 252 282 196 208 220 261 302 179 174 200 226 272 318 254 190 324 262 317 256 227 198 220 243 246 250 312 256 238 102 228 236 232 227 274
6736 274 203 248 176 191 207 157 108 273 243 179 231 191 268 318 251 191 249 211 173 362 278 192 222 280 142 203 264 188 230 187 144 299 180
6769A80J41k12J82r2N9N8n6n7K3K3Q7j09q5J10N3o3l2l2J4j03J53m1k7R0m5P2m4m5j2j2k0
6800A58R8o5o5Q6Q6p4M3J3J4j01J6M5p2J7J7m9O8o3N3l4l5M0M0J03r2q8J08N1N2j44k6J8J7
6833B35j21P5R6k1n3O4m5P2n4n3J29J3j61L5j1J05l3l4MLnnm9O8J3j04R4k3%JJ0J1n4K20j17
6868C05j17O5n2L5L6j1j28J32J6Qj09N4N5r4K3Q0j16J40j34Q7l1o9J27o3N4J9r8J21j12j19
6898A04J15K8K7k5k5k5k5K6K6K6K6l4l4K4K5k3k3J09j26L9L9j07J27k3k3o7J67j41R3j57P8
6929B21nmRJ0J8J7m1m1j4j4j4j4P3P2k5k5j1j1j0j1M8M7n0n0MNlkQ9k9p9J54j37R8k0k0j6
6966B19j7M2M1j5j6%jj22J12L2q5J09j26J31j04N7N7j62P1O8j66L8L9K0K0m6m6J14lo9J65
6997C57q3q4O8O8m6m5J3J3mmJ50k41R5k2o1N5Q0j56J33J6K2k13J14kk3k3O7O7j9j9k0j9j6
$$ plain form
6769 180 321 109 291 199 258 316 260 203 226 249 336 227 142 252 305 242 210 178 192 89 242 201 174 264 219 291 247 202 190 178 158
6800 158 256 191 126 212 298 224 267 280 294 193 209 254 182 199 216 167 235 172 225 191 156 196 236 339 247 159 267 318 370 226 200 218 235
6833 235 114 189 285 264 211 275 230 302 248 195 324 337 176 211 200 305 272 238 242 245 240 235 186 254 267 163 257 234 234 235 245 256 202 422 305
6868 305 188 253 201 236 272 261 133 265 281 289 180 234 289 195 218 298 182 322 188 275 244 175 302 239 293 312 214 335 223 104
6898 104 219 247 274 249 224 199 174 200 226 252 278 244 210 234 259 236 213 322 196 235 274 167 294 271 248 181 348 207 300 143 221
6929 221 216 212 221 231 249 266 225 184 170 156 142 128 201 273 248 223 212 201 191 180 228 275 225 175 179 184 181 179 268 239 160 314 177 275 255 235 219
6966 219 202 244 285 270 254 254 253 131 243 275 190 299 173 304 200 257 314 152 223 291 125 163 202 222 242 196 150 264 261 192 357
6997 357 274 190 258 326 280 235 248 261 257 253 403 162 257 235 174 229 309 153 286 302 324 111 225 223 200 177 244 311 292 273 253 234 218
7030B18j6M3M2o0o0N3N2j05J30j27J07p0M8mmjjn3O5r3J42j08J0J3J2K0J9qqj6j6L9p8J04
7064B89j30J20j16J0J26j45Q9j24J11Q9j46P5m3m0P8M5p1J91j99K7K8j32J02K9K9k9k9l7l7
7093A60J33J6j47Q7KLJ15k76K65j26L7q0m0m1N0M9j9j9M0L9RRj22J11l8l7P4P5o6o6ppP3P3
7127C29p8p8J09j26jJ16nnKLq2q2O9O9m6J89o1j78O4n3J03J03q0q0P2P2j38R6j17JJ46r0q
7160B35J09j10Pj24J09noRRJ3J2J3J3j1j1j1j1k6k7o1J74n8n9Q9j46M5M6L1L1j5j5r6K2J15
7194B90j19ONJ04j30O0O0q1q0J03J02j13Mr6J38j2j2O1j73J72o1p6J58m3m3L0L0n7n6J87m7
7225C11j12J23j56P8K3K3k1k1K7K6l2l2J8J8m1m0poO7O6q4J50k11K3L5L5rql3l2K6K6OPN8
7260C01o0J01j34ONj17J18j4j4J7J8J8J7l0l0J4J4J14j20j05J29r0J45r5r4j7K17j44R1j5
$$ plain form
7030 218 202 245 287 227 167 220 272 167 297 170 277 207 255 251 247 246 245 192 257 164 306 198 208 221 233 253 272 264 256 240 224 263 185 289
7064 289 159 279 163 173 299 154 243 119 230 319 173 248 205 165 243 288 217 408 209 236 264 132 234 263 292 263 234 197 160
7093 160 293 309 162 249 251 254 369 93 358 232 269 189 149 108 158 207 188 169 209 248 257 266 144 255 217 180 254 329 263 197 190 183 256 329
7127 329 251 173 282 156 155 271 266 261 263 266 184 102 171 240 194 383 322 144 208 155 258 361 281 201 273 345 207 303 186 187 333 243 235
7160 235 344 234 241 117 226 221 215 224 233 246 258 271 284 273 262 251 240 214 187 126 300 242 183 272 126 171 217 248 279 264 249 153 175 290
7194 290 171 177 182 286 156 216 276 195 115 218 320 207 211 115 253 241 229 290 117 289 228 152 310 267 224 254 284 227 171 358 311
7225 311 199 322 166 244 267 290 269 248 275 301 269 237 255 273 232 192 185 179 246 312 228 378 167 190 225 260 251 243 210 178 204 230 236 243 301
7260 301 241 342 208 214 219 102 220 206 192 209 227 245 262 232 202 216 230 344 224 119 248 158 303 208 114 97 314 170 261 246
7290B46j5%JrqrrJ0J0J0J0l9l9P1m6J56p9p9L8J3J3q9K8p3J61k2k2K2K2j03J32r9J8K6K5l0
7326B42l0K8K8l5l5O2O3o1o0q8J47m2P5m2P5o3o3rJ07j47Q7PON4j81M9M8J7J7J7J7j9j9j9
7360B33j8M2M2j6j7l1l2K0J9K6r1J65p0n0n0K44l04Q4Q5rqpqn8N9j04J31J4j04J01J01k22
7392A67J3J14lj27J07R1j44LLj2j2j2j2%%N8N9k2k3k2k2M0M0j8j9l7l6K1K2K3K3l6l6M0L9
7427B70j8j9l9l8N9N9j5j4j4j4llllK8K7K8K7J1J0m8m8rrrrM9M9q8q7J3J4J3J4J5J5J5J5r
7466B32j0N0M9p0p0p2J62J9r8J29j05j01J34N3j81J42K5j53Q1L4L3m9m9O2O1o0o0p5J59j04
7496A68J30q5q6J51q4N0o7M3M3l5l5K3K3k9l0K9K9L6L6k2k3l5l6K4K3j4j3j3j4POOPOPOPL
7534B42LJ8J7j11J22n3n3j23J11L7L8L9L8j51Q3j1j1J36r9J5J5%%l4l5Q3j52O7j68J55q0K02
$$ plain form
7290 246 231 231 232 223 215 206 197 207 217 227 237 198 159 230 184 340 261 182 220 233 246 157 185 112 273 251 229 251 273 170 302 203 221 247 272 242
7326 242 212 240 268 233 198 260 323 262 202 114 261 219 294 252 327 264 201 192 299 152 239 246 252 306 125 174 222 239 256 273 290 271 252 233
7360 233 215 257 299 283 266 235 203 223 242 268 177 342 272 222 172 416 112 196 281 272 264 257 249 191 250 146 277 291 187 288 389 167
7392 167 180 294 291 164 271 362 218 221 224 212 200 188 176 176 176 234 293 271 248 226 204 244 284 266 247 210 174 195 217 240 263 227 191 231 270
7427 270 252 233 194 156 215 274 259 245 231 217 214 211 208 205 233 260 288 315 326 336 288 240 231 222 213 204 253 302 214 127 140 154 167 181 196 211 226 241 232
7466 232 222 272 321 251 181 109 271 290 192 321 216 115 249 302 121 263 288 135 216 250 283 234 185 247 308 248 188 113 272 168
7496 168 298 213 127 278 194 244 177 220 263 228 193 216 239 210 180 209 238 274 310 288 265 230 194 218 241 227 214 201 187 194 200 206 213 219 226 232 239 242
7534 242 245 263 280 169 291 238 185 62 173 210 248 287 325 174 257 246 235 371 272 287 302 302 302 268 233 316 164 231 63 218 138 340
7566C40j88J7J7k4k5J66o9llj8j8J0J1nmJ08j26OOOOOORJ0J0J0k4k5n8J76q2q3J6J6J19j15
7603B01KKO0j74J87m8J4J3o0n9N1N1q1J54JJo8o7J64k26N1N2NOj0rQ5j49J15j20j4j3O9O9
7637B55mnmml9l9P4P4j29J05k7k6k4k4L4L5ppQQj05J29j35R9qqPPK1K2l8l7J4J5l7l7j9R9
7675B43P4j60LJ20k6R1n4n4Nj13J42r3J8J8P9j54P5P5m2m2R7j37m0P8J29j05J1J2p7p6J72
7706B69o1o9M8J20j14R1k6o6o7J97j93N7o0M0M0k9l0L0K9L0L0q7J47j47Q7m4P3J1j07O5O4
7737C28o7o7L0L0k1k0l1K03k06J84k70K77r8r8J41r3q0J53n9n8J29J2j52Q3J9K0k5k4j3j2
7767B15j19K71k16J8O3O2j04J30j33J01l5l6k1k1L5L6K8q9J05j30N4N4K1K1l8l7LKJ8J7j27
7798A48J08j05J30j8j35J74n9l6l6L3L2J08j26P1m5K0K0j05J30j46Q8j90K01j%l4l5J3J3K8
$$ plain form
7566 340 152 169 186 162 137 303 234 231 228 210 192 202 213 208 204 312 186 192 198 204 210 216 222 231 241 251 261 237 212 154 330 248 165 181 197 316 201
7603 201 203 205 265 91 278 230 244 257 197 138 189 240 159 313 314 315 247 180 344 118 169 221 226 232 222 213 298 149 264 144 130 117 186 255
7637 255 251 246 242 238 199 160 234 308 179 284 257 231 207 183 217 252 245 238 246 254 149 278 143 242 234 226 233 240 261 283 245 208 222 237 200 163 144 243
7675 243 317 157 160 280 254 345 291 237 242 129 271 178 196 214 293 139 214 289 247 205 302 165 125 203 332 227 238 250 173 97 269
7706 269 208 139 187 307 193 284 258 192 125 322 129 186 126 166 206 177 147 177 206 236 266 179 326 179 266 222 295 306 199 264 328
7737 328 261 194 224 254 233 213 182 385 179 363 93 370 272 174 315 222 142 295 236 178 307 319 167 250 269 289 264 240 227 215
7767 215 96 367 151 169 232 294 190 320 187 288 253 217 196 175 210 246 274 185 290 160 214 268 289 310 272 235 238 240 258 275 148
7798 148 256 151 281 263 128 302 243 207 171 204 236 344 218 289 244 264 284 179 309 163 251 61 262 261 261 227 192 205 218 246
7828B46K8q2J53j04J4m1m2K5K5L1L0m2m3J12j23J6J6o5N3J11j24O7n0JKNOOOL3L2o5o5klR5
7864B62R5o3o2J1J0q7J46j97J93j08J0l1l2R3R3m3m4o2o2P4P5k8k8P0P0q3q3p7J56poPQm6
7898B24m5R3j41j8J00J8r8Q6l1J08j27J2J28o4o5J02j33P2P3q7J47j33j6j03J32n9N9M1M0
7927C15j0j1m4m5j%J04j30n7O0%J16j32J02j2j1MMm7m6N1N1K6K6q6q6J08j26O4O4J0J0K5K5
7961C21j42R2P7j57J24j11J46q8q8L0p2M4J19j15K3K4noN3N3k0k1k1k1kklkJ0J0RJ0jjJ3J4
7997B94j22J13r9J34J1j07k7k6O3O3q7L1j48Q6Q6l1m2m1J34j00O4n2kjL9L9p1M7j04J30j18
8028A56J16p8L9KKn2J81j72O2p9L7J19j16O5O6j78N6M3M4l9m0jkn5O2q8J07J44k07M7M8n0
8060B39n0J22j52KJ20o0N7jjn4n4M4M4j2j1j1j1j%jjL6L6o1o2N2N3pok7k7M4M4j08Q7M3p4
$$ plain form
7828 246 274 192 345 241 255 214 172 197 222 253 283 241 198 310 187 203 219 154 207 318 194 261 211 212 214 219 225 231 237 270 302 237 172 170 167 262
7864 262 357 294 232 243 253 166 312 115 308 200 210 179 147 240 333 290 246 184 122 196 271 243 215 285 355 272 189 112 268 261 255 262 270 224
7898 224 179 272 131 113 213 231 133 219 188 296 169 181 309 245 180 282 149 221 294 207 354 221 205 102 234 175 234 275 315
7927 315 305 294 250 205 204 204 308 178 121 181 181 297 165 267 255 244 248 252 205 159 210 261 287 313 227 141 249 123 187 251 261 271 296 321
7961 321 179 271 348 191 315 204 350 262 174 204 132 176 295 180 203 227 222 216 269 322 302 281 260 239 237 235 232 230 240 250 259 269 268 267 280 294
7997 294 172 285 186 320 331 224 197 171 234 297 210 241 93 179 265 234 192 151 285 185 249 197 195 194 233 272 201 248 144 274 156
8028 156 272 194 233 235 237 185 366 194 256 177 214 333 217 282 348 170 226 269 313 274 234 233 231 176 238 150 257 401 194 241 289 239
8060 239 189 311 159 161 281 221 278 277 276 222 168 212 256 244 233 222 211 210 210 209 208 244 280 219 157 209 262 255 249 222 195 239 283 175 262 305 231
8097B31QPJ%RQj52J21K4r2M9M8l6l7J8j00J76k0o3N4j29J45j19P7M9o7J0J1m0l9N8N9l0l0
8131B09K9K9rqLLj03R3l0k9P6j18J52j21j6J01m1m1M4M3j5j5K8K9l0l0J5J6m4m3K3K2m8m8
8165A26J14q1Q7Q7p0p0K7K8jj%jNONNj0rj8j7R0k7j66O9J78n6p3M4o7o7J31j04K4K3QQklk
8204B20lQQQQM7M7r0q9N3N2nol7l6O2O1m9m8O8j65J63p0L9p8J42r4L2L1J8J8q0p9O0O0l8l7
8241B01lmJ21j13O1n6nmQRO0n8R9j36J13mo3o3P9l8J12j22nnQ2l5q7J48j33J01O5n3j40R3
8275B25l8Q0j49Q6R2k4o8M9R3j42J25j10K3K2j17J17p3M4n6O1KKO8O9j08j08N3N2m5m6K1K0
8307B20l3Q4j22P3n1n2K03j50M9M9l5l6n2n2J91q3n1J44K3j73J30o5n3J42l9l8%%N4o3N4j41
8339A27N9N8MMr8R6j5J01j91Q2j06Q9llKLLKpqk6k5J40j34K1K0K3K3l6l5L1L2K4K5L2q4R2
$$ plain form
8097 231 239 246 247 247 256 264 112 233 257 165 214 262 226 189 207 107 283 263 200 254 125 270 151 228 277 210 220 231 191 152 210 269 239 209
8131 209 238 267 258 250 253 256 153 246 216 187 263 145 297 176 160 261 220 179 223 266 251 236 264 293 263 233 248 264 220 177 200 222 174 126
8165 126 240 159 246 333 263 193 220 248 247 246 246 245 250 256 261 266 256 247 229 212 302 275 109 178 356 300 227 271 204 137 268 164 188 211 219 227 225 222 220
8204 220 217 225 233 241 249 296 343 253 164 217 269 264 258 221 185 247 308 259 211 279 114 277 207 246 168 310 216 248 279 297 315 235 156 216 276 238 201
8241 201 198 194 315 202 263 207 202 198 206 215 275 217 316 180 293 289 226 163 242 204 316 194 189 184 266 231 144 292 159 260 325 272 132 225
8275 225 187 267 118 204 296 272 204 253 346 204 329 219 242 264 147 264 191 235 179 240 242 244 312 381 273 165 218 270 225 179 200 220
8307 220 187 271 149 222 171 119 322 172 221 270 235 199 147 95 286 203 152 296 319 146 276 211 158 300 261 223 223 223 277 214 268 127
8339 127 186 244 248 252 154 250 235 336 145 227 121 210 207 204 206 209 212 214 207 199 173 148 288 154 175 195 218 241 205 170 201 233 257 282 314 230 322
8376C22j04K3K3J1J1j0j0rj0K1K1j60L5J00r6K6K6N4N4q2q3Q6Q5n1n1qrJJ19j55J19j37N8
8409B20J2J3K5K5l6l5l5l6Q6Q5K0j76J0J1jkK2K1L7L6r9J35j43R1J3k21K82j09m2m2P0P0o8
8442B39o8L0L0%jj%K3K4l5l5L2L1r3J41j41k3O2O1llo2o1J7J8J8J7M1M0m2m3q6J48m3m2NO
8479B01NNL1L2k8k8OOP2j63R3k3J01j34L3L3M0p7q0J54m4m4J7J7LLQ3j51N4N4j21J13j9j9
8513B25QQQQL6L5o2o2PQj5J03M5j89M7M8qpM4p4J01j33k4R4M2p5j6j6J45r0M3p5Q4l3n8n8
8549A44K10j81L2L1M0p7J13j21P5m1RJ0J3J3m1P7j44N2J93j58O2j32J16p9M4p3L2L2P8l9j04
8580A86J68k10J41k7k7r7R8j1j2N6N6m1m2n5n5k8J67J9K0j37N8K4K3k4k3rj0J45j29J6J6J9
8612B75r9j3J82j25P0j68J05m9m8J43n3jkRQQ2l6m4P3j13Nj14Q1M5M5l6Q2j01J7p7M0qJ09
$$ plain form
8376 322 218 241 264 275 286 276 266 257 247 268 289 129 164 264 168 194 220 274 328 246 163 249 334 283 232 224 215 216 335 180 299 162 220
8409 220 232 245 270 295 259 224 189 153 239 324 344 168 178 189 188 186 208 229 266 302 203 338 195 286 299 78 360 251 209 167 237 307 239
8442 239 171 201 231 231 230 229 229 252 276 241 206 238 269 176 317 176 153 215 276 273 270 208 147 164 182 200 217 258 298 256 213 127 275 232 190 195 201
8479 201 206 211 242 274 246 218 224 230 302 139 232 209 310 176 209 242 282 205 125 279 235 191 208 225 228 231 314 163 217 271 150 263 244 225
8513 225 233 241 249 257 293 328 266 204 211 219 204 307 352 163 210 258 250 243 287 213 314 181 157 251 293 218 202 186 331 241 284 209 293 260 202 144
8549 144 354 173 205 236 276 199 312 191 266 225 234 244 257 270 229 306 162 214 407 249 311 179 295 216 260 187 219 251 329 290 186
8580 186 354 144 285 258 231 134 232 221 209 265 321 280 238 183 128 100 267 286 306 169 227 251 274 250 227 218 208 353 224 240 256 275
8612 275 176 163 345 220 290 122 227 178 130 273 220 219 217 226 234 316 280 236 309 196 201 87 168 213 258 222 304 203 220 143 183 175 284
8645B84j25J48o4o4J04j3k2k3j17K34o1o2M4M4J7j79O8O9m9m9Q6l2l6l7P9j17pJ10n6O2r3
8676A43J81n8n9j63K66k22J29m1P5r0K7l2Q6o5N3j3j4N8o0q9J85j6j6JKn6n5L2J49j80R4N
8708B57Oj1j1p7M0j3j3j4J04j9j8N5o3J1J1LLk9l0K9K8rrj6J01r3r2J11q5J07q8P5m2K8K9
8743B66m4m5P3m5K9K9k3R5o9o9j4j4R1R1j05J1j05R0j2j2JJL6L6q3q3K50j02n5O2j38N8J16
8776C17p9J1j08J13j61K4K18j11OK1K1m6P2k9j48J17jM3j54Q6Q6n2n3poJ03r1L0L0j27O8K4
8808B17r3L1L2R7k0n5O2N4o3l4l5r3J02%%K0J9q8L0q8J08jjO6n2M5j51Q1Q1j9j36J32J5L6
8842B99L5o9o9JJJJN0N0m8m8j4j4J13q3r0J84J7j77R2j03J04r1L5L4L5L5j20P5L1q5L6L6p6
8876A78p6R3k3M2J59j45k9J38n8j13J60j03j03P1P1J3J2rrkkp2M6qqj08Q7P5j21J25p0l9P9
$$ plain form
8645 284 159 307 243 179 283 270 248 225 108 342 281 219 263 307 324 145 213 282 233 184 270 238 202 165 244 127 120 230 174 236 143
8676 143 324 266 207 44 310 88 217 176 251 161 188 156 242 177 230 217 203 261 201 112 297 281 265 266 268 212 157 189 338 158 252 257
8708 257 263 252 241 164 204 191 178 164 268 249 231 286 223 234 245 248 251 222 192 221 249 240 231 215 316 223 131 242 157 264 176 251 209 237 266
8743 266 222 177 250 205 234 263 240 335 266 197 183 169 260 351 246 257 152 242 230 218 219 220 256 292 209 126 376 274 219 281 143 201 317
8776 317 238 249 141 254 93 117 335 224 230 251 272 226 298 269 121 238 237 280 126 212 298 246 193 186 180 283 192 222 252 125 193 217
8808 217 124 155 187 284 264 209 271 325 262 228 193 100 202 202 202 222 241 153 183 95 203 202 201 267 215 260 109 190 271 252 116 248 263 299
8842 299 334 265 196 197 198 199 200 250 300 252 204 190 176 289 206 116 300 317 140 232 129 233 142 177 211 246 281 161 236 267 182 218 254 178
8876 178 102 195 172 214 373 228 199 337 279 166 326 223 120 191 262 275 287 278 269 267 265 193 239 231 223 115 202 277 156 281 211 172 251
8909B51l4l3P2P1n2n1Q5l3p3J23j27j0Q6l2M9o8l8l9O0N9p2M4M5p2J5J6n8O0M0M0n0n0k6k6
8943A72O5O4j0j27M4M3o1N5o9M9q3L5O9j26J64j10R9k0l1l1K7r0M0M0M5M4r2J04p3M5k5k5
8975B31j8j7L5L5l1Q6r3r2l1J64P3j21PQk0R6J2j06r2J04j3j3L3L3K8q9R4j02N5o2J00r5Q0
9008B79j93J96j55R1k5J1J2J14q1m4m4R7R7k12O2K0r7J29o7L6L7l6l6J5J5N1o6j45K85q6q7
9039A73N0N1q4J11O0j36o2N4k3R3n9N8J2J2j70K4k1R5M7p0LLN0N0k8j45P2m5J09q7P2j63N5
9072A61N4l6l5O1O2j1j1j1j1j6j6L5q1J59p5o1N7j32J03L7L7k3k3l8l8J69o5j30J03N2o5O6
9104B78n1M5j90K03l1J1J2j35R9ONl8l9P1P0j19J14k8k8j4j3k0k0L9L9J2J2J2J2r1r1J39r6
9137A75O6O7m6m6L9L9k0j9k2k2L6L7l1l1K7K7rro0N6r6J38o0N8k1j38J26J25k02L3J3J2r9
$$ plain form
8909 251 217 184 256 327 275 224 309 276 203 326 199 189 275 243 292 224 186 147 207 266 194 238 283 211 226 242 184 244 284 324 274 224 198 172
8943 172 237 301 291 164 208 251 190 245 176 225 142 177 246 120 284 174 273 253 222 191 218 128 168 208 253 297 205 309 236 281 256 231
8975 231 213 196 231 266 235 321 228 136 105 269 342 221 228 236 216 312 324 218 126 230 217 204 237 270 298 209 303 201 256 194 294 199 279
9008 279 86 282 127 218 193 204 216 330 249 205 161 258 355 143 205 225 128 257 190 226 263 227 191 206 221 272 206 61 346 260 173
9039 173 223 274 190 301 361 225 163 217 194 287 228 286 298 310 140 164 143 238 285 215 218 221 271 321 293 148 220 175 284 197 269 106 161
9072 161 215 179 144 205 267 256 245 234 223 207 191 226 145 304 229 168 225 93 196 233 270 247 224 186 148 317 252 122 225 277 212 278
9104 278 227 272 82 285 254 265 277 142 241 247 252 214 175 246 316 197 311 283 255 241 228 208 188 227 266 278 290 302 314 223 132 271 175
9137 175 241 308 262 216 255 294 274 255 233 211 247 284 253 222 249 276 267 258 198 254 158 296 236 294 273 135 261 386 184 217 230 242 143
9170A43J35j43R0J26j09q7J48r8J9r1J44j26J09l3l3J46k44J07j0nJ11j37R7j38R7N3N3j33
9198A91J02l7Q0j17j17K48j44M2M3J7J8n5n5LLjjj%j2j2j2j2K8K8K9K8j7j7j8j7k7k8M6M6
9233B52j16J19o4N3j00J33O8j67P9j56J91m3J1J1p7J58q3q3rj0K4K4L9L9j33J01K8K8n5n4
9263B08llM5p3J18j16J10pN2o5J4J4n1n2k7k7L1L2K4K5j22J12P0j65J21j13PJ25o6N2j27J08
9295B51M8o8l5l5J48q7j3j2L1L1n9n9L9L8L7L6j0j27J24j10P3m5P5m3n1O7j0j0llK2K1l7l7
9329A87mmLLl3Q5q9J46j92K00j16Kp7J57k5k6%%%%M5M5j38R6p6M2M8o8N6o2klK0J9J9K0k6
9366B52k5k6k5K3K4L8L8j25J11l7l6J39r5Nj12L6L6R4j40O6n1k4k4K21j68P2m4o4J71k69K78
9397C39j27rJ8J7J1J0P6j58N3o4j3j3K5K5K5K5k6k7J86k04P3m3O4n3L4L5k5R3k07K7R3j42
$$ plain form
9170 143 278 135 225 351 242 155 303 205 224 133 277 151 260 227 194 340 96 203 193 188 299 162 259 121 218 271 324 191
9198 191 293 256 336 219 102 350 206 248 291 308 326 271 216 219 222 221 220 219 219 207 195 183 171 199 227 256 284 267 250 232 215 188 160 206 252
9233 252 136 255 191 244 144 277 345 178 257 101 292 249 260 271 194 352 269 186 177 167 191 215 254 293 160 261 289 317 262 208
9263 208 205 202 247 174 292 176 286 279 331 266 280 294 243 191 164 137 168 200 224 249 127 239 309 144 265 152 159 284 218 270 143 251
9295 251 299 231 196 161 309 222 209 197 228 259 200 141 180 218 255 291 281 154 278 168 241 196 271 228 177 244 234 224 221 218 240 261 224 187
9329 187 183 179 182 185 152 237 148 294 102 302 186 188 111 268 243 217 217 217 217 217 262 307 169 265 189 231 279 211 267 205 203 200 220 239 258 278 252
9366 252 227 201 176 199 223 261 299 174 285 248 212 351 256 261 149 185 221 315 175 241 190 166 142 363 195 267 223 159 330 61 339
9397 339 212 203 221 238 249 259 335 177 230 166 153 140 165 190 215 240 214 187 373 169 242 199 263 210 244 279 254 347 140 167 260 118
9429A18R6R5j42R3j12NJ32J5j10J24n9n9o2J73l2l2J58p6j16KN3o4onJ31j04K9K8m9n0J65
9460C39o9L2k03K32j59L0L1OOk7k8L2L1j6j6kjr3J41K4K4j49Q5J2J2k5k6m5J90j99L6J6J6
9493B37K1K1l7l7nmj9j9J70o4k9l0J4J4J4J4k8k9L0L0m0l9J9J9K1K2l7l7L2L3k6k7K2K2j10
9528A38J24k2k2pql7l7K2K2M3M4M4M3q8q9K4K4r5J40QQRRQRm2m3j15J18K9K9j5j5J9K0p9p8
9565A42O6O7M7j87J58p6r1J43QPl6l7L8L8j28J06j63K27o1o1n6J78l7l6j25J09m2J92j70O4
9595B84kj19J01j33N7N7m2P5j07J26j35R9l3l3J13j21J1J1JJQQMJ22j35J00m6m6l1l1Q7Q7
9627C38j43R2m0m1L2L2opppk6k6k6k6O2O3J05j30m9O8j3j2M4M4n4n4%J%JK3K4l5l5L4L5k5
9664B36k4J4J3K8K8j84M9N4N5n7n7M9M8p8L9o2J73n5n5m0m1M9M9o4o3J23j11J53q2K9K8J4
$$ plain form
9429 118 214 309 167 260 148 153 285 300 190 314 255 196 134 307 275 243 401 325 209 211 264 200 194 189 320 216 245 273 224 174 339
9460 339 270 302 99 331 172 202 233 239 245 218 190 222 253 237 221 219 218 125 266 290 314 165 250 262 274 249 223 178 368 169 205 221 237
9493 237 258 279 242 205 200 196 177 158 328 264 235 205 219 233 247 261 233 204 234 264 224 185 204 223 244 266 229 192 224 257 231 204 226 248 138
9528 138 262 240 218 211 203 166 129 151 173 216 260 304 347 259 170 194 218 123 263 271 279 288 297 305 314 272 229 114 232 261 290 275 260 279 299 220 142
9565 142 208 275 322 135 293 217 126 269 277 284 248 211 249 287 159 265 102 329 268 207 151 329 292 256 131 240 198 390 220 284
9595 284 282 163 264 131 188 245 203 278 171 297 162 261 228 195 308 187 198 209 210 211 219 227 231 353 218 318 272 226 195 164 251 338
9627 338 195 287 247 206 238 270 264 257 250 243 217 191 165 139 201 264 369 239 190 258 245 233 277 321 267 213 213 214 214 215 238 262 227 192 226 261 236
9664 236 212 226 239 267 295 111 160 214 269 212 155 204 252 174 213 151 324 269 214 174 133 182 231 167 104 227 116 269 187 216 244 258
9696B58J3k0k1j52Q2K3K3L8L8k8k7J04j30OPP3j23L3L3l8l8O3O4lkk7j45J74j00L6L7R7j76
9729A72J03j70J34o0J1J1K8K9m1m0J9J8MMk1R6j56L8l0J66r7K0l3l3O8O8j22P3j76R9J5J5
9761B12K8K8kjk1k1L8L8NOp6p5J75j78K1J38p8M1j9j9nnononnoJ4J3J3J4l8l8K1K1J6J7m2
9800B08m1P0P1k8k7o1o1L6L7m2m1N6N6k3k2L7L6k5k5j13Q2J11pk6k5L3L3o4o5R9J00k23N0
9833A96j1J07m0m0K2K2k9k8n5O3j1j1J48L1j67n0J55j97O7O8j%J2J2j18P7m8P0L3q5J8J8l
9866B25lN5o2J6j00J21MJ6J5J5j02J4J4K6r1m7J49j15J58r1K5N0j45J12oj7j8M7p1mnN3N2
9899B90n8n7J12q3kkL3L2r2K5L6L6p0M8j09Q7r7R8L5L5j60L5M9M9mnL5q3k8k9J26p0k6k6R2
9934B52k6n5O2j5j4p3M4P6P6j64L2QQq3L5N1o6nnJ73k3p6p7K09k22J31o5L0L0J1J0l0j48J26
$$ plain form
9696 258 271 251 230 78 160 183 206 244 282 254 227 331 201 207 214 287 164 197 230 192 154 217 281 278 276 249 104 278 178 214 251 348 172
9729 172 275 105 239 179 190 201 229 258 217 177 196 214 218 222 201 297 141 179 149 315 218 238 205 172 240 308 186 259 83 182 197 212
9761 212 240 268 266 265 244 223 261 299 304 310 234 159 334 156 177 315 237 278 259 240 235 230 224 219 213 208 203 197 211 224 237 251 213 175 196 217 233 250 208
9800 208 167 237 308 280 253 192 131 167 204 162 121 177 233 210 188 225 261 236 211 98 180 291 284 258 233 266 299 235 170 269 369 146 196
9833 196 185 292 252 212 234 256 227 199 144 207 196 185 333 364 197 147 302 105 172 240 239 239 251 263 145 222 174 244 277 192 210 228 225
9866 225 222 277 215 231 131 252 256 272 287 302 200 214 228 254 163 116 265 150 308 217 242 292 147 259 253 236 218 265 194 190 185 238 290
9899 290 232 175 287 204 202 200 233 265 173 198 234 270 200 248 139 226 129 227 262 297 137 172 221 270 266 261 296 213 185 156 282 212 186 160 252
9934 252 226 171 233 218 204 131 175 251 327 163 195 203 211 128 163 214 148 143 138 311 288 212 135 344 122 253 188 218 248 259 269 239 91 217
9968B17p0K9K8J6J6J9K0l9l9J9K0n9N9M0j55J68j07N4o3P5P6qj24L1L1J2j05L2L1j04R2K3
10000B35K4J05j69N2o6L5L6l0l1OPm3P5j24J49j34j6J53m2M3p4O4O3j51M4l9m0J74j00J46
10030C52m8o1o1R9j8Mj13R3j03N9n9R4k3Mj14R1R0n3n3m2m1M9N0P2m4L6q1k0R7l5l5O0O0j09
10064A97Q7k8k8j6J01j43k7J06r0J53j20Q0l7K1r6O8O8q6L1l0Q7j17P8l1l2J31J3j23oM0M1
10095B92j0j1m9n0n6O0L0L0k2k1O0O1j21P6Q9j05J6J7j%o7o6P9l8K8K8n3n4Q3Q3q0q0J05j2
10129B41j16K36k42J87k39J91r7K0R1k6j9R9o7o7L9L8l5l5K4K3j5j5N7n9m1P6LLLKp5M2J20
10162C47p6j66L0P5P6j15LJ8J8l3Q4q9K8J38n8l8l7P4m3ooN3o4NNNNp7M1J35j38m8O8j5j4
10197A85L6L6lj20O4n3O4O4p1p1J9K0J41K4m7m6K2K1k0j9j38J35N4o2p1M6M4M4j07Q9k0k1
$$ plain form
9968 217 147 176 204 220 236 255 275 236 197 216 236 177 236 276 121 289 182 236 173 248 324 316 192 223 254 266 161 193 224 120 212 235
10000 235 259 364 195 247 181 216 252 222 191 197 204 161 236 112 261 127 111 264 222 265 191 255 318 167 211 172 132 306 206 352
10030 352 304 243 182 281 263 267 154 247 144 203 144 238 215 219 105 196 286 233 180 138 97 146 196 268 224 260 179 159 256 221 186 246 306 197
10064 197 284 256 228 212 313 170 143 249 159 312 192 272 235 256 160 228 296 210 241 211 298 181 259 228 196 327 340 217 211 251 292
10095 292 282 271 222 172 116 176 206 236 214 193 253 314 193 269 358 253 269 286 285 285 218 152 231 193 221 249 196 142 225 308 228 148 253 241
10129 241 125 361 119 306 67 258 161 181 272 246 227 326 259 192 231 269 234 199 223 246 231 216 273 214 173 249 252 255 258 260 185 227 347
10162 347 271 105 135 210 286 171 174 192 210 177 261 172 200 338 280 242 205 279 236 230 224 277 213 218 223 228 233 156 197 332 194 146 214 199 185
10197 185 221 257 254 134 198 145 209 273 202 131 150 170 311 335 288 242 264 285 265 246 108 243 297 235 164 210 254 298 191 280 260 239
10229B39k2k2j0rj8J77p0o9jkQ2l5j47J27j66J86n9N9o1o1J90q3K0J9l5Q2j16JR9j8j53M3
10261A67N8N8j5j5j14Q1N0o8l7J57p9p9J53j98M5M6Q6j09P5m3p5M3JJ18llj37J36j16Q0j2
10292B51j3l9m0N9N8q8q8J19p6K6K6Q6l0o6N1l7Q1j6j32J43K6o5o6Q4l4M0p8J52k00K20k10
10323A44Q6Q6j40J33j30O5J6J6j18J56j75n7J84q9M6M5M3p5n4O2j8j8O6n1J4J5J2J3r1J05
10353B91r2K4L0q8O8m9kkP5j19O1O1m9J45k28M6J18p8J01r5J7J7j04R0j9k0%Jm8O9r2J82k2
10386B89k3q1q0J88q6J0J0ooJJk9Q8M1p5q8J07J0j07n6J40L0L0j45k7P5P5rj27L8L7M4M5q0
10420B34L7n2n1J4J5K7K6r0K7jJ17j13MN9n8n1O7j6j5rJ09p3M5p3M4n5O1N8o1N4j42L1J49
10453C18j8j7j1j0m8m8O1O2j66L0KJ20j02R3j20P6J2J3k9Q8j67K8K3K4J6J6m9O8k5k5onk9
$$ plain form
10229 239 217 195 185 176 158 335 265 196 195 193 275 240 93 220 54 240 181 240 179 118 308 225 245 264 229 311 195 196 295 277 124 167
10261 167 225 283 268 253 139 220 270 202 165 322 243 164 317 119 164 210 296 187 262 219 144 187 188 306 303 300 163 299 183 263 251
10292 251 238 199 159 218 276 188 100 219 143 169 195 281 251 185 236 199 280 264 132 275 301 236 170 254 220 260 182 334 134 354 144
10323 144 230 316 176 309 179 244 260 276 158 314 139 82 266 177 223 268 311 236 182 244 226 208 274 223 237 252 264 277 186 291
10353 291 199 223 253 165 233 184 182 180 255 136 197 258 209 354 126 172 290 212 313 218 235 252 148 238 219 199 199 200 152 221 129 311 289
10386 289 266 185 105 293 207 217 227 221 215 216 217 188 276 317 242 154 261 271 164 108 248 278 308 163 136 211 286 277 150 188 225 269 314 234
10420 234 271 219 168 182 197 224 250 160 187 186 303 190 194 253 195 144 211 195 180 171 280 207 252 179 223 168 229 287 226 280 138 169 318
10453 318 300 283 272 262 214 166 227 289 123 153 155 275 173 266 146 222 234 247 218 306 139 167 190 214 230 246 197 265 240 215 209 204 175
10486A75J68p2p3j1J07j16Jm5P2KJO9j26M1M2m4m4R2k4n7J39j47M9K3K3j0j1r2J04j3j4M2
10518B51p6k2k2J25p1M7M6q6L1k8k7L7J54r9j00P4j22J42j31N4N4R6r9p0M8K8q8R6k0p2J23
10549B73o5o5K04j48M8M9j28J46n1n1O4j32J14q1J33o2m6P1M9k25Q7Q7qj26J39K1O0j35o1
10578A61N7j5j4p6M2J51m5p9L8n3n3J14q1J06j0n0J46L5q1o7o8Q9k8j6j6K0K1R1j44M7M7j1
10610B58j2j1j2POrqJ41r2k0j9kkj19J16j08J26J0Rmlmml9l9R3j41P7P8l5l4k7k6Q6Q6j18
10646B05J16J9k16Q9Q9j16J19l2l2J44k46L3L3K3K3o6J68j40R5q5J50j58P6n4n4J9J9lkj8
10676A98j7J13j20K6K5r6J38l7l8n2J82q6q7M6M5O5j70J10j24N1N1k3k3J08j26O1O2Q0j54
10705B08N3N3j38R6j02J31m4m4m5m6Q7j48R9R9j4j3MLJ9J8j14J19q5q5J99l6n2n2J07q8Q0
$$ plain form
10486 175 343 271 198 187 294 178 179 134 206 208 209 278 152 193 235 191 147 239 215 158 297 150 199 222 245 235 224 132 236 223 209 251
10518 251 175 153 131 256 185 232 278 192 223 195 168 205 359 260 160 234 112 254 123 177 231 327 228 158 206 234 146 242 222 150 273
10549 273 208 143 347 199 247 296 168 314 263 212 276 144 258 177 310 248 202 273 322 97 184 271 263 137 276 297 357 222 161
10578 161 218 203 189 113 155 306 261 182 220 167 114 228 147 253 243 193 339 374 293 226 158 247 219 203 187 207 228 319 175 222 269 258
10610 258 246 235 223 230 236 227 219 360 268 248 229 227 225 106 222 114 240 250 259 255 252 248 244 205 166 259 118 195 273 238 204 177 151 237 323 205
10646 205 321 340 124 213 302 186 305 273 241 385 139 172 205 228 251 185 353 213 308 223 373 215 291 237 183 202 221 218 216 198
10676 198 181 294 174 200 225 129 267 230 192 140 322 236 149 195 240 305 135 245 121 172 223 200 177 285 159 220 282 362 208
10705 208 261 314 176 272 170 301 257 213 168 122 209 61 160 259 245 232 236 239 258 276 162 281 196 111 310 274 222 170 277 189 269
10736B69Q0r4r4L5L5O2n6j44J30J0J0mj22K4K4Q3l4kjJ01r5J9J8m3P5j88Q6p4J23j2j1P9l8
10769B51j18P8J9r8Q3l3Q3l3K0r7Q6l2j5j6J02j5n2n2k5J70j13NN6N6j39k2Q2l4j4J04r5K3
10801B15K5K5m3m3R4j79L4L3J8J7K5K5r1K5J29o7kkk2R5q9r0Q2l6poN2N2q9K7K1K0LKKKj4
10838B43j5o5J29l2l3k8R0p5p5m3P4Q7l0J02r3n4O2q8K8Q0l7K8K9oj23J19j16J18j17J18j17
10869A60J33j01J6J6JKJ6J6j37R9l4l4RRJ41r4q0q1J88m6q3J52NNRJ0m2m2j6J01j70O5J13
10902C06j21J8r9J66o9J30j06j0j1N5o2j00J34p1M7j8j7J21j13K5K5MLmj22J82n3p9L8l4Q2
10933B47r2J42m0m1j2j1l4Q4Q1j53j4J04k5R2j71O3J07j28J9J9PPK2K1j71O4N4N4j88K02j63
10964A46P1N7j77J60p4J0J0nnLKLLOOjjK6r2J57p7j0j27j9K14p6J20j56l9J53j19o1J34n9
$$ plain form
10736 269 349 255 161 196 231 293 237 93 223 233 243 239 117 141 165 248 214 212 211 312 217 236 254 211 286 98 184 110 233 221 210 289 251
10769 251 133 211 230 132 215 182 265 232 252 155 241 209 194 178 280 265 213 161 136 306 193 198 254 310 171 149 231 197 183 287 192 215
10801 215 240 265 222 179 273 94 128 161 179 196 221 246 155 180 309 242 240 238 216 311 222 132 214 178 171 165 217 269 180 207 228 248 251 253 255 257 243
10838 243 228 163 292 260 227 199 289 214 139 96 170 257 227 329 236 182 244 156 184 264 227 255 284 278 155 274 158 276 159 277 160
10869 160 293 192 208 224 225 227 243 259 122 221 187 153 162 171 312 218 138 57 245 199 116 268 273 278 287 297 255 213 197 298 128 193 306
10902 306 185 203 104 270 201 331 225 215 204 259 197 97 231 160 207 189 172 293 180 205 230 234 237 233 111 293 240 161 199 165 247
10933 247 155 297 257 216 204 193 159 243 324 171 157 261 236 328 157 220 327 199 218 237 244 251 273 294 123 187 241 295 107 309 146
10964 146 217 274 97 257 183 193 203 198 193 196 198 201 204 210 216 215 214 240 148 305 228 218 91 72 286 210 330 174 135 288 169 108 242 183
10998A83N9o1N6lklkN2o4JJl0l1K8K8L5L4p5p6J30o6j4j5mnj2J06KLJ0J0m1m2J05j68J30J4
11035B73l6l5J7J7m8O8m3m2L5L6m9J46o8o8P2m5K1K1m4m4J4J5j7j7L4L5M6p1j59J14L7L6n6
11068A95n7J02r4J6J6N7N8j04R2p0M8p3M5klJ2J2p5M3L5q2P7l9j35J39m3m4Q6l2J36o0N6j41
11101A71M2M2k9k8j3j3N2o4K7K7k7k6r3J03O6O6j37R7r3K4n5O2MLrrrrO4O4p2p3L6L6k3k2
11137A82M2M2n6n6J8J8J42r2P9l8J3J3n2n1OPKKnnL1q7J55p9R8j37q5L2K1K2J4J4Q3j50J2
11172A55J30m0m0l3l3J7J7J7J7J0J1J0J1KKp9L9L5j98K02l3N7o1l1Q6O0j75k3K12j09RK3K4
11205B91j31j3LK38j15j15L7L6qqqqN9N9p7p8N2N2ppLLLLOOk06J84q4L3O4n2l4Q4m1P6j86
11242A14M8J07j27N8o0k0k0J16p8L1L1j5j5k6J68q2q2L6L5o8M8k4R2o2o2L5L5O6n1q7J07j09
$$ plain form
10998 183 242 181 237 234 232 229 227 279 215 216 217 187 156 184 212 247 281 206 130 260 194 180 165 161 156 144 250 252 255 265 275 234 192 297 129 259 273
11035 273 237 202 219 236 188 256 213 171 206 242 193 339 271 203 275 230 251 272 228 184 198 213 196 179 213 248 294 223 64 178 215 251 195
11068 195 138 240 146 162 178 235 293 189 281 211 259 186 231 229 226 238 250 175 218 253 171 248 209 74 213 170 126 212 180 316 256 312 171
11101 171 213 255 226 198 185 172 224 160 187 214 187 161 68 171 237 303 166 263 170 194 139 201 205 208 199 190 181 172 236 300 228 155 191 227 204 182
11137 182 224 266 210 154 172 190 332 240 319 281 294 307 255 204 210 217 219 221 216 211 242 155 310 231 329 192 107 139 160 182 196 210 293 143 155
11172 155 285 245 205 172 139 156 173 190 207 217 228 238 249 251 253 174 213 248 50 252 219 276 215 184 270 330 155 132 344 235 244 267 291
11205 291 160 147 150 388 273 158 195 231 223 215 207 199 258 317 240 162 214 266 259 252 255 258 261 264 270 276 70 254 170 203 267 215 181 265 224 300 114
11242 114 162 269 142 200 140 120 100 216 138 169 200 185 170 144 312 230 148 184 219 151 199 175 267 205 143 178 213 279 228 141 248 139
11274A39PM4M4L4q4J36j38K1K2r4J02o4J32j73K2K3K4L5L6k7k6j4j4p9J15J8J8r6J01j7j7
11305B30L6q0j15K37K8K8l6l6q6J09n9n9J2J1J8J9q8L0m4P3l3l4M0M0p4M3l0l0J05j3O1n7
11337B46o3o3J30o5L5q3J67j07J19j55M1M1J3J3n3O4k6k6k6k6R9j9j1j1%%qJ10j02j01O5O4
11369B62R1j83R5k2J0J0j53Q0J18k73J76n8J21j13J28j06P6m1J0J0kllkL0L0k8k8j6j5j5j6
11401A70L0L0k9k8Q8Q7j00J7n1J83j59m1N0j84J84m9L7L6l6l6L1L1j89K02l6l7j1j2llJ29
11432C01j05K3K2j23J10m7m6J97l7l1l1ONM9o9P0j64O4O5NOj24J11l5l6J02j32N8N9l7l6P
11464B07QJ28j06m0P7m6m7J9K0k2k2N1N1j16J18j4j4k0k0m2P5K9k06J88m7J15j19o1N7k6R0
$$ plain form
11274 139 146 190 234 268 184 320 182 203 225 131 233 169 301 128 150 173 197 232 268 241 215 201 187 108 223 241 259 163 264 247 230
11305 230 266 186 71 308 336 364 328 292 206 315 256 197 209 220 238 257 169 199 155 228 195 161 201 241 167 210 180 150 255 242 303 246
11337 246 183 120 250 185 220 137 304 197 316 161 202 243 256 269 216 280 254 228 202 176 275 256 245 234 234 234 226 336 234 133 198 262
11369 262 353 170 265 243 253 263 110 190 308 35 211 153 274 161 289 183 259 218 228 238 236 233 230 228 258 288 260 232 216 201 186 170
11401 170 200 230 201 173 261 348 248 265 214 397 238 197 247 63 247 198 235 271 235 199 230 261 72 274 238 201 190 178 175 172 301
11432 301 196 219 241 118 228 181 135 332 295 264 233 239 244 293 224 294 130 194 259 264 270 146 257 222 186 288 156 214 273 236 200 207
11464 207 215 343 237 197 274 228 181 200 220 198 176 227 278 162 280 266 252 232 212 170 245 274 68 256 209 324 205 144 201 175 265
$$ [...]
14828B14
##$OBSERVEDINTEGRALS=	(X Y Z)
(8.8398550175413070917, 8.9771872010354503146, 1.0008110901514928326)
(2.3152641994463980524, 2.5183457167195868465, 3.0721381797764748534)
(8.0365558072399387868, 8.138143997769855531, 1.0193072682256092421)
(7.8825500641231327492, 7.9694574344825275247, 1.7634103304701973514)
(7.7719248417854682742, 7.8635221561789876432, 1.7712660955099830407)
(7.5186342475317688994, 7.5719869263710446461, 2.4044455356801881507)
(7.4241581467711323938, 7.4638381090905987492, 3.0448155995848740218)
(7.3034986695139760826, 7.3869075698994492996, 3.6058793477061126254)
##END=	
##TITLE=	R8
##JCAMPDX=	6.0	$$ NMR Plug-in 1.10 of MestReNova 9.0.0-12821
##BLOCKID=	2
##DATATYPE=	NMRPEAKTABLE
##DATACLASS=	PEAKTABLE
##.OBSERVEFREQUENCY=	400.029998779296875
##.OBSERVENUCLEUS=	^1H
##NPOINTS=	37
##FIRSTX=	2.4237819894315086877
##LASTX=	8.9062203165992670506
##XFACTOR=	1
##YFACTOR=	1
##FIRSTY=	1179.1771626044487675
##XUNITS=	PPM
##YUNITS=	ARBITRARY UNITS
##PEAKTABLE=	(XY..XY)
2.4237819894315086877, 1179.1771626044487675
7.3135533514911923447, 176.402496337890625
7.334647845067833849, 427.874267578125
7.3551780119267036184, 143.5475311279296875
7.3596315528426554664, 557.70263671875
7.3650984960059595608, 171.2914581298828125
7.3758265132083806748, 113.08080291748046875
7.3808053492901546377, 219.780609130859375
7.4125582351961343264, 95.1671905517578125
7.4151419304974464097, 102.83148956298828125
7.4300978276009903567, 507.797210693359375
7.4358640261269259852, 485.0419921875
7.4440580707102865787, 281.188262939453125
7.4471370412368145253, 296.374176025390625
7.4532071418771277393, 227.7245941162109375
7.4574902667058493577, 210.85931396484375
7.4785267196971432213, 236.0188751220703125
7.5303517139793756385, 397.921539306640625
7.5357080110394036865, 156.7296905517578125
7.5472582372153853569, 245.543304443359375
7.5528117661453979537, 432.56268310546875
7.5595672613933695416, 85.42324066162109375
7.5644124356647113316, 95.90224456787109375
7.6295315831729126899, 430.49835205078125
7.8179823298553161592, 397.482330322265625
7.8233102845507511702, 142.2659912109375
7.8349816286880216154, 129.6828460693359375
7.840374654426797818, 352.365325927734375
7.8479870030848131179, 62.648731231689453125
7.8936736286285142938, 37.49588775634765625
7.9032559615211379622, 188.4448699951171875
7.9087642298128937313, 214.934661865234375
7.9167193010255099139, 192.94921875
7.9275839923845641266, 179.4033203125
8.0750879534646156088, 178.8211822509765625
8.0962117523225174409, 171.320404052734375
8.9062203165992670506, 577.8583984375
##END=	
##END=	
