##TITLE=C13CPD CDCl3 {C:\Spectra\data\SiimK\nmr} SiimK 34
##JCAMPDX= 6.0         $$ Bruker NMR JCAMP-DX V2.0
##DATA TYPE= NMR SPECTRUM
##DATA CLASS= NTUPLES
##ORIGIN= Bruker BioSpin GmbH
##OWNER= nmrsu
$$ 1.83.2.2 TOPSPIN		Version 3.2
$$ 2016-05-10 10:53:06.469 +0300  Siim@Siim-workPC
$$ Compression mode = diff/dup
##.OBSERVE FREQUENCY= 176.052858712194
##.OBSERVE NUCLEUS= ^13C
##.ACQUISITION MODE= SIMULTANEOUS (DQD)
##.ACQUISITION SCHEME= undefined
##.AVERAGES= 512
##.DIGITISER RES= 21
##SPECTROMETER/DATA SYSTEM= spect
##.PULSE SEQUENCE= zgpg30
##.SOLVENT NAME= CDCl3
##.SHIFT REFERENCE= INTERNAL, CDCl3, 1, 218.261
##AUDIT TRAIL= $$ (NUMBER, WHEN, WHO, WHERE, PROCESS, VERSION, WHAT)
$$ ##TITLE= Audit trail, TOPSPIN		Version 3.2
$$ ##JCAMPDX= 5.01
$$ ##ORIGIN= Bruker BioSpin GmbH
$$ ##OWNER= Siim
$$ $$ C:/Users/Siim/Desktop/nmr/45 P/2/pdata/1/auditp.txt
$$ ##AUDIT TRAIL=  $$ (NUMBER, WHEN, WHO, WHERE, PROCESS, VERSION, WHAT)
(   1,<2015-11-06 19:43:51.611 +0200>,<nmrsu>,<HP>,<go>,<TOPSPIN 3.2>,
      <created by zg
	started at 2015-11-06 19:19:17.954 +0200,
	POWCHK enabled, PULCHK disabled,
       configuration hash MD5:
       8F AF 65 7A CC E6 26 17 7A A5 E9 E3 EA 55 FD EF
       data hash MD5: 64K
       39 9E C5 A5 04 7C 08 CA C5 01 BE 75 AC F3 A7 3F>)
(   2,<2015-11-06 19:43:52.511 +0200>,<nmrsu>,<HP>,<audit>,<TOPSPIN 3.2>,
      <user comment:
       ICON-NMR User ID: SiimK
       data hash MD5: 64K
       39 9E C5 A5 04 7C 08 CA C5 01 BE 75 AC F3 A7 3F>)
(   3,<2015-11-06 19:43:52.646 +0200>,<nmrsu>,<HP>,<audit>,<TOPSPIN 3.2>,
      <user comment:
       ICON-NMR User ID: SiimK
       data hash MD5: 64K
       39 9E C5 A5 04 7C 08 CA C5 01 BE 75 AC F3 A7 3F>)
(   4,<2015-11-11 13:44:07.166 +0200>,<Siim>,<Siim-workPC>,<proc1d>,<TOPSPIN 3.2>,
      <Start of raw data processing
       ft FT_mod = 6 PKNL = 1 SI = 128K 
       data hash MD5: 128K
       80 44 A6 54 63 19 79 84 BA 60 A1 18 05 AC 94 B5>)
(   5,<2015-11-11 13:44:11.851 +0200>,<Siim>,<Siim-workPC>,<proc1d>,<TOPSPIN 3.2>,
      <apk 
       data hash MD5: 128K
       CC 74 85 1E C9 80 6E 29 6C 96 38 89 DA A3 B5 09>)
(   6,<2015-11-11 13:44:15.782 +0200>,<Siim>,<Siim-workPC>,<proc1d>,<TOPSPIN 3.2>,
      <abs n ABSG = 5 
       data hash MD5: 128K
       B7 9B 37 C2 A1 BB 77 3A 1C 73 8F C3 EE A7 0A 3E>)
$$ ##END=
$$ 
$$ $$ hash MD5
$$ $$ 01 52 99 5E 4A 7C 85 1F 64 2F 11 A3 2B 38 9C D6
##$RELAX= 
##$RELAX= 
##$RELAX= 
##$RELAX= 
##$RELAX= 
##$RELAX= 
##$RELAX= 
##$RELAX= 
##$RELAX= 
##$RELAX= 
##$RELAX= 
$$ Bruker specific parameters
$$ --------------------------
##$DATPATH= <C:/Users/Siim/Desktop/nmr>
##$EXPNO= 2
##$NAME= <45 P>
##$PROCNO= 1
##$ACQT0= -2.60504193666602
##$AMP= (0..31)
100 100 100 100 100 100 100 100 100 100 100 100 100 100 100 100 100 100
100 100 100 100 100 100 100 100 100 100 100 100 100 100
##$AMPCOIL= (0..19)
0 0 0 0 0 0 0 0 0 0 0 0 0 0 0 0 0 0 0 0
##$ANAVPT= -1
##$AQSEQ= 0
##$AQ_mod= 3
##$AUNM= <au_zg>
##$AUTOPOS= <34 >
##$BF1= 176.035256
##$BF2= 700.08
$$ [...]
##$TE_STAB= (0..9)
2 2 0 0 0 0 0 0 0 0
##$TL= (0..7)
120 120 120 120 120 120 120 120
##$TUNHIN= 0
##$TUNHOUT= 0
##$TUNXOUT= 0
##$USERA1= <>
##$USERA2= <>
##$USERA3= <>
##$USERA4= <>
##$USERA5= <>
##$V9= 5
##$VALIST= <>
##$VCLIST= <>
##$VD= 0
##$VDLIST= <>
##$VPLIST= <>
##$VTLIST= <>
##$WBST= 1024
##$WBSW= 4
##$XGAIN= (0..3)
0 0 0 0
##$XL= 0
##$YL= 0
##$YMAX_a= 11059208
##$YMIN_a= -7600649
##$ZGOPTNS= <>
##$ZL1= 120
##$ZL2= 120
##$ZL3= 120
##$ZL4= 120
##$ABSF1= 218.3429
##$ABSF2= -18.35211
##$ABSG= 5
##$ABSL= 3
##$ALPHA= 0
##$AQORDER= 0
##$ASSFAC= 0
##$ASSFACI= 0
##$ASSFACX= 0
##$ASSWID= 0
##$AUNMP= <proc_1d>
##$AXLEFT= 0
##$AXNAME= <>
##$AXNUC= <13C>
##$AXRIGHT= 0
##$AXTYPE= 0
##$AXUNIT= <>
##$AZFE= 0.1
##$AZFW= 0.5
##$BCFW= 0
##$BC_mod= 0
##$BYTORDP= 0
##$COROFFS= 0
##$CY= 15
##$DATMOD= 1
##$DC= 0
##$DFILT= <>
##$DTYPP= 0
##$ERETIC= no
##$F1P= 220
##$F2P= -10
##$FCOR= 0.5
##$FTSIZE= 131072
##$FT_mod= 6
##$GAMMA= 0
##$GB= 0
##$INTBC= 1
##$INTSCL= 1
##$ISEN= 30
##$LB= 0
##$LEV0= 0
##$LPBIN= 0
##$MAXI= 10000
##$MC2= 0
##$MEAN= 0
##$ME_mod= 0
##$MI= 0
##$MddCEXP= no
##$MddCT_SP= no
##$MddF180= no
##$MddLAMBDA= 0
##$MddMEMORY= 0
##$MddMERGE= 0
##$MddNCOMP= 0
##$MddNITER= 0
##$MddNOISE= 0
##$MddPHASE= 0
##$MddSEED= 0
##$MddSRSIZE= 0
##$Mdd_CsALG= 0
##$Mdd_CsLAMBDA= 0
##$Mdd_CsNITER= 0
##$Mdd_CsNORM= 0
##$Mdd_CsZF= 0
##$Mdd_mod= 0
##$NCOEF= 0
##$NC_proc= 1
##$NLEV= 6
##$NOISF1= 0
##$NOISF2= 0
##$NSP= 0
##$NTH_PI= 0
##$NZP= 0
##$OFFSET= 218.261
##$PC= 1.4
##$PHC0= 39.15161
##$PHC1= 22.6123
##$PH_mod= 1
##$PKNL= yes
##$PPARMOD= 0
##$PPDIAG= 0
##$PPIPTYP= 0
##$PPMPNUM= 2147483647
##$PPRESOL= 1
##$PSCAL= 0
##$PSIGN= 0
##$PYNMP= <proc.py>
##$REVERSE= no
##$SF= 176.035270403036
##$SI= 131072
##$SIGF1= 0
##$SIGF2= 0
##$SINO= 0
##$SIOLD= 32768
##$SPECTYP= <C13>
##$SREGLST= <13C.CDCl3>
##$SSB= 0
##$STSI= 131072
##$STSR= 0
##$SW_p= 41666.6666666666
##$SYMM= 0
##$S_DEV= 0
##$TDeff= 65536
##$TDoff= 0
##$TI= <>
##$TILT= no
##$TM1= 0
##$TM2= 0
##$TOPLEV= 0
##$USERP1= <>
##$USERP2= <>
##$USERP3= <>
##$USERP4= <>
##$USERP5= <>
##$WDW= 0
##$XDIM= 131072
##$YMAX_p= 336297031
##$YMIN_p= -3864661
##$CURPLOT= <HP LaserJet 1010>
##$CURPRIN= <$HP LaserJet 1010>
##$DFORMAT= <normdp>
##$LAYOUT= <+/1D_X.xwp>
##$LFORMAT= <normlp>
##$PFORMAT= <normpl>
$$ End of Bruker specific parameters
$$ ---------------------------------
##NTUPLES= NMR SPECTRUM
##VAR_NAME=  FREQUENCY,     SPECTRUM/REAL,   SPECTRUM/IMAG
##SYMBOL=    X,             R,               I
##VAR_TYPE=  INDEPENDENT,   DEPENDENT,       DEPENDENT
##VAR_FORM=  AFFN,          ASDF,            ASDF
##VAR_DIM=   131072,        131072,          131072
##UNITS=     HZ,            ARBITRARY UNITS, ARBITRARY UNITS
##FACTOR=    0.317891438802083, 1,           1
##FIRST=     41666.3487752278, -164834,      214960
##LAST=      0,             -395188,         -146518
##MIN=       0,             -3864661,        0
##MAX=       41666.3487752278, 336297031,    0
$$ Real data points
##PAGE= N=1
##DATA TABLE= (X++(R..R)), XYDATA
$$ [...]
##PAGE= N=2
##DATA TABLE= (X++(I..I)), XYDATA
90555 799060 760288 545787 503820 660943 752191 683494 591365 524999 422797 366424 521195
90544 521195 809192 938198 804496 616854 562320 579240 549956 518273 583614 708363
90534 708363 766387 721399 646017 587006 511934 414591 390902 521793 707925 748409 625700
90523 625700 572033 744122 969550 991708 845096 741581 671775 449785 156404 158230
90513 158230 549098 912096 864681 570359 437022 525229 581700 524059 531698 671549 761438
90502 761438 687628 606950 694544 854426 847810 645962 498226 608912 842534 865018 580223
90491 580223 289633 313816 565650 688235 567610 462252 577653 760391 754341 573596
90481 573596 442887 483751 623820 743369 778866 738593 709488 777270 877387 843334 671442
90470 671442 570307 637838 689193 579309 484875 601357 737036 568742 222534 186792
90460 186792 589824 959160 880714 568007 498531 718716 861372 754573 642151 743923
90450 743923 907248 864492 635684 464849 461017 515537 539830 573546 626622 609185 507936
90439 507936 473870 609888 793516 853578 822314 843411 904923 867158 734614 687677 803789
90428 803789 931931 919061 810587 737525 728732 731559 722801 707174 678850 658571 699235 792984
90416 792984 849652 827582 799462 819506 820380 735816 641338 655699 756417 813882 781378 734482
90404 734482 726007 715961 676648 675288 787521 969566 1076755 1008844 806843 606056 519947
90393 519947 571152 693798 775559 739809 637440 615022 716971 775238 630000 420734
90383 420734 449078 723616 894840 763174 587928 670305 867205 841535 631701 582301
90373 582301 773285 928136 911187 903102 981236 937755 711796 623346 883940 1177420 1085515
90362 1085515 723436 563863 739747 920313 874323 777739 854050 1013667 1039852 940681
90352 940681 906185 1001698 1089275 1045946 920780 836721 829596 851036 878527 932131 984898
90341 984898 954509 834564 756522 836359 1005283 1084947 1005059 856054 745842 701438 706585
90330 706585 743336 787323 825796 865533 872315 769024 579767 481391 572853 688486 629693
90319 629693 498211 551292 769155 861038 724650 591860 630262 702425 669426 651248 775012
90308 775012 897328 827510 660916 637179 779072 907537 933936 917291 892279 849463 842685
90297 842685 917125 963458 844174 652559 639242 849472 1021477 923009 649159 485834
90287 485834 560955 733675 805359 755092 725932 804466 887750 827748 665053 608733 765233
90276 765233 992366 1078547 986226 848922 784668 787395 783625 745899 736967 829865 981057
90265 981057 1046941 976037 896263 912456 920962 789322 629116 660889 852532 958704 924211
90254 924211 954351 1120545 1201839 1055409 865207 833917 868897 797218 694067 747534 934348
90243 934348 1069240 1083350 1044119 979677 881259 816181 855950 937628 947233 889190 843295
90232 843295 823107 807628 838625 951984 1075492 1111215 1057458 966281 874074 843509 936642
90221 936642 1067804 1060012 943871 975142 1213064 1348774 1177074 965015 1032017 1202319
90211 1202319 1088403 765153 685813 957044 1174221 1065972 872510 901019 1057420 1067444
90201 1067444 916523 809761 842378 938974 1035226 1126794 1176866 1128308 1003585 892421
90191 892421 842445 830671 835713 875130 957282 1036836 1053653 1011992 978323 974152 930687 827047
90179 827047 806316 997245 1244953 1239824 971380 813971 1017545 1332586 1357710 1092049
90169 1092049 879905 907492 1032328 1082555 1064752 1041571 1013753 988372 1017547 1110485 1199838
90158 1199838 1222197 1173197 1102517 1104290 1244184 1429408 1453505 1264074 1065268 1037325 1095041
90147 1095041 1075631 1012193 1020685 1056142 1021038 1004659 1151321 1364699 1407400 1248644 1066907
90136 1066907 958334 893290 902734 1029260 1138003 1072183 963865 1071308 1324408 1387814
90126 1387814 1201617 1076844 1166646 1234018 1108813 1005765 1143846 1352515 1347877 1182603
90116 1182603 1124330 1228384 1307375 1244815 1104905 978833 915496 970276 1156452 1364611
90106 1364611 1456502 1420921 1346159 1281903 1220158 1167391 1142706 1133172 1120212 1121490 1159570 1226111
90094 1226111 1304976 1378075 1394929 1315761 1203973 1180540 1254594 1299180 1239155 1165624 1205144
90083 1205144 1350429 1473677 1459399 1307971 1156363 1170077 1338179 1434751 1309305 1139712
90073 1139712 1199060 1424167 1486379 1309629 1209448 1398420 1641243 1606345 1341503 1158721
90063 1158721 1195649 1334801 1458775 1541606 1533461 1385726 1200718 1170834 1332208 1514347
90053 1514347 1566389 1520076 1489217 1496358 1455202 1293791 1066221 933133 1005207 1209165 1366124
90042 1366124 1406796 1420103 1464910 1457620 1330253 1195152 1226077 1423843 1612229 1648216 1554189
90031 1554189 1459632 1474788 1595622 1684403 1591710 1352209 1194404 1280918 1504896 1634655
90021 1634655 1591862 1472209 1359548 1280871 1312158 1527549 1801660 1856853 1620251 1382317
90011 1382317 1443509 1708128 1820471 1653404 1440743 1402858 1473694 1512955 1581115 1791849
90001 1791849 2014936 1990117 1724785 1532714 1613138 1797946 1828128 1714511 1672205 1798316
89991 1798316 1967011 2005505 1868978 1668063 1586541 1721757 1953265 2040972 1910759 1753957
89981 1753957 1771910 1922216 2018573 1994822 1948314 1971382 2047546 2096858 2067212 2006570 2043574
89970 2043574 2212073 2320509 2163890 1867128 1780952 1979772 2147523 2087554 2021824 2159099
89960 2159099 2293996 2176848 2009700 2143903 2466673 2562306 2389451 2305904 2432079 2490462
89950 2490462 2357764 2294546 2453357 2583057 2458913 2260853 2265202 2437159 2582373 2667895
89940 2667895 2741717 2734753 2596173 2468554 2495425 2587624 2590572 2545808 2566213 2581536 2460033
89929 2460033 2301550 2349900 2628633 2887672 2936975 2853646 2813030 2857399 2901325 2881374 2833560
89918 2833560 2845979 2958619 3105560 3167612 3092598 2947070 2849820 2881908 3049412 3285496
89908 3285496 3491839 3621374 3708105 3780151 3793409 3719948 3643839 3666810 3759949 3816816 3814591
89897 3814591 3809512 3817792 3827790 3882237 4005982 4101449 4077339 4034380 4138226 4341944 4441113
89886 4441113 4394491 4374114 4480366 4620080 4706089 4777025 4866631 4937405 4998121 5120039 5291698
89875 5291698 5416590 5483322 5574859 5697466 5784732 5881279 6113432 6448050 6694414 6790853
89865 6790853 6881513 7060875 7252085 7392787 7533676 7696271 7837584 8005572 8316671 8730318
89855 8730318 9069165 9313621 9638075 10093673 10507815 10786036 11070851 11501092 12038514
89846 12038514 12623105 13276521 13971319 14627532 15306109 16155669 17107259 17906386 18517782
89837 18517782 19167740 19856058 20137920 19520407 17744032 14546216 9607054 3102077 -3945026
89827 -10213267 -14901618 -17889436 -19400425 -19804657 -19547674 -18951973 -18124692 -17159703 -16241963
89818 -16241963 -15434221 -14608291 -13744252 -13040646 -12567259 -12100676 -11496023 -10915647 -10479120
89809 -10479120 -10026531 -9485998 -9113755 -9041753 -8935885 -8493407 -7962257 -7725315 -7648367 -7337683
89799 -7337683 -6833016 -6514216 -6445877 -6341288 -6123886 -6014728 -6041310 -5927407 -5560701 -5186833
89789 -5186833 -5034134 -5049199 -5080390 -5058157 -4944274 -4746135 -4606941 -4650556 -4738115 -4617476
89779 -4617476 -4304262 -4065705 -4028985 -4054391 -4006805 -3913235 -3822267 -3714882 -3586942 -3462251
89769 -3462251 -3328774 -3192485 -3131117 -3151032 -3099817 -2902456 -2756032 -2863061 -3087580 -3131960
89759 -3131960 -2967447 -2830472 -2856071 -2958873 -3023390 -2994447 -2846082 -2658391 -2626517 -2797514
89749 -2797514 -2932130 -2836202 -2656971 -2607084 -2595878 -2439003 -2243254 -2230236 -2331318 -2320560
89739 -2320560 -2214678 -2175985 -2156127 -2022270 -1902894 -1995740 -2154620 -2103547 -1948747 -2003678
89729 -2003678 -2190250 -2129908 -1809708 -1639060 -1796737 -1997133 -1981662 -1820270 -1662815 -1578594
89719 -1578594 -1661578 -1905249 -2003952 -1711789 -1337301 -1377781 -1725376 -1827756 -1608698 -1540870
89709 -1540870 -1741294 -1750526 -1409786 -1199994 -1383488 -1526819 -1303848 -1106559 -1330594 -1638258
89699 -1638258 -1540918 -1243578 -1261749 -1551856 -1675801 -1584239 -1599143 -1758974 -1772263 -1571653
89689 -1571653 -1404330 -1376951 -1341869 -1244812 -1215139 -1291221 -1359979 -1373434 -1376114 -1351108 -1265932
89678 -1265932 -1209215 -1266958 -1347537 -1332942 -1290543 -1329744 -1385839 -1358111 -1302893 -1269075 -1136498
89667 -1136498 -874533 -745257 -934440 -1181122 -1133525 -899074 -844418 -991040 -1047309 -957340
89657 -957340 -958581 -1101539 -1152721 -1024943 -904826 -883170 -837816 -766368 -850956 -1068935 -1117556
89646 -1117556 -903944 -759952 -939710 -1209451 -1212570 -994778 -855965 -859902 -829535 -737557
89636 -737557 -758623 -923000 -1021959 -947708 -880139 -984272 -1108024 -993409 -696529 -557946
89626 -557946 -738150 -996635 -1029260 -852954 -704165 -684662 -706108 -713539 -741760 -764648 -708142
89615 -708142 -633412 -687188 -824533 -816854 -625223 -522940 -696148 -941602 -963751 -797052
89605 -797052 -697193 -735489 -759384 -704737 -700458 -837828 -1017014 -1074391 -957139 -750262 -602812
89594 -602812 -614882 -732407 -788322 -708440 -612907 -635290 -721322 -721835 -624641 -560191 -600054 -673377
89582 -673377 -690654 -653944 -619170 -611001 -609476 -605277 -641341 -758813 -886132 -861590 -649063
89571 -649063 -452045 -474937 -633272 -681607 -585862 -542310 -630719 -703599 -664370 -600208 -568791
89560 -568791 -513700 -474893 -594100 -793014 -764143 -458776 -258041 -415625 -646817 -585151
89550 -585151 -362062 -347443 -536323 -627240 -567918 -568752 -634563 -537405 -280189 -166032 -313803
89539 -313803 -473033 -449775 -388720 -464377 -571704 -531692 -401216 -362032 -424650 -435184 -320856
89528 -320856 -182500 -152031 -243325 -354004 -385350 -345626 -311389 -299624 -265150 -240530 -334412
89517 -334412 -517510 -582811 -454440 -355910 -474120 -631082 -554587 -330864 -263902 -376738
89507 -376738 -417194 -326092 -303889 -373378 -291007 -24442 80114 -169371 -454123 -410735 -180272
89495 -150830 -342162 -423538 -263845 -97404 -119041 -226680 -258808 -241656 -267669 -308443 -300698
89484 -300698 -298417 -381637 -480967 -449853 -295526 -193367 -244778 -348442 -374294 -352519 -385665
89473 -385665 -454571 -447512 -344372 -231104 -146761 -69729 -58845 -222120 -489309 -605027 -458973
89462 -458973 -260739 -251456 -390549 -488645 -508367 -524963 -494273 -309916 -60639 9951 -164508
89450 -370150 -395396 -269870 -167936 -191776 -304596 -398510 -392352 -310000 -256032 -273445 -279435
89439 -279435 -206586 -125972 -133471 -203803 -274355 -366669 -474285 -452855 -232219 -36708 -134287
89428 -134287 -419681 -528114 -355727 -177088 -207524 -335926 -378821 -338929 -294233 -253884
89418 -253884 -243590 -334300 -477965 -510870 -416836 -375267 -450696 -478652 -384470 -342506 -439945
89407 -439945 -463868 -269049 -94682 -200787 -407441 -366357 -135513 -71065 -227528 -305910
89397 -305910 -208499 -196599 -379574 -464817 -237074 53045 61486 -140818 -239986 -179260 -154963
89386 -154963 -212768 -192910 -75802 -62216 -224461 -342210 -229333 -25743 13931 -110822 -185487
89375 -185487 -122873 -66165 -138772 -261330 -289068 -216170 -146815 -128792 -122880 -117362 -162542 -257010
89363 -257010 -288957 -175023 -18212 -21327 -222084 -407739 -358803 -114810 87524 98976 -22976
89351 -157464 -250520 -277185 -208716 -93336 -64068 -171260 -288584 -281425 -189571 -134761 -128232
89340 -128232 -104816 -76655 -90687 -86622 14852 112538 29641 -174149 -232430 -71867 60579
89328 -17176 -145933 -109607 6999 -21576 -180327 -249783 -160224 -68444 -88593 -151363 -152545 -81015
89316 -81015 19764 88138 49144 -90451 -185674 -138888 -86848 -204386 -368615 -288882 8371
89304 134897 -97480 -363175 -285681 21737 159565 27455 -118131 -125261 -125373 -209766 -235818
89293 -235818 -92088 73388 67330 -59030 -114446 -60062 -17892 -45959 -82077 -97673 -144290 -219155
89281 -219155 -218528 -84533 85509 133231 4385 -197776 -293347 -181715 30466 102340 -53442 -215894
89269 -215894 -130369 109088 159800 -75203 -298696 -259730 -98306 -73281 -156063 -142733 -27844
89257 16556 -35655 -46993 -6114 -55717 -197204 -235808 -103090 9982 -37285 -111207 -47967 62390
89244 36450 -81882 -81955 77126 191463 98552 -106400 -198373 -84859 116842 228711 190326
89233 190326 81544 -8317 -87836 -206831 -327203 -327438 -157862 61225 143697 38461 -99297
89221 -70526 121000 240721 111407 -133050 -222901 -140064 -106997 -166697 -72519 256140 472414
89210 472414 270353 -122662 -262242 -120882 -21784 -61645 -36338 94337 121107 11742 -9047
89198 97421 83981 -97813 -139170 89479 250543 75476 -165831 -84105 211977 300932 78863
89186 -162810 -200115 -95789 7829 49431 5742 -109527 -197264 -161358 -35935 60919 58843 -27277
89173 -112339 -75215 99659 224240 134120 -11542 72638 306039 311019 40280 -94645 108040
89161 294140 153615 -65765 -21000 134591 81890 -49358 86559 406238 504470 296231 75634
89149 4638 -12930 295 120620 243177 183446 39555 61726 189458 131953 -100449 -182070
89138 -182070 -25456 84801 -2203 -75197 32277 175015 191598 152003 159379 177134 179379 216801
89126 216801 233505 89080 -138934 -164696 69129 252536 164596 -1825 31710 206175 261264
89115 261264 140344 29828 59802 144353 125484 -10585 -90762 49616 322956 441521 284257
89104 284257 71384 39968 111923 90739 20911 69836 182714 180260 109107 148493 232353
89093 232353 134782 -100940 -203839 -137158 -117589 -161582 -51266 182289 203371 -57952 -216701
89082 -216701 -15495 294139 378758 275192 172357 72142 -57417 -71409 123916 345542
89072 345542 377456 249342 84916 -101094 -266053 -250639 -42168 114013 80991 53257 184036
89061 184036 273809 125117 -57400 20481 236273 245574 45068 -53726 58436 178833 185908
89050 185908 185560 228296 204724 106464 110401 282312 423934 357156 185559 119566 168035
89039 168035 169449 60484 -53063 -84054 -69823 -46148 45432 216672 308320 182917 -7667
89027 29136 289294 434015 281442 70003 61050 147087 110997 32608 105757 243182 241612
89016 241612 191184 303990 446371 305803 -30519 -157518 -14948 45504 -87650 -107414 102957
89004 224695 83516 -34097 87170 222233 172516 137413 268296 301195 47483 -163022 974
88992 276904 245119 46166 91517 300364 250063 -39774 -109407 159574 360935 254614 101469
88980 134815 173847 22458 -121412 24960 341958 441852 192954 -134626 -230408 -78965 102072
88968 156669 135440 147304 165296 95946 139 56524 261242 368890 249330 112167 200099
88957 200099 411613 444538 227098 -3765 -24105 138958 281174 228675 -4314 -207478 -184746
88946 -184746 2933 123122 113464 141569 269936 314090 167325 14540 33359 116107 112811
88935 112811 124146 277891 408860 283715 16467 -65933 98201 263751 274942 217561 183611
88924 183611 144440 82538 40018 15382 -18799 -6152 115941 247693 210281 -3484 -210261
88913 -210261 -261762 -164129 956 147371 201410 161407 119821 148459 212166 257224 295537 331012
88901 331012 312313 235292 172802 139353 77254 33600 144054 351930 387521 166201 -42310
88889 -14425 111426 121741 70154 89360 113557 69313 109619 348013 569021 529236 356181
88878 356181 312107 346884 248748 72686 29845 84685 57958 16159 147687 340502 310411
88867 310411 100351 26995 150972 223313 163078 156621 234812 178996 -49917 -179240 -56700
88855 126774 187336 209018 300626 370441 314186 208716 167109 175559 188902 232080 317683
88844 317683 395593 435034 438488 380150 269483 230008 337598 437921 331015 78814 -91614
88832 -118553 -95037 -16736 168656 332651 306337 197975 239041 365242 319903 141434
88821 133563 331238 426565 298739 190707 241958 265083 150698 97279 232682 364014
88811 364014 326128 254921 288748 308682 216839 176842 310223 421539 314580 149210 176144
88800 176144 308505 285830 136974 148443 411127 678388 696959 480727 223067 75049
88789 49456 73527 106411 189959 342312 449138 385410 225057 167458 248565 305508 256165
88778 256165 216654 279751 367014 386140 366794 352246 309518 233865 205155 260750 328783
88767 328783 341356 305509 243910 186480 209282 336166 434550 381482 278910 293726 360707
88756 360707 318617 264720 414883 639443 567016 211607 43747 281660 552707 500929
88746 500929 322637 371765 571392 606542 468724 410729 491028 524547 431064 333123 319556
88735 319556 337918 318554 249414 157451 123527 233896 414677 440850 240033 49553 110212
88724 110212 326761 413717 287224 127856 100747 171786 200734 127929 60452 166112 427507
88713 427507 567866 379900 70740 34649 294500 472639 363943 192664 176109 194698
88703 194698 110742 80003 251012 424111 346929 153912 165084 375791 485499 371612
88693 371612 227286 233600 342854 411692 374580 267410 185620 199246 255051 247426 217977
88682 217977 315886 499872 514160 286773 97732 165285 314296 289300 160406 139329 201004
88671 201004 200449 193821 312526 451203 413721 266810 225162 278982 265060 220214 308393
88660 308393 452779 412506 213340 134303 242493 303377 214258 172784 304368 441916
88650 441916 422521 334379 314343 328359 307037 304379 368706 411094 339577 207931 134812
88639 134812 177034 327139 507868 551253 355291 88741 43017 239849 404882 385644
88629 385644 338984 400006 442591 350541 276723 385509 525819 439810 178452 31278 108062
88618 108062 257552 373693 512684 675377 720853 586999 414758 354976 386534 407915
88608 407915 388951 353634 320596 331922 431959 547157 510975 301753 128697 157342 271595
88597 271595 270393 193849 240125 413422 499810 412028 322468 371069 442945 365913 185317
88586 185317 102274 220551 455680 629908 599159 375189 167935 195166 409284 549204
88576 549204 496942 399445 385437 396203 394959 471966 582776 480044 143752 -23458 239590
88564 567418 464629 72022 -55942 193969 407851 384364 389187 573558 675779 506140
88554 506140 279571 226529 252818 222250 223948 312278 314716 162329 100840 294664 511138
88543 511138 491999 367214 385859 483513 452552 331346 283615 271325 183381 122092 218209
88532 218209 317907 219014 81818 205406 486149 525434 258505 54498 133561 274123 226436
88521 226436 89159 98430 277083 464636 541558 502149 426443 450067 632449 810787 741338
88510 741338 443249 235079 337875 587953 663969 494795 306025 304329 438805 502673
88500 502673 407114 287152 317023 477847 596197 594884 573248 605219 612554 533489 472605
88489 472605 538993 647376 645797 556658 512003 510229 433559 285396 212417 267357 324937
88478 324937 288684 237708 289727 419305 499877 477846 433258 468796 570532 607200 492756
88467 492756 324546 284028 396869 499020 481461 442504 505199 600852 578558 458764 410297
88456 410297 485601 534436 425380 238503 156903 221758 288088 238850 166651 253398 483873
88445 483873 610770 475031 236370 149320 210375 219190 133643 131880 308126 526963 635869
88434 635869 635040 580240 499035 460739 543337 665030 635289 444617 314255 380634 521659
88423 521659 576540 541585 465467 356054 278226 329722 434851 399216 258246 292602 568520
88412 568520 763685 635702 376767 281189 330022 354522 359468 408040 409238 306120 275927
88401 275927 456380 658373 637030 471938 395860 426965 459366 527035 667345 712865 548168
88390 548168 384675 435858 525500 407310 258636 390455 645183 619162 376993 364099
88380 364099 628975 733820 517603 357138 493027 646067 563371 457767 578343 750440
88370 750440 705861 550183 530638 588691 515763 371902 381581 521057 551650 422156 340395
88359 340395 436217 597904 683550 702444 721285 722853 637156 459711 291074 256436 374461
88348 374461 515619 539852 468593 442511 507409 550046 482247 381610 380643 490220 600839
88337 600839 612583 517604 393634 345120 412053 522701 576911 571958 588549 657997 715140
88326 715140 693576 608062 531053 527500 602398 674650 636504 489839 376747 408795 519736
88315 519736 569542 537888 513310 538944 582641 625298 663312 647725 534637 383770 309639
88304 309639 350913 465579 606712 712209 693583 561941 492454 606680 755033 705986
88294 705986 508277 435685 564821 658465 549145 404270 455749 643885 730184 660640
88284 660640 600983 638866 662688 588947 533367 632911 809037 868802 795982 759454 811053
88273 811053 773821 544675 339408 438270 772999 985473 884732 646232 529815 578826
88263 578826 658170 650085 547991 452599 500720 707183 892682 883930 747294 675978 697154
88252 697154 683479 612941 588531 618236 617398 617150 707566 786026 667616 458117 476110 750003
88240 750003 945562 877417 729173 660867 587932 495104 563215 788745 877378 739090 680254
88229 680254 847130 913660 654085 400172 516132 793025 828744 693285 717256 870015
88219 870015 865247 712108 668002 763052 819174 829993 897707 912760 726880 530015 611575
88208 611575 845200 869112 704385 713930 967717 1125354 995156 784338 718843 781700
88198 781700 897375 1044588 1127814 1039906 894857 916434 1077505 1129474 993665 841593
88188 841593 788600 789667 833501 957446 1072713 1047583 955923 982211 1107561 1156226 1113757
88177 1113757 1120440 1187472 1198679 1150719 1115825 1032394 832053 698867 861583 1175510 1266620
88166 1266620 1077208 918305 974246 1104295 1171296 1230335 1317626 1342123 1270440 1189790 1139382
88155 1139382 1080665 1037147 1060009 1085707 1045089 1054466 1243851 1452867 1391374 1089684 897911
88144 897911 1005464 1216626 1263996 1142559 1055576 1145753 1329266 1375563 1197351 1029101
88134 1029101 1141343 1399730 1411582 1153607 1051538 1289236 1495566 1384130 1239830 1386151
88124 1386151 1593648 1495414 1245057 1240053 1451147 1544943 1475470 1461998 1536887 1568252 1590893
88113 1590893 1708861 1820705 1801697 1765178 1811759 1788489 1648336 1702996 2087161 2336551
88103 2336551 2016262 1442420 1221830 1364919 1442519 1375672 1455484 1734983 1960821 2012290
88093 2012290 1967829 1868957 1769052 1804017 1922962 1864765 1655186 1669854 1938071 1994967 1759168
88082 1759168 1804478 2305539 2573302 2243413 2002051 2364933 2693952 2371437 2008711 2370125
88072 2370125 2961185 2918923 2526116 2544807 2773865 2625331 2440905 2812158 3246608 2987727
88062 2987727 2531406 2796308 3413916 3448456 3184191 3483928 3983510 3758669 3237195 3530477
88052 3530477 4353650 4572711 4334889 4621174 5183999 5077170 4729628 5227571 6057769
88043 6057769 5960676 5456250 5947428 6951808 7043458 6828292 7824806 9164673 9008141
88034 9008141 8448638 9867104 12190949 12657444 12562092 15337187 19393177 20371824 20903264
88025 20903264 28219118 38536512 34791010 8423476 -24622432 -40402899 -34774129 -23894383
88017 -23894383 -20181016 -20279282 -17419258 -13190656 -11916433 -12217546 -10646331 -8260844
88009 -8260844 -7916766 -8751659 -8191798 -6675681 -6237832 -6573883 -6119920 -5262019 -5297312
88000 -5297312 -5696372 -5194773 -4299261 -4229094 -4571006 -4233595 -3597671 -3633631 -3939235 -3605243
87990 -3605243 -3055795 -3198454 -3633537 -3413776 -2781799 -2595871 -2777609 -2729534 -2552576 -2590628
87980 -2590628 -2539358 -2147504 -1959939 -2302243 -2474196 -2005349 -1665104 -2103879 -2576589 -2232944
87970 -2232944 -1621233 -1626128 -1911456 -1748460 -1460152 -1678738 -2009356 -1789984 -1412304 -1556024
87960 -1556024 -1837802 -1550546 -1066135 -1167473 -1596299 -1586682 -1294737 -1391159 -1710146 -1589426
87950 -1589426 -1166148 -1113179 -1405921 -1480560 -1322264 -1345256 -1481703 -1372172 -1169089 -1242236
87940 -1242236 -1407848 -1299681 -1130362 -1260700 -1438811 -1284452 -1060748 -1147357 -1262541 -1042738
87930 -1042738 -832944 -1030107 -1237942 -991623 -692630 -841272 -1001984 -625296 -253182
87920 -680294 -1462209 -1562338 -1060946 -893515 -1205805 -1310470 -1080394 -1057948 -1255400 -1115455
87910 -1115455 -683588 -632754 -1040665 -1239139 -987870 -776004 -836540 -827036 -631961 -586194
87900 -586194 -750581 -778468 -622443 -618700 -791529 -795279 -587640 -472288 -490577 -452711 -483518
87889 -483518 -806044 -1103153 -891254 -424465 -386866 -764241 -901768 -645785 -509150 -663318
87879 -663318 -689000 -454892 -366290 -554333 -630452 -456649 -403426 -619584 -750131 -610567
87869 -610567 -497854 -612333 -753720 -770323 -765226 -732739 -533184 -312047 -388479 -667307
87859 -667307 -726447 -520176 -405291 -457944 -403791 -251692 -316441 -546345 -523110 -236649
87848 -166801 -453084 -669455 -598077 -546573 -680904 -708572 -495252 -377714 -553128 -705854
87838 -705854 -560554 -325946 -283222 -355377 -366390 -360972 -424560 -499315 -549744 -618459 -631811
87827 -631811 -471985 -273469 -283512 -426940 -415482 -268661 -266433 -402715 -397728 -262851 -306940
87816 -306940 -529608 -563633 -313323 -112927 -144305 -220818 -251047 -380467 -555810 -493575
87806 -493575 -225497 -144591 -357159 -512855 -431457 -363981 -458643 -504698 -407844 -398254 -548677
87795 -548677 -589337 -422599 -324863 -413011 -414607 -214007 -118084 -291220 -413701 -230925 -1810
87783 -50853 -256201 -328545 -270257 -234681 -215354 -163425 -161088 -241151 -277588 -234748 -255605 -358387
87771 -358387 -359840 -242327 -245183 -427290 -509881 -348205 -188133 -232182 -311522 -239796 -159249
87760 -159249 -262603 -452277 -533115 -503287 -438512 -322366 -179521 -144109 -233280 -286010 -250475
87749 -250475 -268497 -367932 -375782 -256192 -205908 -275770 -244638 -39419 67747 -112644 -381074
87738 -381074 -482841 -452839 -418029 -342126 -188663 -84188 -106908 -136038 -89607 -88356 -219413
87727 -219413 -354290 -351117 -241203 -111932 -11730 -28866 -218293 -411123 -376747 -196758
87717 -196758 -156667 -258263 -227836 -41479 3548 -169947 -269188 -158160 -72502 -140580 -153017
87706 -153017 -9418 63798 -36618 -82808 2403 -66557 -383033 -560848 -345798 -64635 -81674
87695 -81674 -225570 -170988 -6879 19253 -13550 76052 156093 38646 -109828 -56891 43002
87683 -69384 -250720 -192634 24465 81094 -31383 -69189 -19350 -68165 -177606 -142632 -17881
87671 -52861 -221272 -233289 -37235 80924 -40612 -216437 -231676 -104853 36027 109494 69898
87660 69898 -58598 -129974 -49273 35817 -68243 -262229 -270351 -72637 56104 -39159 -206936
87649 -206936 -272532 -262864 -262759 -257807 -224810 -212295 -232695 -212747 -138531 -120854 -219904 -314675
87637 -314675 -259675 -100766 -19742 -89707 -189060 -178300 -84666 -48912 -120914 -194463 -167167
87626 -167167 -79838 -31431 -28308 -17142 -12605 -65993 -133980 -115001 -15412 49825 29185 -19933
87613 -67306 -156375 -285712 -365275 -328637 -199424 -41782 61361 9221 -204508 -398533 -372476
87602 -372476 -165824 -5232 -5423 -79712 -134863 -173245 -188855 -140904 -63880 -48781 -89360 -89099
87590 -89099 -29251 13671 15049 22608 43209 46887 46622 38990 -52080 -210848 -237661 -43628 109955
87576 -35283 -276211 -216175 95099 221964 32443 -127816 -22953 150011 161944 80425 29414
87564 -30433 -108653 -86954 30412 70252 18346 61457 184206 114853 -158849 -244762 32888
87552 281376 137635 -150554 -139793 107621 184932 13738 -97812 1942 108351 29874 -138113
87540 -174217 4628 266906 370422 195560 -65522 -81178 179438 359819 198021 -102695
87529 -174062 12661 169434 115168 -45621 -130610 -93139 -22947 -24158 -90590 -93602 46610 208645
87517 208645 214626 90712 3309 -32166 -140287 -283745 -252641 -14262 195586 214993 139898
87506 139898 89331 44768 3337 28228 69543 4655 -87371 -2402 185792 170509 -55432 -137091
87494 -137091 30037 90510 -139750 -308582 -123632 126885 65389 -136110 -85826 146181
87483 189402 30262 -4866 158649 241871 106761 -44244 -19703 110935 180262 122623 -14939
87471 -107975 -31651 167851 265223 151246 2895 5020 71973 44386 -16113 23426 81596
87460 81596 9686 -97127 -39590 109664 83956 -133592 -239493 -47740 230217 256355 -8504
87448 -257748 -193403 127883 355499 274754 72597 46056 160185 145682 -22360 -77919 68533
87436 172632 84777 -4037 80668 202959 184584 95786 74057 100789 140344 242246 339419
87425 339419 244388 23101 22367 301344 425485 132713 -186205 -71627 284866 376224 172278
87413 64544 181407 262820 155739 -3010 -81514 -75286 29385 203087 254970 71379 -125050
87401 -68999 118630 147095 70623 168710 390214 377894 64438 -193805 -164836 -32181 -9109
87389 -10910 102681 228042 176519 -25684 -174697 -145525 2725 132961 177388 189468 246899
87378 246899 306723 241901 57268 -59628 10866 150042 192852 159720 161983 194415 171204
87367 171204 82362 -11024 -64725 -55415 8241 37750 -32873 -82012 58165 280071 297978 114555
87354 50044 202688 269585 88088 -54013 77702 240575 146390 -23457 59363 300457 358862
87343 358862 197710 59597 41318 52184 65071 95696 75409 16757 109448 377532 494751
87332 494751 263133 -2043 56403 257568 209119 -35058 -124773 -19381 54595 89829 235650
87321 235650 374456 269937 53154 66662 285255 368785 238807 131258 119964 60491
87311 60491 -19642 58390 226069 234461 100764 54684 84766 -2070 -121537 -15302 216122
87299 216323 12803 -3524 212972 254529 -18712 -216092 -67140 181502 248617 229744 273735
87288 273735 269339 128235 24009 85339 153132 71498 -58209 -108089 -128114 -139813 -12693
87276 259307 423621 311105 90341 14030 115230 279744 404114 380923 163284 -64226
87265 -32544 206931 300033 107307 -97736 -76675 34168 10172 -106800 -147737 -101030 -62194
87254 -62194 -53567 -43127 -15009 65313 211363 299168 179221 -55925 -132092 28987 215724
87243 215724 258035 213779 168549 102850 37933 69380 166027 164988 49156 -303 91063 168688
87231 168688 122590 53525 61971 83380 45762 10388 53149 151287 252438 323390 309741
87220 309741 191528 72175 60830 104589 99338 86183 141960 184836 124582 74424 136513
87209 136513 136975 -79130 -256304 -66864 288189 321710 39636 -72155 147798 316439 190310
87198 190310 18117 37998 121635 120052 113307 122096 5751 -167811 -96200 218442 360919 149065
87185 -75969 -43202 48010 4817 23141 236064 344386 117220 -144461 -89840 99462 80766
87174 80766 -19367 136902 453154 540390 355527 207086 215479 219171 163205 159527 178597
87163 178597 66923 -115082 -116927 107268 325854 384274 358305 313890 182935 -34831 -167515
87152 -167515 -91889 79692 142473 49528 -68196 -92555 -48142 -21909 -14440 34256 78046 -18070
87139 -216671 -254498 -23956 181455 67115 -181244 -159150 133744 339718 343905 363459 433505
87128 433505 313652 5811 -141364 -15400 62827 -57651 -53103 280075 592983 518317 237179
87116 114637 124841 62913 10564 125476 221023 41118 -224038 -171203 178627 416101 348756
87105 348756 166933 45965 -36368 -82276 -5633 181707 355335 447990 449097 316804 99599
87093 28000 233130 482735 465217 232540 77788 74461 53380 -33224 -59633 -16012 -30051
87082 -30051 -88568 -34101 130376 211887 150605 112592 190910 250460 164820 15955 -41133
87070 28747 157869 270690 313248 285927 269546 327567 390409 345488 226204 183798 270762
87059 270762 373971 374902 274683 156326 113346 204938 387079 500205 420116 212461 54515
87047 25392 60809 84987 81657 48894 -8960 -40750 5628 88736 113309 77318 88027 197129
87035 197129 304191 289147 183018 118069 130979 126177 61421 44282 147744 243805 188013
87024 188013 88465 154995 309038 248036 -40938 -175749 42829 288317 218664 21462 74529
87013 74529 299560 306553 53358 -109784 -23708 96107 93431 82284 146004 182221 142463 120714
87001 120714 129872 74934 -6790 29785 148058 173035 133774 218585 372337 324666 75102
86989 -51220 72003 188290 122699 40163 84564 131323 83296 78959 217317 368399 419387
86978 419387 433693 438764 341434 163681 74138 102439 117372 121253 220030 299382 154141
86967 154141 -52258 44319 347170 375509 86137 -22469 210950 324381 95934 -25938 245083
86955 460637 215302 -116344 -15277 328398 423914 299870 273367 277089 76527 -141346 -45601
86943 208839 243981 140433 249008 502604 530259 332678 249031 326314 286834 92418 18774
86931 159544 307755 340164 332333 311122 240443 199478 258349 282379 171658 127727 329812
86920 329812 541582 446271 186548 127645 248925 242024 82465 23328 114559 190569 251670
86909 251670 406207 518731 373015 111027 57494 183475 202342 115715 169787 322613
86899 322613 274046 30701 -59236 119399 299907 314172 286344 283502 190501 18527 -33538
86887 93431 248936 358947 467125 504995 363989 174948 159300 234859 150047 -27126 23399
86875 320118 527559 493868 418878 424306 370698 203832 107108 184580 304860 357032 382373
86864 382373 392579 329284 239137 228337 245353 172820 90456 153670 281715 295023 272707
86853 272707 394107 514063 339745 -13514 -120170 88207 230958 116212 6239 133208
86843 133208 370682 519414 550782 455889 206734 -38730 -41729 131216 179669 77329 111646
86832 111646 341049 442203 240196 -7162 -27822 113953 252118 372022 462930 429467
86822 429467 313343 311926 430290 413668 180169 16899 152635 400408 441659 269010
86812 269010 143022 230593 434004 516240 346489 75461 10860 220738 398276 293890
86802 293890 94308 105990 259909 289881 230611 303819 430325 339869 109849 94202 318150
86791 318150 441399 355970 317758 411342 389079 169910 23570 94845 172257 99591 26837
86779 86124 171016 181159 166928 142162 75330 93417 322197 530805 382431 40071 6172
86767 320856 492937 324812 191034 321209 431952 329366 270536 402511 420012 163448
86756 17222 273570 581182 504433 217904 149067 277326 292449 179365 160119 251169 306154
86745 306154 333910 403340 399125 214348 23233 48520 219137 335802 387714 438198 415307
86734 415307 299463 288767 473700 579404 363518 53976 33064 268039 421952 380956
86724 380956 301058 243143 132830 23834 56471 170051 157703 14587 -30837 137832 363876
86713 363876 447446 379198 296095 300218 360932 371990 301417 244520 270227 297298 252231 241712
86701 241712 359162 436946 290465 110133 217840 480382 441493 79499 -94701 152519
86690 405526 297581 74038 97494 235180 183465 57294 169197 445648 530890 345485
86680 345485 135652 45723 -1983 -42494 9298 167483 320532 366271 279797 112037 7536
86668 101441 316609 417831 335545 239223 229147 208357 146428 181558 336685 424871 370754
86657 370754 325930 335639 231104 7548 -63550 104663 224159 128907 64518 214828 347416
86646 347416 253167 144011 245786 369953 294339 213120 361144 518188 377112 124710
86635 137816 329805 334012 160863 126706 246940 246501 120522 153578 368214 447069 272428
86624 272428 108749 147818 247968 243561 195938 208400 241716 230296 200303 197581 233395
86613 233395 318959 433286 488160 445388 397020 402500 360889 201717 66931 107708 225885
86602 225885 230025 137962 107925 164835 204761 191208 163385 130357 104080 127885 152393 48323
86589 -131530 -122923 154848 421695 451881 396560 451996 495450 360478 208493 266355 412422
86578 412422 394535 270353 256643 318018 296217 287801 478451 724290 716437 476544 291069
86567 291069 236317 172467 130551 268484 473038 444239 197077 67949 174239 261948 171452
86556 171452 81570 162345 300295 319926 241175 186799 207792 280465 338500 292895 158561
86545 158561 116956 281786 477508 461445 282924 177799 191843 194474 198461 336783 535764
86534 535764 547883 353842 223132 296376 384846 291535 95787 -6671 32346 129080 220711
86523 220711 299670 359331 361385 251190 48550 -65662 106661 471106 653002 468334 202376
86511 215092 437957 522342 362773 184165 168831 262592 334639 318282 209506 83584 59457
86500 59457 126061 126614 39867 72535 288107 399650 210205 4348 131852 415411 416185 147464
86487 36320 223904 393475 333262 215328 212080 238414 215819 247636 376995 460718 428143
86476 428143 409333 477017 500904 383867 223451 124548 62984 43103 172820 446760 643468
86465 643468 586258 365566 182427 105005 96840 160559 312833 484258 563209 523738 448162
86454 448162 427279 457946 443551 324089 203615 258027 473283 595777 445218 170883
86443 62581 189500 373028 453570 426785 350248 267982 228695 261515 320413 327265 271308
86432 271308 221348 251649 369420 483985 469702 327683 235930 322077 448565 392976 181765
86420 30381 9277 30533 108875 308461 463712 346037 120286 188935 515492 602438 291514
86408 57202 251271 564351 576306 382661 286126 272030 204136 185868 312988 387417 266956
86397 266956 173273 272670 316704 118409 -3734 254349 588609 557464 316358 298793 452756
86386 452756 420178 251491 292811 505409 524881 316720 196106 253393 290946 269829 316978
86375 316978 362091 251098 125413 211175 357997 281595 112684 173922 373391 394361
86365 394361 325912 472200 672050 503938 94247 -5587 256814 368481 166970 81634
86354 315150 494969 369975 218997 297495 433799 445343 459934 564318 582032 440778
86344 440778 352395 419158 448466 337595 262439 325207 387150 387393 453388 575314 552430
86333 552430 376920 292522 370649 408239 333380 321354 421208 456661 381536 357406 416626
86322 416626 417512 359694 368981 392841 315871 298643 527390 739396 569374 259328 342365
86311 342365 682984 625750 142533 -38262 357765 681997 444338 55151 40327 234956
86301 234956 272495 255931 396721 505995 379994 251841 367439 516376 441726 318849
86291 318849 380798 460684 355566 259489 372933 456990 264060 62853 214999 526839
86281 526839 557657 335751 232949 304054 283911 142409 133815 302069 378843 240003 118981
86269 252736 539536 670929 510431 257346 211598 387029 479539 315150 140373 232385
86259 232385 421573 374159 188198 224494 436037 431077 201245 173610 442858 574423
86249 574423 352976 123816 150375 214270 140522 159961 415678 624149 573951 481974 523221
86238 523221 496556 302119 246821 490241 676987 534567 364489 499165 722764 696193
86228 696193 534454 487287 451158 288060 241884 522477 820140 747339 454959 321701
86218 321701 343321 320449 333764 511386 619313 422904 192828 305984 579469 558437
86208 558437 269887 132326 263076 409086 453848 493404 503099 394019 309884 435098
86198 435098 614227 582193 443011 480664 621670 552322 279900 112461 134737 149725
86188 149725 111710 189565 396027 539081 556300 560543 559010 448026 276385 209705 244503
86177 244503 236409 185963 226530 356662 437300 424540 381938 317777 224717 202532 321266
86166 321266 445973 414577 300941 287776 373532 422263 414660 431885 458039 397925 253328
86155 253328 138113 151041 299628 476320 505152 352077 253622 416428 646102 592564
86145 592564 321228 228997 389120 462155 321903 238951 319733 330668 252684 395139 716530
86134 716530 694053 214276 -75842 246031 686477 661004 398624 403739 563625 486825 283646
86123 283646 297869 421086 359942 264626 422436 631388 550662 383714 525266 796541
86113 796541 739630 441363 347238 452271 399264 218971 245745 422734 412046 294553
86103 294553 432754 709188 647144 278409 153114 429364 650192 530859 324197 269075
86093 269075 261460 222943 278064 426388 486508 452807 495818 588872 552144 433993 409682
86082 409682 387738 207490 101063 373603 733921 624900 184172 128926 606439 922362
86072 922362 625953 156402 85723 322542 453460 400269 345618 349020 371966 437118 526751
86061 526751 537729 477554 473827 514141 448864 300926 265977 358074 376908 272752 217550
86050 217550 273181 317286 328224 411417 525946 523837 460283 511155 603309 515832 327192
86039 327192 332324 511232 534025 336132 230369 365658 513680 500716 442288 433773 387012
86028 387012 284923 253256 298306 300086 295254 415378 548928 464711 264563 268256 441986
86017 441986 434363 224072 195711 456791 620418 458146 259257 292192 372799 266163
86007 266163 121138 177299 347148 405226 362846 376824 455602 486790 442783 401630 443540
85996 443540 585566 722993 663685 376529 135767 201188 435691 505708 381544 328063
85986 328063 451528 582541 588942 505394 381146 271339 303733 479335 542703 361169
85976 361169 236396 446983 703553 556680 157570 35326 250231 397815 376135 465009
85966 465009 638800 517292 115222 -45510 235654 525786 498886 394969 479354 598559
85956 598559 575627 559150 672041 736280 623742 494761 458000 384526 261701 309017 527886
85945 527886 577679 347230 211230 429713 705640 669239 443624 376396 490824 546760
85935 546760 452416 330588 303277 395316 537604 583683 470339 362567 433420 562477
85925 562477 544010 498544 677520 932845 874738 550106 420753 603906 702829 528206
85915 528206 412226 583998 769248 693381 514445 460783 451381 362768 300714 342492 357021
85904 357021 311589 401600 656449 785026 642359 486537 536838 631803 567301 433519
85894 433519 374567 335711 280187 342711 542007 642530 518504 371001 391352 492198
85884 492198 544469 591256 662910 663739 584959 551690 560333 478624 374219 474642 717995
85873 717995 754067 514409 361485 513257 727511 739379 628558 562048 524230 480345
85863 480345 488478 512740 435957 338238 422895 623087 666194 551603 531253 601060 504993
85852 504993 279809 257005 453265 520416 395068 409722 632144 703506 503214 370620
85842 370620 470825 536270 442819 441669 602350 629466 455345 404562 554555 573370 408631
85831 408631 443488 719820 753458 430468 304957 620165 832998 588061 371880 620582
85821 620582 921923 769785 448845 453356 603636 482009 255981 320797 528005 494851
85811 494851 346203 454784 715926 732181 508197 384227 457988 560171 612290 599247
85801 599247 426596 166808 145519 440967 661920 562699 441336 551508 618048 389174
85791 389174 164279 257675 421779 348184 264730 456151 661830 567641 439793 612972
85781 612972 793136 585367 307860 498052 932640 954343 554670 330804 491826 666116
85771 666116 647937 640415 739580 773805 694645 639747 608728 498502 405919 499985 681478
85760 681478 735654 692362 684707 632446 434169 274437 361914 560161 634062 638197 715858
85749 715858 771566 692085 612544 626365 554761 341311 290254 540612 733067 617760 528362
85738 528362 772153 1031038 923366 697942 760044 937804 860946 666645 668985 713366
85728 713366 538994 401013 617140 866070 697022 392960 517403 899408 920887 586935
85718 586935 443546 585020 604166 443621 459634 664138 693459 538822 564008 778167
85708 778167 808434 628018 616368 842392 950858 826761 744614 792187 748288 597606
85698 597606 587086 709987 697005 574507 667911 977096 1100074 885906 659236 673517
85688 673517 787476 802605 737693 673470 640905 699126 851874 929161 814250 672729 684968
85677 684968 736964 680845 659801 816329 944253 833470 685110 751848 855997 732228
85667 732228 549865 590350 704665 629013 545125 751684 1048128 1036918 800043 700146
85657 700146 749897 741423 736429 854571 863807 575955 342235 535303 865266 863879 697158
85646 697158 784069 964513 836705 602844 734270 1058000 1044162 784802 801653 1053725
85636 1053725 1036788 752326 682793 871069 896946 735166 787223 1061104 1130901 928051
85626 928051 812051 856291 793195 637206 645743 727657 608156 471603 691814 1060598
85616 1060598 1077509 857344 900622 1105557 934020 479636 404597 800689 1052090 902600
85606 902600 765916 872771 954453 892218 903054 988557 923005 811404 940791 1126193
85596 1126193 963081 637812 671980 969336 990265 768842 824197 1137862 1194988 1005968
85586 1005968 1088824 1431950 1477086 1166525 1011973 1088080 969574 708415 823661 1241122
85576 1241122 1305031 959111 855883 1157383 1300765 1122740 1130472 1433071 1471580 1084194
85566 1084194 830936 982662 1141088 1099415 1137187 1261018 1109173 787277 828338 1176210
85556 1176210 1214226 923980 944510 1347166 1481934 1213733 1148509 1423085 1460213 1166788
85546 1166788 1156520 1502665 1518687 1106871 1044761 1529205 1725795 1259570 897152 1174815
85536 1174815 1537039 1455118 1293000 1433042 1567497 1461919 1465802 1720592 1780454 1492046
85526 1492046 1337145 1506218 1572472 1410782 1438995 1665825 1572767 1200360 1205816 1600193
85516 1600193 1662185 1343519 1411496 1919201 1998355 1536012 1505509 2148808 2432263 1929296
85506 1929296 1636916 2154417 2597013 2199577 1570161 1440621 1504025 1383169 1476789 1968526
85496 1968526 2206640 1885279 1672846 1955448 2160458 1957661 1852897 2010233 1855659
85487 1855659 1398300 1463099 2066358 2163810 1582610 1469438 2179737 2567616 2114081 1844274
85477 1844274 2292860 2526323 2113502 2058469 2763543 3096403 2550637 2272796 2841099 3149747
85467 3149747 2646250 2468827 3154601 3506972 2994883 2876118 3625270 3806894 2929982
85458 2929982 2697877 3828418 4488409 3665831 3127681 4056547 4816465 4231105 3908852
85449 3908852 4939038 5550422 4619269 4116120 5320835 6173490 5333723 5042334 6717511
85440 6717511 7850254 6874971 6606769 8761330 10045396 8448391 7914427 11092859 13538567
85431 13538567 12052351 12022558 17676857 22518436 21335310 24043155 40300371 54496520
85423 54496520 38155759 -8755559 -49749298 -54953322 -35220898 -20600988 -20183548 -20774620
85415 -20774620 -15067225 -10348713 -11333600 -12337329 -9378633 -6792623 -7867565 -9044665
85407 -9044665 -7388673 -5696165 -6413537 -7185427 -5933746 -4691992 -5205586 -5620817 -4446373
85398 -4446373 -3476286 -4114014 -4671157 -3774804 -2937767 -3461730 -4016529 -3430466 -2895801
85389 -2895801 -3388708 -3685575 -2863489 -2174383 -2606363 -3019960 -2450909 -1949166 -2429237
85380 -2429237 -2877939 -2366377 -1803924 -2080499 -2383935 -1924920 -1520631 -1935509 -2343217
85371 -2343217 -1918623 -1377745 -1526559 -1783638 -1498263 -1293125 -1770226 -2232615 -1958762
85362 -1958762 -1481896 -1445627 -1451611 -1133087 -1071836 -1558454 -1753602 -1187341 -775229 -1206835
85352 -1206835 -1654990 -1308336 -880346 -1251635 -1815843 -1616226 -1084232 -1168073 -1599175 -1494048
85342 -1494048 -991743 -888828 -1173665 -1208211 -949434 -850642 -917299 -858374 -799211 -958438
85332 -958438 -1041612 -775323 -550394 -725803 -851671 -449910 -6839 -251699 -935900 -1280275
85322 -1280275 -1214055 -1224177 -1340746 -1225915 -996625 -1045114 -1237279 -1129652 -818795 -784324
85312 -784324 -1022842 -1089373 -904518 -817247 -919088 -937607 -795096 -712724 -761947 -785693 -747235
85301 -747235 -755914 -793299 -759144 -709115 -748119 -805583 -777995 -733235 -737162 -684480 -530104 -446188
85289 -446188 -523737 -585297 -511099 -457045 -538516 -617625 -601946 -600589 -606282 -443979 -223350
85278 -223350 -339365 -771256 -931737 -550643 -151607 -235987 -537950 -581493 -464854 -518358
85268 -518358 -618156 -464510 -218967 -255763 -511799 -631122 -558649 -495468 -457027 -347254
85258 -347254 -290875 -440645 -615777 -549521 -341167 -280633 -388461 -485350 -537470 -590991 -557713
85247 -557713 -397747 -312049 -437231 -570819 -503987 -375337 -384659 -433223 -374326 -327698 -403576
85236 -403576 -420578 -253428 -138082 -254617 -348714 -179457 6428 -101539 -324839 -350549
85226 -350549 -298631 -414676 -528927 -389464 -224097 -358757 -560622 -419575 -129420 -167059
85216 -167059 -389886 -244732 210102 313586 -114691 -479793 -363991 -73310 -1323 -71613
85206 -71613 -98752 -166751 -328467 -362838 -144952 79459 50405 -158153 -343520 -451512 -481455
85195 -481455 -385523 -219104 -148089 -189908 -188119 -116180 -127340 -232105 -234527 -85712 4234 -83096
85182 -203039 -234211 -249356 -295049 -287127 -231271 -262841 -366105 -346657 -184145 -106203 -202183
85171 -202183 -281674 -237787 -216416 -281604 -261349 -103567 -37394 -170448 -265429 -154199 -39694
85159 -117215 -220918 -152926 -56208 -117120 -180443 -40517 133541 72420 -108109 -130025 -74615
85148 -74615 -202299 -386854 -260632 115006 264388 38876 -171649 -99968 16418 -70941
85137 -188929 -101735 52915 25018 -113634 -138895 -83208 -134069 -254271 -236550 -75587 11392
85125 -79404 -226381 -299508 -278120 -166947 1319 92234 -468 -159511 -178566 -79735 -74338 -202385
85113 -202385 -263206 -160003 -58954 -95903 -157953 -112061 -51282 -117929 -228342 -189835 -9694
85101 114850 80253 -22308 -77765 -69090 -22043 43504 82435 41902 -60197 -137326 -129794 -53308
85088 43317 122757 165618 167578 127134 32622 -101032 -184673 -124517 32668 117105 54373 -25988
85075 22016 151064 201035 126887 31111 -4091 -11015 -52911 -113426 -99877 42047 216261 232857
85063 232857 44207 -142132 -118481 19278 26844 -74211 -33573 146390 136107 -157015 -330209
85052 -330209 -81846 264825 230183 -80203 -173845 40553 182956 83774 2571 79468 76216
85041 76216 -131219 -242829 -16384 275909 220847 -120487 -317014 -177770 53791 94163
85031 94163 -41151 -139236 -76748 59652 90383 -39701 -174298 -128116 64207 188528 139014
85020 139014 28171 -13966 1773 16050 20514 -3961 -106048 -241852 -266272 -130215 31935
85008 86515 55270 20974 5121 7794 41815 62630 -3193 -103676 -88921 45990 119887 44555
84995 -45929 -44771 -45607 -128697 -176315 -77461 59375 88079 60601 84380 101177 29023 -18683
84982 94714 250480 229766 65879 -22624 10101 19019 -27813 -10772 72910 78788 -13880 -64647
84970 -64647 -52956 -125335 -281202 -290156 -62485 150195 112763 -44206 -53999 72544 117534 38843
84957 10460 102573 175388 134243 69393 52093 -16420 -207083 -356422 -254707 18395 156342
84946 156342 44823 -83065 -6423 149839 123820 -60036 -128718 -2716 75553 -55507 -200168
84935 -200168 -118085 80277 105153 -55481 -134074 -14389 117031 101729 35206 49935 89278
84924 89278 53794 4526 40590 97608 59091 -18631 5407 95882 84859 -26757 -33608 147101
84911 312522 260398 92538 75160 273990 484345 501960 328750 98380 -85081 -186150 -197743
84900 -197743 -134260 -41122 34684 79887 102380 99263 65166 28381 44658 129743 213763 207691
84888 207691 129613 111665 226720 349587 287599 49994 -126642 -71402 107532 191366 144681
84877 144681 109950 154683 183501 124835 63323 107526 215595 250116 171396 87590 100670
84866 100670 163042 139069 3838 -84552 21312 223946 265236 82929 -61522 67649 324105
84855 324105 367564 151845 -13438 78980 251128 238064 83481 49119 223323 415281 432143
84844 432143 306174 197968 171175 142499 34403 -91608 -105141 4225 91352 55372 -10075
84832 34336 147151 178952 134190 170813 317582 387737 255887 56600 -2624 101122 243985
84821 243985 338211 364088 311931 202397 97718 19232 -60062 -88978 52577 322340 455336
84810 455336 293570 48700 46114 291416 487790 436477 226640 42899 -30889 4013 113211
84799 113211 215567 225768 151583 79250 57929 72547 117688 201777 272708 236549 85022
84787 -61310 -79364 15749 89447 50864 -21980 33685 236645 396848 361787 241463 235255
84776 235255 301811 227524 16766 -59279 115463 296138 242349 61365 1197 91707 193626
84765 193626 248060 274846 253909 193773 189704 248269 213082 40948 -43374 109601 280596
84754 280596 208393 22916 25241 184963 217787 64569 -74962 -121948 -162110 -151797 37432
84742 288205 335317 213981 223987 406349 463773 288883 151705 211466 250203 108529
84731 12537 184170 425993 406048 145616 -62219 -60178 91967 292239 420761 331158 47845
84719 -150477 -62565 139347 166739 49833 59066 263529 439508 424286 324908 310248 365535
84708 365535 349013 206838 48032 14532 110557 196527 177006 137194 202923 317830 312378
84697 312378 178831 92864 140152 220370 268835 351788 458031 432879 252027 131498 196187
84686 196187 264675 175076 103647 278114 543710 543327 242565 -44532 -114031 -48181 54451
84674 202956 324627 265326 80158 40733 219047 335977 206469 75617 245324 560610
84664 560610 601417 304370 51821 117689 333537 407789 311892 185404 69735 -50266 -85705
84653 -85705 37951 182633 153056 11852 1928 159055 258653 200984 185249 366444 563164
84642 563164 504032 219874 -11465 -26672 95011 211085 264539 276004 301119 373541 427561
84631 427561 347887 154216 20727 34145 80626 80039 149121 360538 518050 406152 135049
84619 -10920 28535 90492 99083 109722 107539 32762 -33271 31059 142248 133938 75387 170036
84607 170036 370866 426628 310000 249469 297821 236620 5588 -130649 2784 221998 302713
84596 302713 293729 333435 396371 403902 384163 371344 337257 327327 433308 538738 386078
84585 386078 30811 -108554 137084 365480 187753 -167603 -209137 79551 274769 175454
84575 175454 21941 56164 208979 292392 253344 158349 89569 101725 173307 206964 164947
84564 164947 138256 179404 179694 64073 -15440 110977 322405 352579 198958 127750 258429
84553 258429 396508 356226 229961 202592 255114 224957 90058 18831 117076 260607 271433
84542 271433 185232 200131 357542 444897 310028 116039 113039 271914 361920 313909 251396
84531 251396 202027 74055 -64985 -3612 240342 370649 261696 158410 264323 421356
84521 421356 413631 325052 336289 385058 310498 170018 132939 180012 166283 85409 39157
84509 34891 24353 46448 133270 186741 145352 140360 274309 392900 318624 164554 148670
84498 148670 236085 255844 236874 303337 358330 235410 71065 127228 302639 263674 57529
84486 105058 486299 729633 526353 205809 190507 358366 340504 173870 197212 429448
84476 429448 511799 285805 38983 58886 242007 321165 271934 276243 385953 446041 360664
84465 360664 257645 298058 425224 431766 251478 56516 29541 146123 253488 276782 246572
84454 246572 187363 108916 82951 188874 364451 436403 349267 257986 319830 475500 530343
84443 530343 407760 222846 113122 92044 100260 119942 164989 200264 167878 102190 124859
84432 124859 277111 434539 462076 389289 334541 307329 221170 94322 84040 259635 454844
84421 454844 444119 218978 7807 23882 237815 418921 401020 277527 273434 430044 533741
84410 533741 416166 194068 90028 130815 188602 226712 301175 378006 369517 323143 351691
84399 351691 396546 303165 128323 100882 242547 311931 204183 124143 238353 412814
84389 412814 450681 371675 303668 292332 350367 492645 599950 478527 194943 95802 313883
84378 313883 518440 391019 103463 33840 204684 327688 281287 223005 279785 397176
84368 397176 477926 467928 342927 176074 142502 291985 420302 344020 181010 155590 252976
84357 252976 302314 287720 311136 328594 206116 5361 -51904 91561 263660 327752 312747
84346 312747 279287 243961 241177 296617 343709 306006 229065 194734 170269 99204 61840 160392
84334 160392 316016 376602 360485 386927 429376 367602 245051 238391 379405 520363 569847
84323 569847 560883 497926 348838 191709 161553 232776 245185 162807 119564 182328 247421
84312 247421 215773 125393 70724 96491 176557 214573 115574 -47821 -43376 205690 441818
84301 441818 407064 226164 197767 312215 302462 131155 64634 214038 347970 283644 164007
84290 164007 174324 231039 164532 36999 51750 231805 382770 355354 209345 108756 138956
84279 138956 250293 345300 389833 416486 430223 380095 259758 162675 175430 278540 407592
84268 407592 529269 593387 521552 344948 245148 330439 463389 446199 295997 193686
84258 193686 223527 299515 305249 203888 62741 32530 202261 422291 432951 244623 174051
84247 174051 374783 580844 517055 316312 261292 331028 325781 270430 337313 474769 464800
84236 464800 298688 180866 194933 245840 286309 332631 316763 188051 85271 141180 221108
84225 221108 146050 44198 136975 303724 262947 95717 141876 408321 543127 426330 332797
84214 332797 426163 515841 439125 311087 268820 292751 369667 511578 564116 356603 87124
84202 152022 519661 710706 515855 279263 302078 417882 385667 283362 252138 228179
84192 228179 184377 272881 475633 492638 248282 111041 299039 480604 344847 161710
84181 303298 562584 502577 226240 200558 459241 583925 440640 351956 473438 536761
84171 536761 368028 199624 250598 371660 349973 266788 295361 374139 341154 230675 192140
84160 192140 227615 233490 218225 259492 301314 221916 90161 120088 327302 460325 377472
84149 377472 273493 354013 474219 367295 115775 60513 248878 336473 149220 -4034
84138 192954 554973 665939 474982 294320 299700 353944 307642 199500 133127 157871 277519
84127 277519 417949 432495 302640 241539 399545 583382 519402 284363 174267 232021
84117 232021 245127 165608 167033 277342 314443 235632 217585 325010 409792 397422 371418
84106 371418 332670 198558 81792 215944 539138 716875 654296 596127 627086 516319
84096 516319 220920 86694 296733 535917 501820 367655 398232 458804 308734 103734
84085 166103 433960 557724 440849 311099 315494 377093 423261 465368 463893 361833 241295
84074 241295 230943 276597 211666 49012 2436 183687 430606 498184 346562 190709 258402
84063 258402 497273 593446 370490 71838 52196 262781 334542 168991 88271 291359
84053 291359 522894 496969 342695 345277 473569 480446 333728 240833 297358 366348 315714
84042 315714 198725 162980 264583 392865 380988 225756 138184 268223 466547 502268
84032 502268 421516 430396 506334 462196 347526 386615 519568 455011 227905 203975 415178
84021 415178 440027 152432 15478 307816 612157 501571 232553 243449 399674 323453
84011 323453 130127 204956 479683 555799 402268 336055 400325 337866 145466 106752 264010
84000 264010 361546 338141 390504 509074 440153 195000 125869 356154 555460 452275
83990 452275 209260 111352 188504 316940 431369 485881 428415 328261 324193 383012 339136
83979 339136 213032 214075 365443 429230 311307 241037 395738 617139 684096 633230 605047
83968 605047 563909 394538 154552 29678 98459 275040 425319 449633 334972 209872
83958 209872 254631 472232 642153 587568 394627 273406 290446 348567 365202 351436 340988
83947 340988 342224 360875 398053 419645 383694 308981 268854 295922 334748 328416 316959 377341
83935 377341 473792 471649 341228 235696 275833 363534 344076 261219 271635 369135 406399
83924 406399 364674 371139 438023 424404 305662 247796 336200 443312 450664 404165 370565
83913 370565 336812 320229 372442 417570 316174 140301 120098 261168 322880 252918 284515
83902 284515 476371 550704 384209 262176 389627 539657 490986 426457 532390 579716
83892 579716 343421 101928 213788 471801 430935 174851 165292 443848 589121 454424
83882 454424 364729 499741 610653 505777 372175 420910 560006 599072 508015 346129
83872 346129 178576 140794 329544 568948 553955 288845 111252 215776 428473 524396
83862 524396 489924 387398 239027 146591 258382 503530 609123 487184 349137 332544
83852 332544 307571 208131 244884 539722 803340 697202 360844 236046 422771 554475
83842 554475 371527 108387 128734 388071 527512 425090 352920 515048 702041 607704
83832 607704 301632 114235 153717 238040 263959 313362 374044 303885 153744 175448 383580
83821 383580 471238 332414 280193 495133 647800 425191 96668 122559 443617 618452
83811 618452 507205 363671 337793 321157 263845 265369 340201 398167 443501 527197 561450
83800 561450 452420 330208 360064 431185 347208 211390 267474 452223 488848 364732
83790 364732 326165 427530 470825 389398 324271 315700 272051 239423 344278 479952 426129
83779 426129 271629 315500 536193 590604 396274 271970 386473 492004 372129 181341
83768 152586 281545 463236 647572 723139 554189 274559 232654 491144 694875 602746
83758 602746 426048 430096 514962 457667 309919 259629 287356 251037 182236 228159 377836
83747 377836 482464 505009 546080 635606 673602 602252 508322 500782 556073 551629 445765
83736 445765 357452 408825 534872 564481 475993 414964 443598 471899 481762 568038 667349
83725 667349 554785 277000 239492 589849 863194 626589 171470 85752 367929 516382
83715 516382 367456 256878 360903 447798 376456 336885 444866 525959 466411 410599 453474
83704 453474 465597 371034 304788 361652 449423 490480 520174 520213 412031 264841 250683 361806
83692 361806 432244 436290 478909 515477 411873 265680 309377 499084 571334 499871 493615
83681 493615 548253 452557 264568 288397 502665 527771 292723 205086 454600 666204
83671 666204 527210 288423 301135 459552 480790 415356 487263 653344 682522 533055
83661 533055 368980 307344 350094 455122 531260 488712 385520 368832 426789 409895 327934
83650 327934 354610 485808 497644 329534 203007 257482 366801 417786 467998 528882 502604
83639 502604 427953 467680 569045 490359 256264 198865 420536 611603 555270 421321
83629 421321 392647 400761 415216 580923 849360 882563 573653 275146 254659 315386 233968
83618 233968 172636 320502 490327 446243 330138 390448 543392 561376 474235 441648 424301
83607 424301 311048 206598 281714 462676 535097 455359 354849 340423 438382 607647
83597 607647 707581 616658 443923 409254 483704 434753 263166 238852 426865 567927 543877
83586 543877 554586 688118 733299 591979 463331 442141 360348 202523 217100 421060
83576 421060 488406 348385 357601 616289 696506 395754 172112 394416 711139 661969
83566 661969 416561 374164 481986 497440 508453 638917 637440 328553 90302 298841 668548
83555 668548 742271 653960 750447 836137 546674 169891 275827 718216 830993 528045
83545 528045 385713 619030 773887 570900 341916 403920 581022 592727 463569 345301
83535 345301 297621 372067 580977 725602 593390 337184 299024 477986 573722 534186
83525 534186 605754 814163 864483 650439 438584 425973 490158 496414 507538 567194 580588
83514 580588 519534 482952 487978 455240 425214 511162 624421 548903 318549 219691 372304
83503 372304 589134 692400 703109 680306 627538 589530 612792 615054 519857 467395 621173
83492 621173 826767 780644 506256 328122 376980 461265 454746 468638 567931 627175 567153
83481 567153 481009 441867 406019 365344 386942 457281 479453 448081 446457 477893 486058 510009
83469 510009 613755 702002 628855 458463 394932 478329 559966 546524 472098 382330 339001
83458 339001 452217 698659 820797 648947 404552 410743 616790 711556 607614 487409
83448 487409 447600 434559 475430 630366 753630 647665 432521 412889 585134 640380
83438 640380 484451 381795 494722 622363 541790 337679 234823 297949 432040 539295
83428 539295 573805 537066 479425 450004 449498 475288 540379 588128 512253 350324 303717 452666
83416 452666 624169 664318 637137 618333 539985 410596 412691 574250 639245 498095 412941
83405 412941 537853 596103 397876 282019 568887 926139 835587 417983 209587 334273
83395 334273 493127 593768 763934 872321 679871 392796 433301 710688 755774 541561
83385 541561 495829 690591 729317 521998 453938 626323 641816 381017 294987 600079
83375 600079 836750 643081 381128 500914 772583 711522 408911 350921 611051 774555
83365 774555 614309 384419 389679 593341 752365 737080 611247 493283 430190 410272
83355 410272 444264 543816 615942 533206 380368 428773 716983 891688 705053 433491
83345 433491 472599 724792 795248 637610 542442 578119 540232 435310 507003 726232 743856
83334 743856 471228 265273 376877 605327 676013 618341 585863 591154 591193 602067 601698 525243
83322 525243 430472 455827 576049 622102 557147 501222 493781 475492 469256 521150 529457 419010
83310 419010 386440 631265 942515 943392 670538 495511 535803 586489 584390 660536 747854
83299 747854 630128 398130 370813 539378 582422 453083 424144 514163 440288 225753
83289 225753 258535 598079 812588 702577 609433 763345 889078 757021 597878 628804
83279 628804 646529 461604 312539 456877 701712 719938 550705 452106 499923 610365
83269 610365 729207 774706 639478 430969 428273 637497 717050 517653 332359 402253
83259 402253 552825 572147 577354 709385 804662 698698 567042 630780 762658 710148 518698
83248 518698 432357 517743 641594 706675 707825 654012 579495 537000 507748 443087 406573
83237 406573 492721 618567 624211 551380 557770 607835 562645 506076 604807 714235 565231
83226 565231 291866 276282 493179 555660 416160 415914 587191 568415 337061 333960 654480
83215 654480 816029 608174 478489 721615 961624 861135 701864 782239 841878 616659
83205 616659 415904 576785 828100 773578 571339 559861 624343 523798 455147 674495
83195 674495 909668 784006 509868 510020 636445 463558 136768 186774 604077 825024
83185 825024 642237 453939 520206 589274 444327 304912 433469 709901 841624 760841
83175 760841 624673 566947 576061 551652 446140 367097 455712 630253 628746 399405 227004
83164 227004 323407 531209 625382 655620 739050 754112 555218 316178 330420 571262 743740
83153 743740 709143 604984 583395 640578 689205 657522 540452 424973 402624 436499 429102
83142 429102 404292 443634 478287 390279 287698 375031 570412 605524 498039 518720 675743
83131 675743 689563 526792 461566 531628 475786 317038 404449 709448 734043 370222 177572
83119 469225 793692 740151 594003 694474 783161 576518 397293 586449 811544 651415
83109 651415 398227 542530 868375 838400 554008 534007 773186 816292 621451 580913
83099 580913 750770 780585 600466 518744 611840 618925 485286 459232 596167 665831 602066
83088 602066 591629 681668 716522 678614 703553 771253 752725 710646 777152 819360 633977
83077 633977 383175 397870 620628 700059 587445 566010 698937 727324 567049 464420
83067 464420 560737 680814 665937 601273 603531 635517 623501 573832 526187 520713 589168 674692
83055 674692 653692 537760 498804 591545 669633 686987 785260 935168 862649 550421 400541
83044 400541 604992 787954 638739 449777 567450 742583 582466 280972 285795 522533
83034 522533 574325 421187 391730 538714 634490 652100 724504 775753 689972 650473 803131
83023 803131 835294 465703 87199 254894 753551 901035 628560 497894 715692 898434
83013 898434 831081 729373 685051 535815 366469 479109 773838 804128 544905 455067
83003 455067 659325 739096 515170 376231 572075 784280 712942 573693 677235 929166
82993 929166 1053877 990010 830143 651173 560928 641120 763685 746868 685859 776736 874201
82982 874201 689553 390814 449344 849330 1041896 802735 536970 544941 583280 431257
82972 431257 336139 536048 802356 838846 758920 794717 853315 733137 530219 481070 583740
82961 583740 666353 681501 690487 690071 657872 649724 694386 715203 678202 674850 741567 747358 594143
82948 594143 410401 408425 603736 775827 716392 493333 413715 637334 894183 812297
82938 812297 505273 467061 787065 935334 593278 213510 319976 686709 777837 648527
82928 648527 735608 991679 963342 631836 450780 547017 578529 452764 505041 814646
82918 814646 982428 809748 633235 728529 879595 818529 665784 648859 731591 780453
82908 780453 813315 868172 863922 753687 616216 514327 465921 553166 799780 973409 826466
82897 826466 505507 382324 513742 634054 636957 654332 686088 595020 471920 557524 783360
82886 783360 840015 717473 703751 824702 802772 635687 665980 939318 1038141 767547
82876 767547 511922 639814 968808 1105645 985583 811175 717046 711635 750804 740157
82866 740157 649030 642729 853483 1058540 935181 616689 571324 881152 1088916 889789
82856 889789 558567 498748 707070 891434 871976 699163 546790 567930 719533 764169
82846 764169 610988 516798 694947 910694 823992 561989 516307 702747 797319 718300
82836 718300 679490 721514 687747 632794 757011 951392 902374 644914 525071 617125 662769
82825 662769 585266 578563 682613 735153 730502 781611 792951 631298 498731 627840 772996
82814 772996 588511 326584 478205 880361 947042 683554 640971 894740 941073 663761
82804 663761 528704 689150 749340 585832 568697 772615 795295 570539 530050 735557
82794 735557 714114 413089 412682 854787 1078677 747249 442383 636380 922464 841316
82784 841316 678631 805927 942142 743002 506549 623096 859280 828820 693003 780051
82774 780051 942379 872921 673114 584493 532342 407951 413457 674341 896820 828110 661477
82763 661477 614262 555403 419736 481933 806733 954068 683398 425434 570861 819426
82753 819426 764924 610036 710816 876576 755415 535144 627938 946563 1075094 932552
82743 932552 766539 697551 693898 777116 895361 849888 646077 594186 787619 883665 696454
82732 696454 546351 680584 832254 735448 588747 604121 595386 439077 426108 696183
82722 696183 851309 633763 459516 724836 1092201 1065866 806982 746779 817914 723306
82712 723306 595122 727642 961186 951769 784257 755065 825072 817674 850399 1040694 1115497
82701 1115497 859426 608037 724598 932719 782602 460418 478189 811246 997414 908467
82691 908467 808548 789552 716785 626684 680424 823647 898949 940797 1008192 965228 776884
82680 776884 712218 884283 960433 740750 597462 852279 1160148 1082691 851733 917283
82670 917283 1109780 962971 590414 513587 788750 979445 895119 763858 751054 813776
82660 813776 931653 1048254 950605 613466 421249 625403 881703 792458 572229 642249
82650 642249 890796 926187 786303 795388 947568 1006630 997448 1054621 1026819 773602 589948
82639 589948 780789 1090722 1118768 993563 1040531 1109489 898419 636628 723777 949426
82629 949426 825558 490685 512111 926154 1228954 1232548 1203108 1207911 1036310 756415 687618
82618 687618 812103 812522 674343 676441 829470 892255 881225 992546 1101312 932169 652767
82607 652767 688829 1000181 1141399 1002315 892558 917489 862350 698823 651897 755757
82597 755757 841834 922070 1092170 1161009 916174 633923 733518 1038939 1023298 700638
82587 700638 587758 806261 934652 807313 760021 944534 1048989 897798 756012 813661
82577 813661 868711 756045 661407 772416 960027 1012236 921840 799323 714632 706705 772681
82566 772681 830872 836820 865946 946807 976029 955782 1066554 1297193 1319115 1006875 734870
82555 734870 811587 982427 900031 721042 766728 933016 941957 866652 898911 907831 744773
82544 744773 660578 882308 1114029 1018773 834735 911017 1020738 817724 598887 841142
82534 841142 1286835 1300871 909788 685385 782659 882245 919234 1074864 1191562 993994
82524 993994 760228 966211 1380650 1345578 874725 624756 809986 993830 969164 1005317
82514 1005317 1155034 1119152 902402 862617 1018267 1010997 810649 749393 825325 712582
82504 712582 498717 631967 1058305 1205916 956069 837353 1071148 1202141 938844 649600
82494 649600 707958 945812 1057324 1038086 978926 876304 825964 983105 1224694 1266927
82484 1266927 1143686 1118742 1158438 1013025 781389 815373 1067224 1121047 893398 729309
82474 729309 782289 858408 882840 974536 1078926 1062291 1088481 1335228 1483333 1144781 644523
82463 644523 627598 1005375 1110573 838354 752574 1025498 1173746 992053 890483 1080772
82453 1080772 1210352 1060631 907518 944183 985959 952599 1028736 1180876 1127976 924390
82443 924390 943972 1170893 1162854 841543 645545 753677 832167 721580 709871 926732
82433 926732 1090770 1053692 1016970 1049570 957045 759876 743374 930126 1046568 1058720 1175266
82422 1175266 1321245 1223108 997367 1003985 1153776 1057889 809706 854347 1123589 1125871 885169
82411 885169 912045 1207586 1220688 894301 804947 1090165 1188034 889533 722473 973990
82401 973990 1205218 1093046 943327 1000866 1004944 795503 664981 774413 871519 860243
82391 860243 992557 1263236 1294787 1040588 914773 1037230 1065545 938258 1012771 1288123
82381 1288123 1303128 1014236 941881 1210858 1298546 1007523 827505 1018490 1182841 1086649
82371 1086649 1068639 1271971 1297190 1007763 877724 1131233 1307125 1091110 845384 910278
82361 910278 1081944 1148093 1247035 1372310 1238813 936294 960787 1315233 1388868 1030121
82351 1030121 873931 1240288 1583237 1460308 1202650 1165797 1135255 953738 946582 1228973
82341 1228973 1336277 1022972 721999 779668 945967 1008845 1175478 1443209 1394215 1015938
82331 1015938 900356 1216383 1348241 998768 745351 983434 1228696 1063610 897545
82322 897545 1123311 1335767 1096872 751410 781750 999834 1035359 1016144 1148643 1209577
82312 1209577 1033230 941347 1162998 1384188 1337221 1252535 1306586 1253563 1011699 949974
82302 949974 1194340 1335430 1194841 1146785 1325685 1320830 1032037 962725 1249585 1311247
82292 1311247 924085 708720 1031081 1367980 1320163 1289380 1543430 1590515 1160885 852776
82282 852776 1078615 1299655 1058798 848903 1150311 1496846 1347462 1056369 1128100 1300413
82272 1300413 1202940 1144740 1410401 1550935 1220779 946563 1204002 1506199 1301176 1005341
82262 1005341 1199130 1523268 1364745 989620 1001670 1247963 1220326 1028913 1075828 1246277
82252 1246277 1252632 1284895 1547799 1690136 1438479 1212904 1376384 1513923 1223148 939676
82242 939676 1152667 1474948 1356797 1072089 1114253 1250953 1080049 905545 1142462 1439828
82232 1439828 1312087 1073603 1232931 1514730 1402551 1126090 1200851 1481965 1541535 1490030
82222 1490030 1597917 1629262 1361166 1202254 1484335 1737640 1493604 1171846 1308928 1563645
82212 1563645 1400393 1108848 1190112 1361251 1154966 903401 1119492 1472287 1386319 1111212
82202 1111212 1191357 1413378 1293220 1081875 1262970 1552106 1416396 1109995 1187163 1455971
82192 1455971 1409831 1228606 1358725 1564999 1393318 1120572 1257703 1554323 1472957 1211814
82182 1211814 1290344 1549482 1509593 1300147 1329609 1468604 1416696 1392277 1629949 1753487
82172 1753487 1478581 1298230 1606699 1861011 1547364 1208271 1476111 1868107 1670392
82163 1670392 1262875 1363214 1670849 1517975 1194832 1334535 1613424 1386985 1023399
82154 1023399 1251664 1732341 1647932 1214319 1230436 1584451 1578588 1313917 1391660 1637710
82144 1637710 1469223 1141038 1296501 1670693 1569164 1230817 1365431 1745619 1643300
82135 1643300 1271488 1370972 1725497 1540648 995366 965060 1446666 1666606 1523775 1556958
82125 1556958 1727263 1587572 1387249 1652597 1983386 1655717 1073432 1163682 1684674 1680104
82115 1680104 1290221 1459174 2067851 2075405 1437566 1184533 1555427 1704252 1383211 1326021
82105 1326021 1744923 1935763 1640435 1446750 1597397 1658239 1543508 1662734 1935495 1843358
82095 1843358 1516194 1586330 1959942 1936836 1530066 1440769 1745352 1834890 1628067 1626591
82085 1626591 1818539 1736676 1515834 1677985 2007096 1878891 1516469 1621022 1985145 1854351
82075 1854351 1433573 1561924 2083536 2082020 1600443 1547105 1965072 2002079 1589685 1535001
82065 1535001 1892503 1858436 1393178 1353395 1850520 2037290 1715785 1629858 1950947 1978326
82055 1978326 1579937 1465641 1777419 1822575 1453291 1348959 1707848 1960819 1928468 1981588
82045 1981588 2018528 1622248 1195956 1514611 2215376 2250900 1751571 1787748 2337484 2290446
82035 2290446 1555841 1301717 1848356 2158943 1791669 1579252 1917061 2084891 1779660
82026 1779660 1698327 2071797 2172794 1797943 1728097 2201226 2402738 1993878 1721398 1993810
82016 1993810 2218098 2035866 1908833 2051332 2053312 1898143 2071726 2415155 2213907 1621275
82006 1621275 1569984 2090726 2221289 1777738 1634338 2000581 2054204 1608732 1509414 1981092
81996 1981092 2183257 1833146 1715881 2145472 2419479 2210817 2046919 2078867 1848006 1528891
81986 1528891 1855173 2575120 2596473 1901473 1639882 2079975 2232991 1807476 1705882 2188145
81976 2188145 2365468 1973473 1861330 2253217 2299924 1827230 1750932 2279850 2485610 2120256
81966 2120256 2059226 2488526 2504536 1978853 1915289 2457258 2497613 1820681 1634411 2338211
81956 2338211 2755997 2295703 1913347 2187505 2360491 2051579 2022774 2482218 2512782 1935446
81946 1935446 1848393 2574635 2985163 2593400 2370788 2739935 2765584 2135040 1913925 2485188
81936 2485188 2754342 2262469 2050454 2546032 2678975 2037271 1796034 2485778 2925826
81927 2925826 2446298 2105303 2588288 2942056 2544039 2313923 2790661 2985501 2341087
81918 2341087 1895655 2319891 2704478 2440345 2373839 2955473 3190709 2585941 2202957 2650306
81908 2650306 2972662 2620336 2506460 3023253 3102674 2373002 2098320 2803637 3169590 2519618
81898 2519618 2152643 2876895 3478411 3055890 2648077 3071536 3343246 2762101 2389459
81889 2389459 2934177 3307465 2791968 2489897 3104222 3477270 2872621 2478609 3071752
81880 3071752 3455691 2841587 2466717 3156714 3623359 2963961 2496005 3228291 3851108
81871 3851108 3224073 2568550 3114674 3783825 3339563 2720019 3084928 3579539 3171483
81862 3171483 2744081 3270690 3823292 3420813 2952737 3321299 3624587 3085121 2759541
81853 2759541 3438097 3930353 3330732 2833074 3396090 3855885 3301386 2980567 3811506
81844 3811506 4396299 3639210 2926274 3507338 4149875 3649488 3189533 3864204 4367505
81835 4367505 3579583 2930946 3682866 4397749 3712818 3055165 3870199 4721711 4024814
81826 4024814 3153045 3830268 4840615 4397806 3487806 3778647 4424742 4005293 3460948
81817 3460948 4076201 4717001 4071675 3425106 4212779 5096456 4497223 3684952 4257758
81808 4257758 4971477 4274449 3529674 4381663 5378667 4672150 3647659 4302798 5394024
81799 5394024 4860976 3781378 4179508 5115632 4710960 3914093 4505681 5468041 5059567
81790 5059567 4377371 5147665 6137609 5499451 4487025 5078172 6128776 5676101 4790759
81781 4790759 5324392 6162175 5560200 4796049 5612886 6557513 5808259 4982098 6060385
81772 6060385 7324230 6587589 5565072 6560318 7773232 6618485 4796201 5168609 6451206
81763 6451206 6013475 5100881 6132160 7642413 7149738 6191481 7190780 8282227 6769552
81754 6769552 4719121 5396365 7146638 6685336 5404796 6333605 7922733 7161141 5798623
81745 5798623 7002518 8919777 8187531 6666586 7842881 9805271 8916525 7128250
81737 7128250 8234311 10245298 9224862 7274772 8611335 11133589 10337986 8197401
81729 8197401 9349187 11863206 10971632 8600449 9658401 12212182 11256764 8870834
81721 8870834 10294089 13308482 12314034 9550179 10974264 14415708 13661614 10858797
81713 10858797 12416326 16070214 15131861 12073530 14031453 18361785 17370879 13803964
81705 13803964 15953077 20998913 20025949 15978047 18525387 24639149 23836602 19271316
81697 19271316 22350115 29744785 29047419 24067472 28681919 38442045 37305312 30327290
81689 30327290 36685740 51404822 52163799 44873235 57315150 83025885 86695008 78580461
81681 78580461 115243953 190483750 196491309 60585341 -129399528 -217352636 -169975584
81674 -169975584 -93809882 -73880875 -84493708 -73353250 -49158003 -44391489 -51471912
81667 -51471912 -45192108 -31580673 -31022071 -37900527 -34120883 -24001318 -23399583 -28893609
81659 -28893609 -26462551 -18873740 -18603045 -23289443 -21637044 -15614874 -15463194 -19471083
81651 -19471083 -18263404 -13333233 -13296515 -16797551 -15823908 -11570449 -11487784 -14500615 -13659645
81642 -13659645 -9958644 -9918507 -12634061 -12018574 -8977001 -9233414 -11796692 -11124497 -8208157
81633 -8208157 -8464548 -10969590 -10410475 -7583231 -7696245 -10157041 -9930478 -7377348 -7237080
81624 -7237080 -9273199 -9054343 -6802445 -6732535 -8651178 -8537758 -6534053 -6408868 -7973404
81615 -7973404 -7659024 -5777103 -5845811 -7522896 -7316960 -5513753 -5491899 -6960620 -6634330
81606 -6634330 -4857205 -4921208 -6501648 -6285557 -4507019 -4460027 -6028802 -5972781 -4246984
81597 -4246984 -3925797 -5147631 -5093885 -3748451 -3833999 -5173378 -4860829 -3029645 -2852427
81588 -2852427 -4674331 -5529048 -4681723 -4449249 -5275916 -5064038 -3724499 -3518554 -4521879
81579 -4521879 -4437452 -3235547 -3371217 -5025420 -5634184 -4588026 -4059592 -4703121 -4739358
81570 -4739358 -3802232 -3632883 -4440736 -4454849 -3541997 -3507373 -4421616 -4368219 -3206934 -2918417
81560 -2918417 -3826292 -4072213 -3237757 -2970796 -3614301 -3649290 -2886585 -2860030 -3664870 -3682590
81550 -3682590 -2801340 -2684655 -3512156 -3644701 -2842952 -2655091 -3298853 -3303667 -2560762 -2588360
81540 -2588360 -3427943 -3405411 -2364457 -2045836 -2819410 -3082441 -2380090 -2131564 -2734313
81531 -2734313 -2869358 -2238234 -2147751 -2814965 -2871770 -2109470 -1978095 -2777954 -3045404 -2337338
81521 -2337338 -1995641 -2512040 -2694007 -2100987 -1834051 -2258981 -2336916 -1825329 -1799439 -2413564
81511 -2413564 -2467355 -1754061 -1532243 -2110409 -2266508 -1645413 -1441105 -2060762 -2346712 -1807624
81501 -1807624 -1485135 -1900710 -2168383 -1826004 -1629784 -1919972 -2031675 -1826338 -1993183
81492 -1993183 -2442983 -2261903 -1580883 -1562685 -2235997 -2347960 -1682402 -1443932 -1956298 -2101120
81482 -2101120 -1525815 -1296967 -1778858 -1923292 -1331088 -1043550 -1565850 -1965682 -1661468
81473 -1661468 -1354955 -1503057 -1538093 -1234325 -1225494 -1604144 -1605920 -1164635 -1152347 -1647720
81463 -1647720 -1661004 -1014828 -754944 -1218401 -1457581 -1097672 -986290 -1425821 -1539399 -1038764
81453 -1038764 -881891 -1470287 -1873038 -1574327 -1359756 -1705377 -1872360 -1407268 -1038531
81444 -1038531 -1266161 -1473430 -1220139 -1052878 -1280347 -1289445 -828111 -653862 -1149137 -1552444
81434 -1552444 -1310907 -980380 -1055568 -1100299 -780003 -616962 -968153 -1297906 -1167212 -968366
81424 -968366 -1054069 -1095674 -876989 -782938 -977153 -1020803 -772317 -730427 -1061131 -1232768
81414 -1232768 -1012272 -867620 -1015701 -1043768 -825990 -828541 -1155424 -1268349 -984955 -791679
81404 -791679 -879176 -850139 -639423 -704279 -1048268 -1094380 -775540 -699949 -1000933 -1104492
81394 -1104492 -869727 -841439 -1121107 -1131109 -777030 -690019 -1013998 -1109383 -778181 -616861
81384 -616861 -815918 -793072 -399187 -307217 -768159 -1116479 -959702 -761099 -807364 -701304
81374 -701304 -334163 -267204 -660872 -877464 -627898 -476498 -728912 -860859 -565795 -357218
81364 -357218 -582949 -791457 -620590 -423902 -502088 -565752 -433165 -427679 -650801 -687754
81354 -687754 -426520 -335405 -572303 -674424 -462974 -369908 -547913 -574467 -354177 -357627
81344 -357627 -641486 -634212 -246165 -145462 -527823 -694440 -333935 -129907 -508516 -839370
81334 -839370 -568804 -180432 -279928 -579224 -556340 -380525 -429053 -522030 -343449 -82830
81323 -46478 -124665 -149760 -270219 -524398 -585059 -342185 -182096 -306974 -373869 -187463
81313 -187463 -112309 -371623 -566073 -361267 -81917 -144988 -406091 -511784 -446599 -345766
81303 -345766 -201009 -78963 -191190 -468526 -522957 -270069 -97616 -195774 -253943 -65918 103724
81291 26283 -122449 -155997 -170417 -230936 -224438 -186281 -299795 -456809 -339684 -33775 19726
81279 -212826 -264466 19339 217949 80967 -90426 -40498 51588 26762 42858 169831 189996
81268 189996 27187 -85571 -42526 -17624 -55300 16797 160698 111067 -105188 -132134 116744
81256 309240 254424 142320 121579 88413 -5732 -44868 -12122 -1780 23699 140143 213996
81245 213996 114805 20638 120960 236665 162838 96571 237061 317048 101153 -52759 203707
81233 473355 253685 -110803 -1004 344831 263838 -95806 -57451 298383 275646 -128685 -216327
81222 -216327 124712 259669 1802 -123548 76642 201993 170155 359543 697541 631607
81212 631607 180628 1257 225716 263374 -30835 -57059 366125 588169 265863 -53012 83191
81200 345623 365297 336678 445915 453893 267252 223608 430567 496549 260442 115679 282132
81189 282132 425966 327712 267268 414964 480756 307144 207362 378577 534521 436513
81179 436513 284635 307436 421784 505436 569859 541117 324174 134062 264551 529080
81169 529080 487097 198142 134143 368026 510907 441732 411665 436676 305272 176541
81159 176541 409056 795330 772266 418243 386248 770820 940684 658404 458425 647996
81149 647996 798117 584682 361190 485109 729179 765513 685973 681168 671477 563471 479180
81138 479180 508496 575439 656249 782015 818657 638213 454110 547707 762608 756636 616294
81127 616294 669287 833279 763670 530505 513471 716967 817441 791806 864650 944923 778430
81116 778430 559067 707165 1109359 1243473 1007061 791795 793565 846621 867782 908683
81106 908683 881190 743688 763925 1087138 1326417 1127936 798553 786532 939091 909633
81096 909633 851276 1007510 1093094 836136 634326 874881 1143976 968803 750938 1005281
81086 1005281 1293913 1003669 584853 807674 1321912 1261648 831587 907332 1395329 1419323
81076 1419323 941306 794054 1180056 1455237 1376309 1333088 1374181 1175608 924014 1097220
81066 1097220 1458954 1387696 1056625 1139113 1515732 1476115 1059378 972964 1286998 1408532
81056 1408532 1257346 1298226 1510517 1462262 1270095 1379856 1601379 1468348 1258718 1495813
81046 1495813 1806933 1532762 1065927 1226426 1713213 1634657 1194606 1293297 1779485 1737820
81036 1737820 1267206 1285397 1727250 1655114 1096193 1057297 1677813 2018988 1773924 1612559
81026 1612559 1747695 1680750 1427206 1514256 1763517 1544484 1148099 1385016 1969387 1923867
81016 1923867 1429131 1538529 2175531 2242809 1687445 1580358 2082316 2218515 1818381 1800065
81006 1800065 2303108 2380880 1837286 1593982 1924467 2037805 1713738 1673724 2043449 2088366
80996 2088366 1733291 1734303 2137245 2173796 1835132 1911791 2365205 2337652 1859842 1831653
80986 1831653 2252700 2238303 1824500 1924028 2459475 2440754 1939325 2018189 2634707 2651393
80976 2651393 2044934 2007307 2666992 2838210 2294152 2154440 2683488 2824636 2319720 2216788
80966 2216788 2827519 3174068 2895260 2775888 3017126 2894152 2437757 2534001 3100990 3104054
80956 3104054 2563444 2554922 3090538 3076506 2489712 2448274 3005617 3075923 2655320 2848348
80946 2848348 3577157 3596151 2916778 2852747 3517377 3666265 3143523 3056132 3440893 3249767
80936 3249767 2685116 2965123 3772499 3636850 2825160 3002488 4030686 4117081 3210095
80927 3210095 3104371 4001753 4197991 3462161 3443211 4346168 4507057 3705920 3596630 4397442
80917 4397442 4490415 3742004 3811030 4731033 4701853 3715737 3752956 4901777 5057045 4010446
80907 4010446 3931297 5148431 5477122 4487837 4336946 5492021 5801851 4779986 4594314
80898 4594314 5757446 6110771 5193935 5247021 6661212 6893997 5262788 4358142 5259397
80889 5259397 5808320 5095004 5130269 6529651 7075618 6111893 5815331 6658972 6341372
80880 6341372 4654456 4457702 6283089 7073435 5878913 5540767 7046583 7675599 6551865
80871 6551865 6432560 8068119 8518883 7049269 6796260 8561368 9067815 7479143 7256863
80862 7256863 9316418 9994873 8210924 7745545 9850481 10724633 9043031 8609589 10689555
80853 10689555 11377738 9545697 9388912 11991029 12780368 10597880 10381636 13428354 14470613
80844 14470613 12095085 11932659 15489229 16646199 13708781 13350122 17617477 19395921
80836 19395921 16330471 15983350 20930768 23029031 19533385 19454914 25872908 28752450
80828 28752450 24583870 24710749 33307487 37448711 32016279 31893847 43699725 50733754
80820 50733754 45617365 49101613 70885224 84848704 79185433 94333068 155180454
80813 155180454 193747084 115879332 -56594978 -187397228 -189579994 -120002823 -79218174
80806 -79218174 -82374197 -80329911 -57980762 -44609466 -49541700 -49665342 -37039174 -30169293
80798 -30169293 -35551012 -37182283 -28828982 -23923220 -27971728 -29288892 -22942499 -19267771
80790 -19267771 -22675876 -23836687 -18749263 -15966930 -19187782 -20471468 -16260685 -13825756
80782 -13825756 -16477515 -17476025 -13791168 -11853880 -14586961 -15850086 -12695255 -10826291
80774 -10826291 -13080458 -14110636 -11240914 -9615976 -11873811 -13068109 -10485326 -8737347
80766 -8737347 -10561052 -11786335 -9868068 -8668141 -10452534 -11444099 -9503309 -8318200
80758 -8318200 -9943630 -10771448 -8799220 -7564785 -9060426 -9845002 -7950391 -6775760
80750 -6775760 -8379359 -9513392 -8030486 -6877082 -8070663 -8831925 -7308941 -6254972
80742 -6254972 -7466629 -8229556 -6757825 -5688814 -6787308 -7507784 -6156700 -5275830 -6571318
80733 -6571318 -7512404 -6276088 -5219485 -6174978 -6982555 -5913793 -5011516 -5869710 -6473371
80724 -6473371 -5332710 -4517783 -5548850 -6375415 -5392856 -4473498 -5148753 -5683820 -4714764
80715 -4714764 -3951569 -4595519 -4899512 -3893239 -3663310 -5291155 -6373297 -5273963 -4078460
80706 -4078460 -4629267 -5353192 -4752026 -4361678 -5428157 -6187377 -5278684 -4464692 -5194745
80697 -5194745 -5810187 -4905472 -4145361 -4957122 -5668811 -4758810 -3810118 -4402646 -5110142
80688 -5110142 -4419318 -3683096 -4328831 -4979426 -4201373 -3388391 -4073480 -4966060 -4452707
80679 -4452707 -3575455 -3818003 -4317114 -3893170 -3514496 -4193348 -4726015 -3996263 -3251861
80670 -3251861 -3706439 -4194011 -3563411 -3028944 -3735408 -4366716 -3645621 -2871009 -3451733
80661 -3451733 -4208109 -3695180 -2986715 -3520850 -4288990 -3822901 -3000696 -3246987 -3806942
80652 -3806942 -3392713 -2766404 -3155874 -3793186 -3481883 -2966344 -3360132 -3854428 -3340741
80643 -3340741 -2694654 -3109768 -3746521 -3358555 -2704158 -3026000 -3641250 -3353479 -2813095
80634 -2813095 -3176224 -3787024 -3456239 -2760524 -2886293 -3412610 -3322173 -2995873 -3213052 -3420075
80624 -3420075 -2925328 -2523565 -3031878 -3551871 -3085053 -2482786 -2849672 -3422331 -3048498
80615 -3048498 -2399160 -2644006 -3225822 -3023658 -2503379 -2664946 -3026899 -2674145 -2171332
80606 -2171332 -2451044 -2916487 -2605637 -2130903 -2506393 -3135900 -2927188 -2359609 -2492523
80597 -2492523 -2923131 -2672738 -2155838 -2351520 -2894843 -2838974 -2473805 -2620838 -2959489 -2751693
80587 -2751693 -2377671 -2521452 -2726504 -2349190 -1988946 -2381056 -2869650 -2586514 -2115733
80578 -2115733 -2357086 -2790383 -2541816 -2121912 -2388205 -2807344 -2489772 -1959983 -2149076
80569 -2149076 -2592880 -2385432 -1977536 -2256030 -2745850 -2511100 -1985491 -2136645 -2621803
80560 -2621803 -2512715 -2073318 -2118885 -2379676 -2163907 -1867145 -2179849 -2586534 -2286219 -1797179
80550 -1797179 -2009136 -2466562 -2262378 -1815626 -2049293 -2581005 -2461295 -1987485 -2066523 -2453478
80540 -2453478 -2314419 -1894056 -1967872 -2266136 -2062915 -1701964 -1940063 -2404249 -2277380 -1878095
80530 -1878095 -1997787 -2322656 -2085251 -1635786 -1795959 -2281615 -2304379 -2086723 -2252888 -2413081
80520 -2413081 -1924420 -1364575 -1640666 -2292414 -2285059 -1836422 -1843886 -2145406 -1992459 -1640221
80510 -1640221 -1824725 -2232230 -2097885 -1746942 -1943721 -2313176 -2036919 -1516023 -1677281
80501 -1677281 -2200324 -2123344 -1671877 -1773409 -2240673 -2157812 -1657863 -1630331 -2024365 -2068506
80491 -2068506 -1826489 -1955882 -2272423 -2093841 -1653092 -1679741 -1972310 -1847301 -1550194 -1746218
80481 -1746218 -2111600 -1935020 -1580800 -1807635 -2202619 -1909217 -1341656 -1482713 -2017043
80472 -2017043 -1921642 -1420148 -1527619 -2064429 -1984162 -1371473 -1268714 -1730850 -1842906 -1503771
80462 -1503771 -1460085 -1720140 -1621380 -1312021 -1502006 -1927309 -1736521 -1205190 -1352426 -2030487
80452 -2030487 -2143071 -1627892 -1454932 -1744356 -1677674 -1256095 -1345174 -1904198 -1939382 -1357069
80442 -1357069 -1150150 -1558825 -1715819 -1350140 -1222942 -1584135 -1733553 -1431742 -1312135
80433 -1312135 -1592222 -1719403 -1542570 -1548864 -1762973 -1679667 -1392648 -1501044 -1841775 -1657147
80423 -1657147 -1070604 -1004269 -1544875 -1797054 -1483759 -1293081 -1478974 -1502150 -1252887 -1283908
80413 -1283908 -1620566 -1638414 -1313921 -1320324 -1708123 -1766518 -1373598 -1218732 -1494448 -1605241
80403 -1605241 -1364668 -1277249 -1459415 -1456547 -1271576 -1409418 -1789278 -1776236 -1377278 -1247397
80393 -1247397 -1466001 -1483855 -1285942 -1383007 -1657133 -1484860 -1012005 -1014591 -1479559 -1627895
80383 -1627895 -1352392 -1298358 -1517744 -1424633 -1100991 -1223510 -1659066 -1595065 -1115925 -1128131
80373 -1128131 -1630530 -1656512 -1109427 -1004364 -1585556 -1854389 -1395431 -1067225 -1347932 -1530304
80363 -1530304 -1180504 -957088 -1294673 -1583830 -1351232 -1067801 -1144265 -1241392 -1157609 -1305577
80353 -1305577 -1755313 -1876388 -1461142 -1161997 -1325952 -1443195 -1224077 -1154404 -1474269 -1640859
80343 -1640859 -1334474 -1035526 -1108535 -1228460 -1155436 -1177830 -1388510 -1407626 -1173633 -1134709
80333 -1134709 -1375774 -1452140 -1298768 -1346494 -1566987 -1441462 -1045814 -1054529 -1473347 -1538722
80323 -1538722 -1108493 -932899 -1256297 -1401508 -1099935 -976184 -1284782 -1403705 -1066334
80314 -1066334 -898874 -1220054 -1462999 -1307680 -1249766 -1518112 -1558578 -1145658 -899992 -1137118
80304 -1137118 -1288782 -1036491 -932654 -1294320 -1546116 -1299637 -1068793 -1268331 -1475172
80295 -1475172 -1323377 -1192225 -1371374 -1449582 -1157712 -949143 -1139394 -1306771 -1118659 -938240
80285 -938240 -1078953 -1255847 -1251944 -1315244 -1474888 -1330317 -919902 -875309 -1304336 -1493119
80275 -1493119 -1152020 -936756 -1238095 -1488431 -1238515 -930284 -1000194 -1154396 -1118270 -1181887
80265 -1181887 -1433151 -1382211 -919662 -708165 -1042142 -1272670 -970897 -696956 -953394 -1310525
80255 -1310525 -1269561 -1113777 -1203268 -1262654 -1054145 -947997 -1161342 -1230985 -890261 -665057
80245 -665057 -944105 -1252670 -1115845 -872252 -960443 -1133230 -1040822 -903061 -985089 -1069858
80235 -1069858 -1000986 -1065913 -1340983 -1382214 -1042786 -831500 -999764 -1091513 -865514 -790334
80225 -790334 -1115997 -1345703 -1167879 -1019892 -1181143 -1222303 -921060 -789474 -1098469 -1319844
80215 -1319844 -1137600 -1040250 -1289184 -1329609 -915075 -751996 -1236067 -1598654 -1195677 -645611
80205 -645611 -726855 -1077497 -1009626 -766357 -908834 -1189115 -1078700 -785217 -768622 -843182
80195 -843182 -677112 -585524 -925916 -1289677 -1175017 -892614 -950928 -1126407 -999183 -826183
80185 -826183 -1008203 -1247947 -1109783 -883247 -1026158 -1260511 -1083039 -705871 -661393 -905533
80175 -905533 -1072830 -1169519 -1300814 -1209561 -793498 -553524 -826330 -1133607 -996554 -777416
80165 -777416 -954352 -1202680 -1033547 -742713 -846395 -1122493 -1094341 -954294 -1123089 -1370085
80155 -1370085 -1250366 -974946 -991808 -1124332 -957225 -666682 -660341 -802604 -773208 -755090
80145 -755090 -989791 -1121608 -796806 -446054 -626136 -1032390 -1034563 -770869 -809042 -1089135
80135 -1089135 -1116575 -917215 -922245 -1124017 -1149050 -981256 -901500 -910069 -837318 -779123 -857536
80124 -857536 -872436 -723012 -756794 -1148746 -1426402 -1211246 -899086 -962531 -1145988 -1046746
80114 -1046746 -901264 -1034983 -1126424 -837936 -595134 -863442 -1209016 -1008797 -575211 -602723
80104 -602723 -963773 -1052112 -905956 -975325 -1136747 -963407 -673027 -795958 -1148573 -1118285
80094 -1118285 -757250 -641852 -833071 -900020 -807970 -886004 -1062282 -991801 -797186 -860487
80084 -860487 -1048933 -958267 -730551 -802747 -1039069 -963668 -682911 -715165 -1036775 -1144552
80074 -1144552 -969769 -913783 -1045784 -1039376 -854534 -772196 -817559 -794401 -769117 -903577 -995783
80063 -995783 -806841 -598550 -708268 -895312 -793286 -653230 -866350 -1114861 -870375 -425206
80052 -488588 -982085 -1190574 -960291 -798725 -868719 -817448 -600263 -598380 -862788 -1014097
80042 -1014097 -936754 -879782 -880880 -759896 -631502 -760663 -984608 -930383 -700397 -692118 -876759
80031 -876759 -920961 -860171 -963359 -1104585 -980494 -775670 -882162 -1133165 -1063727 -764518
80021 -764518 -711313 -899436 -920311 -760947 -758558 -889633 -861576 -771788 -918486 -1115714 -974667
80010 -974667 -694534 -759911 -1020566 -931928 -572417 -523090 -815012 -901320 -658990 -539876
80000 -539876 -698076 -799423 -742367 -782881 -907365 -831258 -633021 -663279 -853074 -842423
79990 -842423 -718736 -847519 -1060317 -863574 -410702 -373558 -815489 -1075253 -866821 -647985
79980 -647985 -751995 -940185 -985083 -987754 -969631 -799576 -623058 -741599 -1020463 -1027836 -755555
79969 -755555 -586723 -611358 -614637 -629050 -811369 -924913 -689102 -459468 -736002 -1190649
79959 -1190649 -1112102 -655760 -615349 -1023186 -1090398 -606982 -286820 -519176 -823731 -820696
79949 -820696 -771456 -851607 -797641 -589030 -618965 -885870 -860691 -455610 -275839 -587638
79939 -587638 -878828 -797968 -700623 -865384 -964737 -759754 -588649 -704924 -796367 -614615
79929 -614615 -467925 -642807 -891271 -909567 -820563 -809884 -764902 -608885 -534684 -618236 -647183
79918 -647183 -564012 -606953 -809023 -862051 -683912 -608989 -805122 -1000857 -987708 -902745 -842793
79907 -842793 -696055 -508679 -513598 -661365 -633466 -428288 -398943 -617314 -760939 -716718
79897 -716718 -716906 -803444 -767396 -683244 -851163 -1140557 -1088322 -738368 -643954 -911459 -1017251
79886 -1017251 -751822 -552442 -659474 -729736 -580864 -553184 -793137 -908152 -699109 -540075
79876 -540075 -655907 -703748 -472074 -336037 -579811 -869708 -847634 -703228 -727173 -799372
79866 -799372 -729032 -642701 -669086 -673127 -606033 -668203 -865130 -890849 -694465 -630130 -799118
79855 -799118 -824651 -566844 -452983 -740152 -1029920 -924919 -650351 -602961 -734932 -786070
79845 -786070 -733768 -664970 -562505 -488264 -600620 -787132 -717033 -435638 -398525 -718619
79835 -718619 -938970 -794376 -614138 -674456 -736831 -582866 -457252 -588899 -760850 -736528
79825 -736528 -665321 -713946 -731712 -612627 -556322 -653880 -652668 -442995 -335720 -537432 -778009
79814 -778009 -776099 -666271 -663972 -701686 -675782 -670915 -699841 -612592 -459861 -514050 -752750
79803 -752750 -804395 -592421 -506977 -720462 -882277 -750087 -579156 -603295 -660538 -621835
79793 -621835 -663751 -822257 -803448 -539173 -408107 -602667 -798248 -747350 -664249 -716252
79783 -716252 -690537 -495822 -436113 -636111 -749792 -600862 -545920 -806667 -1004936 -802541
79773 -802541 -481594 -435826 -568134 -633718 -708112 -868962 -871318 -593659 -379206 -494062
79763 -494062 -660895 -559320 -375382 -417780 -582564 -631435 -629622 -693037 -665352 -449347 -303482
79752 -303482 -422452 -575182 -526057 -448225 -548820 -657360 -573091 -467184 -551006 -671335
79742 -671335 -610933 -493132 -540827 -704846 -822067 -867645 -823338 -616607 -388889 -453378
79732 -453378 -789717 -982345 -848864 -689496 -724846 -772896 -697141 -663641 -716866 -624246 -388072
79721 -388072 -366981 -629888 -759441 -576909 -464644 -654009 -809342 -680926 -558804 -676535
79711 -676535 -759015 -589761 -452922 -572631 -674521 -550348 -498888 -741277 -947262 -825044
79701 -825044 -652783 -735577 -848351 -711636 -524565 -534073 -553254 -385974 -261846 -392052
79691 -392052 -558522 -564399 -596324 -744742 -720223 -452571 -362271 -602621 -697433 -416157 -285504
79680 -285504 -650952 -971977 -743789 -406226 -541832 -827778 -674374 -341693 -459955 -869553
79670 -869553 -913511 -588053 -464322 -652682 -719959 -541301 -453300 -594078 -745422 -793335
79660 -793335 -804772 -743088 -583454 -541839 -734940 -848927 -613455 -323018 -385302 -642669
79650 -642669 -671566 -481181 -385114 -437163 -498846 -602519 -770782 -769886 -506620 -337009 -515514
79639 -515514 -717669 -600387 -413971 -513706 -699384 -641113 -538194 -706266 -902020 -737684
79629 -737684 -415309 -364234 -473934 -377604 -197455 -307840 -612128 -728153 -662614 -673036
79619 -673036 -704988 -574788 -447610 -539173 -633109 -482797 -353538 -545118 -748065 -554405
79609 -554405 -241097 -314218 -613963 -639531 -459940 -510595 -739895 -748972 -570458 -548221 -637638
79598 -637638 -552895 -401136 -458999 -557587 -406521 -250977 -448530 -695513 -502049 -147291
79587 -262412 -701683 -779453 -464561 -363887 -601465 -682034 -464617 -346711 -437727 -419733
79577 -419733 -281205 -353064 -570549 -525528 -291064 -353098 -671185 -676707 -305538 -153770
79567 -153770 -436350 -645987 -485470 -334114 -489108 -665476 -579574 -413142 -390014 -417733
79557 -417733 -395739 -406169 -426984 -314035 -172267 -273192 -546369 -644476 -532720 -492689
79547 -492689 -551210 -472455 -307061 -348222 -539805 -542370 -385229 -411064 -575434 -491401 -201920
79535 -185449 -506090 -678039 -506666 -361783 -454796 -531834 -471542 -518341 -711286 -726108
79525 -726108 -510396 -452918 -683457 -807905 -596020 -358110 -366751 -441999 -392110 -374010 -531112
79514 -531112 -694316 -687681 -572873 -437758 -300775 -290715 -512228 -715108 -567520 -250646
79503 -239399 -498604 -525028 -232962 -107489 -343286 -532282 -429489 -355646 -544861 -710539
79493 -710539 -600207 -435548 -450652 -478454 -341266 -218071 -289324 -397367 -364777 -312191
79483 -312191 -396559 -543471 -651209 -755003 -822577 -709759 -466477 -358392 -455807 -531468
79473 -531468 -469044 -423060 -474564 -485273 -398631 -351055 -401236 -460678 -522118 -635631 -683948
79462 -683948 -540624 -387511 -468251 -618112 -508458 -259264 -267276 -500059 -559631 -414790
79452 -414790 -430319 -648148 -699768 -509061 -424488 -536010 -514138 -284979 -223195 -472760
79442 -472760 -680765 -624680 -535359 -582834 -593150 -489942 -483427 -614597 -630866 -497916 -504800
79431 -504800 -688155 -707415 -477631 -355983 -492962 -574368 -437304 -365028 -511157 -595621
79421 -595621 -455222 -354581 -458205 -518682 -388446 -327150 -485489 -577020 -392996 -185383
79410 -212619 -332957 -358836 -400698 -553688 -635528 -530818 -431537 -471787 -483203 -356621 -287252
79399 -287252 -421358 -593638 -624727 -563032 -474126 -324673 -201946 -293049 -534043 -635418
79389 -635418 -531135 -434745 -426767 -400497 -408245 -588519 -765279 -638055 -347487 -293152 -436451
79378 -436451 -413507 -280123 -409922 -674717 -556980 -132285 -47430 -384585 -489261 -159182
79367 -22200 -375492 -625505 -364575 -83010 -238938 -473665 -382803 -274896 -480332 -634476
79357 -634476 -377271 -112450 -311418 -636400 -531783 -195323 -183890 -458182 -571741 -481335
79347 -481335 -461430 -483306 -335506 -141774 -175882 -356917 -424568 -397847 -428155 -461875 -442548
79336 -442548 -522980 -696320 -619352 -220488 -23047 -369231 -793747 -740808 -447005 -453608 -645739
79325 -645739 -521954 -134384 10027 -163648 -234770 -63694 17848 -172941 -405274 -467264
79315 -467264 -434618 -432911 -453486 -450422 -399306 -286096 -190216 -253285 -425405 -448708 -248869
79304 -248869 -84720 -138266 -258531 -300389 -371446 -522216 -563041 -439221 -403859 -554275 -609794
79293 -609794 -439229 -360610 -574345 -759076 -634073 -474456 -605338 -796525 -670489 -363577
79283 -363577 -258084 -339582 -326814 -212063 -204249 -320996 -436705 -548609 -661915 -642083
79273 -642083 -484357 -448554 -628897 -720202 -522962 -308882 -341515 -433144 -362752 -321508 -504159
79262 -504159 -651471 -478600 -210258 -210413 -397941 -491429 -518717 -625334 -687333 -566994 -450890
79251 -450890 -506841 -530673 -351342 -219967 -354063 -487882 -354187 -208608 -356110 -560745
79241 -560745 -487743 -338585 -442364 -589813 -425821 -173228 -278012 -601290 -656381 -440028
79231 -440028 -349416 -436883 -408032 -245400 -213047 -321748 -347611 -296780 -346593 -444437 -442404
79220 -442404 -461978 -641164 -733111 -483116 -180560 -260848 -562429 -591063 -356585 -309456
79210 -309456 -547274 -708212 -614287 -456527 -361678 -276261 -243305 -341005 -422477 -336341 -263278
79199 -263278 -403075 -534462 -374961 -149298 -244203 -510345 -513605 -299732 -262713 -389552
79189 -389552 -316833 -70808 -64406 -345088 -495788 -355701 -244952 -362343 -488594 -421817
79179 -421817 -267160 -178916 -172152 -241552 -356771 -368707 -222911 -159744 -374850 -645953 -667271
79168 -667271 -547843 -551021 -568476 -353973 -75861 -90975 -327317 -433746 -392484 -435448 -511563
79157 -511563 -417082 -307785 -473308 -728451 -658269 -363069 -307256 -506361 -544499 -365243
79147 -365243 -345097 -548540 -595552 -364556 -190706 -242957 -290943 -216622 -205999 -309188 -329797
79136 -329797 -261128 -332825 -531949 -568121 -391660 -263286 -259554 -211342 -166772 -366480 -694757
79125 -694757 -725115 -422612 -242018 -386142 -516817 -385528 -224977 -281279 -415692 -414736
79115 -414736 -314558 -212582 -99252 -36493 -169461 -426616 -531215 -419429 -328624 -386432
79105 -386432 -439719 -376143 -301732 -316761 -388869 -487848 -591995 -582128 -398868 -238586 -301868
79094 -301868 -455474 -463417 -396296 -432210 -438619 -219157 -12622 -208392 -661243 -840373 -617872
79083 -617872 -376598 -355656 -409714 -416006 -424311 -403592 -296384 -275677 -491190 -673703 -502801
79072 -502801 -220881 -291130 -586706 -591025 -302519 -201706 -354765 -335382 -87212 -61454 -354185
79061 -354185 -489521 -280941 -165848 -402533 -624685 -521102 -332491 -325892 -344605 -238253
79051 -238253 -221963 -434569 -585653 -408187 -100951 -5524 -144168 -320266 -405525 -360116
79041 -360116 -226180 -180530 -321619 -427354 -267185 -58764 -161767 -429841 -427353 -204407
79030 -205056 -435755 -444631 -174658 -86048 -307377 -421104 -274456 -246330 -472199 -557788
79020 -557788 -353435 -270259 -488140 -584382 -345789 -227648 -530216 -792365 -554321 -142100
79009 -108189 -367691 -468103 -339521 -238069 -238016 -247441 -289944 -398222 -452595 -398441 -367008
78998 -367008 -390761 -332273 -247777 -395788 -712836 -769041 -460139 -228977 -349147 -519551
78988 -519551 -453459 -330090 -344332 -341424 -232637 -244666 -422196 -431747 -201671 -164332 -477292
78977 -477292 -637538 -337967 -67921 -293343 -637788 -538645 -204003 -197989 -476418 -564028
78967 -564028 -401574 -324700 -399639 -399167 -290925 -223579 -183982 -122915 -210947 -523702 -722802
78956 -722802 -520197 -205813 -223202 -466600 -510159 -313440 -177779 -187567 -200654 -227651 -336969
78945 -336969 -352540 -127545 55022 -145477 -512370 -545889 -233869 -31245 -142898 -326992
78935 -326992 -385960 -390765 -406833 -395764 -398362 -477157 -510202 -363121 -193641 -247100 -431328
78924 -431328 -452710 -305407 -256259 -384216 -495048 -482851 -445592 -438536 -408811 -374878 -402832
78913 -402832 -417714 -295296 -123213 -119328 -296104 -434195 -392179 -252123 -164860 -205714 -352307
78902 -352307 -476649 -423178 -211039 -62497 -116861 -244929 -272804 -238068 -271514 -367809 -432781
78891 -432781 -434354 -372166 -229275 -71096 -47274 -188797 -348754 -412346 -389588 -272881 -55550
78879 72769 -123951 -497467 -597651 -322180 -98327 -223121 -422382 -342832 -117973 -98773
78869 -98773 -298741 -454252 -439168 -324659 -194225 -134994 -238352 -420310 -445779 -289726
78859 -289726 -219825 -360429 -476020 -379439 -233132 -217743 -224650 -136470 -105879 -276255 -498768
78848 -498768 -591721 -619529 -671091 -633475 -428990 -215387 -133276 -119730 -140428 -283404 -462964
78837 -462964 -418541 -190165 -155225 -377777 -420455 -89034 167825 -18690 -329079 -324858 -158397
78825 -204863 -388969 -410303 -306092 -282259 -287269 -228354 -294744 -588842 -765792 -540497 -225531
78813 -241814 -423074 -369034 -173014 -181144 -299607 -200320 -13305 -138341 -489001 -583706 -341391
78802 -341391 -171635 -272774 -406899 -408366 -399508 -433290 -370059 -188973 -57319 -45537 -78650
78791 -78650 -152874 -303171 -411006 -345361 -227311 -269208 -439234 -551380 -563464 -524917 -393606
78780 -393606 -178942 -78904 -193928 -314337 -266144 -206064 -276389 -287116 -104434 -14532 -261792
78769 -261792 -545549 -468774 -198943 -153406 -285434 -254433 -105124 -183829 -494716 -688458
78759 -688458 -620853 -449210 -271560 -114409 -139215 -402250 -565355 -323189 44409 47528
78749 47528 -248229 -368470 -215249 -145273 -320166 -503418 -501359 -368961 -200019 -80476
78738 -160249 -425614 -559937 -381435 -187206 -276225 -430691 -332817 -164537 -242279 -381072
78728 -381072 -251315 -72534 -254138 -587889 -541757 -182322 -48099 -227315 -319905 -235750
78718 -235750 -270658 -423649 -381759 -180515 -168915 -326420 -315907 -185518 -288337 -536024
78708 -536024 -502892 -256873 -271323 -497528 -401838 -4968 43844 -384962 -612813 -311112 -49334
78696 -280766 -607697 -549991 -323075 -313029 -389458 -287171 -166300 -271141 -442615 -429242
78686 -429242 -326345 -317445 -322272 -240432 -200906 -265521 -236913 -47120 22454 -206434 -479682
78675 -479682 -502507 -338435 -187172 -90469 -60869 -166474 -309307 -266635 -95815 -113899 -353359
78664 -353359 -479751 -380807 -337014 -437312 -375543 -72991 56899 -207360 -472161 -373703 -164651
78652 -220979 -385255 -292521 -36649 -11711 -269620 -467072 -371897 -110412 47366 -35222 -243675
78641 -243675 -306452 -118037 68297 -19298 -233929 -244349 -103404 -133215 -308387 -296097 -108064
78629 -104520 -283363 -228342 83204 120361 -294824 -609247 -425471 -125731 -180957 -417348
78619 -417348 -451439 -346729 -334484 -319033 -158694 -59020 -215159 -408084 -388690 -312387 -373170
78608 -373170 -380782 -153987 28577 -143531 -452794 -507732 -369425 -343432 -410235 -349677 -209504
78597 -209504 -180008 -194846 -95017 -898 -97858 -241257 -195711 -83088 -168185 -369997 -415085
78586 -415085 -327102 -333422 -407561 -336435 -165910 -165633 -369626 -505111 -391938 -146256 11092
78574 -42790 -270467 -468880 -432671 -234173 -163912 -293727 -365773 -252041 -187221 -332177
78564 -332177 -461322 -364859 -220553 -243779 -296315 -199200 -119981 -256506 -421473 -353666 -184525
78553 -184525 -176926 -245078 -167109 -44463 -97752 -213415 -156688 -45492 -134882 -305289 -269379
78542 -269379 -138004 -238853 -470903 -412897 -60669 109685 -113863 -393520 -433190 -382704
78532 -382704 -453880 -531695 -419674 -190814 -52421 -45655 -74140 -102295 -163728 -244373 -276227
78521 -276227 -233760 -186807 -238729 -387051 -474146 -371938 -192221 -152517 -242404 -250878 -144539
78510 -144539 -124524 -237994 -279338 -207097 -266286 -488842 -501773 -149052 117731 -104378
78499 -496554 -514404 -249854 -203963 -409908 -438147 -203776 -111968 -331966 -520106 -425996
78489 -425996 -262452 -260600 -297968 -222394 -178719 -324355 -490753 -417545 -150375 38788 11106
78477 -153814 -336097 -461142 -461300 -305803 -73929 82602 65374 -95155 -268804 -329882 -264461
78466 -264461 -173565 -153761 -200119 -242428 -229922 -158521 -70137 -42725 -115272 -214823 -237011
78455 -237011 -190415 -158333 -143784 -96383 -65897 -143164 -261182 -269737 -204383 -234469 -337430
78444 -337430 -313084 -153528 -76271 -130783 -131441 -73118 -203449 -520575 -634168 -374975 -124181
78432 -220810 -435922 -413202 -269034 -308210 -441495 -377563 -180712 -143834 -252454 -252517 -150110
78421 -150110 -176293 -312093 -304846 -149071 -117949 -277607 -368762 -253839 -132391 -194170 -339105
78410 -339105 -373121 -281094 -193356 -206376 -296323 -341263 -249744 -119085 -157018 -366043 -480024
78399 -480024 -347992 -172059 -171309 -229745 -134225 36820 62436 -42724 -109868 -142472 -244291
78388 -244291 -332373 -248067 -79932 -65344 -217889 -329539 -297634 -205523 -143488 -171400 -354872
78377 -354872 -611704 -663485 -393995 -96815 -86943 -244257 -261381 -154112 -145377 -209947 -165387
78366 -165387 -94090 -218376 -429157 -403567 -161007 -42259 -140706 -221280 -223830 -348378 -554460
78355 -554460 -484512 -72080 224477 49432 -348381 -508196 -365714 -197999 -171065 -204971
78345 -204971 -178590 -78863 3888 -44742 -217428 -329306 -242743 -100326 -129550 -267327 -256520
78334 -256520 -100325 -84907 -288913 -416481 -262714 -38857 -34471 -201506 -298985 -269039 -238410
78323 -238410 -261150 -273188 -253457 -265885 -348253 -455621 -509447 -461488 -335194 -219517 -182809
78312 -182809 -197888 -198822 -178889 -164066 -139882 -98710 -102839 -181689 -223152 -115102 43472 39843
78300 39843 -149667 -319065 -320406 -241806 -237430 -295110 -271014 -121458 -9916 -117433 -358107
78289 -358107 -410032 -134883 159915 95111 -226828 -352206 -153371 5307 -120297 -284175
78279 -284175 -214672 -71463 -121639 -269860 -277156 -204062 -252344 -356670 -320186 -206126 -216022
78268 -216022 -304380 -285948 -211040 -258194 -356071 -297358 -144768 -134399 -245126 -260624 -200165
78257 -200165 -269062 -410899 -346435 -79278 61521 -58988 -219417 -271777 -339401 -480737 -531368
78246 -531368 -421927 -318534 -298351 -198194 47421 204004 71607 -197351 -308059 -200853
78236 -200853 -65190 -79669 -242837 -399871 -405136 -304482 -292574 -408220 -421114 -189472 50910
78224 15522 -178697 -223197 -136254 -172401 -304576 -254055 -32323 18915 -189781 -322751 -178435
78213 -178435 -13426 -104130 -332254 -440001 -417020 -395977 -382874 -316896 -239247 -215794 -211966
78202 -211966 -178861 -151388 -164771 -186364 -197628 -229701 -275931 -284816 -256738 -234382 -216586 -201747
78190 -201747 -249843 -349594 -331186 -117991 55275 -61378 -330198 -421720 -309804 -222077 -186960
78179 -186960 -41903 143865 103285 -139795 -259057 -176649 -180701 -375883 -469628 -294076 -119348
78167 -200261 -371728 -364164 -219358 -127695 -111541 -120484 -205144 -356515 -392220 -236414 -107184
78155 -196013 -357202 -350342 -208334 -118056 -93554 -26494 53879 24463 -95322 -171338 -178913
78144 -178913 -210055 -278846 -286217 -185826 -59848 -8184 -44016 -120927 -209807 -309601 -386940 -356172
78132 -356172 -189342 -24482 -37241 -181912 -226075 -106790 -42792 -166965 -287227 -220134
78122 -220134 -124767 -217864 -360771 -278186 -40663 44296 -74949 -182689 -204103 -248178 -295043
78111 -295043 -223507 -120862 -186975 -353325 -376687 -278384 -281900 -342859 -196649 112548 226099
78100 226099 55012 -98381 -86515 -108893 -244836 -280682 -166427 -170532 -374970 -467752 -275179
78089 -275179 -76465 -127731 -265624 -257624 -181862 -180897 -181077 -133992 -201741 -414223 -471711 -204782
78076 72439 8398 -249060 -316927 -168927 -102357 -242296 -398511 -360721 -116131 173811 282949
78065 282949 108300 -166348 -244643 -108701 -24084 -108156 -177988 -114890 -57051 -90790 -79572
78054 -79572 21725 8235 -206768 -374442 -298116 -152759 -167859 -256054 -217803 -80870 17170
78042 71108 99072 3672 -231223 -411111 -412113 -381429 -451395 -480644 -308789 -59410 45368
78030 -5310 -89862 -164022 -210141 -163692 -57134 -44816 -144811 -178764 -98020 -102153 -277979 -405394
78018 -405394 -306960 -117280 -22146 -8023 -43819 -202067 -407840 -398741 -155606 -34175 -223469
78007 -223469 -423773 -345454 -175201 -211366 -357386 -350755 -229784 -197573 -235192 -195909 -101309
77996 -101309 -46429 1266 55384 -7424 -181596 -229231 -93463 -81926 -337700 -495858 -249824
77985 -249824 93628 78507 -188473 -288217 -199203 -223181 -376230 -393239 -251230 -188565 -234311
77974 -234311 -165648 58956 205526 126424 -80116 -261208 -322697 -222716 -66641 -79952 -281359
77963 -281359 -381916 -234354 -107858 -223922 -340453 -186853 4852 -115245 -373419 -363273
77953 -363273 -165024 -177953 -374378 -352653 -92361 -27672 -306495 -548896 -469509 -244932
77943 -244932 -119247 -82695 -84999 -170969 -267091 -194723 -11130 12099 -154702 -229965 -108960
77931 -36463 -150678 -234205 -110479 56346 80090 63736 140581 169497 -19288 -263572 -265271
77920 -265271 -55281 28576 -169922 -401364 -362565 -109863 31255 -85168 -243951 -196174 -12075
77908 50190 -75136 -225582 -296824 -312409 -233945 -4712 195596 83003 -261920 -414739 -223381
77897 -223381 -32048 -122210 -321489 -389701 -395734 -438561 -387884 -213896 -182860 -382601 -459183
77886 -459183 -207414 9850 -118746 -268320 -63473 187971 13034 -343738 -314130 -10066 -11553
77875 -11553 -313631 -349548 -34260 82304 -193098 -376255 -189833 -16326 -169601 -377297
77865 -377297 -341575 -246880 -332063 -434429 -337216 -179330 -172136 -238340 -231882 -212983 -244009
77854 -244009 -212465 -97191 -105673 -308965 -446902 -344517 -218396 -294928 -408855 -295166
77844 -295166 -53555 9462 -140455 -247013 -157535 2079 30646 -119072 -307537 -345001 -199905
77833 -199905 -65720 -127371 -302653 -371477 -315172 -311061 -405007 -435363 -315299 -163214 -101171
77822 -101171 -118332 -169909 -232906 -251483 -195003 -145874 -161032 -127582 31316 124534 -51063
77810 -331435 -394132 -258081 -206133 -279051 -262977 -154258 -186566 -356906 -370790 -151088 16233
77798 -39617 -142274 -138699 -123064 -154452 -114387 7354 25502 -102587 -179143 -128014 -117374 -202869
77786 -202869 -201595 -55308 32765 -36993 -106532 -98664 -141209 -222363 -124291 135911 217338 9700
77773 -144056 -20252 110132 -30343 -259703 -297691 -238930 -296615 -375559 -284588 -132570 -140714
77762 -140714 -253122 -272850 -211174 -185793 -140864 18093 157128 83536 -133023 -269155 -261476
77751 -261476 -188902 -87643 -6819 -85649 -338732 -523634 -456690 -292578 -250357 -252512 -120167
77739 49931 33119 -120963 -168010 -78229 -46830 -133016 -193194 -173933 -188623 -264524 -261961 -119723
77726 9865 -42001 -250214 -440645 -463012 -298095 -67603 56064 12880 -78864 -73263 10815
77714 14580 -149324 -368340 -441073 -309705 -147064 -156076 -296708 -332759 -185063 -63014 -129556
77703 -129556 -231571 -168374 -47235 -87982 -214728 -186189 -46334 -60645 -228065 -263308 -106174
77691 -38106 -185407 -299765 -198709 -69794 -127568 -265518 -273740 -166618 -85315 -63512 -63893
77680 -63893 -87852 -121956 -123421 -124196 -177739 -193278 -58665 80897 -23877 -281339 -331663 -120506
77667 -1144 -157545 -341711 -346312 -321841 -407969 -445964 -318479 -220321 -313839 -429856 -380378
77656 -380378 -272769 -253389 -228494 -98049 10488 -14496 -65420 -67129 -125520 -225092 -142086
77645 -142086 108326 146621 -158064 -377243 -187784 74201 -37212 -356943 -438309 -285341
77635 -285341 -221751 -275097 -232244 -127918 -155034 -225156 -117541 47536 -29013 -281808 -373818
77624 -373818 -257030 -174797 -170198 -72009 60235 -33611 -310387 -408288 -207897 2474 11444
77613 11444 -44112 -6201 41288 -21260 -135878 -184277 -138467 -35360 46599 -6671 -201026 -348975
77601 -348975 -306422 -203886 -234372 -328113 -291570 -156464 -103449 -133630 -118726 -98402 -212247
77590 -212247 -391613 -428965 -315284 -222633 -204674 -194764 -222305 -329983 -367215 -194216 2332
77578 -44935 -217197 -189591 -2705 -1188 -222623 -330370 -207149 -133232 -250203 -306977 -134334
77566 32249 -51708 -245473 -279124 -157803 -76645 -114238 -200289 -249454 -201779 -64505 20002
77554 -86706 -275652 -291210 -112038 3094 -97336 -270357 -345443 -329793 -269844 -158153 -65305
77542 -116463 -245488 -222454 -20373 103454 -3708 -181468 -247335 -225008 -160115 706 189773
77531 189773 170087 -99529 -326039 -314217 -251948 -324037 -345509 -110391 152459 79570 -233576
77519 -366555 -224680 -125556 -228623 -303201 -178824 -54824 -155550 -348167 -346732 -131788
77508 58905 64106 -63739 -191302 -212729 -76828 139248 224181 61189 -163142 -157455 64015
77496 173187 -9105 -250227 -242361 -31292 88108 1591 -120807 -122244 -53367 -35869 -87697 -139574
77484 -139574 -131089 -61065 -549 -33199 -127449 -148748 -81921 -102803 -280195 -380983 -216233
77473 -216233 -14801 -109503 -368249 -361239 -56468 126146 5186 -116978 -40620 2618 -155658
77461 -270771 -143359 -3521 -80764 -180474 -83905 -856 -171547 -347879 -182902 127118 135270
77450 135270 -117280 -215979 -92888 -56471 -161207 -124047 100510 200027 55539 -63372 10367
77438 69817 -87547 -346242 -481914 -419501 -199712 67940 191775 86706 -47983 -7497 54610
77426 -108373 -322200 -209007 133592 207157 -93833 -317807 -205654 -48431 -97362 -155685
77416 -155685 -36586 64654 -15522 -67184 64374 122634 -89700 -265222 -69533 255267 258422
77405 258422 6472 -77081 67326 109339 -43952 -117550 -3480 43523 -131627 -313102 -276409
77394 -276409 -124163 -75953 -145966 -209342 -226212 -231395 -212353 -144581 -78819 -77900 -118329 -144650
77382 -144650 -167757 -215580 -233342 -148787 -23321 -8690 -117857 -169360 -52985 65955 -29874
77370 -254020 -307165 -127887 1455 -109763 -270422 -223721 -31294 89614 130530 216612 302160
77359 302160 247068 114312 81004 105092 -464 -190025 -220695 -73722 7476 -54388 -59058 68913
77346 122985 -6035 -131084 -115388 -97682 -181218 -211499 -89497 -6926 -107442 -195763 -87156
77334 15834 -142656 -374272 -300712 18862 152265 -41576 -236939 -190730 -75792 -113539 -200114
77323 -200114 -130693 19213 -3219 -235724 -433646 -391606 -181344 -34600 -75791 -214583 -270528
77312 -270528 -171440 -21091 26206 -64205 -190009 -248875 -238726 -206558 -158147 -81882 -37363
77300 -127555 -341166 -493514 -411654 -154808 42954 53767 -17990 -19311 44544 57504 -22733
77288 -110434 -99296 18318 122115 61686 -157803 -316653 -221738 13795 97048 -34739 -146562
77277 -146562 -98012 -45704 -127141 -202533 -114062 20023 10929 -85481 -110090 -90299 -127354 -155374
77265 -155374 -90887 -63636 -198689 -331615 -272671 -181992 -290719 -415628 -229682 96439
77254 78073 -272518 -407730 -113258 169031 87030 -106469 -83380 8408 -91375 -235718 -144628
77243 -144628 80761 134878 3663 -93351 -109535 -172336 -282197 -318500 -272641 -219384 -135502
77232 -135502 23173 151884 123733 1781 -73408 -108677 -176745 -224249 -172217 -105891 -152151
77221 -152151 -255741 -274611 -206245 -134396 -64311 -4947 -78408 -317022 -485506 -372351 -143437
77209 -107885 -224259 -181715 62262 193469 42353 -165691 -179843 -59747 6076 -18169 -77567
77198 -77567 -172016 -266915 -222899 1056 201522 172111 -9573 -123156 -143562 -213012 -317200
77187 -317200 -252686 22292 237880 155188 -103511 -236823 -164809 -56265 -22257 -1360 44868
77175 33609 -71819 -161598 -138231 -53531 -10077 -37462 -125646 -254107 -331830 -259556 -115934
77163 -103962 -235222 -284719 -170040 -113250 -247142 -343785 -200462 -26367 -95439 -243369
77153 -243369 -137193 114216 102724 -192223 -357914 -214408 -44605 -63008 -110239 -38050
77142 12184 -75833 -149394 -79676 -3446 -59811 -147353 -139982 -98387 -83824 -7397 153220 230324
77130 230324 140377 38498 23546 -43784 -224533 -282908 -45544 260078 310811 135317 -25293
77118 -124064 -268434 -408246 -384837 -235231 -168720 -250817 -328833 -270209 -103372 73116 183819
77107 183819 184333 77290 -79328 -215122 -265200 -171376 21693 106043 -70349 -334319 -362577
77096 -362577 -134985 49641 37496 -11410 13835 -6981 -112483 -117846 30668 98925 -24459
77084 -99580 35547 146116 3197 -216783 -263043 -235104 -311941 -345249 -139603 101651 57347
77073 57347 -168714 -236858 -155770 -208437 -388489 -391986 -159509 16523 -31262 -142212 -159509
77062 -159509 -133915 -135330 -142559 -163429 -223957 -242151 -150052 -91190 -225772 -406253 -360354
77051 -360354 -141450 -49914 -138212 -169782 -76085 -59703 -182835 -241513 -158747 -138688 -283654
77040 -283654 -391639 -307183 -171635 -136159 -106872 8876 54799 -121869 -359167 -385540 -218146
77029 -218146 -113734 -186455 -289780 -266349 -146067 -68952 -112224 -223470 -284083 -232606 -127446
77018 -127446 -61510 -35835 11673 64373 19468 -146863 -300072 -293248 -141373 1484 14801
77007 14801 -74292 -146350 -135596 -86204 -46319 26919 162624 229407 62500 -251097 -409074
76996 -409074 -286406 -101826 -85780 -175000 -189048 -129166 -101203 -80836 22256 151972 162626
76985 162626 39571 -95477 -145552 -86347 51784 137415 14747 -238531 -308021 -76177 136875
76973 3103 -327323 -457604 -309399 -132966 -64903 -24247 8827 -40803 -107598 -38175 107171
76961 105408 -56133 -147995 -73223 5459 -39068 -132725 -176809 -153907 -32112 193046 348417
76950 348417 241498 -11395 -100050 7196 21322 -173619 -326353 -248895 -112795 -119030 -157095
76939 -157095 -43215 115515 73830 -152756 -294996 -197359 11873 116911 53981 -58111 -62370
76928 -62370 64122 170958 98653 -129276 -335816 -388304 -292036 -127453 922 -8129 -150244
76917 -150244 -267150 -222366 -86122 -15240 -11658 28959 83232 23646 -139059 -243452 -216810
76906 -216810 -139778 -67972 20775 95206 81567 19018 16090 49411 5498 -81915 -67487 19170
76893 -22189 -217595 -333784 -234402 -88900 -97657 -203071 -219923 -111188 1858 15232 -64088
76881 -141663 -126066 -56837 -95233 -276933 -371431 -184490 96546 139587 -10806 -1913 225879
76869 312526 80335 -135579 -6960 256534 219374 -138746 -426113 -391696 -186458 -85909 -167882
76858 -167882 -296486 -302142 -156422 -12103 -32790 -171322 -221527 -114420 -10774 -36545 -99169
76847 -99169 -77965 -34204 -80332 -169003 -180051 -125569 -102300 -104328 -47327 53094 80334 -4186
76834 -105535 -141328 -147599 -197540 -273421 -273950 -142610 49493 176318 192154 141724 48215 -108212
76821 -273971 -317155 -220916 -146051 -180620 -174950 -738 175117 125733 -37574 -14605 179311 209285
76809 209285 -32032 -225865 -119278 90467 80351 -117190 -210873 -94673 48690 39360 -98456
76797 -228635 -268029 -239878 -223714 -255271 -268806 -183709 -43994 16712 -34557 -76827 -9714 115963
76784 193042 198544 180130 165827 145352 107589 60923 28357 19102 -6564 -100945 -225025 -247394
76772 -247394 -106702 91581 203636 191093 73574 -139452 -363563 -418045 -240823 -20147
76761 39368 -24951 -63246 -68883 -112025 -142669 -82781 -12324 -37692 -77438 -15986 41248 -65299
76748 -232017 -241536 -145632 -172784 -305390 -292491 -78564 108912 121938 42043 -51769 -174703
76737 -174703 -273238 -245575 -142582 -99773 -95606 -38208 -17601 -154281 -283206 -167183 46943
76725 16940 -197370 -213421 -5128 34649 -203193 -326674 -105321 156514 141025 -36855 -146454
76714 -146454 -191968 -208008 -101066 70361 48966 -161497 -202350 33475 147615 -112914 -398661
76703 -398661 -319516 -57458 -3065 -127742 -156071 -81712 -79477 -125788 -99301 -61924 -92952 -58580
76691 -58580 119599 205814 11410 -225374 -188966 15965 92117 40303 24647 -20477 -210168
76680 -210168 -337120 -147706 162903 201032 -347 -81402 10590 -13814 -210017 -281651 -101503
76668 82010 67341 -31231 -58097 -60720 -130447 -222835 -244992 -174555 -50489 39444 -4475 -145005
76656 -145005 -180607 -12166 182966 208698 126395 76924 13828 -134594 -224046 -113488 40586
76644 28555 -35126 69003 221740 140961 -110078 -218706 -163567 -214017 -397603 -422311 -200770
76632 -34644 -143965 -359091 -429855 -355510 -260813 -177435 -86459 -8726 40244 61839 23861
76620 -75690 -140322 -120723 -131127 -230209 -231880 -1105 215873 106520 -179981 -223585 14545
76608 167143 71453 -54852 -86000 -160638 -278967 -200985 79434 202858 9525 -175545 -83773
76596 60319 -39790 -241379 -244172 -109179 -96092 -180777 -145261 -25141 -57573 -227742 -256481
76585 -256481 -70370 66589 -17115 -145177 -118626 -46035 -138234 -337433 -394643 -254322 -126608
76573 -154277 -218849 -175371 -106481 -173691 -321704 -339291 -183101 -29700 13686 38807 114625
76562 114625 144632 56859 -44704 -52371 -23047 -38955 -49961 2112 46312 15135 -29787 -40592
76550 -40592 -80317 -132931 -34836 207664 277934 591 -299923 -242253 6674 -7845 -288951 -389215
76538 -389215 -134285 136035 139940 28796 22586 46366 -40994 -143432 -103042 14639 32831
76527 32831 -69420 -179820 -240727 -267859 -257059 -188467 -77735 38128 118470 112421 15358 -72909
76514 -49377 40627 63860 -7414 -83930 -110934 -93570 -11367 128849 191425 52160 -178033
76502 -266878 -190344 -137779 -180163 -168231 -20871 106608 55870 -93641 -141006 -26738 114955
76490 118932 -41754 -224337 -261064 -154335 -63110 -64474 -55615 30899 78778 -9915 -129164
76479 -129164 -153922 -142061 -160823 -106248 63724 125334 -72939 -264853 -133539 139251 125640
76468 125640 -156704 -285229 -124772 21207 -16826 -50917 16692 3908 -138375 -172234 -20329
76456 52886 -82967 -177467 -70157 -2584 -159950 -274803 -54149 294505 357546 127865 -53394
76444 -26700 58350 55282 -36968 -182460 -315768 -308472 -138154 -4529 -74529 -212778 -180882
76433 -180882 -6260 81136 5366 -99862 -145639 -166403 -163104 -88970 -2878 -35938 -168548 -217019
76421 -217019 -100359 29551 3406 -138420 -234601 -238904 -243078 -284324 -264655 -122310 19944
76409 675 -135272 -189386 -98452 5156 44134 90568 137702 33740 -205723 -285006 -58861 174595
76396 108146 -80812 -40799 150601 145937 -39962 -67405 93026 91884 -171525 -363028 -287673
76385 -287673 -173552 -204246 -219481 -103870 -51532 -182482 -279349 -185890 -106468 -206691 -264472
76374 -264472 -67450 152069 70857 -181483 -239869 -87199 -12682 -94647 -117940 19073 152514
76363 152514 139203 42261 -16324 -19102 -35619 -130765 -274189 -311566 -128213 133414 194481
76352 194481 29495 -89373 -23881 24275 -111151 -259180 -205392 -48019 -11421 -96282 -154674
76341 -154674 -145366 -101711 -20678 27039 -107226 -346977 -351771 -31062 201802 18666 -274481
76329 -200139 122083 176586 -115874 -305944 -141789 115825 177047 79242 -56672 -230653
76319 -230653 -368587 -269775 55169 269158 135193 -151178 -245348 -102962 39874 21047
76309 21047 -87798 -131892 -62917 24640 9264 -103066 -172613 -116483 -34516 -52674 -124321 -132782
76297 -132782 -122130 -230393 -412678 -444372 -246166 -20258 25906 -50158 -46178 81823 164900
76286 164900 62913 -134292 -209118 -97050 23720 -23096 -165569 -207161 -131539 -92004 -113648
76275 -113648 -49045 114184 161199 -7713 -183522 -169054 -71023 -65389 -81951 21482 144984
76264 144984 98560 -51583 -84648 5607 33138 -40629 -79811 -66635 -131895 -271899 -305065
76253 -305065 -169141 -28903 -15209 -57672 -55095 -35164 -54627 -81516 -67113 -37128 -41599 -80288
76241 -80288 -116552 -117713 -76487 -31426 -37162 -77239 -74025 -32377 -63907 -188622 -249727 -152484
76229 -152484 -47385 -104611 -230703 -213666 -54250 66095 79549 73761 84550 59447 2676 -29914
76216 -44628 -50670 34521 224517 312018 130114 -124280 -127414 70118 119116 -64394 -186215
76205 -186215 -85693 17709 -70910 -214549 -235296 -211433 -253865 -249793 -97003 25765 -73937
76193 -228064 -134764 131394 186480 -83233 -340243 -284250 -40317 95494 74378 47469 48562
76182 48562 -23888 -155134 -188890 -88097 -10543 -43692 -58410 40907 99642 -51604 -274457
76171 -274457 -291079 -114752 -30600 -137202 -202455 -66854 86226 27709 -171308 -290847 -292573
76160 -292573 -286592 -287783 -222266 -112736 -67914 -115075 -182144 -213132 -195424 -128124 -57967 -72636
76148 -72636 -171308 -237112 -218915 -208245 -239927 -188858 -9499 104862 2111 -148834 -93609 115758
76135 214287 118319 -24687 -113746 -171496 -185645 -112941 -21429 -18094 -63075 -50042 -14490 -51320
76123 -51320 -97979 -42461 22494 -71043 -235719 -233467 -83789 -34052 -112459 -77042 112593
76111 148537 -133405 -443361 -445914 -220265 -66873 -62531 -72142 -51277 -59881 -57124 56559 215699
76099 215699 231688 70422 -98404 -155212 -161398 -187465 -178877 -95595 -51126 -159386 -314996
76088 -314996 -304478 -128065 -19205 -84777 -123923 51197 287275 306421 135356 40993 88769
76077 88769 80994 -42306 -76990 67159 182470 120708 37389 75232 88427 -62544 -200582
76066 -200582 -118847 40464 26033 -85035 -48639 87725 74600 -73046 -94530 48653 102092
76055 102092 -45501 -195424 -181254 -83703 -18903 30030 80508 71404 -197 -49179 -65488 -131475
76043 -131475 -240763 -277142 -206127 -122164 -87770 -82472 -104891 -162336 -183488 -114361 -58866
76032 -58866 -133994 -241569 -200709 -49905 24065 6300 38781 125826 139119 97059 142954 243120
76020 243120 208763 41587 -44952 9212 25172 -73998 -130481 -46138 57650 66636 23042 -25506
76007 -99971 -159115 -120884 -47327 -73659 -145942 -94976 33137 30328 -82754 -71583 66380 53984
75995 53984 -172833 -308546 -159870 71707 154085 133370 101903 -10030 -204885 -281968 -144556
75984 -144556 22020 63046 72773 130213 118334 1334 -25822 114377 186083 31634 -137162
75972 -100128 5359 -35525 -136460 -118090 -58668 -123182 -243380 -265541 -230242 -228776 -181934
75961 -181934 -40579 11881 -139081 -257719 -115614 81246 2211 -248655 -294878 -86382 83506
75949 88260 78289 99670 8577 -185407 -246730 -76589 133280 197365 156665 128613 130699 120399
75937 120399 73254 -1106 -24009 107708 320635 337410 41782 -268405 -246676 5476 108128
75926 108128 -25703 -138591 -109497 -103013 -192576 -204302 -59883 42760 -42878 -164902 -136234
75915 -136234 -27696 1745 -3593 104496 287644 344344 200538 7977 -70840 -54274 -59047 -98409
75903 -98409 -63808 76110 160132 29612 -209518 -288716 -157514 -63168 -166377 -292668 -231881
75892 -231881 -87927 -87229 -182067 -141299 28401 65827 -119310 -291041 -242313 -67333 43481
75880 90568 189765 324469 334150 131541 -160039 -306167 -190779 52359 175042 104471 18789
75868 72030 159530 95907 -71104 -129808 -49778 -23351 -125822 -167961 -11571 149968 21767
75856 -358001 -613924 -492465 -172100 -13148 -88861 -133569 31754 221141 175728 -20478 -74480
75845 -74480 23674 -32463 -337265 -543173 -357247 6865 151248 62545 27252 111359 103504
75834 103504 -48216 -120795 -19073 31316 -152385 -404322 -455028 -301337 -136140 -37308 62773
75822 157698 127462 -55189 -235875 -270272 -204251 -165004 -134847 21915 290093 426642 275617
75811 275617 35251 9248 157047 157431 -62815 -177125 25856 273912 211352 -60130 -164968
75800 -164968 -35658 52356 -22437 -70705 19882 87309 14643 -47497 39454 135921 58078
75788 -95057 -93790 45129 86770 -42531 -142357 -53957 107378 143373 59649 16145 58505 63554
75776 63554 -33307 -104921 -15096 158873 211210 83683 -69287 -105641 -69897 -86300 -163134
75765 -163134 -188763 -95566 38935 70455 -45639 -182199 -170326 -12302 104297 54027 -56187
75753 -63884 -920 -3904 -47899 10651 142623 144402 -27726 -162185 -119773 -26768 -17952 -11897
75741 -11897 84959 146982 21252 -183823 -228464 -86675 38528 7867 -111401 -178685 -132973
75730 -132973 -27183 14494 -84180 -230038 -248041 -133995 -81373 -181785 -264108 -152155 73989
75718 217767 224745 152937 29290 -99965 -115933 -2577 54786 -72613 -235688 -237265 -139710 -120691
75706 -120691 -160313 -130878 -83600 -153882 -252689 -161590 80512 185975 48665 -105587 -73469
75695 -73469 51323 65638 -47897 -127209 -45335 148614 265626 161211 -80235 -215821 -156744
75684 -156744 -83583 -141786 -190042 -48609 149767 130561 -76321 -158194 7547 178669 118460
75673 118460 -80223 -156522 -30381 125428 118551 -21462 -68369 96105 263764 149294 -163636
75661 -292225 -128065 569 -98510 -140915 94486 272509 14620 -392094 -372018 24533 204839
75650 204839 -19791 -210643 -96437 33464 -73528 -203933 -132180 -31327 -98540 -161119 -11905
75638 177303 141159 -23865 -44065 71295 89070 -47710 -172229 -169980 -69150 70353 166105
75627 166105 103786 -100134 -225595 -117627 70041 77012 -111593 -291834 -333294 -263951 -134609
75616 -134609 14584 89552 13967 -139985 -219059 -180198 -115507 -102069 -116887 -97750 -26707
75604 48060 53896 -20643 -88899 -69380 -9962 -25846 -125884 -201982 -186412 -112955 -29196 37904
75591 42235 -31817 -97050 -67466 -1033 -1195 -36499 -28979 -43213 -166213 -274345 -190733 -19612
75578 -13004 -137824 -130420 18580 35419 -128619 -193929 -74419 -48751 -217672 -251072 35905
75566 282585 130172 -192757 -255717 -102831 -79573 -198296 -170026 35945 131031 -6987 -178085
75555 -178085 -212246 -156754 -89965 -23140 -2110 -70626 -140371 -107176 -49163 -93068 -161079 -97960
75543 -97960 29062 30932 -70165 -98480 -61207 -117840 -242192 -236318 -86910 6654 -14141 4185
75530 99540 104897 -37902 -164532 -178731 -184240 -231235 -200753 -57920 32375 -29467 -127224 -161032
75518 -161032 -195059 -247967 -181543 41621 213180 167408 17640 -62495 -93563 -145748 -141996
75507 -141996 -18530 91623 56211 -29706 -32960 -35421 -149042 -233183 -95440 134968 161976
75496 161976 -3162 -60403 84824 188850 101676 6045 81154 200486 158816 -81 -88385 -68722
75484 -68722 -46968 -58912 -41200 28914 98168 112279 47686 -67198 -104481 65336 333624
75473 333624 372556 59203 -271210 -231005 73232 196261 12717 -126937 32392 266890 254355
75462 254355 68791 20406 162111 254763 171785 59317 56377 82742 7187 -122397 -143865
75451 -143865 -12346 135932 146596 17977 -107479 -104753 5670 106740 135746 132783 142840
75440 142840 142901 93437 278 -104845 -187712 -196596 -98692 44362 121455 115297 100844 83795 -16687
75426 -178534 -242093 -156416 -84737 -137817 -185195 -104606 -36604 -153638 -322371 -284095 -85397
75414 -18377 -152504 -235686 -106383 77032 113958 39211 4923 52240 105297 77721 -67272
75402 -256182 -308505 -143219 50775 45032 -67052 -3576 216385 250061 -16820 -243161 -142565
75391 -142565 90439 120660 -17367 -61528 10152 5459 -79564 -39294 153150 251855 114248
75379 -80157 -107175 1091 78591 101888 162684 235088 168093 -60612 -241415 -184480 16812 105090
75367 105090 3255 -112244 -95142 -17445 4565 13584 100139 202761 184404 41258 -110357
75355 -191502 -175306 -43853 113342 85467 -165382 -331906 -159998 105000 31679 -307344
75344 -396526 -63629 258946 208546 -11896 -55621 40524 65601 48563 102042 104074 -81479
75332 -255792 -151301 86328 89728 -129062 -187207 51324 271452 214937 36090 -16268 12068
75320 -72776 -261357 -357782 -262604 -68116 89358 149117 121851 61659 35638 58423 65797 -961
75307 -102560 -144884 -104972 -55326 -51842 -58381 -22089 30573 42275 28217 32333 7177 -121826
75294 -265163 -222592 7798 168169 103784 -18278 -21259 -23809 -175195 -292587 -119758 183835
75282 224637 -745 -93747 105028 296993 246620 99999 25858 -58433 -192425 -185057 15112
75270 103842 -120263 -375930 -308837 -33915 80126 -29002 -127901 -113559 -81261 -59534 5685
75258 62252 22948 -32487 22898 108802 53519 -96337 -135591 -33953 30391 -37966 -132247 -121861
75246 -121861 1185 143067 174060 38118 -119554 -61636 201864 358681 219709 -6876 -55743
75235 -55743 5647 -18522 -67533 37228 219645 254372 151793 111658 155261 121288 -5158 -62410
75223 -62410 -6601 32371 -7657 -57432 -84487 -113891 -111771 -47738 -14458 -81956 -121653 -1403
75210 151588 141787 48258 80924 190954 152565 -30914 -139904 -115895 -87298 -52568 99198
75198 256007 157332 -144938 -269048 -49516 227173 257357 103063 4613 50840 164416 227321
75187 227321 136602 -96782 -275562 -225741 -63464 -28214 -88681 -8059 206249 260039 43541
75175 -178643 -160355 18495 148945 155486 66331 -55553 -83407 51401 176968 67895 -176310
75163 -237524 -81318 -3037 -111586 -150829 33964 223563 202461 76292 10914 -35126 -100891
75152 -100891 -41874 194495 367468 272854 63971 5496 95203 152878 112352 18549 -103888
75140 -196311 -148695 -221 30677 -124097 -236727 -140596 4556 10505 -25911 36235 63182 -116127
75127 -333055 -283141 -2141 189841 167377 115760 171119 219712 113708 -105488 -265894 -243359
75116 -243359 -66949 88857 58082 -110040 -179748 -33493 164928 204655 100126 11403 8138
75105 8138 42722 63945 41448 -37961 -113809 -96379 -28604 -56350 -171888 -178193 -6763 141340
75092 105064 -4189 -40028 -63438 -148717 -173873 -52152 30642 -102742 -270149 -179317 88095
75080 177359 -6628 -192383 -175231 -64394 -35347 -71895 -54373 43341 129589 99107 -60447
75068 -230185 -269109 -191270 -137381 -136042 -57571 117031 189544 50478 -114790 -109762 -13987
75056 26763 82149 237785 315082 124216 -151675 -187223 -29706 -7194 -178818 -269062 -154003
75045 -154003 -27733 -21727 -12981 83745 143202 74261 -25244 -74600 -134061 -218187 -214998 -97843
75032 -4050 -5744 -12061 17974 -4473 -73342 -33290 127536 184621 36045 -91429 5355 170368
75020 170368 145425 -17642 -74163 3224 16380 -99265 -169321 -62859 117500 188571 104448
75009 104448 -30974 -97074 -71504 -40046 -81273 -141599 -100153 24334 56407 -78000 -211429
74998 -211429 -169326 -23839 37123 -4089 -17973 28570 44811 5665 -20216 -31280 -98643 -191904
74986 -191904 -182875 -66776 311 -47978 -78282 5455 88465 47076 -24514 35063 180582 225093
74974 225093 118140 -18745 -93744 -109248 -59283 54110 123582 50784 -55000 -12654 97383
74962 8413 -269219 -373872 -132904 126773 53012 -201759 -240677 -28809 120036 64015 -25956
74950 -22642 6437 31549 126178 243078 216795 57468 -35260 -13136 -36699 -118653 -48161 196879
74937 313322 152242 1424 119719 289536 170847 -132038 -236034 -62972 119611 161460
74927 161460 172674 224374 232642 166457 103302 53447 -38049 -112012 -52231 81433 119620 82521
74915 82521 152767 330660 390258 237516 52520 -5400 10405 26498 89300 196474 216012
74904 216012 105738 6561 -10385 -70103 -218828 -256313 -47888 200860 227416 109815 113494
74893 113494 259127 329657 244957 143000 98538 30660 -79140 -121614 -70106 -39647 -70175
74882 -70175 -59225 9919 -11725 -171117 -266568 -133568 82914 129634 1847 -94737 -58091 25559
74869 60227 22720 -94294 -243196 -261029 -45575 222602 246965 19642 -160208 -114624 1814
74857 5624 -41788 -15988 22457 -39985 -141052 -150005 -90620 -62783 -44723 25000 64322 -28036
74844 -136965 -65964 124767 167395 -15669 -202455 -204400 -89876 -5957 28535 60971 90439
74833 90439 104354 115839 109737 56124 -3212 -4011 7052 -60232 -148314 -117350 -5258 3010 -99312
74819 -97878 78627 208670 126644 -16026 -10919 94702 141414 132981 150852 139483 7422 -158410
74806 -196271 -112570 -28244 37743 130616 180159 83014 -73317 -91720 34014 110052 50349
74794 -13535 19089 55796 -5268 -86499 -59201 36148 42634 -71486 -153366 -74072 97008 191082
74782 191082 159302 99643 74974 23403 -97612 -194451 -177714 -133613 -204581 -347601 -381716
74771 -381716 -262421 -131374 -78739 -37724 40054 79950 26932 -58244 -118363 -174941 -216441
74760 -216441 -158881 -1389 114106 85678 -23778 -111828 -159613 -168555 -114998 -36936 -25349 -65065
74748 -65065 -34152 80155 138957 93823 76004 149207 177191 64091 -68141 -91016 -79459 -146836
74736 -146836 -227114 -193680 -72267 18278 34573 -1057 -70390 -126985 -112785 -66623 -71943 -77231
74724 -77231 22431 118554 190 -230055 -225233 18940 84711 -165662 -291732 -4888 275965 65956
74711 -378566 -456743 -150179 52430 -10582 -38032 88823 127026 -6173 -64391 56288 129713
74700 129713 23580 -79107 -28172 60241 57456 20021 14547 869 -18262 32329 118712 115822
74688 115822 34791 -4366 -20597 -121128 -220895 -128134 86438 145780 20739 -25444 97811
74676 164799 50567 -64567 -36021 30205 42243 84936 169948 131960 -61565 -186582 -114868
74665 -114868 -11470 -14480 -1649 136725 264740 245644 171259 144725 78020 -81929 -165314
74654 -165314 -53048 78185 31530 -80708 -37030 128099 214748 181913 141741 141943 171932 269350
74642 269350 404785 387435 128081 -117526 -43903 237637 324779 103732 -103532 -43064
74631 103644 30767 -209270 -280937 -64228 169601 152435 -7530 -22302 121853 160277 -2677
74619 -124691 -19017 143524 128671 15172 12578 77863 27538 -90255 -80068 15927 -22609
74607 -175958 -194196 -40733 45400 -17121 -30023 81940 117201 -18484 -124067 -65092 488 -60296
74594 -118219 -57583 -1511 -56281 -100202 -34567 16045 -37568 -53273 60529 129898 17614 -117316
74581 -110282 -80188 -156197 -179944 1393 184809 112523 -71346 -42313 173499 270183 157656
74570 157656 11137 -98324 -243139 -345996 -228740 25879 113302 -34170 -143157 -30118 155196
74558 217976 185097 156611 119359 57600 63794 174040 227527 62879 -213771 -310194 -93038
74546 247760 403908 271465 37069 -51232 41435 137391 97784 -20311 -85965 -77209 -71407
74535 -71407 -116625 -185235 -217862 -164349 -22282 128239 177191 105265 4707 -38773 -28542 -10983
74522 -9702 -13099 21163 121447 211142 150529 -32170 -86960 99236 238596 21352 -353285
74510 -400420 -69037 192792 145755 64437 172433 244189 63625 -123929 -1329 274480 320156
74499 320156 116106 -37497 -12094 62057 100466 130101 123820 51156 14043 77688 80539 -114271
74486 -306014 -208550 85706 226314 120778 -7174 -32659 -53778 -99074 -54789 63318 75807
74475 75807 -43496 -92858 22035 130020 82129 -27633 -58723 -48472 -86887 -110526 5424 212648
74463 212648 300730 158163 -70691 -150942 -49936 30845 -39885 -110894 8694 196536 162694
74452 162694 -79505 -202203 -75691 49383 -2762 -58421 20172 42558 -122089 -206191 32478
74440 336564 325623 111133 66561 167263 79640 -188435 -264590 -43957 153684 125888 41938
74428 61827 104338 101689 118831 122950 -7009 -154299 -31838 306909 418613 102777 -283022
74416 -343861 -146133 28425 107761 145083 86402 -82377 -164418 -13759 191005 195167 47753
74404 -26580 -12550 -77576 -222461 -245889 -87028 29809 -105439 -380442 -475114 -251850 67503
74392 164800 16008 -95537 21465 205232 195906 18472 -77662 15246 165098 234565 216019
74381 216019 147142 74954 85739 196881 260017 157382 24759 54533 160721 120424 -25294
74369 -51625 11037 -83144 -292280 -256073 115556 435010 394554 155177 -19841 -141516 -255315
74358 -255315 -194432 99074 311141 176519 -76573 -69955 137883 198074 53996 -34237 24035
74346 40888 -65506 -133106 -67834 -3173 -58446 -160552 -190703 -137503 -44989 46358 74016 9374
74333 -43093 51015 234309 290376 137402 -48139 -59340 94976 232702 216825 81008 -27678
74321 -6077 100245 167681 160198 146417 143851 81724 -19193 6404 208904 363411 259963 35341
74308 -18443 101530 130301 -14492 -99972 28531 188173 140854 -64378 -202521 -183323 -80371
74296 39454 137141 127960 -29468 -202495 -208842 -62204 55726 60684 42145 63707 65612 19289
74283 5060 44485 15530 -142530 -284336 -268829 -185177 -190366 -236410 -174600 -43639 -6280 -51439
74271 -51439 -27475 54437 47381 -1801 102933 276421 162789 -264995 -515795 -258290 165351
74259 245774 21469 -121593 -116383 -194407 -340580 -283516 -12335 166980 137051 107354 179820
74248 179820 189863 87329 74771 211563 252586 73610 -81518 -2081 141123 97607 -62030
74236 -105181 -3503 98861 129284 98041 12312 -53179 34827 229569 266816 41295 -187793
74224 -172226 -40924 -43520 -130572 -90673 44132 57295 -70057 -146769 -106124 -71351 -96554 -95510
74212 -95510 -34255 29080 96105 206026 268956 145164 -99470 -237227 -199084 -133084 -113107
74201 -113107 -28970 153287 249569 117439 -104208 -168415 -34488 123244 160709 106141 76993
74190 76993 126821 184612 144513 24470 -22704 74706 159547 56839 -125437 -117518 86674 175852
74178 175852 -16020 -240990 -208193 -15422 38925 -67467 -89942 54093 174045 145796 68187
74166 5466 -134466 -326273 -315319 -50 307125 274612 29359 -61724 56814 144831 135962 184989
74154 184989 258476 113052 -224391 -368192 -138972 148906 176093 54035 26089 59152
74144 59152 29808 26613 137159 190153 53564 -57438 57898 166309 -25559 -304788 -262269
74133 -262269 3181 51570 -124848 -100471 207982 377136 196050 -21220 -12549 68986 69997
74122 69997 110705 212087 144428 -78590 -45937 374847 676575 436267 -12881 -97823 148978
74110 265829 126652 6138 34270 77392 87800 142418 179439 76545 -51503 10651 185096
74099 185096 189683 -3725 -134845 -75237 30878 59659 56284 68649 81319 122869 215903 248300
74087 248300 126514 2180 78613 245900 218159 11590 -54580 130265 294893 224271 69032
74075 71103 221583 352262 385279 340431 229309 75749 -43731 -67148 790 115646 187665
74064 187665 85669 -201865 -432857 -335253 15300 244308 157556 -33119 -55190 51108 61354
74053 61354 -65884 -142696 -41160 127187 169213 69836 8491 99571 197235 75106 -216810
74041 -349217 -142581 169958 248017 69413 -125271 -189448 -157365 -63451 83472 181083 116836
74030 116836 -37025 -110409 -93558 -100861 -114296 -13174 149968 179629 73364 42048 128764
74019 128764 106410 -123423 -322509 -287851 -168282 -178419 -220809 -78051 173855 258328 134568
74008 134568 39130 93700 148729 72609 -47591 -96446 -119393 -183330 -203195 -78620 87008
73996 82604 -116997 -299888 -272319 -55414 184259 295571 218690 15845 -132012 -67577 145769
73984 268302 183397 36680 -982 32370 23579 13782 99406 197406 138608 -39667 -120369 -28435
73971 85292 99006 53045 112 -72455 -129797 -96030 -13449 -140 -25196 52242 198326 219858
73959 219858 104756 51097 85991 -9330 -268894 -393906 -230848 -49908 -90322 -157452 7098
73947 241986 227902 18088 -79398 -1020 59352 29627 7152 6453 -31240 -53399 270 13887 -107330
73933 -190197 -49246 157864 172211 81094 133936 245873 136032 -117464 -148054 75236 176574
73922 176574 -9709 -204950 -179356 -62692 -23605 -15382 9574 -26408 -97262 -42908 104784 96946
73910 96946 -101996 -203075 -62120 87030 44424 -55651 -59908 -70768 -162182 -142747 106503
73898 330800 253623 15247 -53915 72208 158046 118240 80560 99228 76704 -31509 -132801
73887 -132801 -134887 -48851 41639 57315 10640 23974 163747 281756 196718 12164 -640 147294
73874 150693 -66940 -181848 -5909 162581 7600 -281065 -298839 -32709 177526 147218 -17979
73862 -199889 -361127 -411008 -266917 -36715 86935 83276 59377 24251 -70144 -134733 -37236
73850 148271 217300 131369 23770 -46844 -116803 -129323 16816 228366 274747 116032 -43898
73838 -59958 10973 93427 190080 248164 165480 8049 -11370 119896 127743 -122824 -336683
73827 -336683 -171992 228063 383923 128682 -184254 -196061 -9329 34613 -129652 -247079
73817 -247079 -155812 11537 87060 97802 116224 76802 -74769 -198555 -151024 -52829 -108866
73806 -108866 -230568 -143234 134001 252791 63777 -148432 -119129 7077 -30421 -173496 -183730
73795 -183730 -42579 74567 111003 141934 155594 87441 21341 96547 238012 230889 63609
73783 -46367 8505 95461 94829 58592 43246 -5023 -93834 -96319 49239 191550 157769 -4972 -111935
73770 -111935 -96835 -56492 -69901 -88708 -25964 110243 203548 147389 -21237 -130941 -65919
73759 -65919 74457 92296 -28034 -75260 88552 297913 287984 69487 -72339 28755 202457
73748 202457 215022 111424 106864 217437 231932 71612 -56464 24020 185909 211695 126237
73737 126237 104490 151186 116105 -13679 -81603 -27917 38571 62090 109938 174860 137981
73726 137981 9670 -17912 126347 246151 174213 23249 -21335 16907 21410 27310 124711 218339
73714 218339 125471 -115122 -245983 -127481 89370 174548 93741 10109 57391 164181 136835
73703 136835 -73953 -265509 -235793 -70993 -12443 -81118 -71184 68550 127645 2435 -107356
73691 -27243 121802 170485 171266 198185 124857 -116635 -277232 -124377 140344 155414 -47963
73679 -154304 -117149 -165016 -289674 -201894 126313 318919 155736 -104172 -155053 -65396
73668 -38968 -51465 7404 62806 3800 -71905 -25739 55345 19395 -50982 27174 196435 236532
73656 236532 133467 87094 156269 177955 83403 24405 85017 108729 -32927 -187455 -127000
73645 -127000 110336 273876 234361 96588 8692 12698 80152 158682 170020 80050 -16586
73633 3144 97522 99885 -27500 -133400 -121587 -84572 -100105 -69607 87373 225951 162555 -29362
73620 -120595 -59254 11079 22037 41253 76867 54071 -182 21311 75522 3300 -160714 -176602
73608 -176602 13219 151874 62117 -76258 -22797 164613 269134 235023 143528 25522 -93845
73596 -101369 44278 178232 150314 53486 35073 30714 -71121 -139095 29746 327623 430609
73585 430609 257145 54847 21765 98227 163331 196978 192406 114295 4848 -34033 577 22918
73573 22918 27446 73910 110999 19630 -147932 -181413 -15456 166959 190794 82709 -39266
73561 -107657 -89914 15107 121162 132497 91282 98021 103329 -19492 -201136 -223303 -74673
73549 5950 -78355 -121253 24420 185216 156659 36333 47315 189395 284722 254905 156605
73538 156605 41642 -38368 9186 169272 229274 40415 -213859 -234164 -40717 46039 -131777
73526 -351677 -327065 -72097 153732 173295 71045 65606 242959 436407 414040 178233 -32585
73514 -78243 -86490 -170280 -168431 88526 387838 347048 -1568 -200579 -30312 174421 68646 -163085
73501 -124983 159041 318609 232796 146115 189450 189572 61586 15479 169462 275894 105683
73489 -146607 -163692 -18061 -10322 -118068 -37095 236590 317358 50159 -184920 -25610 334931
73477 466011 323810 210861 240477 208832 1350 -191140 -160393 31710 175397 187362 145972
73466 145972 126737 110113 47971 -40206 -75203 -21561 61256 113954 170876 265262 295963
73455 295963 152392 -45544 -49920 134047 216898 70461 -69198 -12491 55009 -84060 -263508
73444 -263508 -208127 -27165 -26787 -156985 -102116 118004 128040 -153827 -328688 -151898 84481
73432 63004 -48925 59025 281501 278195 44561 -87793 38373 227849 265845 158618 14862
73420 -95481 -128792 -83048 -42831 -68326 -60251 101836 313469 335992 141790 -35849 -41099
73409 -41099 18192 1682 -41745 -14976 21415 -46002 -166698 -184035 -67946 56867 98258 85713
73397 85713 79477 106487 183705 291033 324710 207396 49581 42974 158633 141759 -96564
73385 -284082 -164829 96042 142582 -35735 -107280 68788 237197 167232 -17466 -100042 -111288
73374 -111288 -177624 -216676 -64864 187616 267013 103869 -83802 -110455 -21593 64482 128199
73363 128199 189572 213831 155436 20149 -146279 -257436 -189984 85463 371481 395758 149320
73351 -67913 -21310 168029 223510 95408 -24072 -21460 -247 -50907 -63367 86615 276577 270148
73339 270148 86956 3902 122924 191930 29166 -118239 58741 376641 376797 45604 -139096
73327 40665 215588 65727 -157021 -87497 131378 125639 -58000 -63910 139825 233903 127793
73316 127793 93911 252256 350006 209541 42627 106988 302023 326649 93071 -186287 -245007
73305 -245007 -11317 314312 414221 190177 -82856 -88120 102028 145111 -54806 -229665 -182628
73294 -182628 -50229 -22421 -57377 -27962 47284 78322 60685 27134 -30022 -84727 -55128
73283 -55128 52819 113600 80200 73353 179839 299048 294030 179011 64219 19744 67877
73272 67877 198153 319681 309780 175162 60709 53223 90391 95504 71296 33548 -4098 36236
73259 204057 343254 221756 -106503 -297830 -174398 36215 47762 -101165 -174251 -84664
73248 62422 163207 193153 162310 106222 67018 31486 -29812 -54010 39807 158429 113251
73237 113251 -68868 -140547 -17158 78672 -20966 -164415 -148231 -36580 -12762 -83489 -133030
73226 -133030 -130418 -92810 23518 203308 267946 96431 -140420 -165083 42269 230152 188673
73215 188673 -48099 -270444 -278444 -62242 151451 133884 -39068 -82259 60277 117601 -57461
73203 -216518 -104055 120669 128657 -74147 -184184 -57650 142419 228759 195631 139746 135598
73192 135598 187834 214416 130576 12044 46252 233232 314839 144588 -63727 -51166 102090
73180 143924 52194 4706 52447 90461 91315 119157 151251 108244 28180 11269 35843 19365
73168 19365 3826 81118 190973 197755 119241 78841 80132 32140 -46431 -53680 -757 12361 -17033
73154 -16885 -6536 -55521 -120188 -102686 -24922 30584 87257 197902 279990 230429 130991 128832
73142 128832 185616 161889 73366 36622 40541 7231 -11724 47016 55566 -95216 -196936 6215
73129 326771 325445 -17101 -251768 -144379 23996 -25056 -155844 -137494 -37863 -45810 -144130
73118 -144130 -193081 -159707 -83207 20429 80785 -10589 -178062 -170385 64274 237238 125409
73107 125409 -103025 -169315 -80788 -12729 23093 121313 222057 187718 76131 78114 202445
73096 202445 253868 137845 -14298 -65993 -52879 -69548 -100390 -56100 72180 173406 142643
73085 142643 15215 -64168 -16638 79677 118338 113490 124293 100584 -38450 -200692 -186790
73074 -186790 15051 185149 180060 107194 113445 173072 194764 186921 190476 172965 112054 72699
73062 72699 88062 79663 10752 -9452 88364 172221 101299 -30410 -36691 57334 71486 -10887
73049 -13677 122481 220120 134537 -28361 -75466 12811 107259 139107 157636 204879 246509
73038 246509 247054 234089 245377 258540 223394 145226 85316 74240 67461 6449 -105156 -203950
73026 -203950 -220676 -126496 30579 124471 53258 -119752 -198286 -87715 71965 91419 -15716
73014 -80595 -33991 28936 36567 48989 131895 233534 256471 188976 113028 117339 218758 327671
73002 327671 299881 93929 -126843 -141977 55378 226583 166884 -62302 -232889 -217310 -90838
72990 -1920 -4795 -29590 5846 80913 104198 63212 67818 183817 294902 243665 74195 -6445
72977 79876 171649 108123 -41768 -93188 -13468 45113 -31428 -165961 -199364 -94446 30763
72965 65572 40243 57441 132063 174767 129273 39275 -43194 -121630 -177492 -130163 30218 148081
72953 148081 70857 -120177 -185061 -45608 96809 28725 -179909 -254132 -70101 175785 214361
72942 214361 50457 -59318 27070 148231 100062 -61283 -134692 -84145 -31908 -13929 25407
72930 37213 -67369 -169187 -61532 153385 134686 -139512 -262606 -24505 234779 166648 -41885
72918 -21314 172569 222553 113718 84867 141199 67687 -116352 -146570 23078 132717 49436
72906 -53395 -25573 52653 79553 89717 120215 132883 123209 120442 77751 -38693 -90558 59933
72893 262312 244813 40891 -57753 35278 115293 84391 87867 186276 225074 132016 41642 18120
72880 -57384 -211523 -267277 -131135 47782 106396 37509 -118342 -304714 -350641 -131142 151546
72868 174570 1867 1641 219590 292699 96391 -25334 121689 241570 119480 39116 236399
72857 236399 381958 103357 -319043 -327945 56502 302473 173016 -45701 -92739 -41195 -11421
72845 32743 108312 132670 106474 146469 273233 355654 307207 182462 68523 16514 60880
72834 60880 176335 254275 238393 211059 227607 182660 474 -166349 -128764 45428 137901 100868
72822 100868 65306 94867 136710 165615 183740 127670 -36481 -176997 -142571 5074 87691
72811 87691 85029 118659 205342 229877 151635 59408 22293 32259 78553 148690 186347 162265
72799 162265 128742 100422 -7226 -182418 -209087 33939 293455 229302 -91208 -272167 -142328
72788 -142328 58004 77078 -33222 -91655 -50093 40113 153656 255540 262956 164526 92733
72777 92733 162719 288414 272256 80470 -67960 42135 314665 409332 164761 -170873 -263454
72766 -263454 -134760 -63171 -113286 -71196 122535 219374 85766 -37463 75968 256005 219619
72755 219619 25924 -55897 19312 79765 71242 80664 92325 9603 -115570 -137349 -73840 -67958
72743 -67958 -121517 -110457 -37614 -21992 -50926 5331 129202 157271 69958 35737 120683 185071
72731 185071 135275 65127 62606 67078 18489 -13959 37954 108962 104979 47784 20691 38251
72719 38251 57098 75057 137510 243932 305928 244179 119309 95712 225539 345449 292212
72708 292212 144014 83029 85686 -9153 -145205 -68500 235488 444366 368278 200683 124788
72697 124788 5427 -265354 -431892 -240816 85768 130716 -106395 -249251 -111434 120282
72686 226244 178524 52215 -38738 38263 260827 379097 231157 15052 12060 173706 247513
72675 247513 180120 112885 100520 114736 193585 307851 250166 -31845 -198269 10580 276668
72664 276668 139807 -243267 -309757 32830 305959 229490 37553 -36418 -64340 -99949 -32384
72652 98262 72256 -95566 -127032 26414 91951 -12875 -33612 112745 153285 -24411 -130416
72641 -130416 14717 154691 57067 -92739 -50406 81872 109853 102903 197281 301063 267280
72630 267280 140635 12715 -138190 -277263 -244259 -39585 92629 44005 9767 102511 135318
72619 135318 5850 -53967 120505 302813 248359 94222 83059 162419 165623 133904 152041
72608 152041 110959 -57153 -146453 7013 205037 194876 77263 93262 215407 266516 245018
72597 245018 226614 149282 711 -5090 233933 418646 252118 -75779 -174177 -27183 94677
72585 116483 154655 184662 113331 56441 159165 263125 135120 -97562 -133336 1647 39583
72574 39583 -52101 -89422 -60628 -76779 -44511 163746 320387 120339 -227255 -225100 116623
72562 282055 92697 -43918 132476 328219 254413 77163 21615 -17642 -140672 -117085 223985
72550 588157 587494 296078 78410 46565 44874 40812 155251 335646 336414 90448 -140733 -93432
72538 -93432 165211 336961 257719 60965 -34113 -11658 -31508 -132519 -138175 50072 236611
72527 236611 188832 -13254 -100425 -511 129688 193769 231826 249308 216735 208554 297570 354226
72515 354226 216363 7028 -19992 94792 93315 -25367 -5132 172898 229994 103212 67475
72504 67475 204014 210593 -40101 -203624 -20868 233130 205113 14593 -33284 20837 -38623
72492 -146300 -98337 35667 56843 37314 165614 325057 250808 16775 -56836 72707 153847
72481 153847 116972 146889 268527 275648 132605 62390 148528 202547 118535 22274 -19037
72469 -88387 -126275 76213 447123 575938 291024 -52288 -96238 35751 51942 -23578 -10415
$$ [...]
##END NTUPLES=NMR SPECTRUM
##END=
