##TITLE=PROTON CDCl3 {C:\Spectra\data\SiimK\nmr} SiimK 34
##JCAMPDX= 6.0         $$ Bruker NMR JCAMP-DX V2.0
##DATA TYPE= NMR SPECTRUM
##DATA CLASS= NTUPLES
##ORIGIN= Bruker BioSpin GmbH
##OWNER= nmrsu
$$ 1.83.2.2 TOPSPIN		Version 3.2
$$ 2016-05-10 10:52:42.069 +0300  Siim@Siim-workPC
$$ Compression mode = diff/dup
##.OBSERVE FREQUENCY= 700.084323280578
##.OBSERVE NUCLEUS= ^1H
##.ACQUISITION MODE= SIMULTANEOUS (DQD)
##.ACQUISITION SCHEME= undefined
##.AVERAGES= 32
##.DIGITISER RES= 22
##SPECTROMETER/DATA SYSTEM= spect
##.PULSE SEQUENCE= zg30
##.SOLVENT NAME= CDCl3
##.SHIFT REFERENCE= INTERNAL, CDCl3, 1, 16.20716
##AUDIT TRAIL= $$ (NUMBER, WHEN, WHO, WHERE, PROCESS, VERSION, WHAT)
$$ ##TITLE= Audit trail, TOPSPIN		Version 3.2
$$ ##JCAMPDX= 5.01
$$ ##ORIGIN= Bruker BioSpin GmbH
$$ ##OWNER= Siim
$$ $$ C:/Users/Siim/Desktop/nmr/45 P/1/pdata/1/auditp.txt
$$ ##AUDIT TRAIL=  $$ (NUMBER, WHEN, WHO, WHERE, PROCESS, VERSION, WHAT)
(   1,<2015-11-06 19:17:53.572 +0200>,<nmrsu>,<HP>,<go>,<TOPSPIN 3.2>,
      <created by zg
	started at 2015-11-06 19:15:56.870 +0200,
	POWCHK enabled, PULCHK disabled,
       configuration hash MD5:
       8F AF 65 7A CC E6 26 17 7A A5 E9 E3 EA 55 FD EF
       data hash MD5: 64K
       B0 1C B6 14 E9 0F 1C DB 07 E3 13 1B 73 95 CE D5>)
(   2,<2015-11-06 19:17:54.377 +0200>,<nmrsu>,<HP>,<audit>,<TOPSPIN 3.2>,
      <user comment:
       ICON-NMR User ID: SiimK
       data hash MD5: 64K
       B0 1C B6 14 E9 0F 1C DB 07 E3 13 1B 73 95 CE D5>)
(   3,<2015-11-06 19:17:54.412 +0200>,<nmrsu>,<HP>,<audit>,<TOPSPIN 3.2>,
      <user comment:
       ICON-NMR User ID: SiimK
       data hash MD5: 64K
       B0 1C B6 14 E9 0F 1C DB 07 E3 13 1B 73 95 CE D5>)
(   4,<2015-11-11 13:10:00.452 +0200>,<Siim>,<Siim-workPC>,<proc1d>,<TOPSPIN 3.2>,
      <Start of raw data processing
       ft FT_mod = 6 PKNL = 1 SI = 64K 
       data hash MD5: 64K
       2B 3C 57 77 38 66 5A C8 05 2E 52 28 74 94 FE 80>)
(   5,<2015-11-11 13:10:03.899 +0200>,<Siim>,<Siim-workPC>,<proc1d>,<TOPSPIN 3.2>,
      <apk 
       data hash MD5: 64K
       54 07 8A 3E 84 64 7F C6 7C B3 34 8D FE 91 67 46>)
(   6,<2015-11-11 13:10:06.754 +0200>,<Siim>,<Siim-workPC>,<proc1d>,<TOPSPIN 3.2>,
      <abs n ABSG = 5 
       data hash MD5: 64K
       3E 83 FC 93 C5 6B 22 01 CF AA 90 C3 A8 A6 4B 08>)
(   7,<2015-11-11 13:16:21.031 +0200>,<Siim>,<Siim-workPC>,<dataserver>,<TOPSPIN 3.2>,
      <new intrng file generated by interactive integration
       data hash MD5: 64K
       3E 83 FC 93 C5 6B 22 01 CF AA 90 C3 A8 A6 4B 08>)
$$ ##END=
$$ 
$$ $$ hash MD5
$$ $$ 66 E8 9E 96 4D F6 D2 B0 CA 67 D5 2C 8D 41 37 86
##$RELAX= 
##$RELAX= 
##$RELAX= 
##$RELAX= 
##$RELAX= 
##$RELAX= 
##$RELAX= 
##$RELAX= 
##$RELAX= 
##$RELAX= 
##$RELAX= 
$$ Bruker specific parameters
$$ --------------------------
##$DATPATH= <C:/Users/Siim/Desktop/nmr>
##$EXPNO= 1
##$NAME= <45 P>
##$PROCNO= 1
##$ACQT0= -1.49159661862029
##$AMP= (0..31)
100 100 100 100 100 100 100 100 100 100 100 100 100 100 100 100 100 100
$$ [...]
2 2 0 0 0 0 0 0 0 0
##$TL= (0..7)
120 120 120 120 120 120 120 120
##$TUNHIN= 0
##$TUNHOUT= 0
##$TUNXOUT= 0
##$USERA1= <>
##$USERA2= <>
##$USERA3= <>
##$USERA4= <>
##$USERA5= <>
##$V9= 5
##$VALIST= <>
##$VCLIST= <>
##$VD= 0
##$VDLIST= <>
##$VPLIST= <>
##$VTLIST= <>
##$WBST= 1024
##$WBSW= 4
##$XGAIN= (0..3)
0 0 0 0
##$XL= 0
##$YL= 0
##$YMAX_a= 6251634
##$YMIN_a= -10660565
##$ZGOPTNS= <>
##$ZL1= 120
##$ZL2= 120
##$ZL3= 120
##$ZL4= 120
##$ABSF1= 16.24408
##$ABSF2= -3.893253
##$ABSG= 5
##$ABSL= 3
##$ALPHA= 0
##$AQORDER= 0
##$ASSFAC= 0
##$ASSFACI= 0
##$ASSFACX= 0
##$ASSWID= 0
##$AUNMP= <proc_1d>
##$AXLEFT= 0
##$AXNAME= <>
##$AXNUC= <1H>
##$AXRIGHT= 0
##$AXTYPE= 0
##$AXUNIT= <>
##$AZFE= 0.1
##$AZFW= 0.1
##$BCFW= 0
##$BC_mod= 0
##$BYTORDP= 0
##$COROFFS= 0
##$CY= 15
##$DATMOD= 1
##$DC= 0
##$DFILT= <>
##$DTYPP= 0
##$ERETIC= no
##$F1P= 10.5
##$F2P= -0.5
##$FCOR= 0.5
##$FTSIZE= 65536
##$FT_mod= 6
##$GAMMA= 0
##$GB= 0
##$INTBC= 1
##$INTSCL= 2.562092e-010
##$ISEN= 128
##$LB= 0
##$LEV0= 0
##$LPBIN= 0
##$MAXI= 10000
##$MC2= 0
##$MEAN= 0
##$ME_mod= 0
##$MI= 0
##$MddCEXP= no
##$MddCT_SP= no
##$MddF180= no
##$MddLAMBDA= 0
##$MddMEMORY= 0
##$MddMERGE= 0
##$MddNCOMP= 0
##$MddNITER= 0
##$MddNOISE= 0
##$MddPHASE= 0
##$MddSEED= 0
##$MddSRSIZE= 0
##$Mdd_CsALG= 0
##$Mdd_CsLAMBDA= 0
##$Mdd_CsNITER= 0
##$Mdd_CsNORM= 0
##$Mdd_CsZF= 0
##$Mdd_mod= 0
##$NCOEF= 0
##$NC_proc= -4
##$NLEV= 6
##$NOISF1= 0
##$NOISF2= 0
##$NSP= 0
##$NTH_PI= 0
##$NZP= 0
##$OFFSET= 16.20716
##$PC= 1
##$PHC0= 211.3396
##$PHC1= 2.986736
##$PH_mod= 1
##$PKNL= yes
##$PPARMOD= 0
##$PPDIAG= 0
##$PPIPTYP= 0
##$PPMPNUM= 2147483647
##$PPRESOL= 1
##$PSCAL= 0
##$PSIGN= 0
##$PYNMP= <proc.py>
##$REVERSE= no
##$SF= 700.080025845773
##$SI= 65536
##$SIGF1= 0
##$SIGF2= 0
##$SINO= 0
##$SIOLD= 65536
##$SPECTYP= <PROTON>
##$SREGLST= <1H.CDCl3>
##$SSB= 0
##$STSI= 65536
##$STSR= 0
##$SW_p= 14097.7443609023
##$SYMM= 0
##$S_DEV= 0
##$TDeff= 65536
##$TDoff= 0
##$TI= <>
##$TILT= no
##$TM1= 0
##$TM2= 0
##$TOPLEV= 0
##$USERP1= <>
##$USERP2= <>
##$USERP3= <>
##$USERP4= <>
##$USERP5= <>
##$WDW= 0
##$XDIM= 65536
##$YMAX_p= 475243002
##$YMIN_p= -36925
##$CURPLOT= <HP LaserJet 1010>
##$CURPRIN= <$HP LaserJet 1010>
##$DFORMAT= <normdp>
##$LAYOUT= <+/1D_H.xwp>
##$LFORMAT= <normlp>
##$PFORMAT= <normpl>
$$ End of Bruker specific parameters
$$ ---------------------------------
##NTUPLES= NMR SPECTRUM
##VAR_NAME=  FREQUENCY,     SPECTRUM/REAL,   SPECTRUM/IMAG
##SYMBOL=    X,             R,               I
##VAR_TYPE=  INDEPENDENT,   DEPENDENT,       DEPENDENT
##VAR_FORM=  AFFN,          ASDF,            ASDF
##VAR_DIM=   65536,         65536,           65536
##UNITS=     HZ,            ARBITRARY UNITS, ARBITRARY UNITS
##FACTOR=    0.215114507460057, 1,           1
##FIRST=     14097.5292463948, -33520,       -300920
##LAST=      0,             -25298,          -303717
##MIN=       0,             -36925,          0
##MAX=       14097.5292463948, 475243002,    0
$$ Real data points
##PAGE= N=1
##DATA TABLE= (X++(R..R)), XYDATA
$$ [...]
30839B725L860A90P585b103c55A278C93O92R23R73k59b022G524A74O778a088E336
30821b608G182a310E498b4A132N687A877n45P270C638J143A861K700j405M312
30806G468j533h41j196E19b598B167N87Q784n350H23e56E949a484H235l853K828
30790G210k930j392r90b778F162j759a739A488l15m09N816h94B400r90A51R607
30774I758D367K102l058a300H48c50G868l454K716C449q00o37Q64a188H623B019
30757F819K133A996K535H6K401M81b658E382B467C04L235K569B15J000l75J28
30741I68L56J1K144a545j806C595a195A346K87K37J910b109j912a32B320K72Q23
30724C415L369c121F491B313e57C460jN007a810C6J250P12J304g63j189A735J412
$$ y = [2725, 6585, 190, 7775, -2103, -355, 1278, 393, 1085, 2008, 2981, 2722, -2022, 7524, 174, 6952, -1088, 5336, -2608, 7182, -1310, 5498, -24, 1132, 6819, 1877, 1332, 8602, 3638, 4781, 1861, 4561, 3156, 7468, 5935, -841, -2037, 519, -2598, 2167, 2754, 11538, 6188, 823, -556, 5949, -1484, 8235, 4382, 7210, 4280, 2888, 1898, -2778, 6162, 4403, -1739, 1488, 1173, 764, 6580, -894, 2400, 1410, 151, 9758, 4367, 6469, 3411, -1300, 848, -350, 7868, 4414, 7130, 3449, 2649, 2012, 2876, -1188, 8623, 2019, 6819, 8952, 1996, 4531, 86, 2487, 2968, -2658, 5382, 2467, 304, 3539, 6108, 215, 1215, 840, 968, 1324, 1335, 3479, -1545, -3351, 3595, -1195, 1346, 1633, 1870, 3780, -2109, -4021, -132, 2320, 2592, 3415, 6784, -3121, 6491, 2313, -557, 3460, 3459, 8466, -1810, 36, 1286, 1998, 3302, -763, -1952, 1735, 3147]
30707C147L052k705O463m901A538M799A660R581E99J425a062A0028B133a687A1068
30691F499B984I88d61F757B682K238j848l53K45M182d92j021I127l045j476H85
30674a399A382J561L35a711D507G68N82M48M461k912K369A2J162P78K446H20J23
30657I43M34b434a55B080L229b407F029A02M349A696O895C444J343A721Q352B249
30640A775L304A112l59c49A169A37c53A614K836H63Q2M783b167A924G90K454L87
30623C631K712B2K123I82K280K781G58L707Q71k403b267h40D153q47j124N153
30607G335l077A491N252d893A701b801Q88F002C99K441P740i38D118L345l398
30592D065K55a7C386E25J985a858o76A759e1G247c894A488R58o3N632A174K089
$$ y = [3147, 6199, 3494, 9957, 5056, 1538, 6337, 1660, 11241, 599, 2024, -1062, 10028, 2133, -1687, 11068, 6499, 2984, 988, -461, 6757, 2682, 4920, 3072, 2719, 2964, 7146, -492, -1513, 9127, 6082, 4606, 885, -1399, 1382, 2943, 3278, -1711, 4507, 768, 1350, 1798, 6259, 3347, 5716, 12, 1174, 1952, 4398, 820, 943, 1377, -2434, -155, 2080, 5309, -2407, 6029, 102, 4451, 1696, 8591, 3444, 4787, 1721, 10073, 2249, 1775, 5079, 1112, 753, -349, 1169, 137, -353, 1614, 4450, 863, 945, 5728, -2167, 1924, 790, 3244, 3631, 6343, 22, 2145, 982, 3262, 6043, 758, 4465, 5336, 2933, -2267, -840, 4153, 3306, 2182, 7335, 4258, 1491, 6743, -4893, 1701, -2801, -1913, 6002, 399, 2840, 10580, -938, 4118, 7463, 4065, 4320, -17, 3386, 525, 2510, -1858, -2534, 1759, -51, 7247, -3894, 1488, 2446, 2383, 8015, 1174, 3263]
30575C263a227B055R19A144n37K075P328B553J384O15B61L247b654F305k916N027
30559H416C589L254l146P80A440R196C017A253J0952B848L725n93a115B006J386
30544C392M866G77K539L445j317F14L037j107J463P284D678a880G052k844O06
30529D814H00O235e99F176j208a57D678r88b004A67J394g34l78E543k393G23M507
30512E230G38K691A712c175b06D236L868C456p94J762a049C192L166B992M63h90
30495A565B68d73D159b710A810P489B670J980H08K649J528L271n73j879j492k048
30479B264P183l529P53a166H11J871M579C237O31a28A581J533J939b56h8E511
30462c456E167G34K975J775M958D189J840O30N68L099C689R48d222B445O93E02
$$ y = [3263, -1227, 2055, 2974, 1144, 607, 2682, 10010, 2553, 3937, 4552, 261, 3508, -2654, 6305, 3389, 8416, 3589, 6843, 3697, 4477, 1440, 10636, 3017, 1253, 12205, 2848, 6573, 5980, -1115, 2006, 3392, 8258, 777, 3316, 6761, 5444, 614, 3651, 2544, 4007, 11291, 4678, -1880, 7052, 4208, 4814, 800, 7035, -599, 6176, 4968, -157, 4678, 3690, -2004, 167, 1561, -734, -1112, 5543, 3150, 723, 5230, 738, 3429, 1712, -3175, -206, 4236, 8104, 3456, 2662, 4424, -1049, 3192, 6358, 2992, 3455, -890, 1565, 268, -473, 4159, -2710, 1810, 9299, 2670, 4650, 808, 3457, 4985, 8256, 7683, 5804, 4312, 2264, 9447, 5918, 6671, -1166, 811, 2682, 7261, 3237, 3868, -128, 1581, 3114, 5053, -256, -88, 5511, -3456, 5167, 734, 3709, 5484, 10442, 4189, 6029, 6659, 7227, 10326, 3689, 4637, -4222, 2445, 3138, 502]
30445b16C355N184I43O35D78M968j287M15M327H96B72P966c496a480A755f202
30428a829h24D651A80d12C435J603j000b455A94L090f24C287e67C858A077J896
30412B973K547j732k37L262j069k628M591C477M200l081M117k137B045L824l30
30397E539R63B623M844I81i7C251H87b59H678a916D747M36c866D459A092M747
30381E839A781M162B294N647A89N470F40L16L236K798I24J1130g68D439L57M53
30365E249K393a70D874N028D902B280a232B609n56N26m27c033D816e12D029j077
30349B952P410l960k33K772B003R75Q58L125k617h84E603k375L778r10j237K24
30333E083B98M017A196L495K85k049J906I10r4K223A421M200r93D24P456m72C080
$$ y = [-216, 3355, 8539, 943, 1578, 478, 5446, 4159, 4574, 8901, 896, 272, 8238, -3496, -1480, 1755, -6202, -1829, -824, 4651, 180, -412, 3435, 5038, 4038, -2455, 194, 3284, -624, 3287, -567, 3858, 1077, 2973, 5520, 3788, 3551, 6813, 5744, 3116, 7707, 3477, 7677, 4596, 8713, 6576, 2045, 5869, 5539, 6502, 2623, 7467, 981, -97, 3251, 887, -259, 8678, -1916, 4747, 5183, -3866, 4459, 1092, 5839, 1781, 5943, 2294, 7941, 189, 5659, 640, 956, 4192, 6990, 924, 12054, -768, 4439, 4796, 5249, 7642, -170, 4874, 9902, 4902, 2280, -1232, 2609, 2053, 2579, 2152, -3033, 4816, -512, 4029, 2952, 10362, 6402, 6169, 8941, 2003, 2978, 3836, 6961, 4344, -884, 5603, 3228, 7006, 6096, 4859, 5083, 298, 4315, 1196, 4691, 4976, 2927, 4833, 910, 816, 3039, 1421, 5621, 4628, 424, 7880, 7408, 3080]
30315D423j037O47O064n009K867C404J425J233J169n88j56l29c396a009D033M769
30299H802C587O31j170g81G010n1C391F51N171j643B59N015k9P2B126b956G061
30281A950Q184k315J798m093a047C376J406P10M559B199a291D20K928L909K603
30266I860b000F223J220B907b368A0299k153J44j202B672Q74r65L548k537J2l64
30250C240N661B762J090l34A373M039N69d38B336K43I30M353J754C102J545M909
30234I556D132I69e0A244K636a584I292B534K060O10j106K530E02c864A275K309
30218C584J23J354c921E138N72j225M539B718L317P64j520j934K536K564C461
30202A5444q89o158r62K027j700j558J104n35K094q61J907D111J096R145F435
$$ y = [4423, 3386, 4033, 10097, 5088, 7955, 3404, 4829, 6062, 7231, 6643, 6487, 6158, -3396, -1009, 4033, 8802, 3587, 4218, 3048, -781, 7010, 6959, 3391, 651, 5822, 4179, 259, 5274, 5245, 5317, 2126, -2956, 7061, 1950, 10134, 7819, 9617, 5524, -1047, 3376, 4782, 5492, 10051, 2199, -1291, 420, 3348, 7257, 9860, -2000, 6223, 7443, 2907, -2368, 10299, 8146, 8290, 7088, 2672, 3546, 2581, 6129, 3592, 3604, 3240, 8901, 2762, 3852, 3518, 1373, 5412, 5981, -438, 2336, 2579, 930, 5283, 7037, 3102, 4647, 9556, 4132, 969, -50, 1244, 3880, -1584, 9292, 2534, 4594, 5204, 4098, 6628, 502, -3864, 1275, 3584, 3707, 5061, -3921, 5138, 5710, 4485, 9024, 2718, 6035, 6799, 5279, 3345, 5881, 8445, 3461, 15444, 14555, 8397, 7435, 9462, 7762, 6204, 7308, 6773, 8867, 8006, 9913, 4111, 5207, 14352, 6435]
30186A2519m919M053n29j772Q16D353M924N63D623j743K733J856N290m625K414
30171A0548q23l338O79K958K345n690j896Q474m752K151k770l198O933m147n49
30156F925P39J932j250K5O342F793b285G247k02j031M657E107L232l384R63K633
30140H551K181k208Q45B664J0422m498k836k233L671b901B767L766J847k621j508
30125D251J485K003Q18M11k561k633A635N27A069K125K897L201l345k778Q489
30110A1658n719L444k645j358B82M878N094I7c908G32Q19n60D64O390c022F532
30093C301K555J7k011H74M766k424J825E10a653H973C836g77E472A918G37L511
30077D248p95n33N052k175j429K025B233J283j527a737F855j319A126K685d302
$$ y = [12519, 7600, 11653, 11124, 9352, 10168, 4353, 9277, 9840, 4623, 2880, 5613, 7469, 12759, 8134, 10548, 9725, 6387, 7066, 10024, 12369, 6679, 4783, 13257, 8505, 10656, 7886, 4688, 11621, 7474, 6925, 7664, 9596, 8346, 8371, 14713, 6793, -2285, 7247, 7045, 6014, 10671, 5107, 8339, 4955, 5918, 8551, 10732, 8524, 9369, 2664, 13086, 8588, 5752, 3519, 7190, -2901, 2767, 6533, 8380, 5759, 4251, 5736, 7739, 8557, 8968, 6407, 3774, 1635, 2162, 1069, 3194, 6091, 9292, 5947, 3169, 11658, 5939, 9383, 6738, 5380, 282, 5160, 10254, 97, -3908, 732, 1551, 991, 464, 6854, -3022, 6532, 3301, 5856, 5873, 3862, 874, 5640, 3216, 5041, 510, -1653, 8973, 3836, -777, 5472, 1918, 737, 4248, 3453, 2920, 7972, 5797, 4368, 6393, 2233, 3516, 1989, -1737, 6855, 5536, 1126, 3811, -4302]
30061E25B40N961A268R33a096m521C237B75Q30J521c891E843B12f23I731a461
30044C257Q57A131L389C30J527e36C655c0j105A972L928k553J975A247E63K231
30028B794o59K345K392C252K049N11J207j132K344Q07C325r98N484D14N219O347
30012A1980m346I46N81L543A460N881k519b40C728A11pa405A646d263C324L49
29996C673Q18J668j087A159N75J486a292F86O07K225a130C206O376b121F56K61
29980I17N867o62N78k835A417K539a625F834k388J901c371H438A487L508K452
29965G447C270K605G76K679a3E486H54K500c769G606j515A099L543K435l219a01
29948E450J415A513L627F04N376N877C163F02J023M335a655D847M96J173j505
$$ y = [525, 240, 6201, 1268, 2201, -1096, -5617, 3237, 275, 1105, 2626, -3891, 5843, 212, -623, 9731, -1461, 3257, 4114, 1131, 4520, 330, 1857, -536, 3655, -30, -1135, 1972, 5900, 3347, 5322, 1247, 563, 2794, 2135, 4480, 6872, 3252, 5301, 5812, 7019, 5887, 8231, 9038, 3325, 2327, 7811, 414, 5633, 11980, 7634, 946, 1527, 5070, 1460, 7341, 4822, -240, 3728, 111, 104, -1405, 1646, -4263, 3324, 3673, 4491, 6159, 5072, 1159, 1734, 3220, -1292, 686, 1293, 3518, -1130, 3206, 9582, -2121, 656, 917, 6784, 6122, 6700, 3865, 1417, 3956, -1625, 6834, 4446, 6347, -3371, 8438, 1487, 4995, 7447, 3270, 5875, 776, 3455, -13, 5486, 854, 3354, -3769, 7606, 6091, 1099, 4642, 7077, 3858, -101, 5450, 6865, 1513, 5140, 604, 5980, 11857, 3163, 602, 1625, 5960, -1655, 4847, 5343, 6516, 5011]
29933E011A760b8B589L119j6A465J114d856B374J27p90M895C177R40j976J834
29917C975k81a928D722j394L613k311j832Q07J45h3D387d969D021J970J619A975
29900E992m76j308B92Q44Q30d392C741J474K320k5k553J252Q86n6k040G31O610
29883G341j969A55N355j578N48M381n24j789L383m631K66A087P29M507N498C810
29866G980l287N131m54L33j238k866O038m080k821J673k183J110J247M673A925
29850A3516k790j515C716M871J966F30J557M526k153j467O069k075j970L640a60
29834I5Q17K758J183L67j792j658M202j163M43K012B095k10K227K92N904j924
29818H384l369N57j422J609M447m448J465n43K182P00O938o852J185m755K701
$$ y = [5011, 1760, -28, 2589, 5708, 5692, 1465, 2579, -4856, 2374, 2501, 1711, 6606, 3177, 4117, 2141, 3975, 3694, -1928, 4722, 3328, 6941, 4630, 2798, 3605, 3750, -83, 4387, -4969, 4021, 5991, 7610, 1975, 5992, 5516, 4208, 292, 1136, 1966, -4392, 3741, 5215, 7535, 7510, 4957, 6209, 7095, 7039, 4999, 731, 7341, 5372, 155, 5510, 3932, 4480, 8861, 8337, 6548, 9931, 5300, 5566, 1087, 1816, 6323, 11821, 3810, 7980, 4693, 9824, 9370, 9703, 8465, 5599, 11637, 7557, 4736, 6409, 4226, 5336, 6583, 11256, 1925, 13516, 10726, 9211, 3716, 8587, 10553, 630, 2187, 6713, 4560, 3093, 9162, 7087, 5117, 8757, -160, 95, 912, 3670, 4853, 5220, 3428, 1770, 5972, 4809, 5252, 7264, 2095, 1885, 4112, 4404, 10308, 8384, 5015, 5572, 4150, 5759, 10206, 5758, 7223, 6680, 8862, 9562, 16500, 9648, 10833, 6078, 8779]
29803H779j006B17N006R035k708m551B034N694j855j782N169J780K78l611J491
29788I198j678K165k501Q915G157L74M382l84k585j33o49M579K404k926n775q21
29772E623L992m037O451D432J4n98n07J937J13K14R63q41J348R40k026j46j212
29755D631j55j806K395J169B128M445O09k650J787F52J3529E665L584k879P161
29740A3531F336k71k427P010C764M934C257L824K830M469k074C362J0728j086
29726A3004k652n066K029k580L794B445C76P840J884l983P90r74L146D379J543
29711E922j564N15K343N343E924K178K592B260L457n22K379k558J48H65J921O630
29695I416C899J656L737D121L525K57Q5C724a592A3647o245J668D487N113B413
$$ y = [8779, 7773, 217, 5223, 14258, 11550, 6999, 2034, 7728, 5873, 4091, 9260, 11040, 11318, 7707, 9198, 7520, 9685, 7184, 16099, 7157, 7531, 11913, 11529, 8944, 8811, 8162, 12741, 15145, 12219, 6444, 5623, 9615, 5578, 12029, 4432, 4446, 3848, 3341, 5278, 5391, 5605, 6568, 5727, 7075, 8015, 5989, 5843, 4631, 4476, 2670, 5065, 6234, 2128, 6573, 7182, 4532, 6319, 652, 14181, 5665, 9249, 6370, 13531, 6336, 6065, 3638, 10648, 3764, 8698, 3257, 7081, 9911, 14380, 12306, 3362, 14090, 13004, 10352, 5286, 7315, 4735, 8529, 2445, 376, 8216, 10100, 6117, 6907, 5933, 9079, 4379, 5922, 4358, 4873, 7216, 12559, 5924, 8102, 10694, 2260, 5717, 5195, 7574, 5016, 5164, 865, 2786, 9416, 3899, 5555, 9292, 4121, 7646, 7903, 7988, 3724, -1592, 13647, 7402, 9070, 4487, 9600, 2413]
29679B184O074k54k361P941I11K673a173I849m189C45N559B476N000k884A667
29663F873j842E56d77B697O05M050q81j830N301K583D969M814m703A843n77L757
29647E023o27j472E02K720L869K916A768o13K699L271b385a121E394j203k24A656
29630D869Q18k4K015J71K549l075a22C447A384K6L598B416d326I485l718j707
29614D060M56A758L604A077M56P283N5l037j675j566r77K820M819c46F491A169
29597I032A689P925l029B236L193L40k686Q18j522R05J277l48o31A236L836i33
29580A0565f63F414c236E897k67d48k967B498L631k400k69G22P452l946j890c7
29563A3616E190L927A216Q556C767r09M419k022B333D65J855P59M793n67k184
$$ y = [2184, 8258, 8004, 5643, 13584, 911, 3584, -1173, 9849, 5660, 345, 5904, 2476, 7476, 4592, 1667, 6873, 5031, 556, -477, 2697, 3302, 7352, 6471, 4641, 9942, 12525, 4969, 9783, 5080, 1843, 1266, 5023, 4396, 2924, 502, 3222, 7091, 10007, 1768, 1155, 3854, 7125, -2385, -1121, 5394, 4191, 3967, 1656, 4869, 5687, 5663, 7678, 7849, 10398, 7323, -122, 3447, 1384, 1410, 5008, 2416, -4326, 9485, 5767, 4060, 4516, 1758, 5362, 1077, 1533, 8816, 8871, 5834, 4159, 2593, 1616, 4436, 9255, -346, 6491, 1169, 9032, 1689, 9614, 6585, 2236, 5429, 5769, 3083, 3901, 2379, 3284, 4561, 4213, 3582, 1236, 5072, -933, 10565, -663, 6414, -3236, 5897, 5630, -448, -3415, 2498, 6129, 3729, 3460, 722, 8174, 4228, 2338, -37, 13616, 5190, 9117, 1216, 9772, 3767, 2858, 7277, 5255, 2333, 465, 2320, 3079, 7872, 7305, 5121]
29548E121j702J729N25o09J34L70A625L158J803j864@F348j113E21N64L578K41
29531D904K02j256H62L063O890a840F673M326E314J025B3M044L500k202K251M317
29515A1933p07A557P859J852j374C777K631J282gE977j652m96M328l29j206K111
29499H733m007N785m701j385N82j096K641k471L102i96D821L923q98n46K916m048
29483F168K232M221m708J746l999b10I541j34N570o078l904J947J923o89L994
29468A2170n106L206l860M374j910l781N196k10L529D243L217K176M087b5A1240
29452G651N218l225k540J903N034F657O888k002N53m71Q93J472K57L85r46m628
29436I058L034Q69j514k01L128n267K520K256E637K06Q532D775K268O113l624
$$ y = [5121, 3419, 5148, 5673, 5064, 5198, 5568, 1625, 4783, 6586, 4722, 0, 6348, 5235, 521, 1085, 4663, 4904, 5106, 3850, 862, 3925, 10815, -1840, 6673, 10999, 5314, 6339, 23, 4067, 7567, 5365, 7616, 11933, 11226, 1557, 9416, 11268, 9894, 3777, 6408, 7690, -7, 5977, 4325, 3829, 8157, 7828, 6622, 8733, 4726, 10511, 5810, 4425, 5007, 3911, 6552, 4081, 7183, -996, 4821, 8744, 7846, 7300, 10216, 6168, 8400, 12621, 7913, 9659, 5660, -210, 9541, 9407, 14977, 8899, 4995, 6942, 8865, 8176, 12170, 7064, 10270, 6410, 10784, 8874, 5093, 10289, 10079, 13608, 4243, 7460, 9636, 13723, -25, 11240, 7651, 12869, 9644, 7104, 9007, 14041, 6657, 13545, 11543, 12096, 11625, 12518, 13990, 14247, 14632, 13686, 9058, 12092, 12961, 11447, 11246, 14374, 9107, 11627, 13883, 5637, 5843, 14375, 4775, 7043, 13156, 9532]
29421I532R15k639l76L928R84E306J506A893P731k767j352K450J998A740M242
29406E982B361J273J10L8A337A1Q10K848N32K429M273j052k282j083J026j899
29390E613K131j997M485l620k649j752L385J668C177O291k853J399k616k294P573
29375A0677B817M570k531J903K372k850J142L973K99B763J411M914m27m07J282
29360I536l700g07D645P660p83k900K738E576n05L782Q94m119K261l124N540m607
29344E698J245R50o10e84C285K363j314j336J267j490R426B791M015j400b471
29328E696R8A983c57C551r7K988L316B763Q93j046Q439l820K229k532B032N8K806
29311D896q36A614P6H33L470P19M745k520k010J388k412P088l005l503M867m79
$$ y = [9532, 10447, 7808, 7432, 11360, 12344, 5306, 6812, 1893, 9624, 6857, 5505, 7955, 9953, 1740, 5982, 2361, 3634, 3744, 3782, 1337, 11, 821, 3669, 4201, 6630, 10903, 9851, 7569, 6486, 7512, 5613, 7744, 5747, 10232, 6612, 3963, 2211, 5596, 7264, 3177, 9468, 6615, 8014, 5398, 3104, 10677, 2817, 7387, 4856, 6759, 9131, 6281, 7423, 11396, 11695, 2763, 4174, 9088, 8661, 8254, 9536, 5836, -707, 4645, 12305, 11522, 8622, 11360, 5576, 5071, 8853, 9747, 5628, 7889, 4765, 10305, 5698, 6943, 7893, 7283, -584, 3285, 5648, 4334, 2998, 4265, 2775, 12201, 2791, 6806, 5406, -2471, 5696, 5794, 1983, -357, 3551, 3454, 6442, 9758, 2763, 3656, 2610, 11049, 7229, 9458, 6926, 2032, 2090, 4896, 4060, 1614, 1690, 833, 4303, 5022, 9767, 7247, 5237, 6625, 4213, 11301, 8296, 4793, 9660, 9181]
29295I181K813J626p8o752Q505M463k634m109J0511I957J0074L086M967k121N281
29280C1244R86N744p158L062m771p62l27q047o074J1627A1035O802n707K450k423
29265A2157k762k519P511o377j915K128J275m550M130o06G22L974K785I00N982
29250F882o09F13b86I1L624L405D54Q154l945J456M212C321M28j03A251Q400C893
29232F858l406J130K702C205N635P76m092B645N767J839K318B326R647n121J73
29217G025k47B994O409l732O327n600L088m24l763K252l224L142j39K94K105j933
29201G796j02O390B987P569C490K112G12N862k119P115m363J655k566M908n23
29186A0681J253J570j144q70J905O200k339j016j196P847j500O828l592J326L842
$$ y = [9181, 11994, 13620, 13542, 6790, 15295, 19758, 17124, 13015, 23526, 9957, 20031, 23117, 28084, 25963, 31244, 32230, 37974, 30816, 33878, 29107, 28345, 28018, 19971, 13897, 25524, 11035, 17837, 12130, 14580, 12157, 9395, 6876, 14387, 8010, 6095, 8223, 9498, 4948, 9078, 8472, 722, 4696, 7481, 900, 6882, 6273, 613, -286, 91, 3715, 7120, 454, 8608, 4663, 6119, 10331, 3321, 3749, 3646, 1251, 9651, 3893, 6858, 3452, 4582, 7284, 3205, 8840, 9616, 5524, 2645, 8412, 10251, 12569, 2326, 11973, 6852, 7025, 6778, 2994, 9403, 5671, 11998, 6398, 9486, 9062, 5299, 7551, 4327, 7469, 7330, 7624, 9729, 7796, 7694, 14084, 2987, 10556, 3490, 5602, 712, 6574, 4455, 11570, 7207, 8862, 6296, 11204, 10681, 11934, 13504, 12360, 11490, 13395, 19595, 17256, 16240, 15044, 22891, 21391, 28219, 24627, 25953, 29795]
29171B9795O157l116L963K045J903k759M63K817l602j649n567K845q952J087N696
29156C1126m203q241K596k263k352k283Q472r327n905P380E650J3014I227J263
29142A0490m51p94M208k811j63j212N386n064P272l679j575n39J034n243M729
29127A1588l627P95K641p97D297N242L635r21R41j085k08M45k502J443L258M152
29111A8697I103K502N871j611l473N991K717l188L064qK736P399J596J499O448
29096D0646P48O147N308M821J843P379o079k638j529j85k107m642k80l184K156
29081D8404q671j66m702k70l961j263m063q220N900l014m511O096q08m031J931
29066A8651k171k687J945j607l160M928K617J134M57m242k548m32N63j769O848
$$ y = [29795, 35952, 32836, 36799, 38844, 40747, 37988, 38451, 41268, 37666, 36017, 30450, 33295, 24343, 25430, 31126, 26923, 18682, 21278, 19015, 16663, 14380, 22852, 13525, 7620, 15000, 5650, 18664, 9227, 10490, 10039, 9245, 13453, 10642, 10479, 9267, 14653, 9589, 16861, 13182, 11607, 11068, 12102, 6859, 11588, 7961, 8756, 11397, 10600, 4297, 9539, 13174, 12253, 13194, 12109, 11901, 12346, 9844, 11287, 14545, 18697, 9103, 11605, 17476, 15865, 12392, 18383, 21100, 17912, 20976, 20968, 23704, 31103, 32699, 34198, 40646, 41394, 47541, 52849, 57670, 59513, 66892, 60813, 58175, 56646, 56461, 54354, 49712, 49432, 46248, 48404, 39733, 39567, 34865, 34595, 30634, 29371, 25308, 17088, 22988, 19974, 15463, 21559, 20751, 16720, 18651, 16480, 13793, 15738, 14131, 10971, 15899, 18516, 19650, 20107, 15865, 13317, 12885, 13448, 11679, 18527]
29051A8527l093l779k167N74k873K821O195p633A413Q90R949o070J921l285M574
29036I392l399P50k773P47K302C074N138j851J157b844I131M738r82F248B750
29020D839a297C533j374l06O615A985O371K731E451K35j019N046C692O918J223
29005A1833m192J57K430l678P37K425L207l766j129Q99l196O133m66j533L683
28990A3544k190m464M687j15K295p97m614R509n137R67O93L214p343N198j655
28975A3792P77F166N598k811J743k002M18Q462G853P18O22C789K937l341N690
28960I075k276K500a014E717q63k8r11c677H689k889J821A228L087q48J722L295
28944H484C851R50B094O720b880C130l12K265B464P013j485A182J055c26F992
$$ y = [18527, 15434, 11655, 9488, 10062, 7189, 10010, 16205, 8572, 1413, 2303, 12252, 6182, 8103, 4818, 9392, 5993, 6743, 3970, 4717, 7019, 3074, 8212, 6361, 7518, -2844, 9131, 13869, 12887, 6248, 2750, 4839, -1297, 3533, 2159, 1853, 8468, 1985, 8356, 11087, 5451, 5686, 4667, 9713, 3692, 10610, 11833, 7641, 7798, 10228, 6550, 7287, 9712, 12919, 9153, 8024, 8923, 5727, 11860, 11394, 9861, 13544, 11354, 6890, 11577, 11462, 13757, 12960, 8346, 17855, 12718, 13685, 14378, 17592, 10249, 15447, 13792, 14569, 6166, 11764, 8953, 10696, 8694, 9112, 17574, 7853, 8571, 9193, 3789, 6726, 3385, 9075, 6799, 9299, -1014, 5717, 4854, 4826, 3915, -3677, 8689, 5800, 7621, 1228, 4315, 3467, 5189, 8484, 3851, 4801, 2094, 8814, -2880, 3130, 2818, 5083, 2464, 9477, 7992, 1182, 2237, -326, 6992]
28928C048k04k65L465P43K702m326o09m38N382L379E779L221j536k644I12K849
28912C761K949j345L057B096R58A155M587O559k483A256O101O77j277k804g82
28896F685k708M855l841L423K98L54j90k67J058m613N197Q12j432N162p69l222
28880A0802O902O735k494J0480j436L893P76J112q21k249q97Q994n046n310j035
28865C0406l163R27q813K736J460j011j0406k11N081m48o016J2056j0203j785
28851A0610B386Q871N605e64A1046K460L695m543k136O406J387k734M505N013
28837B5099J21k636J763P191n632L44J1486K887ON038R60L576r629N321n61J372
28821D6706k791k34n849n219J816n705M966o658m513m115M436j592m20m540o491
$$ y = [3048, 2844, 2579, 6044, 6787, 9489, 5163, 4554, 4116, 9498, 12877, 5779, 9000, 7464, 4820, 912, 3761, 6710, 5365, 8422, 2096, 3054, 1155, 5742, 12301, 9818, 1256, 7357, 8034, 6757, 3953, -782, 6685, 3977, 8832, 4991, 8414, 8712, 9066, 8876, 8609, 9667, 5054, 10251, 11063, 9631, 14793, 14024, 10802, 17704, 24439, 21945, 32425, 30989, 34882, 35658, 36770, 35949, 33700, 32803, 41797, 36751, 31441, 30406, 27243, 28170, 19357, 22093, 23553, 22542, 12136, 11925, 17006, 16558, 10542, 22598, 12395, 10610, 2386, 11257, 16862, -564, 11046, 13506, 17201, 12658, 10522, 16928, 18315, 15581, 20086, 25099, 25220, 22584, 24347, 31538, 25906, 26250, 37736, 40623, 40629, 45667, 46627, 50203, 40574, 45895, 45334, 46706, 43915, 43681, 37832, 32613, 34429, 28724, 33690, 27032, 22519, 18404, 22840, 21248, 20828, 16288, 9797]
28806I797O353l800E358N088j31J131j859K023k883k277J2006k014l240j172K165
28791A4195K682l888Q547o066P842n211o62m70o722N970J100k419J573l741M404
28776A7134k018K703j084m383N482E979Q039l164J082D900K94I11R460D384L013
28761G397B182M948L431m52L17N419F010K817A992N150B352E09J0143k058p63
28746G831B970o36K894j87o86M145j482J908R28j466k528k124J159l0J843m65
28730F243N77k38j287N825r0D570O432j981j891k427K544O14l091O566D823M598
28714I421l62k158K302l127n30O083H19Q688k908i20H445B483K910j040B131J475
28698C606M571K226D389J745J010M93o42P897l722m357J64K876K773l023k243
$$ y = [9797, 16150, 12350, 5358, 10446, 10315, 11446, 9587, 11610, 8727, 6450, 18456, 16442, 13202, 12030, 14195, 16877, 12989, 21536, 15470, 23312, 18101, 17439, 16969, 10247, 16217, 17317, 14898, 16471, 12730, 17134, 15116, 17819, 16735, 12352, 17834, 5979, 14018, 10854, 11936, 4900, 5194, 911, 10371, 4384, 7397, 2182, 7130, 10561, 10109, 10426, 15845, 6010, 8827, 1992, 7142, 2352, 509, 10652, 8594, 7831, 2970, 2334, 5228, 5041, 4355, 8500, 7018, 8926, 9854, 8388, 5860, 3736, 4895, 4865, 6708, 6243, 6820, 6582, 5295, 11120, 11030, 4570, 11002, 9021, 7130, 4703, 7247, 7861, 4770, 11336, 4823, 9421, 9059, 6901, 9203, 6076, 5546, 11629, 819, 9507, 6599, -920, 8445, 2483, 5393, 4353, 2131, 3606, 8177, 10403, 4389, 6134, 7144, 7637, 6995, 14892, 11170, 6813, 6977, 9853, 12626, 9603, 7360]
28683G360O99J561n57K900p10m737j741L21r09N996A340O718l400J220J616A431
28666D876L934l176q7B262J1051m338j563n86B196N293C681N467l280R51B486
28650D005K385l14N76J995k52N80k852k07K159J440J412l300l532R880F461j490
28634D971M306l530B454N404J612D329M903k561L240M93O123p173k475N961l338
28619I502k362R15K2k53N24k371j6Q52k943N428l312K5J82k414Q935B317P170
28602I487A993a55G178l149O601C176K616N007o02k289l579L395A17J2588o30
28587A2075C389O723D334L757l971L869B553N032l003J11M072l364K212B321M358
28572F679j176h60E522E88J895q00K606L718J341m519L929G52M152M66k230O808
$$ y = [7360, 8059, 9620, 9063, 11963, 11253, 6516, 4775, 5096, 4187, 10183, 1340, 8058, 4658, 5878, 7494, 1431, 4876, 8810, 5634, 5547, 2262, 13313, 8975, 7412, 6826, 2196, 7489, 3681, 9148, 5868, 6819, 2486, 4005, 6390, 6076, 6652, 8647, 8395, 8975, 6123, 5916, 8075, 9515, 10927, 7627, 4095, 13975, 6461, 4971, 9277, 5747, 2454, 7858, 9470, 4329, 9232, 6671, 9911, 10404, 16527, 9354, 6879, 12840, 9502, 7140, 8055, 8077, 7824, 8348, 5977, 5961, 6813, 3870, 9298, 5986, 6011, 6193, 3779, 12714, 2317, 9487, 1993, -155, 7178, 4029, 10630, 3176, 5792, 10799, 10197, 7908, 4329, 7724, 117, 12705, 12075, 3389, 10112, 4334, 8091, 4120, 7989, 2553, 7585, 4582, 4693, 8765, 5401, 7613, 2321, 6679, 5503, -860, 5522, 588, 2483, 1683, 4289, 8007, 9348, 4829, 8758, 752, 4904, 5370, 3140, 9948]
28556I948D411Q874m997k256J824k944L978l317m36L324l461A054O003A551K929
28541D480P68j595L025p13N206m505L516A79P128l243M357B126P506j014l494
28526E124J392k970J618J000N69k53l58P418F285J037M511j986l346j261J1812
28511A7052m423E074j390L732K169P11J318q40k987l154n39M219R40j631k638
28496D984J553n9A882K066L542K629q68P17N700D234M539P42J224j270l618L481
28480I332j058C804Q884o240j9L145O037F941J147J217l263M661k788K004R95
28465A0914j101m168q11j346L212j526A980K913M60J485J748q80k651P545F145
28449A2933E479R38M515K078k509D488P90L714k593M223B545N187q19k279j661
$$ y = [9948, 4411, 13285, 8288, 6032, 7856, 4912, 8890, 5573, 5137, 8461, 5000, 1054, 7057, 1551, 4480, 5248, 3653, 6678, 5965, 11171, 6666, 10182, 179, 7307, 4064, 8421, 2126, 9632, 8618, 5124, 6516, 3546, 5164, 6164, 6733, 6480, 6122, 13540, 6285, 7322, 11833, 9847, 6501, 5240, 17052, 12629, 5074, 3684, 7416, 9585, 10296, 11614, 10774, 7787, 4633, 4094, 8313, 9253, 7622, 4984, 6537, 6478, 1882, 3948, 7490, 10119, 9251, 9968, 15668, 4234, 8773, 9515, 10739, 9469, 5851, 9332, 8274, 3804, 12688, 6448, 6429, 9574, 15611, 6941, 8088, 9305, 6042, 10703, 7915, 9919, 10914, 9813, 5645, 4834, 3488, 6700, 5174, 1980, 4893, 5353, 6838, 8586, 7706, 5055, 12600, 6145, 12933, 5479, 6417, 10932, 13010, 10501, 4488, 5278, 8992, 6399, 10622, 2545, 7732, 6913, 4634, 2973]
28434B973J310B042M058K930L861B751M615J773g91A1894B097O976l538J622O093
28419A3250k460C301K523k832N03Q242m281K624M92m028K090K479j959b178G308
28403E001K632j94P49B454K041N293m794K812k203K364L925C244M998P58H22M420
28387E242l59A371O205K754C844j556M055J894l097j551j080J643R49k207L541
28372F435k434A876K738J856j140g09B625L733p14p76j18K023P95J268j170k781
28356D885R67B128J954R277K126G055N854n463l076Q646o464J829j591L65O117
28341A3272K66o109A676M623B891K195J359K665j345J576C307P319K533l962M110
28326A3307C315O669k970M695j634l678C106K590M374j332m102Q21N058D853P789
$$ y = [2973, 4283, 2042, 6100, 9030, 12891, 2751, 7366, 9139, -791, 11894, 2097, 9073, 5535, 7157, 13250, 10790, 3301, 5824, 2992, 3495, 11737, 7456, 10080, 10572, 6544, 8634, 11113, 9154, -2178, 7308, 5001, 7633, 7439, 8188, 2454, 4495, 9788, 4994, 7806, 5603, 7967, 11892, 3244, 8242, 9000, 822, 5242, 4883, 1371, 7576, 10330, 3844, 2288, 6343, 8237, 5140, 3589, 2509, 4152, 5101, 2894, 6435, 4001, 1876, 4614, 6470, 5330, -709, 2625, 6358, 5644, 4868, 4750, 6773, 7568, 8836, 7666, 4885, 5852, 2128, 4082, 13359, 15485, 7055, 12909, 7446, 4370, 13016, 6552, 8381, 6790, 7155, 13272, 13538, 7429, 1676, 6299, 2891, 5086, 6445, 9110, 7765, 9341, 3307, 10626, 13159, 9197, 13307, 3315, 9984, 7014, 11709, 10075, 6397, 3106, 5696, 10070, 8738, 4636, 5457, 10515, 4853, 12642]
28311A2642m288K325L336n267j313l364j085M144j69M577J758l611l600o00j129
28296D356Q862C146J0514A122N389j549K020r55L968l065j486J680B659R396B47
28280D780B388L644a481G287d41A3921C390K860K702C419J0040m410m044O432
28266A1437l487k918K148k287B287P249m765K121O145k466m330P689o729q29B126
28250E211B326K963I51K086K116P647l367D050K235B969J146J79K239Q666A590
28234A1387l950k609K488A689P506J421A881M819K369l147J230N50M396J706A861
28218I321K86j663K359j675k315L010k891m04O32L725m802q99M152j387M545k414
28202I580B693N197l211O279l29j489O231k720n236j201Q311p078L204D049P084
$$ y = [12642, 8354, 10679, 14015, 8748, 7435, 4071, 2986, 7130, 6961, 11538, 13296, 9685, 6085, 5485, 4356, 13218, 3146, 13660, 1122, 6511, 4962, 6982, 6027, 9995, 6930, 5444, 7124, 2659, 12055, 247, 4780, 2388, 6032, -1481, 7287, -441, 13921, 3390, 6250, 8952, 3419, 13459, 9049, 5005, 11437, 7950, 5032, 7180, 4893, 2287, 9536, 4771, 6892, 13037, 10571, 6241, 13930, 7201, 6372, 2126, 5211, 2326, 5289, 951, 3037, 5153, 12800, 9433, 4050, 6285, 2969, 4115, 4294, 6533, 15199, 1590, 11387, 7437, 4828, 7316, 1689, 9195, 10616, 1881, 6700, 9069, 5922, 7152, 7702, 12098, 13804, 1861, 9321, 9607, 7944, 10303, 8628, 6313, 9323, 6432, 6028, 6660, 10385, 5583, 4684, 8836, 7449, 11994, 9580, 2693, 7890, 4679, 10958, 10629, 9140, 15371, 12651, 7415, 6214, 14525, 7447, 10651, 4049, 11133]
28187A1133m884K215J679M499k19n659J038O14N54J668j021Q37K983p060J401
28172I778j119J096j931P55R02m481R345m673N423n212k10L573j828K219k765
28157A0872M659F707O89K621r19K543J973j426L175G298R216l678k338M226o886
28142G838r16L366j477k685m45R448B814M662J350B308O868N099l654j699L154
28127A2076m667N452E044N567l170O925n28D737R452o395j323K89L358l996K644
28112H766M07P10j773J94l788L264j39N528k753L901L522n089n012N159l290j447
28096H160N423o627K628L024L465m624n406K695K724q17m99j337K03l146K595
28081H461K471L647k487j940K595J712o301n49A726O644N825D935k195R001E219
$$ y = [11133, 6249, 8464, 10143, 14642, 14423, 8764, 9802, 10416, 10970, 12638, 11617, 12454, 15437, 8377, 9778, 8659, 9755, 7824, 8579, 9481, 5000, 14345, 9672, 15095, 9883, 9673, 13246, 11418, 13637, 10872, 15531, 6707, 7396, 10017, 9098, 11641, 13614, 12188, 15363, 7298, 16514, 12836, 10498, 14724, 7838, 6922, 10288, 8811, 6126, 5681, 15129, 2814, 7476, 8826, 2308, 9176, 14275, 10621, 8922, 12076, 7409, 12861, 5044, 10611, 7441, 14366, 13838, 4737, 14189, 7794, 6471, 6760, 10118, 6122, 8766, 9173, 9883, 8110, 8304, 4516, 7780, 7641, 13169, 10416, 14317, 17839, 12750, 7738, 12897, 9607, 8160, 13583, 6956, 9584, 12608, 16073, 11449, 6043, 8738, 11462, 10645, 10146, 8809, 9012, 5866, 8461, 10932, 14579, 12092, 10152, 12747, 14459, 8158, 7609, 1726, 8370, 14195, 4935, 2740, 11741, 5219]
28065H731J638m872k710N357l866P386m025J300b204G752N84r88M336D473B04
28049I419K717A998J1279n004j645l02N992E128J902B269R594E787O780N50l669
28034I448m2l316K755k014L344L347n144k16J524D039N28L24k049J1876E405A397
28017A6155E895K781Q18M811F670C002J3534k576n157D266L443K676K594k42n218
28002G519O096m995N927L437m327o97K403m856M104l96F589N304J020j69l315
27987I429j239L053J126L447o521p23O132l406q61M165q73K818o354N324p491
27972H026O112M15p177L294l210R239j756k488j677M498l973p46j390J05M479
27957A3751k774p26L656J89n779M008J348L557l452N008p023L373O182r29M12
$$ y = [8731, 10369, 5497, 2787, 8144, 4278, 11664, 7639, 8939, -2204, 7752, 8336, 7348, 11684, 4473, 204, 9419, 12136, 1998, 13277, 8273, 6628, 6326, 12318, 5128, 7030, 2269, 11863, 5787, 12567, 13117, 9448, 9406, 6090, 8845, 6831, 10175, 13522, 8378, 8162, 9686, 4039, 4567, 4891, 2842, 14718, 5405, 1397, 16155, 5895, 8676, 9494, 14305, 6670, 3002, 16536, 13960, 8803, 4266, 7709, 10385, 12979, 12737, 7519, 13615, 8620, 14547, 17984, 13657, 12960, 15363, 10507, 14611, 14215, 6589, 11893, 12913, 12744, 9429, 8190, 11243, 12369, 15816, 9295, 8572, 14704, 11298, 10437, 14602, 13729, 16547, 10193, 15517, 8026, 14138, 14553, 7376, 10670, 7460, 16699, 14943, 12455, 10778, 15276, 11303, 10557, 9167, 9272, 13751, 10977, 10251, 13907, 14096, 8317, 12325, 13673, 17230, 13778, 18786, 11763, 15136, 21318, 20389, 20801]
27942B0801o604N024j121k3L069l852j377N836m425j950l663L127N493j843j567
27927A6925n96M061p110j044M937o595J0377j377k285l186J158K672l590o55K766
27912A6458P148j0120L296k896l076M893K774n685K059L132l622K886L395p913
27898A2729R99J1376j657n688j002J412J388l044Q486n109n032j184O527J088
27884B1289r956N296M627k452j502J874n718k628o91J350l3L132K111l132N754
27869A9321l976j627M623p874M417R15J133m763K108J0236j1297P065r952k64
27855A0065J582L599R60L750n954m375Q105l296o241l314N101K980L274F016N194
27840A1210J046l394D058O735C581M38J302O037j469l282J010B652P642D380J721
$$ y = [20801, 14197, 19221, 18100, 18077, 21146, 17294, 15917, 21753, 17328, 15378, 11715, 14842, 20335, 18492, 16925, 16329, 20390, 13280, 12236, 17173, 10578, 20955, 19578, 17293, 14107, 15265, 17937, 14347, 13692, 16458, 23606, 13486, 16782, 13886, 10810, 15703, 18477, 12792, 14851, 17983, 14361, 17247, 20642, 12729, 13728, 25104, 23447, 17759, 16757, 18169, 19557, 16513, 24999, 19890, 14858, 13674, 20201, 21289, 11333, 16629, 21256, 18804, 17302, 19176, 13458, 10830, 10139, 11489, 11456, 14588, 16699, 13567, 19321, 15345, 13718, 18341, 10467, 14884, 15799, 16932, 12169, 14277, 24513, 13216, 20281, 10329, 10065, 11647, 15246, 16206, 19956, 14002, 9627, 17732, 14436, 8195, 4881, 9982, 12962, 16236, 6016, 11210, 12256, 8862, 4058, 10793, 3581, 4019, 5321, 11358, 9889, 6607, 7617, 2652, 10294, 4380, 6101]
27825F101j178J888q02P07j077M646k760j772N535m171k248L217K263p25o02K385
27809A1407J15N343l915N41k756J781l394l816N029C128Q528m531M555E580N514
27794A1094L367j697j862j881L94p01J746J392J43E488J2651b19I508m167Q971
27779A4312m356k069O950k757l367N097F539P431m957J902j026D324K902K871
27765A0097j47k00N157G203K615k934O156m896k09N061k141n095L853k192j167
27750F254M723O94k017l28M873l625k922k67R70N785J284n907L519k829r85m81
27734H741M936k664R210l468L522l267K886m270J337m62N949l353J581P536q328
27719A9886j751J185J661o909N897K968q019O483p906j984P65Q79k074P39J585
$$ y = [6101, 4923, 6811, 6009, 6716, 5639, 10285, 7525, 5753, 11288, 7117, 4869, 8086, 10349, 9624, 9022, 11407, 11522, 16865, 12950, 13491, 10735, 12516, 9122, 5306, 10335, 3128, 11656, 7125, 11680, 5580, 11094, 14461, 12764, 10902, 9021, 9415, 8714, 10460, 11852, 11995, 5488, 18139, -219, 9508, 5341, 14312, 9956, 7887, 14837, 12080, 8713, 13810, 6539, 13970, 9013, 10915, 9889, 4324, 7226, 10097, 9950, 9750, 14907, 7203, 9818, 6884, 13040, 8144, 7935, 12996, 10855, 5760, 9613, 7421, 6254, 10977, 11671, 9654, 9326, 14199, 10574, 7652, 7385, 8355, 14140, 15424, 9517, 13036, 10207, 9222, 8741, 13677, 11013, 20223, 16755, 20277, 17010, 19896, 15626, 16963, 16501, 22450, 19097, 20678, 28214, 19886, 18135, 19320, 20981, 14072, 19969, 22937, 14918, 21401, 13495, 11511, 12276, 13155, 11081, 11820, 13405]
27704A3405K561F032L795L746E044L597R73J942j397k070L278M673m638l77L357
27689A4382J286n322j773P579l09o561L484J032l396J49m72J934m506N214k348
27674A0373r20N318q23N368o944j451N272k933N330j523k809k628L017Q71l878
27659A1640m170O875r96J048L348M554G707J0664n834O79j194E536Q546J249o686
27644H645K47P569l076L390p330L753J015J699n633Q002G683J0309j496l114J425
27629A4807k378P75J752N511n766m76Q68k609j208J637L689j697O27k409L691
27614A6814p30O30O834r408Q048n640l606K342Q90L503n551M228K875j0212J584
27599A2601J0412n532n422R615m167J323j677K149l74o736J0225l841L676n873
$$ y = [13405, 15966, 6032, 9827, 13573, 5044, 8641, 9614, 11556, 10159, 8089, 11367, 16040, 11402, 11025, 14382, 15668, 10346, 8573, 16152, 15843, 9282, 12766, 13798, 10402, 10551, 10079, 12013, 7507, 12721, 10373, 9453, 14771, 13948, 19316, 12372, 10921, 16193, 13260, 18590, 17067, 14258, 11630, 14647, 15518, 11640, 7470, 14345, 13349, 14397, 17745, 22299, 7707, 18371, 12537, 13216, 12022, 5536, 14082, 15331, 8645, 8892, 16461, 13385, 16775, 9445, 13198, 14213, 15912, 10279, 18281, 7683, 17992, 16496, 13382, 14807, 12429, 13204, 14956, 20467, 14701, 14225, 15093, 12484, 11276, 12913, 16602, 14905, 15532, 13123, 16814, 16084, 16714, 23548, 14140, 22188, 16548, 12942, 15284, 16174, 19677, 14126, 18354, 21229, 11017, 12601, 23013, 17481, 12059, 21674, 17507, 18830, 17153, 19302, 18928, 12192, 22417, 18576, 22252, 16379]
27585A6379n221L919M594j90p468J411J947P745j723k835N275r820M827l640L960
27570A9160O71M837r117M824o882K53N185n175m60M497L134p563M856m027k214
27555A1979M710K475j890l539j159L940M877o251M431J61l610N28J427k991L589
27540A8677K608o347M311k133k597N1O372o044j505O491B717J3423J679l249J495
27525A6065l582M111m809J034P73N724q277j03R076r449L288o773J2401p076J982
27510A4385J250l245k628K460j707J742N98M061l193D550J2988n588J687p00n049
27495G888J0774k634j175o171L740j452j70D675Q030J054O933r002J170L206n013
27480A1053N940k819j739J225j921j206j760Q482n991N228K064n358M642o301
$$ y = [16379, 11158, 15077, 19671, 19481, 12013, 13424, 15371, 23116, 21393, 18558, 23833, 14013, 18840, 15200, 19160, 19831, 24668, 15551, 20375, 13493, 13746, 18931, 13756, 13296, 17793, 20927, 13364, 18220, 14193, 11979, 16689, 19164, 17274, 13735, 12576, 16516, 21393, 15142, 19573, 19734, 16124, 16652, 18079, 15088, 18677, 21285, 14938, 19249, 17116, 14519, 14570, 20942, 14898, 13393, 19884, 2717, 16140, 17819, 14570, 16065, 12483, 16594, 11785, 12819, 13592, 19316, 11039, 10936, 20012, 10563, 13851, 7078, 19479, 12403, 14385, 15635, 12390, 9762, 12222, 10515, 12257, 12855, 16916, 13723, 4550, 17538, 11950, 13637, 12937, 7888, 18662, 16028, 14853, 8682, 12422, 10970, 10800, 4675, 12705, 13759, 20692, 11690, 12860, 16066, 11053, 16993, 14174, 12435, 13660, 11739, 10533, 8773, 17255, 11264, 16492, 18556, 13198, 17840, 11539]
27466A1539N62j803N116j348F252J0901m611P247m817l488N433k674r12M622l333
27451A4620J122q44J97n349L397M934K798p351K429j207Q40K145n180j672Q320
27436A9199o505L754L24n558M252J307J240o99j73k144M201l407Ok379L977j866
27420A5529L271p204O294H727N991o91O220I633O65P459n283O152p495j318M578
27405A4391O318o683p18n709Q073m319N209m798j170L053k377J518N058l49k378
27390A5119m344P372Q85k680l524k168M532M789r140R027o236J719K75k551N94
27375A3669N8N80Q97l158R552G249N072L996j345J861p90P16l570p98N385P93
27359A8569j545J029j839J537j926J394L419r209K860R10K702k579n75L389n829
$$ y = [11539, 12101, 10298, 15414, 14066, 6252, 17153, 12542, 19789, 14972, 11484, 16917, 14243, 13331, 17953, 14620, 15742, 14898, 15095, 9746, 13143, 18077, 20875, 13524, 15953, 14746, 15586, 17731, 12551, 10879, 19199, 12694, 16448, 16772, 11214, 15466, 16773, 18013, 17314, 17141, 14997, 19198, 15791, 15797, 13418, 17395, 15529, 18800, 11596, 17890, 8727, 14718, 14027, 20247, 9633, 10298, 17757, 12474, 18626, 11131, 9813, 14391, 20709, 14026, 13308, 7599, 15672, 11353, 16562, 11764, 10594, 13647, 11270, 12788, 17846, 17497, 15119, 10775, 18147, 19032, 16352, 12828, 10660, 15192, 19981, 10841, 19868, 13632, 15351, 15626, 13075, 13669, 13727, 14307, 15204, 12046, 21598, 7249, 12321, 16317, 14972, 16833, 16043, 16759, 13189, 12391, 17776, 18569, 17024, 18053, 16214, 17751, 15825, 17219, 20638, 11429, 14289, 15199, 17901, 15322, 14747, 18136, 12307]
27344A2307P232l175n803P524K073n260k578j916N755k238K747p015Q243k236
27330A5660j833M610k031N04J079m883L937k436L74O64q42M364j495j410P308
27315B3570A0877Q539N76o328J031L8M978N15p210l463J2537p469M351l551N352
27300B0773p048K236l707M769L912o673N787p785Q319n603K52j5L626l825O713
27285B1731j0673N502j785J0073o82n267J465m511K153M421q890J497J1141q017
27271A8158Q67J82j267j243J233l704J011J653N334J244J299l499K35K494p858
27256A6139L907J312K604l736m511L32P159m185J33K931J831p48l827M685q581
27241A5445K933p5K055k44m504K480P440p617J1418r018k319P833k652n726O915
$$ y = [12307, 19539, 16364, 10561, 18085, 20158, 14898, 12320, 10404, 16159, 13921, 16668, 9653, 17896, 15660, 13827, 18437, 16406, 16910, 17989, 13106, 17043, 14607, 14981, 15645, 14803, 19167, 17672, 16262, 23570, 10877, 19416, 19992, 13664, 14695, 14733, 19711, 20226, 13016, 9553, 22090, 14621, 18972, 15421, 20773, 13725, 15961, 12254, 17023, 20935, 14262, 20049, 12264, 20583, 14980, 15232, 15217, 18843, 15018, 21731, 11058, 16560, 14775, 24848, 24166, 18899, 20364, 15853, 18006, 22427, 13537, 15034, 26175, 18158, 19025, 19207, 17940, 16697, 17930, 14226, 15237, 16890, 22224, 23468, 24767, 21268, 21503, 23997, 16139, 20046, 21358, 23962, 20226, 15715, 16047, 23206, 19021, 19154, 22085, 23916, 23168, 19341, 24026, 15445, 18378, 18303, 20358, 20114, 15610, 18090, 25530, 17913, 29331, 20313, 17994, 25827, 23175, 17449, 24364]
27226B4364l336p156R336K114n363O83j279R41k549M30k966M449K186k2K609q762
27210A5679K629K121J678m303L322k297k227N249J772l175K828A1237J4481n808
27196A9910J607o732O581n35l28o292N785k185P630I451N362M704K153q203R192
27181B2659o765K838j170l08J726n536O444p345R138o702L481n722O617L635k869
27166B0121J448k749o869K646R479q822N020n812j65L356M5P162J187k46p139
27151A8662k387N527L941k407l527M3j687m105l07N419M437k047m355L108q665
27136A1650R492J858n333J811k089Q78L316J155j12n950Q805l462K064m530P04
27121B0257j026L311K9J190M076l169l148J852m274o3K90P400m659k917O717o90
$$ y = [24364, 21028, 13872, 23208, 25322, 19959, 20642, 19363, 20304, 17755, 18185, 15219, 19668, 21854, 21832, 24441, 15679, 18308, 20429, 22107, 17804, 21126, 18829, 16602, 21851, 23623, 20448, 23276, 11237, 25718, 19910, 21517, 14785, 21366, 20831, 20503, 14211, 19996, 17811, 25441, 9451, 14813, 19517, 21670, 13467, 22659, 15894, 18732, 17562, 17254, 18980, 13444, 19888, 12543, 21681, 14979, 18460, 12738, 19355, 22990, 20121, 21569, 18820, 11951, 14597, 24076, 15254, 20274, 14462, 14297, 17653, 17698, 24860, 26047, 25801, 18662, 16275, 21802, 25743, 23336, 19809, 19852, 18165, 14060, 13753, 19172, 23609, 21562, 17207, 20315, 11650, 21142, 23000, 17667, 19478, 17389, 18267, 21583, 22738, 22626, 16676, 25481, 22019, 24083, 19553, 20257, 19231, 22542, 22571, 23761, 27837, 24668, 21520, 23372, 19098, 19035, 19325, 26725, 22066, 19149, 25866, 25176]
27105B5176l026Q349k459q56n402O114l940K808O29l690Q184n169J818n738K597
27090B5395k843j555N268o012N615l291k617M62N449m131K562K421k713J956n161
27075B0805k373K856M0m68o113K168N797K646P83m453J482j348N37l77o351M289
27059A9920l85k651K831l428N646l547k849K886L280j742j946k317M943k494o419
27044A1728R710j386l264J278J084K613l282J0497q212J586K479P850j4870j675
27030A6136j188N816J653m923N718l658l036J331M841Q53m149M441p568P427j293
27015B2401M06l457P98n63N230q755l082N922k550M633j500J243J416r9P7N013
26999B7133r582P118m162J367N59m37k485O694m726k113N138k754p317N085k031
$$ y = [25176, 22150, 30499, 28040, 27184, 21782, 27896, 23956, 26764, 27393, 23703, 31887, 26718, 28536, 22798, 25395, 22552, 20997, 26265, 20253, 25868, 22577, 19960, 20422, 25871, 21740, 24302, 26723, 24010, 25966, 20805, 18432, 21288, 21328, 20860, 14747, 16915, 22712, 25358, 26141, 21688, 23170, 21822, 22359, 21982, 15631, 19920, 19535, 16884, 19715, 16287, 21933, 18386, 15537, 18423, 21703, 19961, 18015, 15698, 20641, 18147, 11728, 21438, 20052, 16788, 18066, 19150, 21763, 18481, 28978, 20766, 22352, 24831, 32681, 17811, 16136, 14948, 20764, 22417, 17494, 23212, 19554, 16518, 17849, 22690, 23543, 19394, 23835, 16267, 23694, 22401, 22807, 19350, 20148, 19585, 24815, 16060, 12978, 18900, 16350, 20983, 19483, 20726, 22142, 22043, 22120, 27133, 17551, 24669, 20507, 21874, 22433, 21996, 19511, 26205, 21479, 19366, 24504, 21750, 14433, 19518, 17487]
26984A7487J392n08Q33j829N315L225q883k653N097R88r68J700n91l959L713n465
26968A4894N631j784P57K143p83L16l502K752J38N742o553k909k89P424q178M696
26952B0495m311Q335k778l071N37L306O60q190N488j622J99K446m221P98M846
26937B2917l466K665l378M273j099k514O232L02o556N192k582q184R190R02m879
26922A9015O222l141L89l71m501J961q30N266l588l01M235m690n113R259l951
26907A9861R45L934N44l826p446J1379J000j0614Q866k720n19n149N544m96j548
26892A9755M036q672J366J865K756j336L25J018J686l926L193N87O05l863m435
26877A4960N554l263J669M50M057p920R357n733O462J108n111j195M115J450J448
$$ y = [17487, 18879, 18371, 19204, 17375, 22690, 25915, 17032, 14379, 19476, 20464, 19496, 21196, 20605, 16646, 20359, 14894, 20525, 18741, 19498, 21641, 20858, 21174, 17672, 20424, 20562, 26304, 19751, 16842, 16553, 23977, 15799, 20495, 16184, 24519, 21741, 18670, 19207, 22513, 23173, 14983, 20471, 18849, 19048, 21494, 17273, 18071, 22917, 19451, 22116, 18738, 23011, 21912, 19398, 25630, 25932, 19376, 24568, 21986, 13802, 22992, 23894, 19015, 25237, 22096, 22485, 22114, 17613, 19574, 18744, 24010, 20422, 20121, 24356, 19666, 14553, 23812, 19861, 20806, 24740, 25284, 21458, 14012, 25391, 26391, 15777, 24643, 21923, 21404, 16255, 21799, 21303, 19755, 23791, 15119, 16485, 18350, 21106, 19770, 20095, 21113, 22799, 18873, 22066, 22653, 23258, 19395, 14960, 20514, 17251, 18920, 19370, 23427, 15507, 24864, 19131, 25593, 26701, 21590, 20395, 24510, 25960, 27408]
26862B7408n348l082K450m000N080o20n524R429j265o7n867P49j952M364J213
26847B2968m564L523K985m308m16N716K251p700K178k426j480O081m767j385P093
26832B5749R12n952k107J0728p091L859l629M996p142O401l957K872j877n80L330
26817B6512j0719M344M964l536L41O600m948O545k354l365J585M08O406q042J264
26802B6005L903m763L381r53K167k858L463K316O77p718Q698J364k653l501Q368
26787C7896l798k217K156j399j369j358j027J258n876M727o02k789L930m694p81
26772B4057L022k256k155K854K052k200L921m897J028J717M018j104p077L891
26758B6871k259O637p350L341J684o346N037j2608O588J2203j3835O525j826L902
$$ y = [27408, 22060, 18978, 21428, 17428, 22508, 21888, 16364, 25793, 24528, 24461, 18594, 19343, 17391, 21755, 22968, 18404, 21927, 24912, 20604, 20188, 25904, 28155, 20455, 22633, 20207, 18727, 24808, 20041, 18656, 25749, 26661, 20709, 18602, 29330, 22239, 26098, 22469, 27465, 20323, 26724, 22767, 25639, 23762, 23182, 26512, 15793, 20137, 25101, 21565, 21906, 28506, 23558, 30103, 27749, 24384, 25969, 26377, 32783, 24741, 26005, 29908, 25145, 28526, 27573, 29740, 26882, 30345, 32661, 33338, 25620, 34318, 35682, 33029, 29528, 37896, 34098, 31881, 34037, 32638, 31269, 29911, 28884, 30142, 24266, 28993, 28391, 25602, 29532, 24838, 24057, 27079, 24823, 22668, 25522, 27574, 25374, 29295, 24398, 25426, 27143, 31161, 30057, 22980, 26871, 24612, 31249, 23899, 27240, 28924, 22578, 27615, 15007, 21595, 33798, 19963, 26488, 24662, 28564]
26744B8564p923P000l501M2N209p473m8j720R760n171L693o065K005L652k489
26729B5535q666K178O373k219mm664N473L630j1012Q218K206k639J959o287R245
26714B9326l760P54j204m280N166p90k548k51M842n635L957K285o313O609j1777
26699A6381J0230l076o97K840Q66k905J862L238l076k588N309q172M07Q483q968
26684B0134P522n10O68O66j0421M127N509k728p95k079O45m65L742l385J527N467
26668B9624p341N479r169N85R293K633p134K94P83J820q86j732J304p357Q931
26653B7127N131j1558M304j900k953M991r00J889P25J635l437M148p213K025q
26638B4006Q063j2057K260O54K253P91J573Q46l450L179r114M954n99l47n1L14
$$ y = [28564, 20641, 27641, 24140, 24182, 29391, 21918, 21870, 20150, 29910, 24739, 28432, 22367, 24372, 28024, 25535, 16869, 19047, 25420, 23201, 23197, 18533, 24006, 27636, 16624, 24842, 27048, 24409, 26368, 20081, 29326, 25566, 26320, 25116, 20836, 26002, 25212, 22664, 22413, 27255, 21620, 25577, 27862, 21549, 28158, 16381, 26611, 23535, 22838, 25678, 26544, 23639, 25501, 28739, 25663, 23075, 28384, 20212, 20619, 29102, 20134, 27656, 27146, 27814, 28480, 18059, 22186, 27695, 24967, 24172, 22093, 22738, 22273, 26015, 22630, 24157, 29624, 22283, 27762, 18593, 19178, 28471, 31104, 23970, 24264, 25047, 26867, 25981, 24249, 25553, 18196, 27127, 32258, 20700, 25004, 23104, 20151, 25142, 24242, 26131, 26856, 28491, 25054, 29202, 21989, 24014, 24006, 32069, 20012, 22272, 22926, 25179, 25970, 27543, 28389, 24939, 28118, 19004, 23958, 23359, 23012, 22961, 23275]
26622B3275M367j595l55j07j428K978r65O00j660r84K035n30N28K389Q72n798
26606B3622j657N754l651K407O07k512J260N996k848n244L790m7m562m25P323
26591B9813p363J0656o834K923j214L037q750O236j973K189J635q645M120r6K085
26576B7819N268m722k194k58L658m676P183p512J039L287N294n974J310L301j1554
26561B1269J1996m569J428L83n072Q965p870N164K478M34k867J442m253j257Q64
26546B8535J1252o867m159K793m170K329M946k921m524M369M65K447k27l081k699
26531B8488N912K036J778K951p878K173O304j969P518p764L494M467q548O40J606
26516D1208j085n036j026K38q35p230P903q38j157J935j074J667O03n664J0667
$$ y = [23275, 27642, 26047, 25692, 25585, 24157, 27135, 26170, 26770, 25110, 24126, 26161, 25631, 26159, 28548, 29420, 23622, 21965, 27719, 24068, 26475, 27082, 24570, 25830, 31826, 28978, 23734, 27524, 27477, 22915, 22490, 29813, 22450, 33106, 26272, 29195, 27981, 31018, 22268, 28504, 26531, 28720, 30355, 21710, 25830, 25734, 27819, 33087, 28365, 26171, 25913, 29571, 24895, 32078, 24566, 25605, 28892, 34186, 28212, 29522, 32823, 21269, 33265, 28696, 30124, 30507, 25435, 34400, 26530, 31694, 34172, 34606, 31739, 33181, 28928, 27671, 28535, 39787, 32920, 28761, 31554, 27384, 29713, 34659, 31738, 27214, 31583, 32048, 34495, 34268, 31187, 28488, 34400, 36436, 38214, 41165, 33287, 35460, 41764, 39795, 47313, 39549, 43043, 47510, 38962, 39602, 41208, 40123, 35087, 34061, 34299, 33464, 26234, 34137, 33299, 32142, 34077, 33003, 34670, 35273, 29609, 40276]
26501D0276J997m177l786M780l062Q39M393n28j434N8K989K688N237l665K284
26486D8889J584o260j1794R119m213j060L873l517M106o787L293l362K566K947
26472C9384q512O380k494J228l02j283L571M47l614Q505o855J164L938l396K72
26457C8433j318j114O053J077o477O454k696N10o891J972j035M188Q67q355N235
26442C6903P497j1807L852k01j374l64M322p42k264j466J895k414L921J615n809
26427C3564K934m389J3238j2702J255J098O985p463O620k564M325n216o92l633
26413C3360R23l590M655Q73J251l644K602l461Q55J393j423k083Q063k302n754
26398C1718L81J222K099rJ132K28J181q342Q040K263o734M120K740l886k157N144
$$ y = [40276, 42273, 38096, 34310, 39090, 36028, 36867, 41260, 40732, 39298, 39356, 42345, 45033, 50270, 46605, 48889, 50473, 44213, 32419, 41538, 37325, 36265, 40138, 36621, 40727, 33940, 37233, 33871, 36437, 39384, 30872, 37252, 34758, 35986, 35684, 34401, 37972, 38419, 34805, 43310, 36455, 37619, 41557, 38161, 38433, 37115, 36001, 42054, 43131, 36654, 43108, 40412, 40922, 34031, 36003, 34968, 39156, 40023, 31668, 36903, 44400, 32593, 36445, 36244, 34870, 34506, 38828, 38086, 35822, 34356, 36251, 33837, 37758, 39373, 33564, 36498, 32109, 45347, 32645, 33900, 34998, 41983, 34520, 41140, 38576, 42901, 37685, 36993, 33360, 34283, 30693, 35348, 36221, 37472, 33828, 36430, 32969, 33824, 35217, 33794, 31711, 39774, 37472, 31718, 32099, 33321, 35420, 35411, 36543, 36771, 37952, 29610, 37650, 39913, 33179, 37299, 40039, 36153, 33996, 39140]
26382C9140l704O427j1995L442K039L653n721K695L231K964o304M513q203J0131
26368D2308j806j375m506K223N918o351K329n98K627n005J947L454q454N095l36
26353C7470K271k631K104K421p142K648Q967q129k788Q106m579l407K501L568
26339D1380K164L303q931j505M490K227n159K824K971l088J249j906K560L292
26325D5871l835M2k694L521L355m146K356l420o23N614k610K094j821k396J4228
26310E5536n588m891L446M656p099k91N682k022l316O76j01K758j450J321l450
26295D5867L342O34j794L65k976K0l622M09O819J351n1o331R966L663o321o544
26279D4797P897L456k729P164j550m570K937J148l737R816p677L851k284J81K221
$$ y = [39140, 35436, 41863, 29868, 33310, 35349, 39002, 33281, 35976, 39207, 42171, 35867, 40380, 32177, 42308, 40502, 39127, 34621, 36844, 42762, 36411, 38740, 38142, 40769, 35764, 37711, 41165, 32711, 37806, 37470, 39741, 37110, 39214, 41635, 34493, 37141, 46108, 37979, 35191, 43297, 38718, 35311, 37812, 41380, 43544, 46847, 37916, 36411, 40901, 43128, 37969, 40793, 43764, 40676, 41925, 40019, 42579, 45871, 42036, 42078, 39384, 42905, 46260, 42114, 44470, 41050, 40427, 46041, 43431, 45525, 43704, 41308, 55536, 49948, 45057, 48503, 53159, 46060, 45769, 51451, 49429, 46113, 46789, 46688, 49446, 47996, 49317, 45867, 49209, 49843, 48049, 48414, 45438, 45458, 41836, 42245, 49064, 50415, 50364, 44033, 53999, 57662, 51341, 44797, 52694, 56150, 53421, 60585, 59035, 54465, 57402, 58550, 54813, 64629, 56952, 60803, 58519, 58700, 60921]
26264F0921L043n157O684J751k849M40Q049j444M24Q300l344J781K404J397L446
26249H5846M124j2J531o2M807R465k895P242O071O641J0496P312J2420K2472J7025
26234A92483K1089K4297K8895L0020M1427L8319M3769M6134N8239N8227P9075
26223F61974Q9941R1826O7448j9621o4847p8783q0153o5398n8180m7018m2302
26212D54887k6069l0840k0610j6807j0730n189Q147J8717K2362L0445M1102N4577
26200E19992O6891P4462Q1606J01942J12439J26930J40482J51080J71029K06818
26190A753671K73731K85788K04947l096j92793k63904k56869k29367j90685j58212
26180A223211j32841j19148j02160r5161p6834p2771n1007l3464k3322k9J4545
$$ y = [60921, 63964, 58807, 65491, 67242, 64393, 64833, 72882, 71438, 71862, 80162, 76818, 78599, 81003, 82400, 85846, 89970, 89958, 91489, 91427, 96234, 105699, 102804, 110046, 116117, 122758, 133254, 140566, 152986, 175458, 192483, 213572, 237869, 266764, 296784, 338211, 376530, 420299, 466433, 524672, 582899, 661974, 751915, 843741, 911189, 891568, 826721, 747938, 667785, 602387, 544207, 497189, 454887, 428818, 397978, 377368, 360561, 349831, 344642, 352789, 371506, 393868, 424313, 465415, 519992, 586883, 661345, 742951, 844893, 957332, 1084262, 1224744, 1375824, 1546853, 1753671, 2027402, 2313190, 2518137, 2515041, 2322248, 2058344, 1801475, 1572108, 1381423, 1223211, 1090370, 971222, 869062, 773901, 697067, 624296, 573289, 539825, 516503, 516474, 531019]
26169E31019K3595M2712M1693N6399P9413R0574J01668J24192J34287J37203J64386
26158A527141J98267K49086K89010K21392M6281j70017k67362k65355k39741k08736
26148A379966j60431j53878j19704j15254j08188r2816q3774p8608m9051l9391
26138C78871k2957k0146o486m205Q390N756J1869K7405K0382L4794M3507M8290
26126E25470M1655O0906P4855R7371P1574K8102n1520q3513q2843r2478o8411
26115E21168o4886n2114m6665l4296m4771k9252l2636k6372j6236k2201k1604
26104A30135K476j4100j3785q88K07j3233P114j0493k604K201p299q76m32j071
26090G7352j247r056M746o628m475M248k483O74j611M509r99Q54o791M30Q149
$$ y = [531019, 554614, 597326, 639019, 695418, 774831, 865405, 967073, 1091265, 1225552, 1362755, 1527141, 1725408, 1974494, 2263504, 2484896, 2531177, 2361160, 2093798, 1828443, 1588702, 1379966, 1219535, 1065657, 945953, 830699, 722511, 629695, 545921, 467313, 418262, 378871, 355914, 335768, 329282, 325077, 333467, 339223, 351092, 378497, 398879, 433673, 477180, 525470, 567125, 628031, 702886, 800257, 871831, 899933, 848413, 764900, 682057, 589579, 521168, 456282, 404168, 357503, 323207, 278436, 249184, 216548, 190176, 173940, 151739, 130135, 132611, 118511, 104726, 103838, 104045, 90812, 97926, 87433, 84829, 87030, 79731, 78855, 78423, 77352, 76105, 67049, 71795, 65167, 60692, 64940, 62457, 63131, 61520, 66029, 65030, 65884, 59093, 59523, 67672]
26075F7672j0195J934k360L463l284P436k973l496K251k567K253j377p24k734
26061E5299L848L474m115n340K606l232P322o893P684n317J0280K152m485J569
26047F4852l315J1147l370n239m26o235o272J1038Q86p239Q016j57r547j447j222
26032E1470O593P968l433n19l133O134p292L968j65L003J460M650l978N489l610
26017F8605R295L366K284l980J547n351j336m747M519J065k755M01r308P329k351
26002F8583k027J0173q908j719N940L029q970L368o41K228n823N297j949M00j805
25987F7176l9K678N681p182k478J4958j0272j465k068k322p57J67k563N007k000
25972F4521R28j822J021O327o240N260q695Q665n095K168l745K264j851j158k043
$$ y = [67672, 57477, 59411, 57051, 60514, 57230, 64666, 61693, 58197, 60448, 57881, 60134, 58757, 58033, 55299, 59147, 62621, 58506, 53166, 55772, 52540, 59862, 52969, 60653, 55336, 65616, 67768, 63283, 64852, 61537, 72684, 69314, 64075, 63649, 57414, 51142, 62180, 63066, 55827, 63843, 63686, 54139, 52692, 51470, 58063, 66031, 62598, 62079, 58946, 65080, 57788, 61756, 61591, 64594, 66054, 70704, 66726, 72215, 68605, 77900, 81266, 83550, 79570, 81117, 75766, 74430, 69683, 74202, 75267, 72512, 72913, 63605, 70934, 68583, 66556, 76729, 67821, 66102, 72042, 75071, 66101, 69469, 68828, 71056, 65233, 70530, 68581, 68981, 67176, 67137, 69815, 75496, 68314, 65836, 80794, 70522, 69057, 66989, 64667, 63910, 64077, 61514, 66521, 64521, 65449, 63627, 64648, 70975, 64735, 69995, 61300, 69965, 64870, 67038, 63293, 65557, 63706, 62548, 60505]
25957F0505q944N233r78j118k590L84l944M383k420j345L425L898l638l127J577
25942E1301K154M274l909O627p910j488j224O186l486j328k406J0081n081J185
25928E4976j0200O083j859R5j19%l800K661j464L807k071J133k243m124K284J437
25912D6596R61K56K017p36k877L443R53j949l908M758k214K950q24k153K197m011
25896D5459l55P04Q243m673j4K16l693Q198j3917N572m3P22o27O824j72m086L832
25879E2190r015J2988q806L225k281M450n680l04N970k66q57p65L09j896l48L445
25863E2359m452o65o964K861J364R598o120Q15o276P045k973M999q19O37o116
25848D5293Q884p737P073q32K789N196J392L02l933L043M241n780K905k941K104
$$ y = [60505, 51561, 56794, 55816, 54698, 52108, 52492, 48548, 52931, 50511, 49166, 52591, 56489, 52851, 49724, 51301, 53455, 57729, 53820, 60447, 52537, 51049, 49825, 56011, 52525, 51197, 48791, 58872, 53791, 54976, 44776, 50859, 49000, 49095, 48976, 48976, 45176, 47837, 46373, 50180, 48109, 49242, 46999, 42875, 45159, 46596, 47557, 47813, 49830, 49094, 46217, 49660, 50613, 48664, 44756, 49514, 47300, 50250, 49426, 47273, 49470, 45459, 45104, 45808, 54051, 49378, 49364, 49580, 45887, 54085, 40168, 45740, 45697, 46419, 45792, 52616, 52444, 48358, 52190, 43175, 56163, 47357, 50582, 48301, 52751, 47071, 46767, 52737, 52471, 51614, 50849, 51158, 49262, 48914, 52359, 47907, 47242, 40278, 43139, 44503, 54101, 47981, 48796, 42520, 49565, 46592, 51591, 50772, 51409, 45293, 54177, 46440, 53513, 52681, 55470, 60666, 62058, 62360, 58427, 61470, 65711, 59931, 62836, 59895, 61999]
25833F1999p777K636L405p826J180m519k741J1405m955P946o766k646m34K562
25819E3469l626j046K869k422J99l023J0466l691P577j016J983j231q37K587P587
25804F9845n48p076k562J723l976O98n546O976n605M327q73n964l632L272N012
25789E6071j949j976l012J81K694k961O416M17m549N596K747n119J718r38O67
25774E6003j138L08M161p378K609L587k988N912K781j883j607n345L908j793m36
25759E6701K764n87k323j658N109j214k520M132o731j283K285J420M985q687K637
25744E5030m251K486k471O121k058k349N975r17m186j034J383K093j081P044n992
25729E5793J685p87J013j505L673k561M860k899K081p24o082j077Q388p712R378
$$ y = [61999, 54222, 56858, 60263, 52437, 53617, 49098, 46357, 57762, 52807, 60753, 53987, 51341, 50907, 53469, 49843, 48797, 51666, 49244, 49443, 46420, 56886, 53195, 60772, 59756, 61739, 60508, 59671, 62258, 69845, 69297, 62221, 59659, 61382, 57406, 58104, 52558, 59534, 53929, 58256, 57383, 51419, 47787, 51059, 56071, 54122, 52146, 49134, 49315, 52009, 49048, 55464, 55881, 51332, 56928, 59675, 54556, 56274, 55336, 56003, 54865, 55173, 59334, 51956, 54565, 58152, 55164, 61076, 63857, 61974, 60367, 55022, 58930, 57137, 56701, 59465, 58878, 56555, 54897, 60006, 58792, 56272, 60404, 53673, 52390, 54675, 56095, 61080, 52393, 55030, 50779, 53265, 50794, 56915, 54857, 52508, 58483, 57566, 53380, 52346, 53729, 55822, 54741, 61785, 55793, 57478, 56691, 57704, 56199, 59872, 57311, 62171, 59272, 61353, 60629, 54547, 53470, 61858, 54146, 63524]
25714F3524m587j849k124l241J1313j3474K394Q051j970L313n704K894j927J815
25700E8428M651J706o881J975K806O821Q67q780M63j159J742L191k420o193Q891
25685F6108K400k726k559p70j591O811m427j228n27P540K775j118r140O847o003
25670F2392J1921o323m676L80P436o18K8o403M576j761K752N18Q021m385n641
25655F8217q00j432m993N048l671R185k21p077N341Q59K677J744j382L300R246
25640H6041n166m703O59K437k423k451r394P071l457K857N87o564K276Q43J387
25625G0000K649L44k971j25L152k439L574l136N582k08R133n979N546l205N331
25610H7248j326j406N36M303j137L78o07k705n619m829k38k185q59K103q68R97
$$ y = [63524, 58937, 57088, 54964, 51723, 63036, 49562, 51956, 60007, 58037, 61350, 55646, 58540, 56613, 58428, 63079, 64785, 57904, 59879, 62685, 69506, 70373, 61593, 62056, 60897, 62639, 65830, 63410, 57217, 66108, 68508, 65782, 63223, 62453, 60862, 67673, 63246, 62018, 61491, 69031, 71806, 70688, 61548, 68395, 62392, 74313, 67990, 63314, 63694, 71130, 70512, 70540, 64137, 68713, 66952, 69704, 70222, 78243, 73858, 68217, 67417, 65985, 60992, 66040, 62369, 71554, 71333, 64256, 69597, 70456, 73133, 74877, 73495, 76795, 86041, 80875, 76172, 76831, 79268, 76845, 74394, 65000, 72071, 68614, 71471, 72058, 65494, 67770, 68613, 70000, 72649, 72993, 70022, 69897, 73049, 70610, 74184, 71048, 76630, 76422, 85555, 79576, 85122, 81917, 87248, 85922, 84516, 85052, 89355, 88218, 88596, 87989, 85284, 79665, 74836, 74598, 72413, 71554, 73657, 72789, 73786]
25594G3786L441j0694Q788q998M247N540k81J035q89J0883p443Q314k35O140P52
25579I4386k593J529o806l22K391n341l918n011M973o562l359J1269j1403N254
25565G4487o497Q45L942m407K867J548N31j550j200l717M195M155n936K500R248
25550H1011j257K753N757M130l526m199k693j740L644o147l823Qm60l913K194
25535G1739N250o991N372n151q6K99r5Q306o919R75l694o42l156Q685p780L344
25519F9456M04J381n645N484j120K754M68J020p360R270j0407O267m461j539q56
25504F5116L798J100p83J235j853J911r4N163r160P293l498L912o288K043k982
25489F6913R82N830q599j493m027L694O026l214j202J282r980O597Q62J733N579
$$ y = [73786, 77227, 66533, 75321, 66323, 70570, 76110, 75829, 76864, 75975, 86858, 79415, 87729, 87494, 93634, 94386, 91793, 93322, 86516, 86194, 88585, 83244, 79326, 74315, 79288, 72726, 69367, 80636, 69233, 74487, 67990, 68835, 72777, 68370, 71237, 72785, 73316, 71766, 70566, 66849, 71044, 75199, 69263, 71763, 81011, 79754, 82507, 88264, 92394, 88868, 84669, 81976, 80236, 83880, 77733, 73910, 73918, 73458, 69545, 71739, 76989, 69998, 75370, 70219, 70133, 70432, 70337, 78643, 71724, 72699, 69005, 68363, 65207, 73892, 66112, 69456, 69860, 71241, 65596, 71080, 69960, 72714, 73182, 74202, 66842, 76112, 65705, 71972, 67511, 65972, 65116, 68914, 70014, 69231, 70466, 68613, 70524, 70430, 75593, 66433, 73726, 70228, 74140, 67852, 69895, 66913, 67895, 73725, 65126, 63633, 59606, 63300, 69326, 66112, 64910, 66192, 56212, 62809, 63671, 65404, 70983]
25474G0983p832J90N983m535J069O807o765r35M638k099j923J616J454L094l459
25459F8286L714p486o1p48P109j498q83n99M84L020l567L561n482k038L678k029
25443F5461k677P206j077m53n787P333P30k600o362O864M469k661J233m197K757
25428G0239l058k911R248j278k919l169J829K995Q71K480k380k473l78L583K488
25413G5167M464n758M286r329L656J175J504K977l489k958J1658j1682K532K736
25399G6939l18O906l881J2138m030L278N238L86L18L558M741K503j665O617J260
25384A13988M779j782L278R59p591K267n264p519j815n042J306m795m365P06n377
25369H3733O416q459k487N117o838P64n526J967L846J228k579n195J0929n160
$$ y = [70983, 63151, 63341, 69324, 64789, 65858, 72665, 65900, 64965, 69603, 67504, 65581, 67197, 68651, 71745, 68286, 72000, 64514, 64453, 63705, 70814, 69316, 68433, 67834, 68318, 71338, 67771, 71332, 65850, 63812, 67490, 65461, 62784, 69990, 68913, 68460, 62673, 70006, 70736, 68136, 61774, 68638, 73107, 70446, 71679, 67482, 70239, 67181, 64270, 73518, 72240, 69321, 66152, 67981, 70976, 71847, 74327, 71947, 69474, 69096, 72679, 75167, 79631, 73873, 78159, 68830, 72486, 73661, 75165, 78142, 74653, 71695, 83353, 71671, 74203, 76939, 76621, 83527, 79646, 91784, 87754, 91032, 96270, 96656, 96974, 100532, 105273, 107776, 106111, 112728, 113988, 118767, 116985, 120263, 121222, 113631, 115898, 110634, 103115, 101300, 96258, 97564, 92769, 88404, 89110, 83733, 90149, 81690, 79203, 84320, 77482, 78246, 72720, 74687, 78533, 79761, 77182, 71987, 82916, 77756]
25355G7756n299Q307l905j941l481N888j0238N595J216k971L61N89P358r133K594
25340G2696O889j740l491k57M59J292K92o825O637j21L109q088M599J258K79M79
25324G7467K644k046m125j283J002p38j968J0818p884N122l376k590K203J446
25310G6692K118K632j150j661j02l955J535L120P70j551n066N281n57L341K528
25295H3975q295K854L679o781j588O740j04K448o761K256J330k528k039M444L064
25280H2694k690J640j001j752J580K815n707K086k375N192o271R679j906N06m45
25265H4045m470N331m075o453M580M478j194k998Q067o645P266n505K519K250
25251H7196n95n336K714J370L248r624M139L350k614L645p227M143j981J074O66
$$ y = [77756, 72457, 80764, 76859, 74918, 71437, 77325, 67087, 72682, 73898, 70927, 71288, 71877, 79235, 70102, 72696, 79585, 77845, 74354, 74097, 74556, 75848, 76140, 69315, 75952, 75831, 78940, 70852, 75451, 76709, 76988, 77467, 80111, 78065, 73940, 72657, 73659, 72921, 70953, 81771, 73887, 79009, 75633, 73043, 75246, 76692, 78810, 81442, 80292, 78631, 78529, 74574, 76109, 79229, 79999, 78448, 73382, 78663, 78106, 81447, 83975, 75680, 78534, 82213, 75432, 73844, 80584, 80480, 82928, 76167, 78423, 79753, 77225, 75186, 79630, 82694, 80004, 81644, 80643, 78891, 80471, 83286, 77579, 79665, 77290, 82482, 76211, 85890, 83984, 84490, 84045, 79575, 84906, 80831, 74378, 78958, 83436, 82242, 79244, 87311, 80666, 87932, 82427, 84946, 87196, 86601, 81265, 83979, 85349, 88597, 78973, 83112, 86462, 83848, 87493, 80266, 84409, 82428, 83502, 84168]
25236H4168p84M609l117O06l418M725L226n374N278l559L46O254k346j645K539
25221I1508K714j4498O943L014J5J030l079J882j964M409l410k159K979n339M535
25206H8580m18k268R839j0099k26L089L466k092J045R56M877k624l929p12M289
25191I3773Q62o515J342O93L041n31j491l036O009L98n960J354N503K125l474
25176I4093k414j527N716p91K602p737O198Q73K544l707N190q273l523P322n921
25161I0645P616n421N502K27l372n963J8436j1043K327l87P70k249k306j677M747
25146I7852K674j906J346q60J130m439O380m854k438K807N33q22k085N311o92
25131I9937r49l276J030J119j309K628N73J046J458K344j190l635K175J485n731
$$ y = [84168, 83384, 87993, 84876, 85482, 82064, 86789, 90015, 84641, 89919, 86360, 86706, 92960, 90614, 88969, 91508, 94222, 79724, 86667, 89681, 89696, 90726, 87647, 89529, 87565, 91974, 88564, 86405, 89384, 84045, 88580, 88162, 85894, 95733, 85634, 85408, 88497, 91963, 89871, 90916, 91872, 96749, 94125, 90196, 89484, 93773, 94635, 88120, 89462, 90155, 93196, 92665, 91174, 88138, 94147, 94545, 88585, 89939, 95442, 97567, 94093, 91679, 90152, 95868, 95077, 97679, 89942, 96140, 97013, 99557, 95850, 101040, 92767, 89244, 96566, 90645, 98261, 92840, 98342, 98569, 95197, 89234, 107670, 96627, 98954, 98567, 99337, 97088, 94782, 93105, 97852, 100526, 98620, 99966, 99106, 100236, 95797, 102177, 97323, 94885, 97692, 98225, 97403, 95318, 100629, 99937, 98988, 95712, 96742, 97861, 96552, 99180, 99753, 100799, 102257, 104601, 103411, 99776, 101951, 103436, 97705]
25116I7705O291J470m680n05L623L758K355p177o12j068J294J282l30N749n794
25101A03361K682n7m23J57j608R413o140j091N342k047k878o41l791R422l514
25086A08187M022k029K142n003R987o464l213N236j771J001K869l826N03o76K209
25071A13174K848O57r705N637M544k486R7j772N117q890O948O346l257K17n657
25056A13818N795k2N89o729K927K656O115o585j938L490k418J029l384J225P237
25041A23805q09q462N35J236R8K54k056K80R470p614O205j422l889L155n485P062
25025A22363m26m191J437K966Q93m867P091j1541L599K676j693O408n024n351
25011A14340P294n122N350k39k914O548M98K951j0473N048L047j222K2l664Q550
$$ y = [97705, 103996, 105466, 100786, 100281, 103904, 107662, 110017, 102840, 102228, 101160, 102454, 103736, 103406, 109155, 103361, 106043, 105986, 105563, 105720, 104112, 113525, 107385, 106294, 111636, 109589, 106711, 106070, 102279, 111701, 108187, 112209, 110180, 112322, 107319, 117306, 110842, 107629, 112865, 111094, 112095, 114964, 111138, 111641, 110965, 113174, 116022, 116679, 106974, 112611, 117155, 114669, 114766, 112994, 118111, 109221, 116169, 122515, 119258, 119475, 113818, 119613, 119591, 120180, 113451, 116378, 119034, 125149, 118564, 116626, 120116, 117698, 118727, 115343, 116568, 123805, 122996, 114534, 115069, 116305, 116403, 116657, 114601, 114881, 124351, 116737, 122942, 121520, 117631, 120786, 115301, 122363, 121937, 117746, 119183, 122149, 123042, 118175, 125266, 113725, 117324, 120000, 118307, 124715, 119691, 114340, 121634, 116512, 121862, 121623, 118709, 125257, 125755, 128706, 118233, 123281, 126328, 125106, 125128, 121464, 130014]
24996A30014k147N83l729M107n714M834j0175J0459j0058J3120p826r77N060o59
24982A26892j21J739j740l489R594k619L044R625o715l064K697l599P696q495
24968A31445O89Q425m449o9K591J013l569l147L514n178K453j40L614l564K842
24953A36470J569l53p419P242M698j286j865L144o786N020l447J19J100Q638r828
24938A37016L959l512K249L518m801J147N173n884J030Q474n525K341q24o51J456
24923A45166R96k273k624M311k130O724m695K48R656k654R45P80P36j175q69k825
24907A50317K635K458m356Q86n107L241N6l695O259o206J1345m289j456q90q307
24892A42891J3952p850K330L293k965K701K305p065N674O50R303m655k071j344
$$ y = [130014, 127867, 128450, 124721, 128828, 123114, 127948, 117773, 128232, 118174, 131294, 123468, 122491, 127551, 126892, 126771, 128510, 126770, 123281, 132875, 130256, 133300, 142925, 136210, 133146, 135843, 132244, 139940, 131445, 132134, 140559, 136110, 136041, 138632, 139645, 136076, 132929, 136443, 131265, 133718, 133578, 137192, 133628, 136470, 138039, 137686, 130267, 137509, 142207, 140921, 139056, 142200, 135414, 140434, 136987, 137106, 138206, 146844, 137016, 140975, 137463, 139712, 143230, 138429, 139576, 144749, 138865, 139895, 148369, 142844, 145185, 144361, 143710, 145166, 146162, 143889, 141265, 145576, 143446, 150170, 145475, 145723, 155379, 152725, 153670, 154450, 155186, 154011, 153142, 150317, 152952, 155410, 151054, 151940, 146833, 150074, 150130, 146435, 152694, 146488, 157833, 153544, 152088, 151198, 142891, 156843, 148993, 151323, 154616, 151651, 154352, 156657, 149592, 155266, 155916, 165219, 160564, 158493, 157149]
24878A57149K860K951p703N478o983N038K109L289L248o360j282Q696k583O667
24864A72574l842m194O377k517M93k896M430j658Q007l007K559K744K889N651
24850A87610p32J202R674J754q112l220k705r14l180l38o37N99r56l948r62Q69
24834A76004M34n413l806P344l858q137R973O08j374l380L290j912N34Q55M385
24819A75547j0537P870l917J313N004J836l516j682M749J64Q756q041M592J71
24805A82309k316k651L755J887j181p77k568O690j2j389N445n866L527K089j231
24790A87711m651K519l883K364L689k184J316m826O900m136N334Q61j615j98K885
24775A92086M477m025K324L146p51o358J887L262l747P187o871O451P232k907
$$ y = [157149, 160009, 162960, 155257, 160735, 153752, 158790, 160899, 164188, 167436, 161076, 159794, 168490, 165907, 172574, 168732, 164538, 170915, 168398, 168891, 165995, 170425, 168767, 176774, 173767, 176326, 179070, 181959, 187610, 186878, 188080, 197754, 199508, 191396, 188176, 185471, 184557, 181377, 181039, 180402, 181001, 180045, 176097, 175135, 176004, 176438, 171025, 167219, 174563, 170705, 162568, 172541, 173149, 171775, 168395, 171685, 169773, 170307, 171162, 175547, 165010, 172880, 168963, 170276, 175280, 177116, 173600, 171918, 176667, 176831, 185587, 177546, 182138, 182309, 179993, 177342, 181097, 182984, 181803, 181026, 178458, 185148, 185136, 183747, 189192, 183326, 186853, 188942, 187711, 183060, 185579, 181696, 184060, 187749, 185565, 186881, 182055, 188955, 184819, 190153, 191014, 189399, 189201, 192086, 196563, 192538, 194862, 198008, 197257, 190899, 192786, 196048, 192301, 199488, 192617, 199068, 206300, 203393]
24761B03393m018L736l405l818N281J536J1445o075m686N581M845k110O12l518
24747B08799J968O1n078M562K884p01M380l253L830l017N217p117M390N919l659
24732B19185J811l421M478l616L384n539J224M557r063R820R79N02j308L505m122
24717B22376R630k829M90j294q01K971N356m307P025n284R108j786J50J4093l889
24702B51009O934K755J872Q770P404O219J2174J0954O564J4830N339K0886K0022
24689C75732J3959K3022K5459L4704K0073J5105j7296k2399k5928k1703j7809
24678D02919k2180o728r867q428p403m850k898r028O417J882O519N602j3830K692
24664C40819p793o553j0120r032n612K312m026p34M990j0369K218j480j65k393
$$ y = [203393, 199375, 203111, 199706, 195888, 201169, 202705, 214150, 208075, 203389, 208970, 213815, 211705, 212317, 208799, 210767, 210828, 205750, 210312, 213196, 212495, 216875, 213622, 217452, 214435, 219652, 212535, 216925, 222844, 219185, 220996, 217575, 222053, 218437, 221821, 216282, 217506, 222063, 213000, 222820, 223799, 224301, 222993, 226498, 222376, 232006, 229177, 229667, 228373, 227572, 230543, 235899, 231592, 238617, 233333, 242441, 240655, 240805, 254898, 251009, 257943, 260698, 262570, 271340, 278744, 284963, 297137, 308091, 314655, 329485, 334824, 355710, 375732, 389691, 412713, 438172, 472876, 492949, 508054, 490758, 468359, 442431, 420728, 402919, 380739, 374011, 364144, 355716, 348313, 343463, 340565, 331537, 337954, 339836, 346355, 351957, 338127, 340819, 333026, 326473, 316353, 307321, 301709, 304021, 299995, 299261, 304251, 293882, 296100, 294620, 294455, 292062]
24650B92062n528j812Q512j781k227O871M910N488O669q709L341J496M536N993
24636C19821L066Q682K874J8586l094K6263K383J4693J6952J2813K1947J6565
24624D61551K2055L0482L1060K4186J076k7903k0125k5290k9074k0231k0562j1295
24612D15930j5127j1115l160j4893j0497K59r347L877m842o682o490M650k302
24599C40261n944K97K699M89K097J723m389O11N932l572l177k43j027P055o46
24584C42166J618Q63M609Q101j2328J0706L948p25L455j377j180N855n028P335
24570C68018l151k503J2317m289k763K364J675L882m693N88O439p645K300O839
24556C79378J758m684L411K061m50L82N066r37J1730K446J72l275J0666n99L478
$$ y = [292062, 286534, 284722, 293234, 291453, 289226, 296097, 301007, 306495, 313164, 304455, 307796, 309292, 313828, 319821, 322887, 331569, 334443, 353029, 349935, 376198, 378581, 393274, 410226, 423039, 444986, 461551, 483606, 514088, 545148, 569334, 570410, 542507, 522382, 497092, 468018, 447787, 427225, 415930, 400803, 389688, 386528, 371635, 361138, 361397, 352050, 355927, 351085, 344403, 337913, 342563, 340261, 334317, 334614, 337313, 337802, 339899, 341622, 337233, 337844, 343776, 340204, 337027, 336784, 335757, 342812, 342166, 343784, 344647, 349256, 357357, 345029, 355735, 359683, 358958, 362413, 361036, 359856, 365711, 360683, 368018, 364867, 362364, 374681, 370392, 367629, 369993, 371668, 375550, 370857, 371445, 377884, 370239, 372539, 379378, 381136, 376452, 379863, 381924, 381474, 381856, 386922, 385985, 397715, 400161, 400333, 397058, 407724, 407125, 410603]
24541D10603J1836L566N147J5470k008M937N176o055K696M856P926j203k803Q487
24527D68631O225K217J799M73K420J2698l639J5446k352J8046l291J3253r243
24514E22683n912n834L108o839p583P650o705M054m389L378L79J1898l485O550
24500E18953M136N471L195Q308R165M715R262P825R496J0520J6729J4833J2439
24487F35047J9056K0540J5603K2189K9825M2844L8621M2315O4716P0057P9633
24476A080446R3372J11328J29772J45732J59454J75499J82130K09999K43313K88545
24466B819590L43437L82076L40342J48517j47574l13326l66111l40476l05033
24457B561442k63552k32616k01862j79408j55207j51583j31229j13419j02140
$$ y = [410603, 422439, 426005, 431152, 446622, 444614, 449551, 454727, 448672, 451368, 456224, 464150, 462947, 460144, 468631, 474856, 477073, 478872, 479345, 481765, 494463, 490824, 506270, 503918, 521964, 518673, 531926, 522683, 516771, 510937, 514045, 507206, 499623, 507273, 500568, 504622, 500233, 503611, 503990, 515888, 512403, 518953, 523089, 528560, 531755, 540063, 549228, 553943, 563205, 571030, 580526, 591046, 607775, 622608, 635047, 654103, 674643, 690246, 712435, 742260, 785104, 823725, 866040, 930756, 1000813, 1080446, 1173818, 1285146, 1414918, 1560650, 1720104, 1895603, 2077733, 2287732, 2531045, 2819590, 3163027, 3545103, 3885445, 4033962, 3886388, 3573062, 3206951, 2866475, 2561442, 2297890, 2065274, 1863412, 1684004, 1528797, 1377214, 1245985, 1132566, 1030426]
24448A030426p2418n8753m6364l7892l0927k6110j8030k1270k3745j1883p767
24437F75267m243r063k47m244n377O24j291o706M267m989K637Q060q37J522j229
24422F54151L82LL101n118L797L212l56k352N903p06n14J619O592O263j142j691
24406F73144P951j799N367p020M988L396k16L400K027L768K033L765R424J466
24392G11694P177M776R153M486O949J3958k775Q489P616J1039J1991L006Q994
24379H06553Q614R016O969J0815k794O754M431o999N613J584n350N18K261j831
24365H46154L967p593J3105n465R713P371Q571K376N826M370K241J2785n03L56
24351I03274R420J586P497j810L892P148N522M839J0445O872O622P814J0936O157
$$ y = [1030426, 958008, 899255, 852891, 814999, 784072, 757962, 739932, 718662, 694917, 683034, 675267, 671024, 661961, 661714, 657470, 652093, 652717, 651426, 644720, 648987, 643998, 646635, 654695, 653858, 655380, 654151, 654533, 654536, 657637, 652519, 656316, 659528, 659172, 656820, 662723, 662017, 661503, 663122, 669714, 675977, 674835, 673144, 681095, 679296, 684663, 677643, 682631, 686027, 685811, 689211, 691238, 695006, 697039, 700804, 710228, 711694, 718871, 723647, 732800, 737286, 744235, 758193, 755418, 763907, 771523, 782562, 794553, 797559, 806553, 815167, 824183, 831152, 841967, 839173, 845927, 850358, 843359, 848972, 850556, 845206, 845724, 847985, 846154, 850121, 842528, 855633, 850168, 859881, 867252, 875823, 878199, 884025, 888395, 890636, 903421, 902918, 903274, 912694, 914280, 921777, 919967, 923859, 931007, 936529, 941368, 951813, 958685, 965307, 973121, 984057, 990214]
24337I90214J0291J1561R269J1431M239J8055L636M855P106P863P031J2792N438
24324A103781J048J8918P906J2664P069J6428N071L692J4228R983J0077J3277
24312A224142O233J4953J0764J2595K1197J1438J7786K0347K0687K4098K0245
24301A404485L0098K2936K7917L8917L4054L6357K8898L6462K9228L1635L8124
24290A759111K6873L3823K6355J9827J9169K3446K4802K0245J7632K5526K2752
24279B019561K1039K6110J4096K3031J2665J0795K6058N032K7415J6359J8952
24268B221113K6157K0411L1445L0200L5769M3174M0503M4691N0640N0190M1922
24257B636215M4348M6666L7903M3953N2327M0393L2686K4884K8370K7923K3380
$$ y = [990214, 1000505, 1012066, 1021335, 1032766, 1037005, 1055060, 1058696, 1063551, 1070657, 1078520, 1085551, 1098343, 1103781, 1104829, 1123747, 1131653, 1144317, 1151386, 1167814, 1172885, 1176577, 1190805, 1200788, 1210865, 1224142, 1230375, 1245328, 1256092, 1268687, 1289884, 1301322, 1319108, 1339455, 1360142, 1384240, 1404485, 1434583, 1457519, 1485436, 1524353, 1558407, 1594764, 1623662, 1660124, 1689352, 1720987, 1759111, 1785984, 1819807, 1846162, 1865989, 1885158, 1908604, 1933406, 1953651, 1971283, 1996809, 2019561, 2040600, 2066710, 2080806, 2103837, 2116502, 2127297, 2153355, 2158387, 2185802, 2202161, 2221113, 2247270, 2267681, 2299126, 2329326, 2365095, 2408269, 2448772, 2493463, 2544103, 2594293, 2636215, 2680563, 2727229, 2765132, 2809085, 2861412, 2901805, 2934491, 2959375, 2987745, 3015668, 3039048]
24246C039048L4557L4012L7422M1086M6898M7485N4333N8170N6961L8457L0910
24235C519339J5117K5068M2739N3324M7473O2512P4095P7781Q0391R6417R7490
24224D191746J15791J29484J35042J35023R7011M4901J7410K3381K6226M2571
24214D958586L3371O2541P2478P2178Q7887Q7078R9419J01832J13305J18289J36887
24203E943851J44005J43977J60405J58472J79547J87038J94434K06711K11873
24194G530313K19225K31262K46425K51306K63962K66592K95353K93070L15299
24185I912807L30379L58654L73095M12072M25713M59980M84870N02006N26259
24176A3785835N65685N97745O42881O90275P36695P92936Q58042R19090R96158
$$ y = [3039048, 3073605, 3107617, 3145039, 3186125, 3233023, 3280508, 3334841, 3393011, 3449972, 3488429, 3519339, 3534456, 3559524, 3602263, 3655587, 3703060, 3765572, 3839667, 3917448, 3997839, 4094256, 4191746, 4307537, 4437021, 4572063, 4707086, 4804097, 4848998, 4866408, 4889789, 4916015, 4958586, 4991957, 5054498, 5126976, 5199154, 5287041, 5374119, 5473538, 5575370, 5688675, 5806964, 5943851, 6087856, 6231833, 6392238, 6550710, 6730257, 6917295, 7111729, 7318440, 7530313, 7749538, 7980800, 8227225, 8478531, 8742493, 9009085, 9304438, 9597508, 9912807, 10243186, 10601840, 10974935, 11387007, 11812720, 12272700, 12757570, 13259576, 13785835, 14351520, 14949265, 15592146, 16282421, 17019116, 17812052, 18670094, 19589184, 20585342]
24167B0585342J073442J171490J262010J372556J493314J636770J793391J976195
24159C2364510K185963K428646K695491K992900L319670L757240M240614M843973
24151E8829007N632794O705297Q091772R681325J1161186J2675164J4282948J6175377
24143A43234870J8250081K0158673K1874680K3046897K2986110K3255649K3759332
24136B96566292K5219714K7268812K9936776L2819889L2021399K4216246P193874
24129D75243002j5149886k9063524l3492770l3421498l1621178k9566802k7354715
24122B75572629k5935272k4352059k2536358k1434740k1691162k0761720j8401627
24115A20459691j5365518j2730617j0621494q984287p718704o800961o008741
$$ y = [20585342, 21658784, 22830274, 24092284, 25464840, 26958154, 28594924, 30388315, 32364510, 34550473, 36979119, 39674610, 42667510, 45987180, 49744420, 53985034, 58829007, 64461801, 71167098, 79258870, 88940195, 100101381, 112776545, 127059493, 143234870, 161484951, 181643624, 203518304, 226565201, 249551311, 272806960, 296566292, 321786006, 349054818, 378991594, 411811483, 443832882, 468049128, 475243002, 460093116, 431029592, 397536822, 364115324, 332494146, 302927344, 275572629, 249637357, 225285298, 202748940, 181314200, 159623038, 138861318, 120459691, 105094173, 92363556, 81742062, 72757775, 65039071, 58238110, 52229369]
24108E2229369n276778m620801m055198l495888l060079k658095k337499k044661
24100B4680370j825315j606882j443137j289760j182672j052220r56670q55693
24092A4468021p79410p28200o90005o25058n73730n24638m82714m41037m22944
24083I200285m03582m10604l65390l55607l13513l09608k69250k71890k48487
24074F252354k41838k26105k10157j95793j98596j75277j63511j56026j42213
24065D542838j23586j33049j19676j09597r3531r2978q3603q8721q5577j00735
24055C511785r4323r3930p8610q6554p4312p7252p0561o6261p0904o5472n5025
24044B678581n8143m6773m1369m5842m1832l0964k8440k8690l0958j7819k0238
$$ y = [52229369, 46952591, 42331790, 38276592, 34780704, 31720625, 29062530, 26725031, 24680370, 22855055, 21248173, 19805036, 18515276, 17332604, 16280384, 15323714, 14468021, 13688611, 12960411, 12270406, 11645348, 11071618, 10546980, 10064266, 9623229, 9200285, 8796703, 8386099, 8020709, 7665102, 7351589, 7041981, 6772731, 6500841, 6252354, 6010516, 5784411, 5574254, 5378461, 5179865, 5004588, 4841077, 4685051, 4542838, 4419252, 4286203, 4166527, 4056930, 3963399, 3870421, 3786818, 3698097, 3612520, 3511785, 3417462, 3323532, 3244922, 3158368, 3084056, 3006804, 2936243, 2869982, 2799078, 2733606, 2678581, 2620438, 2573665, 2532296, 2486454, 2444622, 2413658, 2385218, 2356528, 2325570, 2307751, 2287513]
24033B287513k1224j4267j0569j6058n345l583j3300L815j0004J20N108M866P821
24020B214893O596J2199J1244O369J2105K2403J1790K4671K3522L4119K6958K6914
24008B433783M1541M3710L7224N1085N3595N9445N8987P8309O5755Q5171Q2343
23997C090948R8947J03969J18021J17431J48834J58032J77604J86710K24971K46063
23987D671530K81503L14983L53417M16894M74608N34825O13287P08638Q02822
23978I172507R18823J041133J185960J334369J507266J681093J894758K099019
23970B0834928K331172K568741K796780L020235L202616L323500L327000L243628
23962D4648600L012548K695746K294198J877282J462483J096014P67260N29463
$$ y = [2287513, 2266289, 2252022, 2241453, 2225395, 2220050, 2216467, 2203167, 2206982, 2196978, 2197098, 2202206, 2207072, 2214893, 2221489, 2233688, 2244932, 2251301, 2263406, 2285809, 2297599, 2322270, 2345792, 2379911, 2406869, 2433783, 2475324, 2519034, 2556258, 2607343, 2660938, 2720383, 2779370, 2857679, 2923434, 3008605, 3090948, 3189895, 3293864, 3411885, 3529316, 3678150, 3836182, 4013786, 4200496, 4425467, 4671530, 4953033, 5268016, 5621433, 6038327, 6512935, 7047760, 7661047, 8369685, 9172507, 10091330, 11132463, 12318423, 13652792, 15160058, 16841151, 18735909, 20834928, 23166100, 25734841, 28531621, 31551856, 34754472, 38077972, 41404972, 44648600, 47661148, 50356894, 52651092, 54528374, 55990857, 57086871, 57854131, 58383594]
23954E8383594L74346L23130L25514L19548K86203J64817n6420l23185o25319
23945E9172228r18791j199467j425295j528495j545675j388290j111091p33489
23937D9321635k70012K05184O81766J083761J377664J521656J528687J396298
23929E6846639J184729Q97490O08862K94643L2052j95727l11413l74292l86556
23920E8596427l90316m48548o12679q54300j164953j550206j935690k344344k725657
23911D6569734l034174l251423l368194l347469l247009l050815k835212k593605
23903B1841833k329999k093169j875580j653940j474975j283091j137686r79619
23895I013774q61022p41971o50612n64969m92056m25126l75299l34709k92505
$$ y = [58383594, 58757940, 59081070, 59406584, 59726132, 60012335, 60177152, 60120732, 59797547, 59172228, 58253437, 57053970, 55628675, 54100180, 52554505, 51166215, 50055124, 49321635, 49051623, 49256807, 49938573, 51022334, 52399998, 53921654, 55450341, 56846639, 58031368, 58928858, 59537720, 59832363, 59864415, 59668688, 59357275, 58982983, 58596427, 58206111, 57757563, 57144884, 56290584, 55125631, 53575425, 51639735, 49295391, 46569734, 43535560, 40284137, 36915943, 33568474, 30321465, 27270650, 24435438, 21841833, 19511834, 17418665, 15543085, 13889145, 12414170, 11131079, 9993393, 9013774, 8152752, 7410781, 6760169, 6195200, 5703144, 5278018, 4902719, 4568010, 4275505]
23886D275505k62753k32929k15037j89106j74714j57464j43047j20022j25803
23877B654630j04076r7215r9315p5510q6573p5576p3148o9513n9748o2833n3711
23866A797412n2641m9837m3701m8747m3928l9850l4762l9512l6616l4248l0860
23855A342710k9452l0831k6887k4951k4534k6749k8352j1168k8879k0345j5868
23844A074694k8331q273j8415r516j4874k2781o988j0130k1550q756j6456m008
23832I04616q263o020j3781k956o400p046l189J130q410L902r61K156P681l103
23818H59356J4872N884P972J0220N946O178J3033J0451Q079J4820Q242J7190J3106
23805I95349J0830K4509J3652K2972K5723K4583M1762M2760M8317N6707O8677
$$ y = [4275505, 4012752, 3779823, 3564786, 3375680, 3200966, 3043502, 2900455, 2780433, 2654630, 2550554, 2453339, 2354024, 2278514, 2191941, 2116365, 2043217, 1973704, 1913956, 1851123, 1797412, 1744771, 1694934, 1651233, 1602486, 1558558, 1518708, 1483946, 1444434, 1407818, 1373570, 1342710, 1313258, 1282427, 1255540, 1230589, 1206055, 1179306, 1150954, 1139786, 1110907, 1090562, 1074694, 1046363, 1038090, 1019675, 1010159, 995285, 972504, 965516, 955386, 933836, 925080, 908624, 904616, 896353, 890333, 876552, 873596, 867196, 860150, 856961, 858091, 849681, 853583, 852622, 854778, 862459, 859356, 874228, 880112, 888084, 898304, 904250, 910428, 923461, 933912, 941991, 956811, 965053, 982243, 995349, 1006179, 1030688, 1044340, 1067312, 1093035, 1117618, 1159380, 1202140, 1250457, 1307164, 1375841]
23794A375841Q3241R6414J14108J28067J44270J59764J71742J91366K30372K57899
23784B953084L20474L63403L66805K40940j4175k53359l55947l48715l13887k86241
23774B672382k54369k10127j98993j69046j58675j45429j41218j13008r4441p9804
23764A107272p1306n4906m8485m5444m7425l9792k2424l3310k4916j7952l0256
23753F71056k3533j7541j8828j6294k3283r750k7166l980n885k0905j5691j516
23741D86684j0281o865l638j5604j2532K215k935j0783m366J400n679k518j3957
23728D01141L847j258k098k295n498j807M073l215m305k113P2r35p18q41j926
23713C82124k349q594k392M734m704k61k978l533O258r050P819q744n830K760
$$ y = [1375841, 1459082, 1555496, 1669604, 1797671, 1941941, 2101705, 2273447, 2464813, 2695185, 2953084, 3273558, 3636961, 4003766, 4244706, 4230531, 3977172, 3621225, 3272510, 2958623, 2672382, 2418013, 2207886, 2008893, 1839847, 1681172, 1535743, 1394525, 1281517, 1187076, 1107272, 1035966, 981060, 932575, 887131, 839706, 799914, 777490, 744180, 719264, 701312, 671056, 647523, 629982, 611154, 594860, 571577, 561827, 534661, 530681, 524796, 503891, 488200, 486684, 476403, 469538, 465900, 450296, 437764, 439979, 437044, 426261, 421895, 423295, 417616, 415098, 401141, 404988, 403730, 401632, 399337, 393839, 392032, 396105, 392890, 388585, 386472, 386544, 385609, 384891, 384050, 382124, 379775, 371181, 368789, 373523, 368819, 368558, 365580, 362047, 368305, 359255, 367074, 358330, 352500, 355260]
23699C55260k643P483q675M015K443p154m385P322L916l231o84M39o082O573L670
23684C58267N233o462M062N96l603L144K53n428R691n983J2192p649K590M40j613
23669C65730P624N572p011L495L454j375L06M772l367L59O913K091L765L815J307
23654C97450k870P889L022j986R086L976K800K042N795K982J0903j535Q302M831
23640D52687k452P593N21J747J2098J812J5944K855J1442P836J5288R328R882
23627E46581J3614K1801J0972J7361K1498J4385K9218K4334K2212K2710J9311
23616G63997K7518J1443J7375J4325J3526N536Q082J5332O957N835O144J2390
23604I08460N111l673P331n193J780L896l82l1o064J041J262J05J1106L786J2791
$$ y = [355260, 352617, 360100, 351425, 355440, 357883, 350729, 346344, 353666, 357582, 354351, 353667, 354106, 348024, 354597, 358267, 363500, 357038, 361100, 361696, 358093, 361237, 361490, 356062, 365753, 359770, 371962, 364313, 366903, 367343, 365730, 373354, 378926, 371915, 375410, 378864, 377489, 377795, 382567, 379200, 379559, 386472, 388563, 392328, 396143, 397450, 394580, 402469, 405491, 403505, 412591, 416567, 419367, 421409, 427204, 430186, 441089, 439554, 447856, 452687, 450235, 457828, 458349, 460096, 472194, 474006, 489950, 492805, 504247, 512083, 527371, 536699, 546581, 560195, 581996, 592968, 610329, 631827, 646212, 675430, 699764, 721976, 744686, 763997, 791515, 802958, 820333, 834658, 848184, 853720, 861802, 877134, 884091, 889926, 896070, 908460, 913571, 909898, 917229, 912036, 913816, 917712, 917330, 917299, 911235, 912276, 913538, 913643, 924749, 928535, 941326]
23589I41326J1299J9031J1514K1122P890J5468J5678J0451J4559R701J4720J1446
23577A104205J2521Q439J1834J994J2537J479Q441N258m683K970r3O15j0935o288
23563A148294R189K820o784M536M945J3914J3000O389J9605K2464J5803J2986
23551A267161L0737K5611L0749L0128K7819K7260L8669L5966M0736M4090L3751
23540A632677M6737N6600M6614N2580N4328O1384O2684P2596P5203P6337Q5507
23529B323247Q9281R6692J08953J07741J32790J31815J42587J65251J73539J90111
23519C662007K05397K23869K61281K69725L09260L49347L78095M12213M71793
23510F542987M99093N65649N99086O75324P39504Q08976R04698R84525J074192
$$ y = [941326, 952625, 971656, 983170, 1004292, 1012182, 1027650, 1043328, 1053779, 1068338, 1078039, 1092759, 1104205, 1116726, 1125165, 1136999, 1138993, 1151530, 1153009, 1161450, 1166708, 1162025, 1164995, 1164902, 1165517, 1154582, 1148294, 1157483, 1160303, 1153519, 1158055, 1163000, 1176914, 1189914, 1196303, 1215908, 1238372, 1254175, 1267161, 1297898, 1323509, 1354258, 1384386, 1412205, 1439465, 1478134, 1514100, 1554836, 1598926, 1632677, 1679414, 1736014, 1782628, 1835208, 1889536, 1950920, 2013604, 2086200, 2161403, 2237740, 2323247, 2412528, 2509220, 2618173, 2725914, 2858704, 2990519, 3133106, 3298357, 3471896, 3662007, 3867404, 4091273, 4352554, 4622279, 4931539, 5280886, 5658981, 6071194, 6542987, 7042080, 7607729, 8206815, 8882139, 9621643, 10430619, 11335317, 12319842, 13394034]
23501A3394034J191452J293995J412591J534451J624724J718763J789636J829616
23493B5789262J812572J818161J761422J704287J656244J604335J580884J583459
23485C9310626J593638J659332J707388J771971J793063J763044J664457J511078
23477E2774597J286503J016652P48155M87826K66136Q9982k0120n5814p461P1564
23467E6658020K08944L14256L82771M00837L43963K27712P3743r8572k83283m19775
23457E7808616n11523n50056n23975m42284l08334j60154m0870K4350L900j14202
23447E5185468k90044n45344q09585j094119j341699j565952j708583j791661
23439D6038481j796909j742205j652880j560643j485306j447938j471541j512320
$$ y = [13394034, 14585486, 15879481, 17292072, 18826523, 20451247, 22170010, 23959646, 25789262, 27601834, 29419995, 31181417, 32885704, 34541948, 36146283, 37727167, 39310626, 40904264, 42563596, 44270984, 46042955, 47836018, 49599062, 51263519, 52774597, 54061100, 55077752, 55825907, 56313733, 56579869, 56669851, 56649731, 56593917, 56586456, 56658020, 56866964, 57181220, 57563991, 57964828, 58308791, 58536503, 58610246, 58511674, 58228391, 57808616, 57297093, 56747037, 56223062, 55780778, 55472444, 55312290, 55271420, 55295770, 55299670, 55185468, 54895424, 54350080, 53540495, 52446376, 51104677, 49538725, 47830142, 46038481, 44241572, 42499367, 40846487, 39285844, 37800538, 36352600, 34881059, 33368739]
23431C3368739j568538j660953j752390j816927j863544j872541j842033j771615
23423A9220198j674255j555727j420328j290186j183580j055030r52921q71236
23415I216935p92056p07594o46502n92208n26855m85731m35496l94338l47968
23406D288187l11999k86363k42193k22426k08100j82546j67015j44809j32932
23397B389804j23750j02981j06986q9638p9484q5245o4425o6334o0899n6892n3514
23386A499656m3337m8664m2185l9110l3737l7741k9903l0477l2489k7648k3127
23375A111238k9359k3744k3598k1211j7092k9448k1060j0168j6228j5931k2638
23364H80761j2946j3820j8841j4697j2491j0442j2078j7135m678j1848j1948r526
$$ y = [33368739, 31800201, 30139248, 28386858, 26569931, 24706387, 22833846, 20991813, 19220198, 17545943, 15990216, 14569888, 13279702, 12096122, 11041092, 10088171, 9216935, 8424879, 7717285, 7070783, 6478575, 5951720, 5465989, 5030493, 4636155, 4288187, 3976188, 3689825, 3447632, 3225206, 3017106, 2834560, 2667545, 2522736, 2389804, 2266054, 2163073, 2056087, 1966449, 1886965, 1801720, 1737295, 1670961, 1610062, 1553170, 1499656, 1456319, 1407655, 1365470, 1326360, 1292623, 1254882, 1224979, 1194502, 1162013, 1134365, 1111238, 1081879, 1058135, 1034537, 1013326, 996234, 966786, 945726, 935558, 919330, 903399, 880761, 867815, 853995, 835154, 820457, 807966, 797524, 785446, 768311, 763633, 751785, 739837, 730311]
23352G30311j5699o071q140j0479p691q507q622p412j0768j1504m328j0573j3900
23339F06617m78q700j0018q794r347r91o742j6080o200k296j0341l761n974j375
23325E15520p022l208j5688R14k387o943J106k406l681l645o828k053j764K388
23311D64303p208n885M233k969N160l220q4k816P420j1233J055J767l54p763k233
23296D40173k012l242l297P899k210m428R51N104n239l710l416k220L599p612
23282D20340K645m254K022l520L95n941j0226N721j351l692j133K097n086P250
23268D05267j0508O778l328K414J671l620o81J1844p026J537N416N14J0463l336
23254D17405M595Q002R308K386O691N764J923O098N500L035P179l691p864r25
$$ y = [730311, 714612, 708541, 700401, 689922, 682231, 673724, 665102, 657690, 646922, 635418, 631090, 620517, 606617, 606139, 597439, 587421, 578627, 569280, 568289, 561547, 545467, 539267, 536971, 526630, 522869, 516895, 515520, 508498, 505290, 489602, 490516, 488129, 481186, 482292, 479886, 476205, 472560, 465732, 463679, 461915, 464303, 457095, 451210, 455443, 452474, 457634, 454414, 454330, 451514, 458934, 447701, 448756, 450523, 450169, 442406, 440173, 438161, 434919, 431622, 439521, 437311, 432883, 433834, 438938, 433699, 429989, 426573, 424353, 427952, 420340, 422985, 418731, 420753, 417233, 417628, 411687, 401461, 407182, 405831, 402139, 401006, 403103, 398017, 405267, 394759, 401537, 398209, 400623, 402294, 398674, 397993, 409837, 402811, 404348, 409764, 410278, 420741, 417405, 422000, 430002, 439310, 441696, 448387, 454151, 456074, 462172, 467672, 470707, 477886, 474195, 466331, 465406]
23240D65406J788p550n640l675L638q873L240m877l9j275j354O492R23J2120n250
23225D55074J5479L405R611O991K244J4594N227J2167J855K598K561j0148Q229
23212E29887k084p638K179m418o843l010O57J611M409N386n962J0848L206K982
23198E31210J3501J4282J4626J7938R092J6488M644K1367K1645J0504P280P632
23186F90209l854L636o424j1053n213q127o658n39l095j2835K128n687J5337j896
23172F45929J6499J0554K0192R910K7035J8495K5183K5287K2115K5502L1724K2783
23160I01208K8211K3080J7651K2738K2758K5053K5826K9188K9152L0518K3063
23149A178446J9947K0053K4886J9766J9147K5572K1496J1610L0122R960L3159
$$ y = [465406, 467194, 459644, 454004, 450329, 453967, 445094, 448334, 443457, 443418, 442143, 440789, 447281, 448204, 460324, 455074, 470553, 473958, 483569, 490560, 492804, 507398, 512625, 524792, 526647, 529245, 531806, 521658, 529887, 527803, 520165, 522344, 517926, 511083, 508073, 508730, 510341, 514750, 520136, 514174, 525022, 528228, 531210, 544711, 558993, 573619, 591557, 600649, 617137, 621781, 643148, 664793, 675297, 682577, 690209, 686355, 689991, 683567, 672514, 667301, 659174, 652516, 651977, 648882, 636047, 638175, 632488, 647825, 645929, 662428, 672982, 693174, 703084, 730119, 748614, 773797, 799084, 821199, 846701, 878425, 901208, 929419, 952499, 970150, 992888, 1015646, 1040699, 1066525, 1095713, 1124865, 1155383, 1178446, 1198393, 1218446, 1243332, 1263098, 1282245, 1307817, 1329313, 1340923, 1371045, 1381005, 1414164]
23138A414164K3081K0807K2770K3534J1226J2789N076J0436M947P201k023l451
23126A550557p866r575p864j325j1324O150J097p688J203m69q277M514J0642o658
23112A513117k287Q010n362M100N957O311m275m154j8201j8504l0722k5396k4422
23099A404172l8134k9921m8788m5843l7154m3854l7954m3974k6996l4321k1183
23088I96050k5384k4083k0215j0451j8640j3175p830j5313p897m890o471m093
23076H37608J883l212M589o605Q117Q805k950o80K010P479q89P290P877J054P927
23061H80303q017J1770n91P166p37O429J6589n375R145Q390M587J4879O698P292
23047I58528J0936Q434R163Q323J4930J1415J6127J5541J3452R664J2170J4659
$$ y = [1414164, 1437245, 1458052, 1480822, 1504356, 1515582, 1528371, 1533447, 1543883, 1548830, 1556031, 1554008, 1550557, 1542691, 1533116, 1525252, 1523927, 1512603, 1518753, 1519850, 1512162, 1513365, 1512896, 1504619, 1509133, 1519775, 1513117, 1510830, 1518840, 1513478, 1517578, 1523535, 1529846, 1525571, 1521417, 1503216, 1484712, 1453990, 1428594, 1404172, 1366038, 1336117, 1287329, 1241486, 1204332, 1160478, 1122524, 1078550, 1051554, 1017233, 996050, 970666, 946583, 926368, 915917, 897277, 884102, 876272, 860959, 853062, 848172, 841701, 837608, 839491, 836279, 840868, 834263, 842380, 851185, 848235, 847555, 849565, 857044, 856155, 863445, 871322, 872376, 880303, 872286, 884056, 883465, 890631, 889894, 896323, 912912, 907537, 916682, 925072, 929659, 944538, 951236, 958528, 969464, 977898, 987061, 995384, 1010314, 1021729, 1037856, 1053397, 1066849, 1076513, 1088683, 1103342]
23035A103342J9020O968J7209J2249J4233J4387J4670J4144J0841J8005J8899
23024A263967J8618J7051K1481J3877K5361J5317K5075J7128K1284K4081J7597
23013A480837L4069J9210K0384L5104K2918L2346K9127L5056L8036M0204L9817
23002A827108L8487M6551M2391L4505N1226M0919M2354M6945N2108M4877N8253
22991B325724M7380N6719O2302O5404O4133P4158P1917P4059R2819R1170R4934
22980C120719J18622J30243J48524J65313J96891K18285K54688K81020L20417
22971D954722L72068M23456M67315N20590N87939O49658P26270P94691Q68807
22962A0365516R34660J019756J084219J140572J178348J168080J095458R35892
$$ y = [1103342, 1122362, 1129330, 1146539, 1158788, 1173021, 1187408, 1202078, 1216222, 1227063, 1245068, 1263967, 1282585, 1299636, 1321117, 1334994, 1360355, 1375672, 1400747, 1417875, 1439159, 1463240, 1480837, 1514906, 1534116, 1554500, 1589604, 1612522, 1644868, 1673995, 1709051, 1747087, 1787291, 1827108, 1865595, 1912146, 1954537, 1989042, 2040268, 2081187, 2123541, 2170486, 2222594, 2267471, 2325724, 2373104, 2429823, 2492125, 2557529, 2621662, 2695820, 2767737, 2841796, 2934615, 3025785, 3120719, 3239341, 3369584, 3518108, 3683421, 3880312, 4098597, 4353285, 4634305, 4954722, 5326790, 5750246, 6217561, 6738151, 7326090, 7975748, 8702018, 9496709, 10365516, 11300176, 12319932, 13404151, 14544723, 15723071, 16891151, 17986609, 18922501]
22954A8922501P08003M00735O8016k57498n34880p18385q25965q24817p76255
22945A6161455o73767n54038m18543k73870j55725Q755J45681K79915M33094N72171
22935A5525128P13358Q44730R76367J083802J154186J195295J148145J023872
22927B3664883Q11716N23436K08214p3720k93259m02054m20076l30274j68337
22918B3520529M8554L02106N48944O89990P09274O61082O99713Q94064J152054
22909B9226310J438894J629157J705982J686052J719801J859023K001206K089649
22901D3356074K087358J922044J564488J056843L94860k96697r52394j473505
22893D7659071j782329j895202j822860j603845j258932q79356m55594j04094
$$ y = [18922501, 19630504, 20031239, 20099255, 19841757, 19306877, 18588492, 17762527, 16937710, 16161455, 15487688, 14933650, 14515107, 14241237, 14085512, 14094267, 14239948, 14519863, 14952957, 15525128, 16238486, 17083216, 18059583, 19143385, 20297571, 21492866, 22641011, 23664883, 24476599, 25000035, 25208249, 25134529, 24841270, 24439216, 24019140, 23688866, 23520529, 23569083, 23871189, 24420133, 25110123, 25819397, 26480479, 27180192, 28074256, 29226310, 30665204, 32294361, 34000343, 35686395, 37406196, 39265219, 41266425, 43356074, 45443432, 47365476, 48929964, 49986807, 50381667, 50084970, 49132576, 47659071, 45876742, 43981540, 42158680, 40554835, 39295903, 38416547, 37960953, 37856859]
22885C7856859J27190K52665L68786O29997R77854J368598J698142J917528J948789
22876D7146408J938753J924783J851209J634732J236680O74391J8455o46522j209686
22867E4569203j613232j783042j736825j472959j075728n84580J759N77954J187384
22858D8069934J797593K426984L056974L705683M328893M973102N670501O324145
22850H0353809O829544O838669O112934M755660L528090L008188L029773L215704
22842A17672371L063951K207628O74061q49035j674108j689484j140697l04815
22834A17959872M73869P06006J64947o15846r49858n69689J74171R47780J275162
22825A19566414R00688K07012r5542K34675R37813J639056J846817J334351L76084
$$ y = [37856859, 37984049, 38236714, 38605500, 39235497, 40213351, 41581949, 43280091, 45197619, 47146408, 49085161, 51009944, 52861153, 54495885, 55732565, 56406956, 56425411, 55778889, 54569203, 52955971, 51172929, 49436104, 47963145, 46887417, 46302837, 46304596, 46882550, 48069934, 49867527, 52294511, 55351485, 59057168, 63386061, 68359163, 74029664, 80353809, 87183353, 94022022, 100134956, 104890616, 108418706, 111426894, 114456667, 117672371, 120736322, 122943950, 123618011, 122768976, 121094868, 119405384, 118264687, 117959872, 118433741, 119139747, 119304694, 118688848, 117738990, 117169301, 117343472, 118291252, 119566414, 120467102, 120674114, 120578572, 120813247, 121751060, 123390116, 125236933, 126571284, 126947368]
22816A26947368l53910n92665n28928m21170o85966j510085k674267l504518l618649
22807A13057210l150421k326716j457650r52530j243759k207328l139088l447895
22799I5131823l205600k742514k478233k884966l991103n175494n866382o033281
22791F2754250n853632n481762m968741m443361l971989l541451l181873k872898
22783B8438543k580096k261280j948958j633687j387809j156229r69660p96509
22775A5704315o34994n02818l66514k40734j34021o210J29164K50942K93446K14212
22765A4706788j5828k07536k73779k26822j46916j02873j82899l92944o18448
22756A2538743p07372p05569o55366n74942m86079l99547l10436k34011j64013
$$ y = [126947368, 126593458, 126000793, 125471865, 125050695, 124364729, 122854644, 120180377, 116675859, 113057210, 109906789, 107580073, 106122423, 105169893, 103926134, 101718806, 98579718, 95131823, 91926223, 89183709, 86705476, 83820510, 79829407, 74653913, 68787531, 62754250, 56900618, 51418856, 46450115, 42006754, 38034765, 34493314, 31311441, 28438543, 25858447, 23597167, 21648209, 20014522, 18626713, 17470484, 16500824, 15704315, 15069321, 14566503, 14199989, 13959255, 13825234, 13819024, 13948188, 14199130, 14492576, 14706788, 14690960, 14483424, 14209645, 13982823, 13835907, 13733034, 13550135, 13157191, 12538743, 11831371, 11125802, 10470436, 9895494, 9409415, 9009868, 8699432, 8465421, 8301408]
22747H301408j04137l4039L4426J18296J99553K61022L32416M31303N15317N67088
22737A0622653N30224L16441Q6485n4868n6908j3743N4217K5653j52251l93876
22727A0964027n50468n90301n70065m99225m23169l50635k69385k11133j54248
22718G345398j02914n0872k225O1999J26217J86656K60182L36558M10247M94421
22708I065667O00338P04712Q25705R54656J097923J257402J431708J606973J816001
22699A9361085K028641K264481K522865K791339L083925L366613L638825L903925
22691D2961699M119204M252066M210831L926013L331988K487273J496128N70067
22683F7355269j50782n69632o84544n61902l10390p676K18592K70164N0153m56578
$$ y = [8301408, 8197271, 8163232, 8197658, 8315954, 8515507, 8776529, 9108945, 9540248, 10055565, 10622653, 11152877, 11469318, 11555803, 11500935, 11444027, 11430284, 11484501, 11510154, 11357903, 10964027, 10413559, 9823258, 9253193, 8753968, 8330799, 7980164, 7710779, 7499646, 7345398, 7242484, 7191612, 7189387, 7251386, 7377603, 7564259, 7824441, 8160999, 8571246, 9065667, 9666005, 10370717, 11196422, 12151078, 13249001, 14506403, 15938111, 17545084, 19361085, 21389726, 23654207, 26177072, 28968411, 32052336, 35418949, 39057774, 42961699, 47080903, 51332969, 55543800, 59469813, 62801801, 65289074, 66785202, 67355269, 67204487, 66634855, 65950311, 65388409, 65078019, 65070343, 65288935, 65559099, 65609252, 65152674]
22673F5152674j235630k123265k960207l619143m006454m119993m031670l817286
22665C9239026l538217l233847k924542k649608k367580k099527j837098j568840
22657A9019767j342707j107321q75023o92657n01269l32712j66156q274J50647
22648A4144295L00062M54307O13644P78783R46478J115593J307967J494771J709435
22639B2865335J892192K091271K270518K422422K515776K504370K319586J949504
22631D0830974J417859Q09755K49197j81535m10544m54535l51722j73579J4905
22622D1750775J50315J69850j2439l78999r06955j503744k040651k454443k668563
22613C2105146k709095k624327k476512k287629k101007j920456j741497j573904
$$ y = [65152674, 63917044, 61793779, 58833572, 55214429, 51207975, 47087982, 43056312, 39239026, 35700809, 32466962, 29542420, 26892812, 24525232, 22425705, 20588607, 19019767, 17677060, 16569739, 15694716, 15002059, 14500790, 14168078, 14001922, 13993648, 14144295, 14444357, 14898664, 15512308, 16291091, 17237569, 18353162, 19661129, 21155900, 22865335, 24757527, 26848798, 29119316, 31541738, 34057514, 36561884, 38881470, 40830974, 42248833, 43058588, 43307785, 43126250, 42715706, 42261171, 41909449, 41735870, 41750775, 41901090, 42070940, 42058501, 41679502, 40772547, 39268803, 37228152, 34773709, 32105146, 29396051, 26771724, 24295212, 22007583, 19906576, 17986120, 16244623, 14670719]
22605A4670719j420634j266135j125454r92693q67844p51269o64598n84792n13502
22596F483798m41370m05151l58120l04493k72723k43138k22700j87898j82346
22587C865859j57761j42116j34581j13859r8096j01721q7283q7239p7012r3722
22577B772469o7039q4112o4828p1088o1573n3832m9163n6398m2350l9314m7938
22566B134834k4452l8375k4056l1126k0516k5023k0981k3072j6239k2370j8723
22555A869901k5478k5544k0700l3168l0587l3400k9532l2785k1564k7947j8073
22544A571123j5469o381j2280k999o429P496L456J4802N412K8253J2242K3748
22532A622974K5455J9001O236L484k780M243r8K368J289j3432j6422j3212j8919
$$ y = [14670719, 13250085, 11983950, 10858496, 9865803, 8997959, 8246690, 7582092, 6997300, 6483798, 6042428, 5637277, 5279157, 4974664, 4701941, 4458803, 4236103, 4048205, 3865859, 3708098, 3565982, 3431401, 3317542, 3219446, 3117725, 3030442, 2943203, 2866191, 2772469, 2705430, 2621318, 2556490, 2485402, 2423829, 2369997, 2320834, 2264436, 2222086, 2182772, 2134834, 2110382, 2072007, 2047951, 2016825, 1996309, 1971286, 1950305, 1927233, 1910994, 1888624, 1869901, 1844423, 1818879, 1798179, 1765011, 1734424, 1701024, 1671492, 1638707, 1617143, 1589196, 1571123, 1555654, 1549273, 1536993, 1533994, 1527565, 1535061, 1538517, 1553319, 1558731, 1586984, 1599226, 1622974, 1648429, 1667430, 1673666, 1677150, 1674370, 1678613, 1678515, 1680883, 1682172, 1668740, 1652318, 1639106, 1620187]
22519A620187j3552n716L929j4006k661o899l066o711q591l69K681m322n748m181
22505A550975j935L640J440k220j2215l944k4019j1625r843j3383j7944j7174
22493A441753k8341j9946j6725k2535j4832o344k3995j4376j4094k3862j6873
22482A239830j9199k3979k0037k7019k7326k8808l5762l6513k9902k2078l3640
22471I35567k4346k4569j8363k4734k0390j7695j5318j2988j4624q785j0866l436
22459G39453o475j6749j240j2187j085n081n529p407Q39l040l181n014j1639k195
22445F59470p342j722p054K622r606k883m655j2427j432p466n890m875m016K324
22431E95048q961j070n296o62k38l387K225p142Q083j0156N543m247m830o411
$$ y = [1620187, 1606635, 1600919, 1604848, 1590842, 1588181, 1581282, 1578216, 1571505, 1562914, 1562545, 1565226, 1560904, 1555156, 1550975, 1549040, 1552680, 1554120, 1551900, 1539685, 1535741, 1511722, 1500097, 1490254, 1476871, 1458927, 1441753, 1413412, 1393466, 1376741, 1354206, 1339374, 1333030, 1309035, 1294659, 1280565, 1256703, 1239830, 1220631, 1196652, 1176615, 1149596, 1122270, 1093462, 1057700, 1021187, 991285, 969207, 935567, 911221, 886652, 868289, 843555, 823165, 805470, 790152, 777164, 762540, 753755, 742889, 739453, 732978, 716229, 714989, 702802, 701717, 696636, 691107, 683700, 684539, 681499, 678318, 673304, 661665, 659470, 652128, 650406, 643352, 645974, 636368, 633485, 628830, 616403, 614971, 607505, 601615, 596740, 592724, 595048, 586087, 585017, 579721, 579059, 578821, 575434, 577659, 570517, 578600, 568444, 573987, 569740, 564910, 558499]
22417E58499j651l244l403k728r767M481j1065m627n607k179q009o837l287k004
22403D98572r890Q419M9j0716K392o75J243k095j182R626J988N129j751J1929
22389E13038M094Q292J1015Q571J1055J5927J1657J7147J9847J8897R107J8999
22377F67646J7524J2085J3349Q626k679k567Q05O76j1069p630R742j987Q592j0470
22363G02643n103r556r668j7840j9997j5784k9719j5349k0916k0879o159k0764
22351E10909j0895j3852j0919j0444r390n968q153j0506N697q102N420n071j401
22338D27325rP045l346M512P121M735J1861L377Q266J0668J0512J5628J5155J0556
22324E33406K2007N003J2572J7401M439k061M505n03k768m805j961m017l981k26
$$ y = [558499, 556848, 553604, 550201, 547473, 537706, 542187, 531122, 526495, 520888, 518709, 510700, 503863, 500576, 498572, 488682, 497101, 497150, 486434, 488826, 488151, 489394, 487299, 486117, 495743, 497731, 502860, 501109, 513038, 517132, 525424, 536439, 545010, 556065, 571992, 583649, 600796, 620643, 639540, 648647, 667646, 685170, 697255, 710604, 719230, 716551, 713984, 714789, 715465, 704396, 696766, 706508, 704521, 713113, 702643, 697540, 687984, 678316, 660476, 640479, 624695, 594976, 579627, 558711, 537832, 531673, 510909, 500014, 486162, 475243, 464799, 455409, 449441, 441288, 430782, 436479, 428377, 433797, 428726, 427325, 427316, 434361, 431015, 435527, 442648, 447383, 459244, 462621, 470887, 481555, 492067, 507695, 522850, 533406, 555413, 560416, 572988, 590389, 594828, 592767, 597272, 596769, 594001, 589196, 587235, 583218, 579237, 579011]
22310E79011J843p833j604o156q579k1202j0399j6154k5796p083j9630j9523p460
22297D29435p465j3907o812j6824q590l367j4495j758n542r728Q579n061q378
22284C36087k245q609P282r428p1m179J432K327o102l395k540O62m186L768k829
22269C07974n116L627q702J157J874m367N91l117q38M172k653L052J033j1691
22255B86996K426R24l538K014l290J972k663j130P97J800m965J573J063l67k821
22240B80791K733m137k372j165P78r210Q736J315o962O333n632M23L914k424m519
22225B68602N751l663k265m969J1078o989K027k066n82j833j126M177k441N868
22211B71569j3907J0529k241K438n792J020j713n28Q243m393L995o208J858n42
$$ y = [579011, 580854, 573021, 571417, 565261, 556682, 535480, 525081, 508927, 483131, 476048, 456418, 436895, 429435, 421970, 408063, 401251, 384427, 375837, 372470, 357975, 356217, 350675, 340947, 349526, 344465, 336087, 333842, 325233, 332515, 323087, 323016, 318837, 320269, 322596, 316494, 313099, 310559, 311221, 307035, 310803, 307974, 302858, 306485, 297783, 298940, 300814, 296447, 297038, 293921, 293083, 297255, 294602, 297654, 298687, 286996, 289422, 290346, 286808, 288822, 285532, 287504, 284841, 283711, 284508, 286308, 281343, 282916, 283979, 283612, 280791, 283524, 279387, 277015, 275850, 276628, 267418, 276154, 277469, 270507, 276840, 271208, 271631, 275545, 273121, 268602, 274353, 270690, 268425, 263456, 274534, 267545, 269572, 267506, 266924, 265091, 263965, 268142, 265701, 271569, 257662, 268191, 265950, 268388, 262596, 263616, 261903, 261375, 269618, 265225, 269220, 263012, 264870, 264328]
22197B64328n171O987r892K407K507n530J495j225n259Q024l406K453m597m253
22183B48868O06M455J60j741J255L627m517k83L804n106q41K42L577p396P989
22168B54699j939l35N911q005L252q12o51J218k96k649k82j0J430n224Q196K968
22152B57471j0116Q089n074Q096K975o879K732M909l594K978O38l660J420N487
22138B65472j0219J1146p096j788L066j10k437J680J493J80N43r087M432L914
22124B61189l414Q95j63M889n109J622J4392n089r25K594K564N607m903N647j2226
22109B67570M036L944j0724l77k980l17R29o751P37Km018N159o572k969j035O36
22093B47270P15N97k370N525j076l128K040L011l470k526Q92J636M895o388j35
$$ y = [264328, 259157, 266144, 256252, 258659, 261166, 255636, 257131, 255906, 250647, 258671, 255265, 257718, 253121, 248868, 249474, 253929, 254089, 252348, 253603, 257230, 252713, 252430, 256234, 251128, 250287, 250529, 254106, 246710, 254699, 252760, 252425, 258336, 250331, 253583, 252771, 252120, 253338, 253042, 250393, 250111, 250101, 251531, 246307, 254503, 257471, 247355, 255444, 250370, 258466, 261441, 254562, 257294, 262203, 258609, 261587, 262225, 258565, 259985, 265472, 255253, 266399, 259303, 257515, 260581, 260471, 258034, 259714, 261207, 261387, 261930, 252843, 257275, 261189, 257775, 258670, 258507, 263396, 258287, 259909, 274301, 269212, 268287, 270881, 273445, 279052, 274149, 279796, 267570, 271606, 275550, 264826, 264449, 261469, 261152, 262081, 255330, 256067, 256069, 252051, 257210, 250638, 247669, 246634, 247270, 247985, 248582, 246212, 251737, 250661, 247533, 249573, 252584, 249114, 246588, 247480, 249116, 254011, 247623, 247488]
22078B47488J064k897L358J099L605l938L361m747p648L649M666n899l458l49
22064B39354p725k77j686K974k564N716n207k625N056K681K175L187l976m53M133
22049B40763Q57j401j316L360l006m919N691l493q03o662M468j2478L221L636
22035B27918q911L093K251m333r11K241k801P747o627j69O283m167m67K024k923
22020B20248j325k780J868m912j050n604O709k375m502K942p045K471j264N541
22006B08922K815o601k988m452P545q27j073l809M466k525J471k053m344P079
21992B03626k616k818J172K141K056l8l456N603n885J794j122n321O057O71n60
21977B01304K7k413j478K074J552n184L734J215J972j101p760N345M806o488K582
$$ y = [247488, 248552, 245655, 249013, 250112, 253717, 249779, 253140, 248393, 240745, 244394, 249060, 243161, 239703, 239354, 231629, 231352, 229666, 232640, 230076, 235792, 230585, 227960, 233016, 235697, 237872, 241059, 237083, 236630, 240763, 241620, 240219, 238903, 242263, 239257, 234338, 240029, 236536, 235733, 229071, 233539, 221061, 224282, 227918, 219007, 222100, 224351, 220018, 219107, 221348, 218547, 226294, 219667, 219498, 225781, 221614, 221147, 223171, 220248, 218923, 216143, 218011, 213099, 212049, 206445, 213154, 210779, 206277, 209219, 202174, 204645, 203381, 208922, 211737, 205136, 202148, 197696, 205241, 204414, 203341, 199532, 203998, 201473, 202944, 200891, 196547, 203626, 201010, 198192, 199364, 201505, 203561, 203523, 200067, 205670, 199785, 201579, 200457, 195136, 201193, 201864, 201304, 201331, 198918, 197440, 199514, 201066, 195882, 199616, 200831, 202803, 201702, 193942, 199287, 204093, 197605, 200187]
21962B00187P126j2374N805o893K873J643J489K925m452M81j685M43N773k491
21948B00850l500n114O202o404p63N731m030l081L605J320m906M952J353j562
21934A94653j295L704J265m329J247j204q78l33M158n327K668m702K956l42J173
21919A93414q069K742N21n342J3710j0308M034j685l915N007p593M394M76L044
21905A90430m954K44l193M02K570k393J239j419O94J988n57m219M963J580k917
21890A84458K17m026k748O111M80j171M089n267J385n892L107P27n018K871J0649
21875A89972p942J831q340L053K706n838L079R07j404L329O99n402j78P597j217
21860A82852j602j423M89m078M365k070k25J671j998j314j50J462j953N090q752
$$ y = [200187, 207313, 194939, 200744, 193851, 196724, 198367, 199856, 202781, 198329, 198810, 197125, 197568, 203341, 200850, 197350, 192236, 198438, 192034, 191271, 197002, 192972, 189891, 193496, 194816, 189910, 194862, 196215, 194653, 193358, 197062, 198327, 193998, 195245, 194041, 193163, 192830, 196988, 191661, 194329, 189627, 192583, 192241, 193414, 185345, 188087, 188608, 183266, 196976, 186668, 190702, 189017, 185102, 190109, 182516, 186910, 187386, 190430, 185476, 185720, 182527, 182929, 185499, 183106, 184345, 182926, 183620, 185608, 185051, 180832, 185795, 187375, 184458, 184675, 180649, 177901, 184012, 184492, 183321, 187410, 182143, 183528, 177636, 180743, 181470, 176452, 179323, 189972, 182030, 183861, 175521, 178574, 181280, 175442, 178521, 179428, 178024, 181353, 182052, 176650, 176472, 184069, 182852, 181250, 179827, 180316, 176238, 180603, 178533, 178308, 179979, 177981, 176667, 176517, 177979, 176026, 181116, 172364]
21845A72364J950P344r537K239l841L23P918k048K519K017m124L200J977p624
21831A74677k199K646J462l527O066j680K662n154J1340q685O270P214n498K788
21817A88382q901J381L644m101J2211m948O0j190j778M003J834K131Q14n967J577
21802A89152J763M99q366O950L361o833J615K827k099O507l398r73k983J823k52
21787A89593l738o14k73J345p516M298j213m03L766j408m304j188O90K396K152
21772A83583m853R136p121L161K460r337O916n369j060N322K809k846k92K744
21758A85253n129N044M624o392M274M499k802K784O32j300J783k750P011m348
21744A93183P76M671m362M115l307P586k941m57L297K467Q25k238L304k270p292
$$ y = [172364, 174314, 181658, 172121, 174360, 170519, 170842, 178760, 176712, 179231, 181248, 177124, 180324, 182301, 174677, 172478, 175124, 176586, 173059, 179125, 177445, 180107, 174953, 186293, 177608, 183878, 191092, 185594, 188382, 179481, 180862, 184506, 180405, 192616, 187668, 187728, 186538, 184760, 188763, 190597, 192728, 193542, 187575, 189152, 190915, 191414, 183048, 189998, 193359, 186526, 188141, 190968, 188869, 195376, 191978, 191005, 188022, 189845, 189593, 185855, 185241, 184968, 186313, 178797, 183095, 181882, 181479, 185245, 183837, 179533, 178345, 179035, 181431, 183583, 178730, 187866, 180745, 183906, 186366, 177029, 183945, 178576, 177516, 182838, 185647, 182801, 182509, 185253, 180124, 185168, 189792, 183400, 187674, 192173, 189371, 192155, 192787, 191487, 193270, 190520, 197531, 193183, 193959, 198630, 194268, 198383, 195076, 202662, 199721, 199264, 202561, 205028, 205853, 203615, 206919, 204649, 197357]
21729A97357N8j506q622L285j1995O327K89m121j470M55J485n372N629K605p268
21714A77136M930o15N522m938N669l042K334K560o802M098M890j650L209K197
21700A95498n356P338l229J438R77J726k397J658o08J075N199q554P256J490o060
21685A97451l546N770K598m887J888J28N266n057J847l75J606l172p91N67j433
21670A97860n012n24k563M720p390k1m582m273k5O1n84o408R091l878k420Q93
21654A74945j701R118k452l404N610p018J1293n968K045L500J471L17r60m124
21640A82672L175N9J506K79K29j105Q34k42r06l930J028q602Q390l880N919M05
21624A85831j589k132j115P72k77m836L454l001q314P526j0146P070p688L324
$$ y = [197357, 197415, 195909, 187287, 190572, 178577, 184904, 185193, 181072, 179602, 180057, 181542, 176170, 181799, 184404, 177136, 182066, 181451, 186973, 182035, 187704, 184662, 186996, 189556, 182754, 186852, 191742, 190092, 193301, 195498, 190142, 197480, 194251, 195689, 196666, 198392, 195995, 197653, 197045, 198120, 203319, 194765, 202021, 203511, 197451, 193905, 199675, 202273, 197386, 199274, 199402, 204668, 199611, 201458, 201083, 202689, 199517, 198726, 199293, 197860, 192848, 192324, 189761, 194481, 187091, 187070, 182488, 178215, 178190, 178251, 177667, 171259, 180350, 176472, 174052, 174945, 173244, 182362, 179910, 176506, 182116, 175098, 186391, 180423, 182468, 185968, 187439, 187756, 186796, 182672, 185847, 185906, 187412, 187691, 187920, 186815, 187649, 187407, 186501, 182571, 183599, 174997, 183387, 179507, 185426, 185831, 184242, 182110, 180995, 181767, 181490, 176654, 180108, 177107, 168793, 176319, 166173, 173243, 165555, 168879]
21610A68879j888M06j799j0549O002n100M365J176l840M441l834j268q607R812
21596A58196k565k370l59O75k747N899j528j181P64j142p084Q764p062M555L176
21581A55991l362J644l032p67M24J46k62Q75O87j358J709o9L519j2924N95O165
21565A49981m222N494q80P25J406q167O745J137L36m339M901k867J293k242J198
21550A50499l867J691K048k130J561L438j727N716J123m183M320l817q192L781
21536A50261l971L148Q02n547J5768j1979J838K057l449n021P860n848K793l027
21522A45685L844p250M619j989o554O734k611K275j40p439R223n577K110K27L633
21507A46790m084k556K781k856N668n68j484K359n991N219k346k914R213l314
$$ y = [168879, 166991, 167397, 165598, 155049, 161051, 155951, 160316, 161492, 157652, 162093, 158259, 156991, 148384, 158196, 155631, 153261, 152902, 153577, 150830, 156729, 155201, 154020, 154784, 153642, 146558, 155322, 148260, 152815, 155991, 152629, 154273, 151241, 150474, 150898, 151044, 150782, 151657, 152344, 150986, 152695, 152626, 156145, 143221, 143816, 149981, 145759, 151253, 150373, 151098, 152504, 144337, 151082, 152219, 152555, 148216, 153117, 150250, 151543, 149301, 150499, 146632, 148323, 150371, 148241, 149802, 153240, 151513, 157229, 158352, 154169, 158489, 154672, 146480, 150261, 146290, 149438, 150240, 144693, 160461, 148482, 150320, 152377, 148928, 143907, 151767, 145919, 148712, 145685, 149529, 142279, 146898, 144909, 138355, 145089, 142478, 144753, 144613, 137174, 146397, 140820, 142930, 143157, 146790, 142706, 140150, 142931, 140075, 145743, 145175, 143691, 146050, 140059, 145278, 142932, 140018, 149231, 145917]
21493A45917j32k536K657j064J448L815r37M70K232r211J937N469o037L569Q92
21478A48489J18n189M075l155l900L713p85j983K674L917j0170R575l816P08l641
21463A40630P019p265O241j0303P062j094k553L655J334n124N520j095r175L966
21449A38818P017j491j852m277K612k973M447j54n422K893M323k934r11o585N024
21434A38535l717J817M895m903K679r17J794m087j333M644K136r343M632l671
21420A33161N258j856l713N107p562O710n489O184o569M912m102j089O708j222
21406A36438N700r452J149k74o94j057K721j19N415j1506K025J758M86K795K352
21391A37737R77p313L395K0J800j12o426J562L193j775k199o00K218K371n599
$$ y = [145917, 145785, 143249, 145906, 144842, 146290, 150105, 149168, 149638, 151870, 142659, 144596, 150065, 144028, 147597, 148489, 148607, 143418, 147493, 144338, 140438, 144151, 143366, 141383, 144057, 147974, 137804, 147379, 143563, 144271, 140630, 147649, 140384, 146625, 136322, 143384, 142290, 139737, 143392, 144726, 139602, 145122, 144027, 134852, 138818, 145835, 144344, 142492, 138215, 140827, 137854, 142301, 142147, 136725, 139618, 143941, 141007, 140096, 133511, 138535, 134818, 136635, 141530, 136627, 139306, 138389, 140183, 136096, 134763, 139407, 141543, 132200, 136832, 133161, 138419, 136563, 132850, 137957, 130395, 137105, 131616, 137800, 131231, 136143, 132041, 130952, 137660, 136438, 142138, 132686, 133835, 133561, 132867, 131810, 134531, 134412, 139827, 128321, 130346, 132104, 132590, 135385, 137737, 138714, 131401, 134796, 134816, 136616, 136504, 130078, 131640, 134833, 133058, 130859, 130259, 132477, 134848, 129249]
21376A29249J502q806O980l497N572M618q542J2012q304M125m018P869k517q14
21362A35429j796j683K517k933j86k26J713k393K65K916l655K249k025L580J527
21347A35299m715M387j692q97J592j437K2k640O628J879o867O015L360k847O016
21332A44103m732O32M10k052N682m131K748m866n371L650K827l321Q388Q92r543
21317A35316J002P714l583M5n61m040N795m474m215L686J794p069R257q363K723
21302A35027j627M030j976M260q094N562k436M14J336O539m249N961l363l99N741
21287A46726M529L02L775N427J884q43N559J104J2565j986n052J1637j1780O883
21273A80730r72j958l513J824L980k241j698q551M435R53n801K176N04m080R24
$$ y = [129249, 130751, 121945, 128925, 125428, 131000, 135618, 127076, 139088, 130784, 134909, 130891, 138760, 136243, 135429, 133633, 131950, 134467, 131534, 131348, 131122, 132835, 130442, 130707, 133623, 129968, 132217, 130192, 133772, 135299, 130584, 134971, 133279, 132382, 133974, 132537, 132559, 129919, 136547, 138426, 131559, 137574, 140934, 138087, 144103, 139371, 140003, 140413, 138361, 144043, 139912, 142660, 137794, 132423, 136073, 138900, 135579, 143967, 144859, 135316, 136318, 144032, 140449, 140494, 139933, 135893, 141688, 137214, 132999, 136685, 138479, 131410, 140667, 132304, 135027, 133400, 137430, 135454, 139714, 131620, 137182, 134746, 135160, 136496, 143035, 138786, 144747, 141384, 140985, 146726, 151255, 151557, 155332, 160759, 162643, 161800, 167359, 168463, 181028, 179042, 173990, 185627, 173847, 180730, 179758, 177800, 174287, 176111, 180091, 177850, 176152, 167601, 172036, 172989, 167188, 169364, 169868, 165788, 166712]
21258A66712Q147q833N827o389Q001M335l244m635N444n339j734m914L01J068
21244A64747O0l815J598j0406n67j421J0715n912L794r176M274P8M090n423J140
21229A53776L942j174k811K424r70Q642O24R33n648M447J559J135J444k794J0160
21214A75689L390j443O130p669p05j329l584K324L142J909K858k736o57l408K277
21199A76188J331k364O47p417P204J883J906m306o457J013l424M298K855J124
21185A74481m453O463k734M352j783q27K801J2414o137p806J408O679m104J264
21171A82018j0112M985m500j374J502k954l181q74o262J032o90p104Q89M573j518
21156A56430K966L153j66L819j143K847O766l892Q763M887L912j0733J3971k670
$$ y = [166712, 174859, 166026, 171853, 165464, 173465, 177800, 174556, 169921, 175365, 170026, 168292, 163378, 163679, 164747, 164807, 160992, 162590, 152184, 151617, 150196, 160911, 154999, 158793, 149617, 153891, 153969, 158059, 152636, 153776, 157718, 156544, 153733, 156157, 155187, 163829, 164453, 165386, 159738, 164185, 165744, 166879, 168323, 165529, 175689, 179079, 177636, 183766, 176097, 175392, 174063, 170479, 172803, 175945, 177854, 180712, 177976, 177319, 173911, 176188, 177519, 175155, 175802, 168385, 175589, 177472, 179378, 175072, 168615, 169628, 166204, 170502, 173357, 174481, 170028, 176491, 173757, 178109, 176326, 175499, 178300, 190714, 184577, 176771, 178179, 184858, 180754, 182018, 171906, 176891, 172391, 171017, 172519, 169565, 166384, 165510, 159248, 160280, 159590, 152486, 153375, 157948, 156430, 159396, 162549, 162383, 166202, 165059, 167906, 174672, 170780, 179543, 184430, 188342, 177609, 191580, 188910]
21142A88910l775J951k977Q30j582j62L942r879K933k274j545M743o534J754r863
21127A66472o777N46K686j916K8l395Q483j0589K155N037n51l982O469o032j319
21112A57315m22K473M175n007R31M401j121o085J0146j4228k811M395n223P89
21098A49728l181M922j0603R617J089o178K727o384Q097j916L955k194m250O588
21084A52017K197k880L799l751L080N734l927r784j72L947M271o516J226o814
21070A42427J896k049n070O246m531K658o655P40O016j539N527l409O55m08p26
21055A41778n026Q603J63l890J3201p096K856n157m44R62l585J161j237n90p139
21040A34560L099k125m396L943M578q855N423m959k619N700n37j705m087P051
$$ y = [188910, 185135, 187086, 184109, 184939, 183357, 183195, 187137, 177258, 180191, 177917, 176372, 181115, 174581, 176335, 166472, 159695, 160241, 162927, 161011, 161039, 157644, 166127, 155538, 157693, 162730, 162179, 158197, 164666, 158634, 157315, 156893, 159366, 163541, 158534, 159465, 163866, 162745, 156660, 166806, 152578, 149767, 154162, 148939, 149728, 146547, 151469, 140866, 150483, 151572, 145394, 148121, 141737, 149834, 147918, 151873, 149679, 145429, 152017, 154214, 151334, 155133, 151382, 154462, 160196, 156269, 146485, 146313, 150260, 154531, 148015, 149241, 142427, 144323, 142274, 137204, 143450, 138919, 141577, 134922, 135662, 141678, 140139, 145666, 142257, 142912, 142504, 141778, 136752, 145355, 145518, 141628, 154829, 147733, 150589, 145432, 144988, 145950, 142365, 143526, 142289, 141699, 134560, 137659, 135534, 131138, 135081, 139659, 130804, 136227, 131268, 128649, 134349, 133812, 132107, 128020, 135071]
21026A35071l359k383J940J276k112o460O176j720k43P305K280j1031J092O338
21012A34170l877K439k918L380l074P764m174N764j685o33m96k16K077J722j189
20997A39054k869r48J978J291J543n359K281p775M388l049j24N44N331L627p345
20982A32568K41m09J624n218M47J127l991Q214q46M392j0113M796j733j096J740
20967A31743j239O31L040j289N050j1797Q726j773m371O553p881N776J310j0642
20953A23837O347Q980k856p244O75Q099J635m992L923l480N500k196l515J902
20939A36615J00j127K743o31j995o149Q029l175M958k811j653n16Q444l421J710
20924A41121j263q576Q092L535m585j219J815O38Q00k881p316p10J5114j415m007
$$ y = [135071, 131712, 129329, 131269, 132545, 130433, 123973, 130149, 128429, 128186, 135491, 137771, 126740, 127832, 134170, 130293, 132732, 129814, 133194, 130120, 137884, 133710, 139474, 137789, 137156, 136660, 136444, 138521, 140243, 139054, 136185, 135237, 137215, 138506, 140049, 134690, 136971, 129196, 133584, 130535, 130411, 130955, 136286, 139913, 132568, 132809, 132400, 134024, 128806, 129253, 130380, 126389, 134603, 133757, 138149, 128036, 132832, 131099, 130003, 131743, 130504, 131135, 134175, 132886, 137936, 126139, 134865, 133092, 128721, 135274, 127393, 133169, 134479, 123837, 130184, 139164, 136308, 129064, 129739, 137838, 139473, 134481, 138404, 134924, 140424, 138228, 134713, 136615, 136715, 135588, 138331, 137700, 135705, 129556, 137585, 134410, 139368, 136557, 134904, 134388, 142832, 139411, 141121, 139858, 131282, 139374, 142909, 138324, 137105, 138920, 139558, 140358, 137477, 130161, 129451, 144565, 143150, 139143]
20909A39143j600N90L435j859r91j940p55o514K216N211N89K973k452l019P579
20894A42606q03p037R64N916p524O777o670K511J544K157k10k04J921n862Q527
20879A44613m934K95O167k522N06j690L61N66J032L341k109p146J0867r75m206
20864A44166M944j360m295R388n819j719n04j183O439l912L05Q952o679M546o769
20849A46500K299l589J67N517n221O97j58O008j637j428j39k767K941L047n285
20834A46952O265j652n99R12K012K958m784M139k115l614O011P56j709k330K993
20819A56195k438M078J845m064k419N394k504Q6N78j210Kk865M222l50k900P239
20803A60889r605L597j2O639k653n804P1k78m139J1601j42n313O35M144l798j085
$$ y = [139143, 137543, 138133, 141568, 139709, 138718, 136778, 136023, 129509, 131725, 136936, 137525, 140498, 138046, 135027, 142606, 141803, 134766, 135730, 141646, 134122, 140899, 134229, 136740, 138284, 140441, 140231, 140027, 141948, 136086, 144613, 139679, 139974, 146141, 143619, 144125, 142435, 142796, 143362, 144394, 147735, 145626, 138480, 149347, 148372, 144166, 149110, 147750, 143455, 152843, 147024, 145305, 144801, 143618, 150057, 146145, 146450, 155402, 148723, 153269, 146500, 148799, 145210, 145377, 150894, 145673, 146370, 146212, 152220, 150583, 149155, 149016, 146249, 149190, 152237, 146952, 153217, 151565, 150966, 151878, 153890, 156848, 152064, 156203, 154088, 150474, 156485, 157241, 155532, 153202, 156195, 153757, 157835, 159680, 155616, 153197, 158591, 156087, 156173, 156751, 155541, 155543, 152678, 156900, 156550, 153650, 160889, 151284, 154881, 154869, 161508, 158855, 153051, 153122, 152844, 148705, 160306, 160164, 154851, 155486, 159630, 155832, 154747]
20787A54747L46N572p140l947N780L002o24J90N309m586L693O77k053o056J710
20772A56620N579m994J3092j0390L93k95N772m986n19J0801n871J967K143k604
20758A66708K602P136p708o39l174O735j87l40M126p694O741q828J1810o985l391
20743A66912O031l409M836L987o01M32q149P674l76j12r48N903m359J88L467l534
20727A77942R99J78k890R542N851p365l67J11P049n768J0332N3m596N61O468L571
20711B01671M72k420q53M154j034N0J262o095M48P470k00j214K858l673P438j389
20695B08945M06n037J613L121m769M071l949K585q96k919Q995m365L137k813J242
20680B09367J30J1327p626J015l541K747J752k369L731p392L058P114m022N262
$$ y = [154747, 155093, 160665, 153525, 149578, 155358, 158360, 157736, 157926, 163235, 158649, 162342, 163019, 160966, 154910, 156620, 162199, 157205, 170297, 159907, 160300, 160005, 165777, 160791, 160272, 171073, 165202, 167169, 169312, 166708, 169310, 176446, 168738, 168099, 164925, 171660, 171473, 171133, 175259, 167565, 174306, 165478, 177288, 170303, 166912, 172943, 169534, 174370, 178357, 177756, 178188, 170039, 177713, 177337, 177225, 176277, 182180, 177821, 178009, 181476, 177942, 178941, 179119, 176229, 185771, 191622, 184257, 183890, 184001, 191050, 185282, 195614, 195667, 191071, 191632, 198100, 201671, 202143, 199723, 198870, 203024, 201990, 202040, 203302, 197207, 197655, 205125, 204925, 203711, 206569, 202896, 210334, 208945, 209351, 204314, 205927, 209048, 204279, 208350, 204401, 206986, 206090, 203171, 212166, 207801, 210938, 208125, 209367, 209497, 220824, 213198, 214213, 210672, 213419, 215171, 212802, 216533, 209141, 212199, 219313, 215291, 220553]
20666B20553O084m493j510J0190J140m425K211L383m208P846K592K021k66Q464
20652B49582k392M553R513M587m642N177J0221J0741J915Q092M578l201J0458
20639C09182k214m730k400j0760L125n448n197j730o478k266M66m843M281p290
20625B63698j26O812p208Q957P34j556m04M917K969m3L470L286L50o293K421p974
20609B74010J3835j859J514M697p007R27M303K415k101J541Q314J331M522K779
20595C09221K725k967Q075R418n738O280N755M017J1124K760R759J4739M269K2628
20581D02065J7190J4299J9695J9914K7288K5518K4167M1150L4847L7689L9090
20570G02912N0522M5820M5609L4195L99j4187l0543n1494m4916m5234l9138l2141
$$ y = [220553, 226637, 222144, 220634, 230824, 231964, 227539, 229750, 233133, 228925, 236771, 239363, 241384, 241118, 249582, 247190, 251743, 261256, 265843, 261201, 266378, 276599, 287340, 289255, 297347, 301925, 298724, 309182, 306968, 302238, 299838, 289078, 292203, 286755, 281558, 279828, 273350, 271084, 271550, 266707, 270988, 263698, 263572, 270384, 263176, 272133, 272867, 271311, 270907, 275824, 278793, 278750, 282220, 285506, 285856, 279563, 281984, 274010, 287845, 285986, 287500, 292197, 285190, 286117, 290420, 292835, 290734, 292275, 300589, 301920, 306442, 309221, 311946, 308979, 317054, 326472, 320734, 327014, 332769, 336786, 347910, 350670, 360429, 375168, 379437, 402065, 419255, 433554, 453249, 473163, 500451, 525969, 550136, 591286, 626133, 663822, 702912, 753434, 799254, 844863, 879058, 879457, 865270, 834727, 783233, 738317, 693083, 653945, 621804]
20558F21804l3574l0787j7087k6413j0768j8956j1312j3422k443j0521R23j025
20546D46419k580J1725p594L889K565J487M130J1876K035O378J3118J2788J0572
20533E16808J1598K1270Q467K4326J8209K6828K7410M1099M4210M7379M8732P4103
20521I10439O8512R6043Q0607J07340J24084J36643J56489J66956J90608K00081
20511B237802K27601K40825K26923K05391J50869Q2197P479r6073j56224k02175
20501B924615k41441k57789k34671k22812j93426j72716j52790j27997j25330
20492A195643r7427r4664o9430o0141n5345l3892l1039l6926k1369j8333j6386
20481F60691k1709n215j1142r834r679l347o517j1543P50K841o095p93q573K355
$$ y = [621804, 588230, 557443, 540356, 513943, 503175, 484219, 472907, 459485, 457042, 446521, 447444, 446419, 443839, 455564, 447970, 451859, 454424, 455911, 460041, 471917, 473952, 480330, 493448, 506236, 516808, 528406, 549676, 558143, 582469, 600678, 627506, 654916, 696015, 740225, 787604, 836336, 910439, 978951, 1074994, 1155601, 1262941, 1387025, 1523668, 1680157, 1847113, 2037721, 2237802, 2465403, 2706228, 2933151, 3138542, 3289411, 3371608, 3379087, 3283014, 3126790, 2924615, 2683174, 2425385, 2190714, 1967902, 1774476, 1601760, 1448970, 1320973, 1195643, 1098216, 1003552, 934122, 873981, 818636, 784744, 753705, 716779, 695410, 677077, 660691, 638982, 633767, 622625, 612791, 603112, 599765, 593248, 581705, 582455, 585296, 579201, 578408, 569835, 572190]
20467E72190k215N237j258M01j863l640J802P422J425P044k766l19K988r24N937
20452E91461k767R342O344M97K53O979K960N896L003J6437k439N813M086J0570
20438F58435O735N510J0099P287Q677Q356J4268J3427J1623J5918J3325J5640
20426G89300K0204Q269J9618J0374J2929L823k451n05r145K569p674n131r722
20413H32458n66R659K157m472N116K86n60J0208Q603j45N494N461J0491O536O215
20398H96941J0748K80K3920o226J1331J2059J4490K590J7067J1680J0631J1483
20386A016994R394J7684O374J4553J3156P096J4438J3840J3533J5011O087J4909
20374A163069J4093J8038J6179J9261J2556J0737J6513J6700K0243J5267J6605
$$ y = [572190, 569975, 575212, 573954, 574355, 572492, 568852, 570654, 578076, 579501, 586545, 583779, 583460, 586448, 585524, 591461, 588694, 598036, 604380, 604877, 605130, 612109, 615069, 620965, 623968, 640405, 637966, 643779, 647865, 658435, 665170, 670680, 680779, 688066, 696743, 705099, 719367, 732794, 744417, 760335, 773660, 789300, 809504, 817773, 837391, 847765, 860694, 864517, 862066, 861561, 852416, 854985, 847311, 842180, 832458, 831892, 841551, 843708, 839236, 844352, 844638, 844078, 854286, 862889, 862744, 868238, 873699, 884190, 890726, 896941, 907689, 907969, 931889, 925663, 936994, 949053, 963543, 966133, 983200, 994880, 1005511, 1016994, 1026388, 1044072, 1050446, 1064999, 1078155, 1085251, 1099689, 1113529, 1127062, 1142073, 1148160, 1163069, 1177162, 1195200, 1211379, 1230640, 1243196, 1253933, 1270446, 1287146, 1307389, 1322656, 1339261]
20363A339261K0225K1266K0353J5237K3915J4412J7503K7223J6584J7985K7472
20352A561436J5412J7025K8334K3267K1074K2902L2857K1039K0803L7288K3084
20341A824521L4779L2088L0543L5077L4363L4669M0106L2179M6097L8030M3502
20330B225954M0222M8192M4928M1556N4302M8578N3110O1439N0764O5949N1659
20319B786653O0482N4974N7812O5179O1652O7540O4778P2943O7116P3613P6634
20308C509376P9530Q4898Q4972R4139R1869R6230J01620J04289J12060J22652
20298D481635J29689J25882J42638J43896J59465J60912J74422J78991J74451
20289E871981J80372J81808J92101J93911J96589K08533K11218K27027K25825
$$ y = [1339261, 1359486, 1380752, 1401105, 1416342, 1440257, 1454669, 1472172, 1499395, 1515979, 1533964, 1561436, 1576848, 1593873, 1622207, 1645474, 1666548, 1689450, 1722307, 1743346, 1764149, 1801437, 1824521, 1859300, 1891388, 1921931, 1957008, 1991371, 2026040, 2066146, 2098325, 2144422, 2182452, 2225954, 2266176, 2314368, 2359296, 2400852, 2455154, 2503732, 2556842, 2618281, 2669045, 2734994, 2786653, 2847135, 2902109, 2959921, 3025100, 3086752, 3154292, 3219070, 3292013, 3359129, 3432742, 3509376, 3588906, 3673804, 3758776, 3852915, 3944784, 4041014, 4142634, 4246923, 4358983, 4481635, 4611324, 4737206, 4879844, 5023740, 5183205, 5344117, 5518539, 5697530, 5871981, 6052353, 6234161, 6426262, 6620173, 6816762, 7025295, 7236513, 7463540, 7689365]
20280G689365K28580K42105K47936K59043K77426K87674L06568L29632L27208
20271A0195537L43726L55685L67424L99523M28225M64382M93654N35922N80235
20262A4164313O34885O75710P24131P91584Q46674R08008R94681J078220J174540
20253B1992746J285184J409932J547952J707817J886114K092182K334405K617136
20245C6873468K930276L308991L791115M356633N031362N857602O811378P897248
20237G6858073R126647J0466246J1876723J3336523J4787889J6213408J7603418
20230A70268927J8915488K0109474K1133517K2056515K2970925K3815411K4321975
20223C23592232K3883361K1771552J7960329J3155979P734332J485706n242339
$$ y = [7689365, 7917945, 8160050, 8407986, 8667029, 8944455, 9232129, 9538697, 9868329, 10195537, 10539263, 10894948, 11262372, 11661895, 12090120, 12554502, 13048156, 13584078, 14164313, 14799198, 15474908, 16199039, 16990623, 17837297, 18745305, 19739986, 20818206, 21992746, 23277930, 24687862, 26235814, 27943631, 29829745, 31921927, 34256332, 36873468, 39803744, 43112735, 46903850, 51260483, 56291845, 62149447, 68960825, 76858073, 85984720, 96450966, 108327689, 121664212, 136452101, 152665509, 170268927, 189184415, 209293889, 230427406, 252483921, 275454846, 299270257, 323592232, 347475593, 369247145, 387207474, 400363453, 408097785, 409583491, 404341152]
20216D04341152j1309018j6209502k0296666k3578960k5426479k5649120k4872257
20209B56999150k3712929k2388615k1054641j9726460j8398883j6961773j5386395
20202A19369454j3765514j2155846j0615243r184210p939860o874348n985108
20195E2849325n200271m538133l949677l462218l016699k653335k333598k064955
20187B5630439j823061j631621j454197j312205j187491j066152r68847q72173
20179A5314692p99374p40492o65617o23242n59812n27541m88643m61274m21975
20170A0026722m06161l76469l65817l47583l27200l28442l04146k99959k70113
20161G000832k71353k54257k39485k28468k06931k04849j89354j78448j70899
$$ y = [404341152, 393032134, 376822632, 356525966, 332947006, 307520527, 281871407, 256999150, 233286221, 210897606, 189842965, 170116505, 151717622, 134755849, 119369454, 105603940, 93448094, 82832851, 73648641, 65708781, 58834433, 52849325, 47649054, 43110921, 39161244, 35699026, 32682327, 30028992, 27695394, 25630439, 23807378, 22175757, 20721560, 19409355, 18221864, 17155712, 16186865, 15314692, 14515318, 13774826, 13109209, 12485967, 11926155, 11398614, 10909971, 10448697, 10026722, 9620561, 9244092, 8878275, 8530692, 8203492, 7875050, 7570904, 7270945, 7000832, 6729479, 6475222, 6235737, 6007269, 5800338, 5595489, 5406135, 5227687, 5056788]
20152E056788j62117j46556j47578j32876j37873j23287j06718j21282j05229
20143C873272j01120j01048j02136q9602q9571r6892q2593q1417q6345p4168o8654
20132B899726o7745p3941o2496o1664o1231n3604o3390n3084m8055m9024n2390
20121B253102l9527m1084m6661m5066l1267l8694l0561m0349l6995k9267l0833
20110A842798l4951k1169l1435k3229l5514k8430k5534k5504k0846k3401l0639
20099A542146k2953j9183k2480j6462l3225j8214j9039k7190j3938k2735k3746
20088A302981j7495j8587j9288k7203r241k3022j9529j1978j7581j8195k0203
20077A100659j1581q119j8952q320r730j4440q961m328j1933j4813m317j4379
$$ y = [5056788, 4894671, 4748115, 4600537, 4467661, 4329788, 4206501, 4099783, 3978501, 3873272, 3772152, 3671104, 3568968, 3479366, 3389795, 3292903, 3210310, 3128893, 3042548, 2968380, 2899726, 2831981, 2758040, 2695544, 2633880, 2572649, 2519045, 2455655, 2402571, 2354516, 2305492, 2253102, 2213575, 2172491, 2125830, 2080764, 2049497, 2010803, 1980242, 1939893, 1902898, 1873631, 1842798, 1807847, 1786678, 1755243, 1732014, 1696500, 1668070, 1642536, 1617032, 1596186, 1572785, 1542146, 1519193, 1500010, 1477530, 1461068, 1427843, 1409629, 1390590, 1363400, 1349462, 1326727, 1302981, 1285486, 1266899, 1247611, 1220408, 1211167, 1188145, 1168616, 1156638, 1139057, 1120862, 1100659, 1089078, 1080959, 1062007, 1053687, 1043957, 1029517, 1020556, 1016228, 1004295, 989482, 985165, 970786]
20065I70786r264j0444k0989J336j2626j7623r894o286j7419k264j2613p500j2072
20052H33128p276p226j9159p841L130j0964p121p839r168m120j186j1000m905
20039G38453r185p981J100p772j279p747p801J0518q747K106J2054O880K619J9203
20025G42421J3393J0878K4487J4418K1978K8559L2499K7715L8115L2897K8165
20014A015525K9674J6085p237j3036m6205m2920n4617n3917k8653m5408m0418
20003G28873k4715l3813k0235l3273k3764j2012j8090j9267k0891O02r883j54
19991E13378p961m821q365M894q653k557J577j1207P620j1431J418j12r258J362
19977D65884j4079n32r694j1405l71K358p065l932K149n185K11K776m331P956
$$ y = [970786, 961522, 951078, 930089, 931425, 918799, 901176, 891282, 884996, 867577, 865313, 852700, 845200, 833128, 825852, 818626, 799467, 791626, 794756, 783792, 776671, 768832, 759664, 755544, 754358, 743358, 738453, 729268, 721287, 722387, 714615, 713336, 705589, 697788, 708306, 699559, 701665, 713719, 720599, 723218, 742421, 755814, 766692, 791179, 805597, 827575, 856134, 888633, 916348, 954463, 987360, 1015525, 1045199, 1061284, 1054047, 1041011, 994806, 951886, 897269, 843352, 814699, 769291, 728873, 704158, 670345, 650110, 616837, 593073, 581061, 562971, 543704, 522813, 523415, 513532, 513378, 505417, 500596, 492231, 497125, 488472, 485915, 487492, 476285, 483905, 472474, 473892, 473780, 464522, 465884, 451805, 451273, 441579, 430174, 429803, 432161, 425096, 421164, 423313, 418128, 418339, 421115, 416784, 424740]
19963D24740m061j452j447K662N051o748P601l992K460k840L86O558N341K914
19949D37173J130J866J0902P576M654K2792J2313K1640J4613K5326K6334M8779
19937F35098M6882M4707O1956P2279Q9474R4460J05806J21319J37511J50489J73638
19926A733619J92313K07007K40660K35671K17721J87166J26733N9993l4868j10229
19916C055786j69694k22993k43319k40528k31163k05148j91172j55853j51056
19907A244860j34964j21152r5039r0688p1913o6740m6367m9325m2851k8452k7935
19896D69434k1270k3330j7476j4979j0430j0075j6073q152j474j2527p942n252
19884C20454J604j0583k514n109m469L081j1068K150r321L75l973J041n090m526
$$ y = [424740, 420679, 419227, 417780, 420442, 425493, 418745, 426346, 422354, 424814, 421974, 422360, 428918, 434259, 437173, 438303, 440169, 451071, 458647, 463301, 486093, 498406, 520046, 534659, 559985, 586319, 635098, 681980, 726687, 788643, 860922, 950396, 1044856, 1150662, 1271981, 1409492, 1559981, 1733619, 1925932, 2132939, 2373599, 2609270, 2826991, 3014157, 3140890, 3200883, 3166015, 3055786, 2886092, 2663099, 2419780, 2179252, 1948089, 1742941, 1551769, 1395916, 1244860, 1109896, 988744, 893705, 803017, 731104, 664364, 617997, 568672, 525821, 497369, 469434, 448164, 424834, 407358, 392379, 381949, 371874, 355801, 347649, 346175, 333648, 325706, 320454, 322058, 311475, 308961, 303852, 299383, 302464, 291396, 293546, 284225, 284600, 280627, 281668, 276578, 272052]
19870B72052J588l436o456P270l755p638K088J396m978J214L810l347L768j425
19856B62151p818K072m614K554m610o656N850O3l421J722k018n181j212L483p69
19841B41596K861J491o713j263L013q90j387o5p342p50m98L594o69k341N704m665
19825B31676J16M684l725j050J15k949N243O553p494L211J093K06l968n201R10
19810B29420L375j063l943q90k70L007p822N624o280J733l87P339k942k875K214
19795B26240j1251R208J212m382n781K858k23J876l142L126o25n163J368Q69l94
19780B15796k495O95L772k636j378N140J0237p836K268P44N998l546L571j623
19766B28707Q625l754m715k736k641k232m903N792o871l902k773j39L822k747
$$ y = [272052, 273640, 270204, 263748, 271018, 267263, 259625, 261713, 263109, 258131, 259345, 263155, 259808, 263576, 262151, 254333, 256405, 251791, 254345, 249735, 243079, 248929, 248992, 245571, 247293, 245275, 240094, 238882, 242365, 241596, 244457, 245948, 239235, 237972, 240985, 240095, 238708, 238643, 231301, 230551, 230053, 233647, 232978, 230637, 236341, 231676, 231792, 236476, 232751, 231701, 231816, 228867, 234110, 240663, 233169, 236380, 237473, 237679, 233711, 228510, 229420, 232795, 231732, 227789, 226899, 226629, 229636, 221814, 227438, 221158, 222891, 222504, 229843, 226901, 224026, 226240, 214989, 224197, 225409, 221027, 215246, 218104, 217881, 219757, 216615, 219741, 219116, 213953, 215321, 216190, 215796, 213301, 213996, 217768, 215132, 213754, 218894, 229131, 221295, 223563, 224307, 230305, 226759, 230330, 228707, 237332, 233578, 228863, 226127, 223486, 221254, 216351, 222143, 215272, 211370, 208597, 208458, 212280, 209533]
19752B09533m927m274n195J595P65l126K047j200l331n54O2J250M100j0648k829
19737A83268J0055J319m3K503K408l269N080m72j0348J1958k138k830K84K827
19723B00602j068J158N992l590K667j443K185M849q774J0415p57L131M524L306
19709B23197J684j35J896N756j848R75M135P152L85k766Q454J634R826M184r873
19694B54656n635q79k831j1892j365n99p473n807l993J987N644n034n750N174
19680B16203O44j402k62R041m724m580j112M063l547l531l013J507P462p48l413
19665B12588l397L588K254N452J743k498j609R897k581M321n13l7j206P681r810
19650B25873L400N568p400q06N162Q751q538L516O971j431l432j199L219J912
$$ y = [209533, 204606, 200332, 195137, 196732, 197497, 194371, 196418, 195218, 191887, 191333, 191395, 192645, 196745, 186097, 183268, 193323, 194642, 194599, 197102, 199510, 196241, 201321, 200849, 190501, 202459, 200321, 197491, 197775, 200602, 199534, 200692, 206684, 203094, 205761, 204318, 206503, 211352, 202578, 212993, 212236, 215367, 219891, 223197, 224881, 224746, 226642, 232398, 230550, 231525, 235660, 242812, 243197, 240431, 248885, 250519, 260345, 264529, 254656, 249021, 248142, 245311, 233419, 232054, 231455, 223982, 218175, 214182, 216169, 221813, 216779, 211029, 216203, 216847, 215445, 215183, 224224, 219500, 214920, 213808, 217871, 214324, 210793, 207780, 209287, 216749, 216001, 212588, 209191, 212779, 215033, 220485, 222228, 219730, 218121, 228018, 225437, 229758, 229245, 229208, 228002, 235683, 225873, 229273, 234841, 227441, 226635, 231797, 240548, 232010, 235526, 242497, 241066, 237634, 236435, 239654, 241566]
19636B41566J666n101Q155M264O064M62N289L105J859O011L75J3233M888o672
19622B85164J3258J048P939J432O697M146O220P224L71N178N757j477J3607N866
19608C62430Q921J2425J4126N747R205J4592M869Q560J4701K965Q868O304J642
19595D75355R457N122J6464P650J8565J8101K0490J8034K7263K1875M2540M4986
19583G25902L8989N1045P2020O4002P5867R4008R9673J01981J29388J51882J79651
19572A784408J78625J83305K18628K65638L28607L59494K49924p2856k85476l17346
19562B892951l00395k76582k30998j92861j69344j46435j26930j18127j12495
19553A218784j02537q0061o4274m5735m2082l5081j5835k2692j0539j7559n620
$$ y = [241566, 243232, 238131, 246286, 250550, 256614, 257076, 262365, 265470, 267329, 273340, 273715, 286948, 291836, 285164, 298422, 299470, 307409, 308841, 315538, 319684, 325904, 333128, 333499, 338677, 344434, 342957, 356564, 362430, 371351, 383776, 397902, 403649, 412854, 427446, 432315, 440875, 455576, 458541, 467409, 473713, 475355, 484812, 489934, 506398, 514048, 532613, 550714, 571204, 589238, 616501, 638376, 680916, 725902, 764891, 815936, 887956, 951958, 1027825, 1121833, 1221506, 1323487, 1452875, 1604757, 1784408, 1963033, 2146338, 2364966, 2630604, 2959211, 3318705, 3568629, 3495773, 3210297, 2892951, 2592556, 2315974, 2084976, 1892115, 1722771, 1576336, 1449406, 1331279, 1218784, 1116247, 1036186, 971912, 926177, 884095, 849014, 833179, 810487, 799948, 782389, 776769]
19542G76769j2896M819n9j0156J50L991l1j7622K185l239p377j249j0317L455
19528G28423p558k323m819N814j3912o557j812n810r297n822j4285j0527q322
19515F43193j3262k104j1208q719p727l177P046p294M473Q669O491Q261J1871
19502F36513J1478M388K996K5875o254J3492l555R353N03j3322P565j1349n537
19489F72146j968n604p04k104m673L396k711m040Q438J657O022m622M030N316
19475F74579l278M879J205q184m229j0852O419k663m783L776m025l732N062k686
19461F51488j351K754k535P512O197m577N428L958N457O093L961L257J0931M236
19447G02809O165K656O747P575M762J0729J1118O480J2061J3830J1705K2185Q745
$$ y = [776769, 763873, 768692, 768633, 758477, 758627, 762618, 762587, 744965, 747150, 743911, 736534, 735285, 724968, 728423, 720865, 718542, 713723, 719537, 705625, 699068, 697256, 691446, 682149, 676327, 662042, 651515, 643193, 629931, 627827, 616619, 607900, 600173, 596996, 604042, 596748, 601221, 609890, 616381, 624642, 636513, 647991, 652379, 655375, 681250, 674996, 688488, 684933, 694286, 694789, 681467, 689032, 677683, 672146, 670178, 664574, 663870, 661766, 657093, 660489, 657778, 653738, 662176, 663833, 669855, 665233, 669263, 674579, 671301, 676180, 677385, 669201, 664972, 654120, 660539, 657876, 653093, 656869, 652844, 649112, 654174, 651488, 650137, 652891, 650356, 657868, 664065, 659488, 664916, 668874, 674331, 680424, 684385, 687642, 698573, 702809, 708974, 711630, 718377, 725952, 730714, 741443, 752561, 759041, 771102, 784932, 796637, 818822, 827567]
19434H27567K2706J3802K1793K6041J9401L3512L0420L3112L9194M0632N1469
19423A159649M9171P0608Q5623R9153J29909J49436J71075K12084K32226K65845
19413B624779L18898L68259M05789M55512M97800N49767O11216P23307R27079
19404G482406J174325J345138R94370j9488r59850j212269j130607r74301q20664
19395E879060o82432n92255n17122m33662l93496l63082l50261k73175k03667
19386B069908j43743j00530p9326p5343o0763n3896m3639k4835k5009j3592q520
19375A440712q278L284P28R686J7208R825K0484J6761J6680K9449K0133K8296
19363A604968K2841L7555K4507L6856L1899L7425M0355L9598M1446N0767M3486
$$ y = [827567, 850273, 864075, 885868, 911909, 931310, 964822, 995242, 1028354, 1067548, 1108180, 1159649, 1208820, 1279428, 1365051, 1464204, 1594113, 1743549, 1914624, 2126708, 2358934, 2624779, 2943677, 3311936, 3717725, 4173237, 4671037, 5220804, 5832020, 6555327, 7482406, 8656731, 10001869, 10996239, 10976751, 10016901, 8804632, 7674025, 6699724, 5879060, 5196628, 4604373, 4087251, 3653589, 3260093, 2897011, 2546750, 2273575, 2069908, 1926165, 1825635, 1746309, 1670966, 1610203, 1556307, 1512668, 1487833, 1462824, 1449232, 1440712, 1432434, 1435718, 1436446, 1446132, 1463340, 1473165, 1493649, 1510410, 1527090, 1556539, 1576672, 1604968, 1627809, 1665364, 1689871, 1726727, 1758626, 1796051, 1836406, 1876004, 1917450, 1968217, 2011703]
19352B011703N5778N7462O1014N4754O3078P6728O8501Q3781Q5703Q8454R3454
19341B800410J14384J12872J36261J35764J60081J66966J87634K06203K34897
19332D255472K51577K92467L21283L50053L92116M29431M93874N30172O05927
19323G922372O47117P11902P83566Q44849Q92616R36388R42575R38048R32009
19314A5551442R33454R41320R55075R65114R56933R83391J008186J034835J037137
19305B4366887R94700Q96144P41633N77988M12599L12688K67662K87834L45302
19296B9203437L89768M29632M77476N24084N91317O48525O95224P22920P46250
19287C4428633P75248P78940P35049O07248L75384M4197l37818p26532j074776
$$ y = [2011703, 2067481, 2124943, 2185957, 2240711, 2303789, 2380517, 2449018, 2532799, 2618502, 2706956, 2800410, 2914794, 3027666, 3163927, 3299691, 3459772, 3626738, 3814372, 4020575, 4255472, 4507049, 4799516, 5120799, 5470852, 5862968, 6292399, 6786273, 7316445, 7922372, 8569489, 9281391, 10064957, 10909806, 11802422, 12738810, 13681385, 14619433, 15551442, 16484896, 17426216, 18381291, 19346405, 20303338, 21286729, 22294915, 23329750, 24366887, 25361587, 26257731, 26999364, 27577352, 27989951, 28302639, 28570301, 28858135, 29203437, 29593205, 30022837, 30500313, 31024397, 31615714, 32264239, 32959463, 33682383, 34428633, 35203881, 35982821, 36717870, 37325118, 37700502, 37744699, 37406881, 36680349, 35605573]
19278C5605573j311208j422698j402011j254440j045322p93739n31018k66987
19270B7578150j729K80015N50453Q11978J045486J236457J345366J392657J387583
19261C5626416J358432J316923J276924J263221J278500J392621J619446J942316
19253D7074799K333615K743425L148614L509923L738509L833692L759373L524655
19245G3666605L152955K675832K103861J516721Q68367K52782l28096p88741j188195
19236H1932091j434494j489929j373540j157321r23952p72896p50880p93711q90042
19227G2345326j031775j182538j345032j522972j696426j814822j793144j709068
19219F0249549j583048j503149j531535j634425j735041j775205j746281j687160
$$ y = [35605573, 34294365, 32871667, 31469656, 30215216, 29169894, 28376155, 27845137, 27578150, 27576421, 27856436, 28406889, 29218867, 30264353, 31500810, 32846176, 34238833, 35626416, 36984848, 38301771, 39578695, 40841916, 42120416, 43513037, 45132483, 47074799, 49408414, 52151839, 55300453, 58810376, 62548885, 66382577, 70141950, 73666605, 76819560, 79495392, 81599253, 83115974, 83984341, 84237123, 83909027, 83120286, 81932091, 80497597, 79007668, 77634128, 76476807, 75552855, 74779959, 74029079, 73235368, 72345326, 71313551, 70131013, 68785981, 67263009, 65566583, 63751761, 61958617, 60249549, 58666501, 57163352, 55631817, 53997392, 52262351, 50487146, 48740865, 47053705]
19211D7053705j610563j469342j289584j035682p47422l87872j65L74736P32952
19202D1620763J070414J353613J586388J799110J919375J918050J743208J370586
19194E4381507Q52768K37046m39535j110750j729576k177119k431478k442078
19186D5140785k301891k045535j726107j371511j016142o55527l11568L2876L35693
19177C6081073N98215P81519Q72108Q27803O90335M45696J04000k61505o18803
19168C9520441r36425j153883j281317j359069j399888j441862j449316j447242
19160B9051439j442400j440009j467577j460192j426282j356042j230945j079684
19152A8148308r18634p53566n87742m45524l12639j87143q8155l3751j5808l8301
$$ y = [47053705, 45443142, 43973800, 42684216, 41648534, 40901112, 40513240, 40513075, 40887811, 41620763, 42691177, 44044790, 45631178, 47430288, 49349663, 51267713, 53010921, 54381507, 55234275, 55471321, 55031786, 53921036, 52191460, 50014341, 47582863, 45140785, 42838894, 40793359, 39067252, 37695741, 36679599, 36024072, 35712504, 35745380, 36081073, 36679288, 37460807, 38332915, 39160718, 39851053, 40296749, 40400749, 40139244, 39520441, 38584016, 37430133, 36148816, 34789747, 33389859, 31947997, 30498681, 29051439, 27609039, 26169030, 24701453, 23241261, 21814979, 20458937, 19227992, 18148308, 17229674, 16476108, 15888366, 15442842, 15130203, 14943060, 14854905, 14821154, 14805346, 14767045]
19142A4767045j13909j94283k78186l54758m62517n60000o68413p44104p84346
19133A0606529q04807p77588p35218o84302o33844n69683n26428m77864m27882
19124D968913l75974l40060k98847k63233k41403k06645j87647j58868j58233
19115B738003j28047j14384j16944j00167q3418q5734p9820p3514o0301n3951
19105A841723n8785n0564m3978m9609m2877l3463l5995k8527k6523k1001l3824
19094A416577k7818m2628k7042k7180k3788k2945k8468k4898j6448j6789k7202
19083A131371j2535j5960k4280j2101j1260j2516j5389j2640j498j6242l003j2224
19071I81723R27q282j378m766l706j1048q757k886p836m812j6691j1549p82j4145
$$ y = [14767045, 14653136, 14458853, 14180667, 13825909, 13363392, 12803392, 12134979, 11390875, 10606529, 9801722, 9024134, 8288916, 7604614, 6970770, 6401087, 5874659, 5396795, 4968913, 4592939, 4252879, 3954032, 3690799, 3449396, 3242751, 3055104, 2896236, 2738003, 2609956, 2495572, 2378628, 2278461, 2195043, 2109309, 2029489, 1955975, 1895674, 1841723, 1782938, 1732374, 1688396, 1638787, 1595910, 1562447, 1526452, 1497925, 1471402, 1450401, 1416577, 1388759, 1346131, 1319089, 1291909, 1268121, 1245176, 1216708, 1191810, 1175362, 1158573, 1131371, 1118836, 1102876, 1078596, 1066495, 1055235, 1042719, 1027330, 1014690, 1013192, 996950, 993947, 981723, 982650, 974368, 972990, 968224, 964518, 953470, 944713, 941827, 933991, 929179, 912488, 900939, 900157, 886012]
19057H86012j4390n17j0080j1029k806q145J96o562K296m794m57J987ML138j0587
19042H24266M506n043l002K458l862O043k102R221p215J233n795L297k578L162
19028H24589j633O747m124P048j347N456N147L963m169J2332o408J2708K353N947
19014H68609L086M332J2100o52O949k438P51L361P8q677k367p547r194j3091k293
18999H53007j4913J766k568o194k703k661p51L322P667j22J3241K060j478J3777
18985H63450M418N022N624O082l769Q022N839J472K769P727l782J2443j97O938
18971I22058O910M255P246J288J692J5082M566Q138O305J3725q07J8721P670J4186
18957A031035N841J4578J0428K0218M126N354J4555q41k051J2066j0120j048j0531
$$ y = [886012, 871622, 871105, 861025, 849996, 847190, 839045, 839241, 832679, 834975, 830181, 829724, 831711, 831715, 834853, 824266, 828772, 823729, 820727, 823185, 819323, 825366, 823264, 832485, 825270, 826503, 820708, 824005, 821427, 824589, 822956, 829703, 825579, 832627, 831280, 836736, 841883, 845846, 841677, 854009, 847601, 860309, 862662, 868609, 871695, 876027, 888127, 887475, 894424, 891986, 892737, 896098, 896176, 887499, 885132, 877585, 868391, 855300, 853007, 838094, 839860, 837292, 831098, 828395, 825734, 824983, 828305, 835972, 835850, 849091, 851151, 849673, 863450, 867868, 872890, 878514, 884596, 880827, 888849, 894688, 896160, 898929, 906656, 902874, 915317, 915120, 922058, 928968, 933223, 940469, 941757, 943449, 958531, 963097, 971235, 977540, 991265, 990458, 1009179, 1016849, 1031035, 1036876, 1051454, 1061882, 1082100, 1086226, 1091580, 1106135, 1105294, 1103243, 1115309, 1105189, 1104141, 1093610]
18944A093610j1231j9247p286k3989p943k3222j2598j4611r726j0071p797O285
18932I52174p165J1205L782J1699O584O412J0203M102P194l224j913p343j632
18919I92078j468j0278m826K283l094l34o299Q723J610P07N700J04R724O152j930
18904I98852L983J418J07K477k407m68R390k088Q221K487M766J484J3211p12N141
18889A045862r756L374n577k440k892k0733n11j7419j1706j5850r919j4525m114
18876I33794m969k770k856J533L573m123J8482p639R540K977N685K833Q369L795
18862I68224j628M834L659J323P040J4062o741J4413r13Q592P09J6829M42O968
18848A037813L813J0399P638L821J2135J1631J7059J1252J8173J5503J0147J8012
$$ y = [1093610, 1082379, 1063132, 1055846, 1031857, 1023914, 1000692, 988094, 973483, 963757, 953686, 945889, 952174, 945009, 956214, 959996, 971695, 978279, 984691, 994894, 998996, 1006190, 1002966, 1001053, 993710, 992078, 990610, 980332, 975506, 977789, 974695, 974361, 968062, 976785, 978395, 979102, 984802, 984906, 994630, 1000782, 998852, 1002835, 1004253, 1004360, 1006837, 1004430, 1003962, 1013352, 1011264, 1019485, 1021972, 1026738, 1028222, 1041433, 1040721, 1045862, 1036106, 1039480, 1033903, 1031463, 1028571, 1007838, 1007327, 989908, 978202, 962352, 952433, 937908, 933794, 928825, 926055, 923199, 924732, 928305, 924182, 942664, 935025, 944565, 947542, 953227, 956060, 964429, 968224, 966596, 971430, 975089, 976412, 983452, 997514, 990773, 1005186, 1004273, 1012865, 1013574, 1030403, 1030845, 1037813, 1041626, 1052025, 1059663, 1063484, 1075619, 1087250, 1104309, 1115561, 1133734, 1149237, 1159384, 1177396]
18836A177396J9031R451J5443K2584J4815J6797J9069J5061K0237K4226K5683
18825A379793K6495K3695L6662K3928L8539M5736M0593M6529N8238N2568N3700
18814A826476O6405O4196P7694Q6687P9562R4546R9826J10652J12408J28309J25568
18803B872329J46321J38165J49000J53457J51492J51215J47322J57344J59796
18794D226441J75954J76131K11761K35376K45615K88774L11245L47556L68402
18785F587255L97709M09565M23658M05957L79474L41139K85018K52356K42029
18776I724160K39481K73950L23467L75432M59193N16362N89938O58767P01879
18767A3862629P31515P32724P06574O70761O34505N95970N81546N79382O05417
$$ y = [1177396, 1196427, 1205878, 1221321, 1243905, 1258720, 1275517, 1294586, 1309647, 1329884, 1354110, 1379793, 1406288, 1429983, 1466645, 1490573, 1529112, 1574848, 1615441, 1661970, 1720208, 1772776, 1826476, 1892881, 1957077, 2034771, 2121458, 2201020, 2295566, 2395392, 2506044, 2618452, 2746761, 2872329, 3018650, 3156815, 3305815, 3459272, 3610764, 3761979, 3909301, 4066645, 4226441, 4402395, 4578526, 4790287, 5025663, 5271278, 5560052, 5871297, 6218853, 6587255, 6984964, 7394529, 7818187, 8224144, 8603618, 8944757, 9229775, 9482131, 9724160, 9963641, 10237591, 10561058, 10936490, 11395683, 11912045, 12501983, 13160750, 13862629, 14594144, 15326868, 16033442, 16704203, 17338708, 17934678, 18516224, 19095606, 19701023]
18758A9701023O24335O40430O45987O26167N72308M98569M02698K95707J89231
18749B4196455J14070O9514P1221R8806J63223K57317L82305N11741O56446P99944
18739B7321042R57748J128730J268680J421493J531015J585740J603801J516761
18731C8335010J408255J243962J099106R41019P86371O97395O40536O37489O78046
$$ y = [19701023, 20325358, 20965788, 21611775, 22237942, 22810250, 23308819, 23711517, 24007224, 24196455, 24310525, 24380039, 24451260, 24550066, 24713289, 24970606, 25352911, 25864652, 26521098, 27321042, 28278790, 29407520, 30676200, 32097693, 33628708, 35214448, 36818249, 38335010, 39743265, 40987227, 42086333, 43027352, 43813723, 44511118, 45151654, 45789143, 46467189]
$$ [...]
##END NTUPLES=NMR SPECTRUM
##END=
