##TITLE=PE2I
C13CPD CDCl3 {C:\Spectra\data\SiimK\nmr} SiimK 55
##JCAMPDX= 6.0         $$ Bruker NMR JCAMP-DX V2.0
##DATA TYPE= NMR SPECTRUM
##DATA CLASS= NTUPLES
##ORIGIN= Bruker BioSpin GmbH
##OWNER= nmrsu
$$ 1.83.2.2 TOPSPIN		Version 3.2
$$ 2016-05-10 10:45:27.663 +0300  Siim@Siim-workPC
$$ Compression mode = diff/dup
##.OBSERVE FREQUENCY= 176.052858712194
##.OBSERVE NUCLEUS= ^13C
##.ACQUISITION MODE= SIMULTANEOUS (DQD)
##.ACQUISITION SCHEME= undefined
##.AVERAGES= 512
##.DIGITISER RES= 21
##SPECTROMETER/DATA SYSTEM= spect
##.PULSE SEQUENCE= zgpg30
##.SOLVENT NAME= CDCl3
##.SHIFT REFERENCE= INTERNAL, CDCl3, 1, 218.3302
##AUDIT TRAIL= $$ (NUMBER, WHEN, WHO, WHERE, PROCESS, VERSION, WHAT)
$$ ##TITLE= Audit trail, TOPSPIN		Version 3.2
$$ ##JCAMPDX= 5.01
$$ ##ORIGIN= Bruker BioSpin GmbH
$$ ##OWNER= Siim
$$ $$ C:/Users/Siim/Desktop/nmr/PE2I_700/2/pdata/1/auditp.txt
$$ ##AUDIT TRAIL=  $$ (NUMBER, WHEN, WHO, WHERE, PROCESS, VERSION, WHAT)
(   1,<2016-04-13 09:53:15.116 +0300>,<nmrsu>,<HP>,<go>,<TOPSPIN 3.2>,
      <created by zg
	started at 2016-04-13 09:28:41.916 +0300,
	POWCHK enabled, PULCHK disabled,
       configuration hash MD5:
       D4 84 F4 16 5E 7D 81 70 50 03 B4 7A EA 88 CE C6
       data hash MD5: 64K
       E7 CF 6A 1D 1B 89 A5 68 36 58 B1 A6 A7 C0 61 DB>)
(   2,<2016-04-13 09:53:15.970 +0300>,<nmrsu>,<HP>,<audit>,<TOPSPIN 3.2>,
      <user comment:
       ICON-NMR User ID: SiimK
       data hash MD5: 64K
       E7 CF 6A 1D 1B 89 A5 68 36 58 B1 A6 A7 C0 61 DB>)
(   3,<2016-04-13 09:53:16.009 +0300>,<nmrsu>,<HP>,<audit>,<TOPSPIN 3.2>,
      <user comment:
       ICON-NMR User ID: SiimK
       data hash MD5: 64K
       E7 CF 6A 1D 1B 89 A5 68 36 58 B1 A6 A7 C0 61 DB>)
(   4,<2016-04-13 10:29:41.239 +0300>,<Siim>,<Siim-workPC>,<proc1d>,<TOPSPIN 3.2>,
      <Start of raw data processing
       ft FT_mod = 6 PKNL = 1 SI = 128K 
       data hash MD5: 128K
       F8 06 A0 D9 26 3C F8 46 3A D9 CE 57 E7 50 CA E3>)
(   5,<2016-04-13 10:29:44.114 +0300>,<Siim>,<Siim-workPC>,<proc1d>,<TOPSPIN 3.2>,
      <apk 
       data hash MD5: 128K
       14 93 33 AB 77 AE 4D F1 25 4C 0C 2E F4 CD FC 9E>)
(   6,<2016-04-13 10:29:49.747 +0300>,<Siim>,<Siim-workPC>,<proc1d>,<TOPSPIN 3.2>,
      <bcm 0 0 131072 0.000000e+000 0.000000e+000 0.000000e+000 0.000000e+000 0.000000e+000 
       data hash MD5: 128K
       14 93 33 AB 77 AE 4D F1 25 4C 0C 2E F4 CD FC 9E>)
(   7,<2016-04-13 10:29:54.850 +0300>,<Siim>,<Siim-workPC>,<proc1d>,<TOPSPIN 3.2>,
      <abs n ABSG = 5 
       data hash MD5: 128K
       92 8D AA 59 7C B4 1C 22 F3 B4 94 D3 99 0F 70 10>)
$$ ##END=
$$ 
$$ $$ hash MD5
$$ $$ 55 E9 8B F0 76 4A B1 88 83 7C 09 F3 C0 A6 82 D9
##$RELAX= 
##$RELAX= 
##$RELAX= 
##$RELAX= 
##$RELAX= 
##$RELAX= 
##$RELAX= 
##$RELAX= 
##$RELAX= 
##$RELAX= 
##$RELAX= 
##$RELAX= 
$$ Bruker specific parameters
$$ --------------------------
##$DATPATH= <C:/Users/Siim/Desktop/nmr>
##$EXPNO= 2
##$NAME= <PE2I_700>
##$PROCNO= 1
##$ACQT0= -2.60504193666602
##$AMP= (0..31)
$$ [...]
##$TE_STAB= (0..9)
2 2 0 0 0 0 0 0 0 0
##$TL= (0..7)
120 120 120 120 120 120 120 120
##$TUNHIN= 0
##$TUNHOUT= 0
##$TUNXOUT= 0
##$USERA1= <>
##$USERA2= <>
##$USERA3= <>
##$USERA4= <>
##$USERA5= <>
##$V9= 5
##$VALIST= <>
##$VCLIST= <>
##$VD= 0
##$VDLIST= <>
##$VPLIST= <>
##$VTLIST= <>
##$WBST= 1024
##$WBSW= 4
##$XGAIN= (0..3)
0 0 0 0
##$XL= 0
##$YL= 0
##$YMAX_a= 3077851
##$YMIN_a= -3320658
##$ZGOPTNS= <>
##$ZL1= 120
##$ZL2= 120
##$ZL3= 120
##$ZL4= 120
##$ABSF1= 218.3429
##$ABSF2= -18.35211
##$ABSG= 5
##$ABSL= 3
##$ALPHA= 0
##$AQORDER= 0
##$ASSFAC= 0
##$ASSFACI= 0
##$ASSFACX= 0
##$ASSWID= 0
##$AUNMP= <proc_1d>
##$AXLEFT= 0
##$AXNAME= <>
##$AXNUC= <13C>
##$AXRIGHT= 0
##$AXTYPE= 0
##$AXUNIT= <>
##$AZFE= 0.1
##$AZFW= 0.5
##$BCFW= 0
##$BC_mod= 0
##$BYTORDP= 0
##$COROFFS= 0
##$CY= 15
##$DATMOD= 1
##$DC= 0
##$DFILT= <>
##$DTYPP= 0
##$ERETIC= no
##$F1P= 220
##$F2P= -10
##$FCOR= 0.5
##$FTSIZE= 131072
##$FT_mod= 6
##$GAMMA= 0
##$GB= 0
##$INTBC= 1
##$INTSCL= 1
##$ISEN= 30
##$LB= 0
##$LEV0= 0
##$LPBIN= 0
##$MAXI= 10000
##$MC2= 0
##$MEAN= 0
##$ME_mod= 0
##$MI= 0
##$MddCEXP= no
##$MddCT_SP= no
##$MddF180= no
##$MddLAMBDA= 0
##$MddMEMORY= 0
##$MddMERGE= 0
##$MddNCOMP= 0
##$MddNITER= 0
##$MddNOISE= 0
##$MddPHASE= 0
##$MddSEED= 0
##$MddSRSIZE= 0
##$Mdd_CsALG= 0
##$Mdd_CsLAMBDA= 0
##$Mdd_CsNITER= 0
##$Mdd_CsNORM= 0
##$Mdd_CsZF= 0
##$Mdd_mod= 0
##$NCOEF= 0
##$NC_proc= -1
##$NLEV= 6
##$NOISF1= 0
##$NOISF2= 0
##$NSP= 0
##$NTH_PI= 0
##$NZP= 0
##$OFFSET= 218.3302
##$PC= 1.4
##$PHC0= 52.80518
##$PHC1= 5.844332
##$PH_mod= 1
##$PKNL= yes
##$PPARMOD= 0
##$PPDIAG= 0
##$PPIPTYP= 0
##$PPMPNUM= 2147483647
##$PPRESOL= 1
##$PSCAL= 0
##$PSIGN= 0
##$PYNMP= <proc.py>
##$REVERSE= no
##$SF= 176.0352582243
##$SI= 131072
##$SIGF1= 0
##$SIGF2= 0
##$SINO= 0
##$SIOLD= 32768
##$SPECTYP= <C13>
##$SREGLST= <13C.CDCl3>
##$SSB= 0
##$STSI= 131072
##$STSR= 0
##$SW_p= 41666.6666666666
##$SYMM= 0
##$S_DEV= 0
##$TDeff= 65536
##$TDoff= 0
##$TI= <>
##$TILT= no
##$TM1= 0
##$TM2= 0
##$TOPLEV= 0
##$USERP1= <>
##$USERP2= <>
##$USERP3= <>
##$USERP4= <>
##$USERP5= <>
##$WDW= 0
##$XDIM= 131072
##$YMAX_p= 439822652
##$YMIN_p= -83045363
##$CURPLOT= <HP LaserJet 1010>
##$CURPRIN= <$HP LaserJet 1010>
##$DFORMAT= <normdp>
##$LAYOUT= <+/1D_X.xwp>
##$LFORMAT= <normlp>
##$PFORMAT= <normpl>
$$ End of Bruker specific parameters
$$ ---------------------------------
##NTUPLES= NMR SPECTRUM
##VAR_NAME=  FREQUENCY,     SPECTRUM/REAL,   SPECTRUM/IMAG
##SYMBOL=    X,             R,               I
##VAR_TYPE=  INDEPENDENT,   DEPENDENT,       DEPENDENT
##VAR_FORM=  AFFN,          ASDF,            ASDF
##VAR_DIM=   131072,        131072,          131072
##UNITS=     HZ,            ARBITRARY UNITS, ARBITRARY UNITS
##FACTOR=    0.317891438802083, 1,           1
##FIRST=     41666.3487752278, 459849,       -387865
##LAST=      0,             482103,          394273
##MIN=       0,             -83045363,       0
##MAX=       41666.3487752278, 439822652,    0
$$ Real data points
##PAGE= N=1
##DATA TABLE= (X++(R..R)), XYDATA
$$ [...]
$$ plain form
15271 1197079 871673 791441 1041776 913649 217605 -345071 -188241 372019 595354 328968
15261 328968 195841 659237 1200955 929993 -31013 -497334 121796 889603 723486 24593
15250 -39372 597521 936362 639075 436255 673635 713178 219263 -103260 266631 659247
15240 659247 264041 -556281 -904287 -728743 -605796 -551378 -94043 635881 908567 536207
15230 536207 113177 -24472 -211261 -563833 -544318 105893 716091 594561 44945 -200422
15219 -121841 -202088 -368287 -62113 642231 893009 297073 -444392 -533512 -109309 166683
15208 39894 -329487 -819951 -1210355 -989837 -26083 845376 691347 -191308 -642886 -296718
15197 56940 -108332 -299598 -95650 4947 -426519 -729518 -124561 826412 863276 -63546 -652388
$$ packed form
15271A197079l25406q0232K50335j28127B17605c45071J56830C72019K23335k66386
15261C28968j33127M63396N41718k70962c1013m66321A21796P67807j66117B4593
15250c9372E97521L38841k97287k02820K37380L9543B19263a03260B66631L92616
15240F59247B64041e56281l48006J75544J22947N4418i4043F35881K72686l72360
15230E36207A13177b4472j86789l52572J9515A05893O10198j21530D4945b00422
15219a21841q0247j66199f2113F42231K50778B97073d44392q9120a09309A66683
15208C9894c29487m90464l90404K20518b6083H45376j54029a91308m51578b96718
15197E6940a08332j91266i5650D947d26519l02999a24561H26412L6864f3546n88842
$$ plain form
15186 -652388 -124504 771052 957563 397634 -207396 -428052 -283351 100328 453543 331397
15176 331397 -357405 -1020824 -1037057 -533461 -95243 66105 160600 231359 105560 -121434
15165 -138124 -1079 -96071 -392501 -345572 173783 440436 -137379 -1023008 -1175279 -460029
15154 211149 139404 -374764 -654449 -520991 -239595 26199 315093 597334 723881 600216
15144 600216 259955 -127802 -249155 104676 620080 617304 -81247 -753844 -671332 -106194
15133 119714 -100240 -107633 268495 280484 -510720 -1312568 -1087300 -13626 789314 781973 491172
15122 491172 491921 636428 533906 252172 179793 469092 879035 1014540 619325 -160314
15111 -753626 -685223 -173744 115951 -24437 -132902 72164 158122 -307950 -938767 -976836
$$ packed form
15186f52388a24504G71052J86511C97634b07396k20656J44701A00328L53215j22146
15176C31397c57405o63419j6233N03596i5243F6105R4495P0759A05560a21434
15165a38124a079r4992k96430M6929A73783K66653a37379q85629j52271d60029
15154B11149p1745c74764k79685J33458b39595B6199K88894K82241J26547j23665
15144F00216B59955a27802j21353A04676N15404k776h1247o72597Q2512a06194
15133A19714a00240p393B68495J1989e10720q01848K25268a3626G89314p341k90801
15122D91172P49J44507j02522B52172p2379K89299M09943J35505l95215a60314
15111g53626O8403a73744A15951b4437j08465G2164Q5958c07950o30817l8069
$$ plain form
15101 -976836 -349054 264789 320245 -112723 -677193 -1030980 -855531 -126398 543478 404156
15091 404156 -380107 -733424 -64742 846520 875905 89557 -416185 -80480 434915 294039
15081 294039 -371237 -757401 -462819 190813 727152 924104 684234 21901 -614431 -470940
15071 -470940 608315 1653101 1498419 228055 -859683 -861967 -276624 -60968 -237093 -77885
15060 610773 1184920 1197444 1034228 1202112 1486798 1275101 477745 -292068 -431866 32704
15049 586414 822295 804635 845103 1010704 1023336 691352 217337 -83117 -153139 -82297 113524
15037 314993 206162 -245489 -530868 -321709 -107587 -449619 -928292 -700290 118105 638323
15027 638323 656465 753511 918475 440838 -537474 -837930 -190315 133064 -537981 -1027904
$$ packed form
15101i76836c49054B64789N5456a12723n64470l53787J75449a26398E43478j39322
15091D04156c80107l53317f4742H46520K9385H9557d16185h0480D34915j40876
15081B94039c71237l86164K94582A90813N36339J96952k39870B1901f14431J43491
15071d70940F08315J044786j54682B28055h59683k284b76624f0968j76125g7885
15060F10773N74147J2524j63216J67884K84686k11697D77745b92068j39798C2704
15049E86414K35881j7660M0468J65601J2632l31984B17337h3117p0022P0842A13524
15037C14993j08831b45489k85379K09159a07587l42032m78673K28002A18105N20218
15027F38323J8142R7046J64964D40838e37474l00456a90315A33064e37981m89923
$$ plain form
15017 -1027904 -383158 334654 -90372 -719337 -11278 1309760 1245035 -145748 -823695 -117997
15006 428077 -70467 -454401 180675 871822 603979 19147 58035 321346 88019 -221701
14995 83740 608392 647507 504154 813911 1262698 1149154 630882 331588 262466 133375
14985 133375 145703 469320 535438 -101517 -776231 -650492 -62973 155629 115779 402850
14975 402850 729916 402792 -272574 -426578 -177126 -344355 -812493 -630790 272690 886146
14965 886146 728241 361879 167998 -106031 -397090 -204900 332365 460600 137023 82146
14955 82146 288500 -103544 -1048600 -1230261 -140426 892138 658461 -197154 -438240 -123213
14944 -46832 -187992 6115 392892 410820 182239 248497 514247 467661 200081 223904 444795
$$ packed form
15017a027904c83158C34654i0372o28965a1278A309760o4725a45748o77947a17997
15006D28077g0467l83934A80675O91147k67843A9147L8888K63311H8019b21701
14995H3740N24652L9115j43353L09757M48787j13544n18272k99294o9122j29091
14985A33375J2328L23617O6118a01517o74714J25739f2973A55629l9850K87071
14975D02850L27066l27124b72574j54004a77126j67229m68138J81703B72690O13456
14965H86146j57905C61879A67998a06031k91059J92190C32365J28235A37023n4877
14955H2146K06354a03544r45056j81661a40426H92138k33677a97154k41086a23213
14944d6832j41160F115L86777J7928A82239O6258K65750m6586B00081K3823K20891
$$ plain form
14933 444795 272389 -297842 -600695 -357449 -52535 -129765 -430589 -564339 -350542 189687
14922 867825 1303915 1210447 713335 157041 -281881 -556157 -584304 -443816 -428743 -552088
14912 -552088 -358054 312154 788242 434090 -313123 -526312 -166653 -21176 -348970 -505405
14902 -505405 -64412 514162 654310 435610 223067 52880 -213493 -498147 -626869 -594838
14892 -594838 -483312 -341393 -282601 -423501 -630634 -642218 -501669 -478478 -494932 -146116
14881 521961 806886 273874 -574635 -961044 -764700 -357463 80131 502785 582884 68163
14870 -546414 -429472 405177 971214 601718 -173717 -387439 149772 806276 1029052 843021
14860 843021 561980 392399 354406 348852 255630 86183 -2032 53535 80850 -71733 -270611
$$ packed form
14933D44795j72406b97842l02853K43246e2535p7230l00824j33750K13797A89687
14922H67825M36090r3468m97112A57041b81881k74276k8147J40488J5073j23345
14912e52088J94034C12154M76088l54152c13123k13189a66653b1176l27794j56435
14902e05405f4412E14162J40148k18700k12543E2880b13493k84654j28722L2031
14892e94838J11526J41919N8792j40900k07133j1584J40549K3191j6454a46116
14881E21961K84925B73874e74635l86409J96344c57463H0131M22654Q0099F8163
14870e46414J16942D05177N66037l69496a73717k13722A49772O56504K22776j86031
14860H43021k81041j69581l7993n554r3222H6183b032E3535K7315g1733j98878
$$ plain form
14849 -270611 -284013 -113711 77658 237615 356879 267029 -149628 -623483 -746194 -532005
14839 -532005 -357641 -370503 -383620 -341707 -369826 -318255 110752 626563 475535 -330818
14828 -657516 276823 1685149 2215892 1665231 854030 250301 -251703 -449930 62813 862917
14818 862917 935732 240241 -63341 586475 1181069 677041 -397233 -771667 -216329 463652
14807 749350 741753 480992 -58853 -422183 -102213 473694 347623 -470073 -898303 -452771
14797 -452771 18287 -204485 -515307 -119955 422002 -28419 -1255056 -1796962 -1027377 51314
14786 405702 285958 360222 484906 220329 -97639 148248 646956 522586 -198442 -548174
14776 -548174 -143190 293233 226449 112605 393400 614025 274330 -176600 -41579 468561
$$ packed form
14849b70611j3402a13711G7658J59957J19264q9850a49628m73855j22711K14189
14839e32005J74364j2862j3117M1913k8119N1571A10752N15811j51028c30818
14828f57516B76823J408326N30743n50661q11201B50301b51703j98227F2813Q00104
14818H62917P2815B40241f3341E86475N94594n04028c97233l74434b16329D63652
14807G49350p597k60761e8853l63330a02213D73694j26071d70073m28230M45532
14797d52771A8287b04485l10822a19955D22002b8419j226637n41906P69585E1314
14786D05702j19744P4264J24684B20329i7639A48248M98708j24370a98442l49732
14776e48174a43190B93233o6784A12605K80795K20625B74330a76600d1579D68561
$$ plain form
14765 643745 439061 371216 548609 638079 554922 386149 -79689 -859152 -1145705 -281881
14754 864685 817581 -216160 -460013 696091 1655834 1101452 47647 144615 1038817 1039566 -133103
14742 -947968 -434041 515433 666576 166642 20366 502604 899040 667002 211670 273776
14732 273776 827275 1001092 247154 -760073 -876902 -20794 713403 589740 142657 163692
14722 163692 490118 457561 27855 -308015 -406485 -468733 -398373 42933 571825 662345 430562
14711 430562 463239 782693 811734 441240 245463 412048 362656 -149033 -430999 19831
14700 519779 182151 -579851 -523919 565327 1438972 1033363 -172268 -885064 -613951 -8301
14689 221834 137331 187199 439605 569785 432213 231276 133422 114930 267889 780102
$$ packed form
14765F43745k04684o7845J77393Q9470q3157j68773g9689p79463k86553b81881
14754H64685m7104b16160k43853F96091R59743n54382D7647R6968Q94202P49a33103
14742i47968d34041E15433J51143A66642B0366M82238L96436k32038B11670O2106
14732B73776N53499J73817B47154g60073j16829b0794G13403j23663A42657K1035
14722A63692L26426l2557B7855c08015r8470o2248P0360D2933N28892R0520k31783
14711D30562L2677L19454K9041l70494j95777J66585m9392a49033k81966A9831
14700E19779A82151e79851N5932E65327Q73645m05609a72268p12796K71113h301
14689B21834q4503M9868K52406J30180j37572k00937r7854j8492J52959N12213
$$ plain form
14679 780102 1382154 1341473 467041 -344351 -224519 357137 250272 -593692 -1031595 -529239
14669 -529239 60706 -30046 -293891 -914 446099 266890 -188470 89181 1037897 1488225 907456
14658 907456 67732 -260137 -260667 -344017 -394758 -279662 -322883 -670670 -821496 -392642 201913
14646 409655 313642 176521 -150266 -666953 -741377 -59503 542951 214605 -487737 -474691
14636 -474691 70040 161313 -68699 380574 1249801 1043637 -392841 -1224396 -414019 608167
14625 296365 -568849 -390315 541137 726862 55250 -223459 243867 524196 228317 45892
14614 258001 198311 -459687 -1124337 -1333673 -1285891 -1053351 -357341 559364 872708 355070
14603 -283153 -491004 -428190 -250017 175478 633156 636499 323972 278711 382617 30290
$$ packed form
14679G80102O02052m0681D67041c44351J19832C57137j06865e93692m37903N02356
14669e29239F0706c0046k63845i14D46099j79209a88470H9181R48716M50328n80769
14658I07456F7732b60137n30q3350n0741J15096m3221l47787j50826c92642B01913
14646D09655r6013j37121a50266n16687p4424e9503E42951B14605d87737J3046
14636d74691G0040R1273f8699C80574Q69227k06164c92841q31555d14019F08167
14625B96365e68849J78534E41137J85725E5250b23459B43867K80329B28317D5892
14614B58001n9690d59687o64650k09336M7782K32540c57341E59364L13344C55070
14603b83153k07851O2814J78173A75478M57678L343l12527m5261J03906C0290
$$ plain form
14592 -470009 -165630 682702 697307 -233598 -534532 338324 742787 -367614 -1422694 -682168
14581 922764 1383210 754640 528173 837976 637963 72323 268541 972809 744489 -375968
14570 -674067 340305 1008794 244562 -788285 -735153 -95842 15825 -226742 -68286 239356
14559 -49940 -707117 -843229 -359030 -12602 -185235 -435040 -273517 216104 585797 538373
14549 538373 274814 382069 1093869 1698361 1251252 -38740 -867896 -544478 131125 118852
14539 118852 -481184 -889019 -824910 -523912 -87759 425559 635574 304157 -83466 100233
14528 631223 688257 29749 -696344 -851951 -514422 -187486 -176610 -369021 -431760 -183515
14517 147918 132505 -325769 -829639 -925842 -485630 325563 1075644 1096494 105739 -1068037
$$ packed form
14592d70009a65630F82702J4605b33598l00934C38324M04463c67614j055080f82168
14581I22764M60446o28570k26467L09803k00013G2323J96218P04268k28320c75968
14570f74067C40305O68489B44562g88285N3132i5842A5825b26742f8286B39356
14559d9940o57177j36112c59030a2602j72633k49805J61523B16104L69693m7424
14549E38373k63559J07255P11800O04492m47109c8740q29156L23418A31125j2273
14539A18852d81184m07835O4109L00998h7759D25559K10015C04157h3466A00233
14528F31223N7034B9749f96344j55607L37529a87486J0876j92411o2739a83515
14517A47918j5413c25769n03870r6203M40212C25563P50081K0850A05739a068037
$$ plain form
14506 -1123862 10283 896033 525666 -275823 -170974 720002 1217846 904838 347396 -158147
14495 -757231 -1095368 -608209 145202 -96278 -1177025 -1347443 74324 1351163 798969 -644030
14484 -867083 248115 912353 339846 -280690 65561 759726 854584 521549 390130 446723
14474 446723 441562 609037 1120275 1429235 1012936 292815 28912 216576 350295 346988
14464 346988 363004 115661 -605017 -1032929 -185750 1477355 2276659 1432199 14243 -554899
14453 -111578 538353 788759 616502 293661 127684 180642 118105 -276969 -531291 -84502
14442 621434 578828 -192457 -579092 -167898 120025 -251660 -344699 671975 1896541 1856730
14432 1856730 610498 -500532 -720682 -389980 33483 354882 294923 -207091 -518545 -76341
$$ packed form
14506a123862A0283Q85750l70367b75823J04849G20002M97844l13008C47396a58147
14495g57231l38137M87159A45202i6278j080747j70418G4324J276839n52194f44030
14484h67083B48115O64238C39846b80690F5561O94165R4858l33035j31419N6593
14474D46723n161J67475N11238L08960m16299B92815B8912J87664J33719l307
14464C46988J6016A15661f05017m27912a85750A477355P99304q44460A4243e54899
14453a11578E38353K50406j72257B93661A27684N2958o2537b76969k54322h4502
14442F21434m2606a92457l86635a67898A20025b51660r3039F71975J224566l9811
14432A856730F10498e00532k20150L30702C3483L21399n9959b07091l11454g6341
$$ plain form
14421 589773 542200 -88224 -331266 97438 583671 823815 1087439 1230602 652863 -474828
14410 -1017869 -371028 681914 1030320 501656 -263973 -622065 -362039 154516 203690 -436904
14399 -947448 -491077 419585 550866 -169846 -587786 -207593 195531 184008 462901 1396387
14389 1396387 2014380 1465311 431239 39731 197259 110153 -213342 -173428 142164 58334
14378 -486998 -847059 -711646 -414494 -240968 -163863 -228556 -532212 -844376 -824246 -538620
14368 -538620 -236929 190293 882886 1336327 863415 -264873 -926469 -558691 215559 582751
14358 582751 514856 423388 386502 178278 -244025 -681199 -958109 -991937 -769753 -477465
14348 -477465 -451793 -747264 -931401 -625268 -113650 -7009 -307150 -316806 286906 787109
$$ packed form
14421E89773m7573h8224k43042I7438M86233K40144K63624J43163n77739d74828
14410a017869c71028F81914L48406E01656b63973l58092K60026A54516M9174d36904
14399i47448M56371D19585J31281a69846m17940b07593A95531j1523K78893R33486
14389A396387O17993n49069D31239C9731J57528q7106b13342L9914A42164E8334
14378d86998l60061J35413K97152J73526P7105o4693l03656l12164K0130K85626
14368e38620b36929A90293O92593M53441m72912b64873o61596L67778B15559L67192
14358E82751o7895r1468l6886A78278b44025m37174k76910l3828K22184K92288
14348d77465K5672k95471j84137L06133a13650g009l00141r656B86906N00203
$$ plain form
14338 787109 374851 -549652 -805594 -158456 285939 -216826 -844841 -481493 483390 701295
14328 701295 -101971 -809263 -640853 -73527 221302 309618 417660 353571 86789 107146
14318 107146 568481 803527 395079 25695 415214 1035650 902886 207915 22276 572745
14308 572745 971432 714680 331429 264453 142814 -326707 -615418 -211769 416802 463406
14298 463406 4299 -167519 245787 689559 593439 -11972 -755636 -1277362 -1240500 -536096
14287 338644 616270 238982 -4427 322205 540189 -84068 -995859 -985107 5642 727818 440033
14276 440033 -123678 -53254 364958 328135 -60076 22711 740901 1251840 810724 -309323
14265 -1123193 -903017 134768 979237 842228 85010 -251853 109683 373106 17858 -385040
$$ packed form
14338G87109C74851e49652k55942a58456B85939b16826o28015L63348D83390K17905
14328G01295a01971p07292J68410g3527B21302Q8316J08042o4089H6789K0357
14318A07146M61335K35046C95079B5695L89519O20436j32764B07915B2276N50469
14308E72745L98687k56752C31429o6976j21639c26707k88711b11769D16802M6604
14298D63406D299a67519B45787M43772r6120a1972p43664n21726L6862e36096
14287C38644K77626B38982d427C22205K17984h4068r11791J0752E642P22176k87785
14276D40033a23678e3254C64958l6823f0076B2711P18190N10939m41116c09323
14265a123193K20176A34768Q44469j37009H5010b51853A09683K63423A7858c85040
$$ plain form
14254 -215512 188422 290573 332389 684133 959342 742089 482089 623050 621158 45496
14243 -206734 671717 1570821 940117 -501268 -702556 385442 827487 88077 -222208 502452
14232 651287 -597008 -1573012 -938255 16330 -285270 -996425 -573662 373550 251001 -642444
14221 -722773 127406 617049 405328 340416 585722 433833 -72786 -84160 459995 740480
14211 740480 588851 619764 819480 504721 -194650 -277076 460420 1024103 794000 295499
14200 111019 133695 196616 414641 618609 387107 -140990 -369218 -262456 -323492 -496509
14190 -496509 -160496 623212 950777 461347 -117264 -160448 24050 -54919 -287438 -324243
14180 -324243 -111361 209405 447635 360966 -3868 -137793 172774 298276 -225597 -687452
$$ packed form
14254b15512A88422J02151M1816L51744K75209k17253k60000J40961j892D5496
14243b06734F71717Q99104o30704e01268k01288C85442M42045H8077b22208E02452
14232F51287e97008r76004O34757A6330b85270p11155M22763C73550j22549f42444
14221g22773A27406M89643k11721o4912K45306j51889g2786j1374D59995K80485
14211G40480j51629L0913J99716l14759a94650q2426D60420N63683k30103B95499
14200A11019K2676O2921K18025K03968k31502a40990k28228J06762o1036j73017
14190d96509a60496F23212L27565D61347a17264m3184B4050e4919k32519l6805
14180c24243a11361B09405K38230q6669c868j33925A72774J25502b25597m61855
$$ plain form
14170 -687452 -320050 163225 -318671 -1035935 -350611 1300840 1598437 -29499 -1269063
14161 -1269063 -421306 1088393 1161987 158620 -261960 -19019 -248741 -920273 -908549 -121196
14150 312855 -12946 -225583 262362 937444 1184828 1027943 642584 73817 -355080 -204778
14140 -204778 313278 505714 265948 168334 357723 263179 -260667 -433664 225976 943432
14130 943432 743373 -36661 -193890 566228 1229381 998433 383769 277989 565139 433464
14120 433464 -197223 -481126 -7531 515627 383717 -47378 -108349 -7488 -357409 -908582 -849913
14109 -849913 -265805 -136843 -707478 -985200 -318334 553446 707933 448206 633922 1198494
14099 1198494 1290410 623397 -168090 -464711 -286620 28618 240227 240716 64682 -91329 -89674
$$ packed form
14170f87452c20050A63225c18671p17264c50611A300840K97597b9499j239564
14161a269063d21306A088393P3594A58620b61960a9019k29722o71532J1724a21196
14150C12855a2946k12637B62362O75082K47384j56885l85359G3817c55080J50302
14140b04778C13278J92436k39766r7614J89389r4544b60667j72997B25976P17456
14130I43432k00059c6661j57229E66228O63153k30948C83769j05780K87150j31675
14120D33464a97223k83903g531E15627j31910d7378o0971g488l49921n51173N8669
14109h49913b65805J28962n70635k77722c18334E53446J54487k59727J85716N64572
14099A198494R1916F23397a68090k96621J78091B8618K11609M89F4682i1329J655
$$ plain form
14088 -89674 -23984 9368 115808 350113 508973 454058 368016 372238 212294 -255716 -577833
14077 -577833 -247030 470728 850099 740939 664103 869702 957986 624453 194287 77620
14066 139785 24233 -209298 -221615 -1740 110300 -28233 -201412 -277684 -429024 -742190 -938873
14055 -938873 -745991 -318131 -3848 141342 310030 559275 803619 1054063 1283064 1196253
14045 1196253 623007 13365 -74329 71274 -341348 -1201868 -1384961 -454589 454023 167653
14034 -879922 -1412447 -1114781 -679441 -481400 -290684 -120451 -313554 -755785 -880561 -541973
14024 -541973 -165913 -25620 -46120 -252529 -675047 -890226 -448247 285387 504401 134226
14013 -164951 -93056 41485 89219 165821 65805 -456923 -902009 -580372 122558 238119
$$ packed form
14088h9674b3984I368J06440K34305J58860n4915q6042M222j59944b55716l22117
14077e77833b47030D70728L79371j09160p6836K05599Q8284l33533A94287G7620
14066A39785B4233b09298j2317a740A10300b8233j73179p6272j51340l13166j96683
14055i38873J92882c18131c848A41342J68688K49245K44344K50444K29001q6811
14045A196253n73246A3365g4329G1274c41348q60520j83093d54589D54023A67653
14034h79922n32525K97666M35340J98041J90716a20451j93103m42231j24776L38588
14024e41973a65913b5620k0500k06409m22518k15179M41979B85387K19014A34226
14013a64951P1895D1485M7734P6602F5805d56923m45086L21637A22558J15561
$$ plain form
14003 238119 -103228 94306 712643 449105 -871520 -1647274 -924227 141692 238175 -184151
13992 -131642 166299 101303 107473 690414 1016614 155373 -1002434 -837176 431264 1042528
13982 1042528 399228 -267166 -74378 292939 21876 -510358 -567409 -282807 -324134 -835967
13972 -835967 -1275477 -1089846 -305052 443734 498914 -52253 -435519 -237383 45329 -98145
13961 -310834 -50566 348612 173041 -429147 -638081 -258247 64386 -93166 -445865 -621527
13951 -621527 -572365 -324451 76502 365355 339509 255890 427300 623231 476757 243271
13941 243271 429841 852156 832097 242926 -354847 -528630 -277369 288182 880259 910418
13931 910418 204967 -438776 -242943 357796 469565 249487 439215 761321 303653 -615187
$$ packed form
14003B38119a03228I4306O18337k63538h71520p75754P23047A41692R6483a84151
13992a31642A66299o4996O170N82941L26200A55373a002434J65258D31264O11264
13982A042528C99228b67166g4378B92939B1876e10358n7051b82807m1327n11833
13972h35967m39510J85631c05052D43734N5180e2253l83266J98136D5329i8145
13961c10834e0566C48612A73041d29147k08934b58247F4386i3166l52699j75662
13951f21527M9162K47914G6502K88853k5846q3619J71410J95931j46474k33486
13941B43271J86570M22315k0059B42926c54847j73783K51261B88182N92077L0159
13931I10418B04967d38776J95833C57796J11769k20078J89728L22106C03653f15187
$$ plain form
13920 -655976 282421 755019 178363 -221389 366523 910737 475595 -7513 578439 1360868
13910 1360868 781791 -748052 -1382264 -640911 142548 145684 81806 530036 780921 131388
13899 -740173 -624967 533965 1568427 1471169 377726 -705116 -875240 -157040 531303 381798
13889 381798 -361751 -772581 -504691 -184451 -399703 -844436 -859066 -424036 -78777 -28152
13878 82872 421059 521337 -46565 -851162 -937516 -44884 917936 892168 -42457 -757325 -443337
13867 -443337 460051 886998 460855 -144291 -161011 278794 380926 -194218 -842315 -811960
13857 -811960 -158606 477487 827767 1157701 1483127 1323142 550394 -115685 3759 583568
13847 583568 800121 481466 116707 -43735 -176126 -267963 -56352 359499 516429 323921
$$ packed form
13920f55976B82421M72598A78363b21389C66523N44214m35142g513E78439P82429
13910A360868n79077g48052o34212f40911A42548L136o3878M48230K50885A31388
13899g40173J15206E33965J034462r7258C77726g05116j70124a57040E31303j49505
13889C81798c61751m10830K67890a84451k15252m44733j4630d24036g8777b8152
13878H2872L38187J00278d6565q04597q6354d4884I17936k5768d2457p14868L13988
13867d43337D60051M26947m26143a44291j6720B78794J02132a94218o48097L0355
13857h11960a58606D77487L50280L29934L25426j59985E50394a15685C759N79809
13847E83568K16553l18655A16707d3735j32391r1837e6352C59499J56930j92508
$$ plain form
13837 323921 185271 240220 122076 -301256 -556125 -266615 265151 515000 364186 4985
13826 -359057 -468939 -117803 426731 568792 230330 43887 370734 689120 431966 -84028
13815 -169405 171343 314037 -68816 -721584 -1267769 -1472115 -1202285 -583557 -51831 130537
13804 217168 480174 673996 462285 88001 59071 363522 543109 399186 127559 -90361
13793 -178148 -71805 36817 -260240 -799486 -663948 441121 1265969 616202 -623592 -555755
13783 -555755 839480 1605934 802690 -248674 -354256 -238228 -775076 -1083261 -72188 1275346
13772 1117613 -356296 -1180659 -580625 131320 -193324 -1014791 -1301289 -938221 -374890
13762 110948 287650 -21627 -398674 -125660 656918 961896 427257 -186933 -327384 -406076
$$ packed form
13837C23921j38650N4949j18144c01256k54869b66615B65151K49849j50814D985
13826c59057j09882a17803D26731J42061B30330D3887L26847L18386k57154h4028
13815a69405A71343J42694f8816o52768n46185k04346K69830e83557e1831A30537
13804B17168K63006J93822k11711H8001k8930L04451J79587j43923A27559i0361
13793a78148g1805C6817b60240n39246J35538D41121Q24848F16202f23592O7837
13783e55755H39480P66454H02690b48674j05582J16028n36848l08185g2188A275346
13772A117613c56296q24363e80625A31320a93324q21467k86498L63068c74890
13762A10948J76702b1627l77047a25660F56918L04978D27257a86933j40451p8692
$$ plain form
13752 -406076 -727100 -768215 -247960 130220 -137029 -371152 113019 722383 585271 81643
13741 135710 570745 509049 25465 4748 490449 541207 -158785 -764323 -610970 -74240 231751
13729 272457 292038 362030 468340 535254 332133 -128467 -284170 204985 660013 261341
13718 -536237 -589447 60173 190862 -616610 -1325510 -1093483 -330581 307375 764776 927729
13708 927729 357741 -651055 -906141 11265 946429 841473 199846 31595 328780 550858
13698 550858 707939 919222 727248 -53463 -561324 -92949 609137 441505 -330125 -646949
13688 -646949 -372444 -134412 32279 493170 845110 385062 -460028 -574104 86961 523940
13678 523940 385826 235448 166014 -349371 -1096399 -1115987 -354183 138662 22521 179970
$$ packed form
13752d06076l21024m1115b47960A30220a37029k34123A13019O09364j37112H1643
13741A35710M35035o1696B5465D748M85701N0758a58785o05538J53353g4240B31751
13729B72457J9581O9992J06310O6914k03121a28467j55703B04985M55028B61341
13718e36237n3210F0173J30689f16610p08900K32027c30581C07375M57401J62953
13708I27729C57741f51055k55086A1265R35164j04956A99846C1595K97185K22078
13698E50858J57081K11283j91974e3463n07861i2949F09137j67632c30125l16824
13688f46949K74505a34412C2279M60891L51940C85062d60028j14076H6961M36979
13678E23940j38114j50378o9434c49371p47028j9588c54183A38662B2521J57449
$$ plain form
13668 179970 897859 1099691 207817 -677823 -513406 44729 -55201 -411225 -35563 758220
13657 878381 374152 289231 788842 928385 388860 39162 371630 605039 19286 -764581
13646 -698622 99341 587482 370684 132118 423852 804509 578624 -101991 -435669 -93232
13635 401435 463627 150508 -125159 -198369 -172243 -117937 -77017 -147954 -270925 -163843 205395
13623 375751 31777 -443923 -594988 -702069 -1189399 -1502775 -675104 916907 1574047 566339
13612 -676168 -514406 619705 1035963 340591 -205964 146809 536836 108011 -425877 104788
13601 1266630 1367752 -112132 -1617515 -1587479 -529671 -105901 -681040 -997767 -296309
13591 503093 299189 -512512 -777061 -343604 -18396 -90777 -55605 209883 125469 -450068
$$ packed form
13668A79970P17889K01832B07817f77823J64417D4729e5201l56024c5563G58220
13657H78381C74152q4921M99611J39543C88860C9162L32468K33409A9286g64581
13646f98622I9341M88141k16798A32118K91734L80657k25885a01991l33678i3232
13635D01435O2192A50508a25159p3210K6126N4306M0920p0937j22971J07082B05395
13623C75751C1777d43923j51065j07081m87330l13376f75104I16907O57140E66339
13612f76168J61762F19705M16258C40591b05964A46809L90027A08011d25877A04788
13601A266630J01122a12132j505383L0036e29671a05901n75139l16727b96309
13591E03093k03904e12512k64549c43604a8396p2381L5172B09883q4414d50068
$$ plain form
13580 -760727 -339467 184482 103331 -234667 -74625 482076 741185 631057 708466 1014073
13570 1014073 885474 145564 -380122 -32342 629789 593065 -184942 -818998 -787108 -462001
13560 -462001 -331252 -379294 -452162 -607438 -748794 -476483 211962 566739 60300 -669526
13549 -602454 196007 747586 687976 638695 931159 988763 414723 -191827 -135354 331431
13538 525955 369393 233829 179717 9699 -229450 -390200 -586985 -893448 -1003579 -721397
13528 -721397 -425825 -479665 -559039 -208454 312117 450883 297355 303209 353921 6884 -495431
13516 -395464 341220 816800 433085 -360691 -788802 -665845 -363535 -269768 -445355 -556113
13506 -556113 -169699 619920 1069874 681625 -41266 -243155 115396 343190 91522 -315174
$$ packed form
13580g60727c39467A84482q1151b34667g4625D82076K59109j10128P7409L05607
13570A014073j28599A45564c80122c2342F29789l6724a84942o34056L1890L25107
13560d62001J30749m8042p2868j55276j41356K72311B11962L54777F0300f69526
13549f02454A96007N51579n9610m9281K92464N7604D14723a91827N6473C31431
13538E25955j56562j35564n4112I699b29450j60750j96785l06463j10131K82182
13528g21397K95572n3840p9374b08454C12117J38766j53528N854N0712F884d95431
13516c95464C41220M75580l83715c60691m28111J22957L02310R3767j75587j10758
13506e56113a69699F19920M49954l88249d1266k01889A15396K27794I1522c15174
$$ plain form
13495 -540835 -597564 -535108 -297413 67636 396577 531922 263910 -497232 -1261169 -1268279
13485 -1268279 -630294 -369241 -775096 -746619 341449 1251723 722150 -321764 -156263 874583
13474 946130 -151078 -731872 -106319 472895 205236 -26362 411545 655557 41209 -590930
13463 -374618 181950 300516 161325 81066 -240875 -703714 -402494 692475 1072521 -26156
13452 -1069393 -484054 779497 743545 -484207 -1062533 -356904 411383 337843 -72026 -151879
13442 -151879 -5372 99573 177172 121649 -268840 -724842 -717210 -290995 -6639 -74281 -204426
13431 -204426 -257732 -394055 -603615 -639484 -387290 57846 481212 456253 -355427 -1441002
13421 -1441002 -1623394 -562127 615499 833054 456622 366667 457689 134043 -374278 -407253
$$ packed form
13495e40835n6729O2456K37695F7636L28941J35345B63910d97232p63937p110
13485a268279f30294K61053m05855K8477C41449R10274n29573c21764a56263H74583
13474I46130a51078n80794a06319D72895B05236b6362D11545K44012D1209e90930
13463c74618A81950J18566j39191q0259b40875m62839L01220F92475L80046b6156
13452a069393d84054G79497l5952d84207n78326c56904D11383p3540g2026p9853
13442a51879e372I9573P7599n5523b68840m56002P632b90995f639o7642j30145
13431b04426n3306j36323k09560l5869K52194E7846M23366k4959c55427j085575
13421a441002j82392e62127F15499K17555l76432q9955R1022A34043c74278l2975
$$ plain form
13411 -407253 -107233 -66228 -163799 31506 109150 -599063 -1560138 -1558694 -555692 320135 560215
13400 560215 660655 737779 284832 -486017 -589248 37010 249381 -337027 -591323 129604
13389 679366 495 -916078 -476158 891322 1272146 210912 -592754 89486 1163019 920320
13379 920320 -370693 -888081 39019 1010105 696088 -259226 -380406 362753 667573 21986
13368 -628865 -518124 -93972 53100 140088 389483 356904 -73184 -26498 950544 1709786 1025204
13357 1025204 -385183 -806640 -66453 395391 -157257 -872164 -866906 -314086 328089 980983
13347 980983 1453692 1318942 719233 435801 752024 1011289 665260 45768 -264763 -191180
13337 -191180 35507 265515 332332 83311 -259255 -231364 215662 614817 610389 276476 -154946
$$ packed form
13411d07253a07233M1005r7571C1506P7644e99063r61075J444e55692C20135K40080
13400E60215J00440P7124B84832d86017j03231C7010K12371c37027k54296A29604
13389F79366D95i16078M39920H91322L80824B10912e92754H9486J073533k42699
13379I20320c70693n17388C9019R71086l14017b59226j21180C62753L04820B1986
13368f28865J10741i3972E3100Q6988K49395l2579g3184b6498I50544P59242o84582
13357A025204c85183m21457f6453C95391a57257p14907N258c14086C28089O52894
13347I80983M72709j34750n99709k83432L16223K59265l46029D5768b64763P3583
13337a91180C5507K30008O6817H3311b59255K7891B15662L99155m428B76476a54946
$$ plain form
13325 -454909 -421388 -193757 -267462 -667709 -573276 467381 1474227 1253577 246875 -119584
13314 351744 535748 39106 -242318 144740 460316 197691 -156001 -308539 -733446 -1431214
13304 -1431214 -1470682 -529555 346371 330636 -10842 48921 195088 24174 10680 453214
13294 453214 571791 -150348 -746327 -194377 831793 1036104 546832 395687 571469 208725
13283 -616561 -872040 -299667 231886 165705 -164507 -438974 -678489 -606041 164086 1141872
13273 1141872 1252870 357243 -476858 -440016 175022 778047 1188164 1268460 767070 -88670
13262 -585733 -457891 -169709 -37310 201755 662623 903371 615452 100185 -264542 -448713
13252 -448713 -431160 -99186 276918 197363 -170149 -49182 651023 990695 444348 -215854
$$ packed form
13325d54909L3521a93757p3705m00247R4433D67381J006846k20650B46875a19584
13314C51744J84004C9106b42318A44740L15576A97691a56001j52538m24907o97768
13304a431214l9468e29555C46371j5735a0842D8921J46167B4174A0680M42534
13294D53214J18577a50348n95979a94377H31793K04311m89272j51145J75782B08725
13283f16561k55479b99667B31886o6181a64507k74467k39515P2448A64086R77786
13273A141872J10998C57243d76858L6842A75022O03025M10117Q0296n01390h8670
13262e85733J27842a69709c7310B01755M60868K40748k87919A00185b64542j84171
13252d48713J7553i9186B76918p9555a70149d9182F51023L39672D44348b15854
$$ plain form
13241 -150805 286693 342453 128372 131458 129584 -287072 -625385 -149882 680453 723549 -9877
13229 -342962 152053 538360 148681 -394543 -340300 77392 344281 546153 808653 700481
13219 700481 38650 -413808 40172 875200 1088458 613101 85134 -322367 -805333 -1047846
13209 -1047846 -589112 98853 57847 -634780 -903491 -332633 312225 425636 327928 348300
13199 348300 204082 -206564 -334957 114958 607743 638174 420348 235819 -78714 -464187
13189 -464187 -362644 246595 468796 -72941 -398853 261896 1038078 795475 98316 257793
13179 257793 1008987 904111 -157552 -635350 129925 808514 209064 -881443 -991575 -150232
13168 321593 -254979 -1134001 -1226119 -369521 585132 773959 335670 229394 846881 1254906
$$ packed form
13241a50805B86693N5760A28372L086j874b87072l38313a49882F80453M3096i877
13229c42962A52053L86307A48681c94543N4243G7392K66889K01872K62500j08172
13219G00481C8650d13808D0172Q35028K13258m75357H5134c22367m82966k42513
13209a047846M58734I8853m1006f34780k68711c32633C12225J13411r7708K0372
13199C48300j44218b06564j28393A14958M92785L0431k17826j84529g8714l85473
13189d64187J01543B46595K22201g2941l25912B61896P76182k42603I8316J59477
13179B57793P51194j04876a57552m77798A29925O78589B09064h81443j10132a50232
13168C21593b54979q79022r2118c69521E85132J88827C35670j06276O17487M08025
$$ plain form
13158 1254906 463735 -928309 -1379522 -606468 61134 -222657 -628399 -204637 503565 404532
13148 404532 -341002 -629347 -137910 367305 351609 157421 217562 439442 620714 828325
13138 828325 1039781 922420 377608 -46920 242726 1012107 1365194 838957 -15535 -329041
13128 -329041 50465 492818 422496 -123226 -758328 -1183082 -1230065 -843960 -256953 102082
13117 123617 164811 429271 555251 203746 -285241 -343480 -40677 86139 -66286 -71334 211554
13105 340386 -13648 -548163 -744901 -491705 -85887 191307 355712 634193 1096824 1394962
13095 1394962 1110373 448098 181606 646274 1214876 1167652 656398 295134 206886 119489
13085 119489 78872 337938 725779 815752 591017 339535 86376 -247045 -375139 -30814
$$ packed form
13158A254906D63735i28309m51213f06468F1134b22657m05742b04637E03565r9033
13148D04532c41002k88345a37910C67305j5696A57421O0141K21880J81272K07611
13138H28325K11456j17361C77608d6920B42726P69381L53087n26237a5535l13506
13128c29041E0465M42353p0322a23226o35102m24754m6983L86105b56953A02082
13117A23617M1194K64460J25980B03746b85241n8239d0677H6139f6286n048B11554
13105C40386a3648n34515j96738K53196h5887A91307J64405K78481M62631K98138
13095A394962k84589D48098A81606M64668N68602m7224n11254B95134q8248q7397
13085A19489m0617K59066L87841Q9973k24735k51482H6376b47045j28094c0814
$$ plain form
13074 445814 610619 661741 875798 754545 -185321 -1144592 -885145 310676 935841 538366
13064 538366 200500 497646 571104 -158372 -810909 -470822 365094 700576 478037 225148
13053 74063 -33302 101318 391858 207867 -570694 -977636 -279130 815581 1147993 709582
13043 709582 338225 339154 347628 197809 71957 37048 86173 311177 512638 176737 -580312
13031 -753986 93924 879418 490974 -446425 -498571 412389 1094101 998896 658790 364857
13021 364857 -123973 -490704 10583 990002 960658 -406605 -1420307 -720097 650277 790978
13011 790978 -228015 -618667 304938 1135938 577257 -652679 -950463 -72766 738120 542629
13001 542629 -312429 -971647 -1017986 -493653 293610 708869 213845 -759874 -1010595 -138628
$$ packed form
13074D45814J64805N1122K14057j21253a85321r59271K59447C10676O25165l97475
13064E38366B00500K97146P3458a58372o52537L40087C65094L35482k22539B25148
13053G4063c3302A01318K90540j83991e70694m06942b79130H15581L32412m38411
13043G09582C38225R29Q474j49819G1957l4909M9125K25004K01461A76737e80312
13031g53986I3924P85494l88444d46425n2146D12389O81712r5205l40106k93933
13021C64857a23973l66731A0583R79419k9344d06605j013702P00210F50277J40701
13011G90978b28015l90652C04938Q31000n58681f52679k97784g2766G38120j95491
13001E42629c12429o59218m6339d93653B93610M15259B13845g59874k50721a38628
$$ plain form
12990 735226 497358 -337320 -445714 327876 921033 772361 428323 375682 376939 240788
12980 240788 288319 663011 956855 888339 685132 515164 200347 -264235 -563188 -617865
12970 -617865 -630549 -504454 -9804 450103 222197 -358052 -250627 564946 930248 442320
12959 148717 691667 1180193 800726 216045 265946 496279 247536 109385 833981 1682327
12949 1682327 1426441 387586 -76169 309474 633696 522017 460773 540243 340245 98274
12938 584661 1604284 1911610 991070 -173827 -547206 -318783 -226130 -350990 -196171 432192
12927 1086612 1126112 384697 -539601 -814648 -340501 131656 66296 -168393 -64998 170849
12916 146701 111433 488012 1000948 1067911 728733 428855 225830 -17315 -22851 472346
$$ packed form
12990G35226k37868c37320j08394C27876N93157j48672l44038n2641J257j36151
12980B40788M7531L74692K93844o8516k03207j69968B00347b64235k98953n4677
12970f17865j2684J26095i804D50103B22197c58052J07425E64946L65302D42320
12959A48717N42950M88526l79467B16045M9901K30333B47536A09385P24596Q48346
12949A682327k55886C87586g6169C09474L24222j11679o1244P9470j99998I8274
12938E84661J019623L07326r20540a73827l73379K28423R2653j24860J54819D32192
12927A086612L9500C84697e39601k75047c40501A31656o5360a68393f4998A70849
12916A46701l5268L76579N12936O6963l39178k99878k03025a7315n536D72346
$$ plain form
12905 1005845 966494 580043 470758 586086 484961 353075 683007 1181422 1094580 523976
12894 356465 874031 1389572 1310715 739993 47903 -387459 -170335 587704 981064 402142
12883 -423794 -461548 12485 -3909 -448708 -422263 49409 57233 -445565 -597564 -428740 -926599
12872 -926599 -1936533 -1841520 -106826 1517611 1383381 165972 -435276 -77429 360889 410117
12862 410117 279496 79962 -166369 -167490 147968 228378 -278842 -807963 -706245 -262271
12851 -147196 -330831 -349947 -212319 -214831 -230497 8043 224760 22614 -255558 55772 780078
12840 780078 994577 350272 -431633 -549708 -19946 625620 1040830 1172017 1015318 636829
12830 636829 314481 336996 587105 540977 -95913 -837617 -852311 -59632 604648 346725
$$ packed form
12905A005845l9351l86451j09285J15328j01125j31886L29932M98415q6842E23976
12894C56465N17566N15541p8857n70722D7903c87459a70335E87704L93360D02142
12883d23794l7754A2485c909m44799K6445D9409P824d45565j51999J68824m97859
12872i26599j009934R5013a06826A517611j34230A65972d35276g7429C60889M9228
12862D10117j30621G9962a66369j121A47968Q0410b78842n29121J01718b62271
12851a47196j83635j9116J37628k512j5666H043K16717B2614b55558E5772P24306
12840G80078K14499C50272d31633j18075a9946F25620M15210J31187j56699l78489
12830F36829C14481K2515K50109m6128i5913p41704j4694e9632F04648k57923
$$ plain form
12820 346725 -415193 -644753 -113454 401442 291646 -156027 -335145 -89775 289119 455276
12810 455276 247270 -172397 -381172 -180448 60568 -106573 -512798 -605264 -257997 125641
12799 206183 -57426 -576220 -1028785 -876128 -101313 415596 43985 -468222 -38697 901582
12788 912546 -176565 -948356 -598081 -1646 -69086 -403903 -367584 -272008 -567395 -816866
12778 -816866 -474087 85595 250375 208482 388495 511762 175454 -172737 120855 688370
12768 688370 592355 -198885 -727510 -374776 500955 1220724 1426207 1097491 485910 11195
12757 -147885 -186902 -108152 507484 1611507 2099639 1022631 -832020 -1552272 -425456 1159800
12746 1448127 341379 -754091 -741653 28748 453175 111309 -359976 -318319 -44133 -177876
$$ packed form
12820C46725d15193k29560a13454D01442j09796a56027j79118h9775B89119J66157
12810D55276k08006a72397k08775a80448F0568a06573m06225r2466b57997A25641
12799B06183e7426n18794m52565J52657a01313D15596D3985d68222c8697I01582
12788I12546a76565p71791L50275a646o7440l34817L6319R5576k95387k49471
12778h16866L42779H5595J64780m1893J80013J23267A75454a72737A20855N67515
12768F88370r6015a98885n28625L52734E00955P19769K05483l28716D85910A1195
12757a47885l9017P8750E07484J104023M88132A022631h32020p20252d25456A159800
12746A448127C41379g54091J2438B8748M24427A11309c59976M1657d4133j33743
$$ plain form
12736 -177876 -577462 -506558 73983 296907 -247949 -792917 -552916 130075 466785 418583
12726 418583 423423 412327 12027 -530277 -538762 12339 404125 229993 -120764 -146771 183340
12714 661738 1114008 1275347 900680 235782 -59316 239630 506306 87270 -693887 -848315
12704 -848315 -52455 812998 754166 -22384 -399490 114907 776032 762125 311435 156464
12694 156464 317642 224395 -236251 -624557 -776420 -867361 -703321 75408 981671 945796
12684 945796 -68042 -749021 -261908 600496 754782 378474 256097 372619 199685 -162593
12673 -188662 58897 74440 -178806 -363558 -500686 -727224 -627479 180305 1013776 842276
12663 842276 -7647 -122330 799606 1314510 394619 -927179 -1022989 23307 719459 384873
$$ packed form
12736a77876l99586P0904G3983K22924b47949n44968K40001A30075L36710m8202
12726D18583M840j1096A2027e30277q485A2339L91786j74132a20764k6007A83340
12714F61738M52270J61339l74667B35782e9316B39630K66676H7270f93887j54428
12704h48315e2455H12998n8832b2384l77106A14907O61125j3907C11435j54971
12694A56464J61178r3247b36251l88306j51863r0941J64040G5408R06263l5875
12684I45796f8042o80979b61908F00496J54286l76308j22377J16522j72934a62593
12673a88662E8897J5543a78806j84752j37128k26538R9745A80305Q33471j71500
12663H42276g647j14683G99606N14904C94619i27179r5810B3307O96152l34586
$$ plain form
12653 384873 -128041 11095 414866 323339 -117895 -182466 186791 293587 -106508 -310926
12643 -310926 227096 933750 919978 353390 173430 563218 670399 44152 -607731 -588188
12633 -588188 -285162 -349882 -513649 -180346 296662 76022 -618785 -634170 262318 858211
12623 858211 337871 -402806 -136718 769563 929311 82143 -547908 -157980 485426 344202
12613 344202 -291958 -348260 350456 894615 719228 307571 236224 326235 233928 226249 639893
12602 639893 993551 548584 -337535 -385247 776260 1781126 1177855 -600044 -1719787
12593 -1719787 -1234873 -45280 564613 497571 409166 389751 45398 -364439 -32668 915787
12582 1180048 166785 -877698 -592649 476147 856044 496107 518754 958714 668455 -364156
$$ packed form
12653C84873a28041A1095M03771r1527a17895o4571A86791J06796a06508k04418
12643c10926B27096P06654j3772C53390A73430L89788J07181D4152f07731J9543
12633e88188b85162o4720j63767a80346B96662G6022f18785j5385B62318N95893
12623H58211C37871d02806a36718G69563J59748H2143e47908a57980D85426j41224
12613C44202b91958n6302C50456N44159j75387C07571p1347R0011r2307p679M13644
12602F39893L53658m44967c37535m7712G76260J004866o03271f00044j119743
12593a719787M84914d5280E64613o7042q8405j9415D5398c64439c2668I15787
12582A180048A66785h77698K85049D76147L79897l59937K2647M39960k90259c64156
$$ plain form
12571 -614651 427351 1239891 795579 246593 729855 1248532 521511 -549527 -370167 534386
12560 501771 -275662 -190718 779211 1025114 216787 -188113 376313 715057 202362 -181860
12549 168007 468319 273826 317428 815808 821455 153223 50659 853501 995086 -349594
12538 -1493902 -779783 732802 994893 107166 -244556 409025 1011265 941757 599953 346438
12528 346438 225451 417157 854152 871435 246111 -113530 414621 940752 530459 -43518
12517 408011 1258623 967757 -276954 -752596 87218 932780 827380 419107 599917 1211717
12507 1211717 1581596 1387291 688281 -128350 -365786 244733 918262 759851 115770
12497 12470 496899 683700 317627 52017 150573 135270 -129037 -166184 76804 39941 -324013
$$ packed form
12571f14651D27351Q12540m44312B46593M83262N18677E21511e49527J79360E34386
12560E01771b75662Q4944G79211K45903B16787a88113C76313L38744B02362a81860
12549A68007L00312j94493M3602M98380N647A53223E0659Q02842J41585c49594
12538a493902P14119G32802K62091A07166b44556D09025O02240o9508l41804k53515
12528C46438j20987J91706M36995J7283B46111a13530D14621N26131m10293d3518
12517D08011Q50612k90866b76954m75642H7218Q45562j05400m08273J80810O11800
12507A211717L69879j94305F88281a28350k37436B44733O73529j58411A15770
12497A2470M84429J86801C17627E2017R8556j5303a29037l7147G6804l6863c24013
$$ plain form
12485 -306531 304773 732336 433673 -51401 -3484 439295 685999 602274 515831 642548
12475 642548 864995 911982 633650 230362 100174 277944 343062 176770 293444 901466
12465 901466 1251942 721994 -24824 9982 507434 362740 -388447 -550387 275409 1043369
12455 1043369 883216 218398 -148288 -88981 143820 416769 503403 124252 -436569 -469903
12445 -469903 82126 421689 111771 -244323 24901 663770 961721 719173 282635 -11436
12434 -47919 150428 461452 769119 1035435 1070865 492968 -630202 -1411935 -1125881 -318524
12423 -95462 -469791 -456301 205347 628308 357394 150595 586216 973662 519740 -248406
12412 -255649 435168 771565 347722 -123219 -84612 8778 -444566 -1080487 -1008521 -180056
$$ packed form
12485c06531C04773M27563k98663e1401c484D39295K46704q3725q6443J26717
12475F42548K22447M6987k78332B30362A00174J77770O5118j66292J16674O08022
12465I01466L50476n29948b4824I982M97452j44694c88447j61940B75409P67960
12455A043369j60153B18398a48288N9307A43820K72949Q6634A24252d36569l3334
12445d69903H2126L39563A11771b44323B4901O38869K97951k42548B82635a1436
12434d7919A50428L11024L07667K66316L5430D92968f30202p81733K86054c18524
12423i5462l74329J3490B05347M22961k70914A50595M35621L87446m53922b48406
12412b55649D35168L36397C47722a23219L8607H778d44566o35921P1966a80056
$$ plain form
12401 405669 77002 -547978 -501691 102516 398742 274892 465080 1050011 1104878 336991
12390 -163935 317825 755447 -1058 -1147055 -1000062 370536 1223630 718582 -140883 -277776
12380 -277776 123947 382078 272074 -117784 -543519 -434095 477834 1278622 755402 -690717
12369 -1266628 -259657 985160 1083266 364560 -117155 -192618 -258740 -247426 65911 335216
12359 335216 155487 -160322 -134142 -16333 -303132 -728035 -608600 -1879 333515 105421
12348 -147487 7710 258348 156273 -108993 -17823 396547 511044 93217 -171398 387347
12337 1262016 1306880 457666 -21404 586177 1272602 803990 -388788 -915107 -506923 -141209
12326 -305425 -441477 -174080 142940 353870 825368 1456960 1444562 586624 -114607 154259
$$ packed form
12401D05669G7002e47978M6287A02516K96226j23850J90188N84931N4867C36991
12390a63935C17825M37622a058j145997J46993C70536Q53094n05048a40883j36893
12380b77776A23947K58131j10004a17784m25735J09424D77834Q00788n23220f90717
12369a266628b59657I85160R8106C64560a17155p5463o6122J1314F5911K69305
12359C35216A55487a60322K6180a6333k86799m24903J19435a879C33515A05421
12348a47487G710K50638j02075a08993a7823C96547J14497I3217a71398C87347
12337A262016M4864D57666b1404E86177O86425m68612c88788n26319M08184a41209
12326c05425j36052a74080A42940K10930M71498O31592j2398E86624a14607A54259
$$ plain form
12315 779951 652191 -197375 -689467 -193763 742060 1149255 689239 -128611 -572989 -439153
12305 -439153 -145404 -100588 -198642 -115705 137416 252834 35275 -458291 -945897 -938704 -203749
12293 569767 280141 -958381 -1545214 -505414 974962 1159267 153159 -575072 -457211 -150949
12282 1223 275329 480167 103341 -466541 -342012 233963 210588 -272277 50197 1224473
12272 1224473 1650968 634021 -396207 -130853 719609 897930 611411 760817 1201405
12263 1201405 1153713 679246 488720 682170 731313 459472 193511 121310 141616 189809
12253 189809 257057 273957 248465 246840 120831 -319534 -809800 -868261 -556019 -346086 -271618
12242 -271618 -23141 159563 -264289 -931484 -805432 152034 775528 527116 239633 505326
$$ packed form
12315G79951j27760a97375m92092a93763G42060M07195m60016a28611m44378J33836
12305d39153a45404M4816r8054Q2937A37416J15418C5275d58291m87606P193b03749
12293E69767B80141i58381n86833e05414I74962J84305A53159e75072J17861a50949
12282A223K74106K04838A03341d66541J24529B33963k3375b72277E0197J174276
12272A224473M26495F34021c96207a30853G19609J78321k86519J49406M40588
12263A201405m7692m74467j90526J93450M9143k71841A93511p2201K0306M8193
12253A89809O7248J6900k5492j625A20831c19534m90266n8461L12242K09933P4468
12242b71618b3141A59563b64289o67195J26052A52034O23494k48412B39633K65693
$$ plain form
12232 505326 655294 117389 -432381 -223983 328314 482453 402514 528183 512157 -122519
12221 -854264 -765377 69117 686006 513207 -128253 -607964 -579577 -189511 12862 -356387
12210 -930139 -993826 -466163 100881 401165 496292 237265 -437092 -795885 -146616 744370
12199 530065 -443550 -485657 635962 1226569 514337 -129835 299625 799793 434170 65888
12188 520573 833381 40893 -892802 -769803 -301958 -614206 -976204 -177686 991268 943437
12178 943437 89358 45719 682262 431643 -731698 -1089028 -95023 749652 399182 -286286
12167 -219490 353609 661476 574721 354904 106151 -111075 -232594 -345375 -387322 -8099
12156 645836 653890 -239019 -700966 361548 1801955 1701376 301000 -407964 208933 714143
$$ packed form
12232E05326J49968A17389d32381K08398C28314J54139p9939J25669j6026a22519
12221h54264Q8887F9117O16889j72799a28253m79711K8387a89511A2862c56387
12210i30139o3687d66163A00881L00284R5127B37265d37092l58793a46616G44370
12199E30065d43550m2107F35962N90607E14337a29835B99625N00168l65623F5888
12188E20573L12808D0893h92802J22999c01958l12248l61998a77686I91268m7831
12178I43437H9358m3639O36543k50619g31698l57330i5023G49652l50470b86286
12167b19490C53609L07867q6755k19817A06151a11075j21519j12781m1947h099
12156F45836Q054b39019m61947C61548J440407j00579C01000d07964B08933N05210
$$ plain form
12146 714143 118243 -785035 -1036119 -793558 -445041 104533 665110 578458 -112519 -464842
12136 -464842 -108018 209558 12078 -126290 257276 680886 661530 492967 462780 234329
12126 234329 -331030 -591280 -79275 638920 728087 186906 -336528 -374062 99470 765559
12116 765559 1045847 584336 -162342 -368051 25785 298859 171749 174702 544480 679224
12106 679224 182494 -347256 -190323 420953 707167 395226 -146979 -486381 -404893 95746
12095 692371 882291 523402 42766 -75379 195584 523556 592968 311826 -133203 -422284
12085 -422284 -495004 -657950 -1036457 -1181470 -654829 241384 841187 979794 890977 516148
12075 516148 -305962 -1110550 -1146602 -490173 -3560 -71361 -175510 87372 368951 270476 -22631
$$ packed form
12146G14143A18243g85035k51084K42561L48517A04533N60577q6652a12519l52323
12136d64842a08018B09558A2078a26290B57276M23610j9356j68563l0187k28451
12126B34329c31030k60250g9275F38920Q9167A86906c36528l7534I9470O66089
12116G65559K80288m61511a62342k05709B5785K73074j27110K953L69778J34744
12106F79224A82494c47256J56933D20953K86214l11941a46979l39402Q1488I5746
12095F92371J89920l58889D2766g5379A95584L27972O9412k81142a33203k89081
12085d22284p2720j62946l78507j45013N26641B41384N99803J38607q8817l74829
12075E16148c05962q04588l6052d90173c560o7801j04149H7372K81579r8475b2631
$$ plain form
12063 -206999 -382473 -678835 -821979 -511855 76304 532345 726525 796192 801792 659904
12053 659904 337460 -60192 -376552 -506789 -407876 -38807 581930 1147593 1123995 404306
12042 -294495 -253477 185620 156027 -247027 -119531 497747 422526 -585375 -1068734 -194761
12031 645233 5333 -1127245 -866876 477584 967318 190116 -386803 -146535 -147549 -840325
12021 -840325 -1081980 -226460 615770 433786 -68869 139082 642423 446940 -264860 -496693
12011 -496693 -25710 463572 546734 482814 587713 800612 838668 496729 -44996 -153838
12001 -153838 583523 1563797 1671494 751579 -129714 -160923 252873 408507 380736 546967
11991 546967 686605 323659 -418347 -989249 -1169375 -1062906 -611857 222043 934364 829127
$$ packed form
12063b06999j75474k96362j43144L10124G6304M56041J94180O9667N600j41888
12053F59904l22444f0192l16360j30237R8913c8807E81930N65663k3598D04306
12042b94495M1018A85620k9593b47027a19531D97747p5221e85375m83359a94761
12031F45233E333a127245K60369D77584M89734A90116c86803a46535j014o92776
12021h40325k41655b26460F15770j81984f8869A39082N03341j95483b64860k31833
12011d96693b5710D63572Q3162o3920J04899K12899L8056l41939d4996j08842
12001a53838E83523R80274J07697G51579a29714l1209B52873J55634k7771J66231
11991E46967J39638C23659d18347n70902j80126J06469M51049B22043P12321j05237
$$ plain form
11981 829127 -16530 -687018 -540074 23740 198007 -126379 -346583 -157144 -12013 -311783
11971 -311783 -624164 -299651 417258 665716 304838 81256 279160 187761 -587656 -1227803
11961 -1227803 -911130 -171132 -73123 -571727 -747081 -367605 -135236 -418811 -705049 -477107
11951 -477107 66754 387707 264765 -45764 -105523 178634 295060 -204172 -772133 -400143
11941 -400143 705800 1060075 62189 -958723 -750844 13461 126329 -64980 420025 1061465
11931 1061465 541605 -853962 -1449742 -706721 215255 476218 471418 542936 369512 -3922
11920 59236 573831 720909 203369 -307732 -353988 -229279 -128572 159556 527334 561288
11910 561288 386898 470863 623468 336873 -29951 252823 746902 359094 -630740 -770259
$$ packed form
11981H29127a6530o70488J46944B3740J74267a26379k20204a57144a2013k99770
11971c11783l12381b99651D17258K48458C04838H1256J97904r1399e87656o40147
11961a227803L16673a71132g3123m98604j75354c67605a35236k83575k86238K27942
11951d77107F6754L20953j22942d5764n9759A78634J16426b04172n67961L71990
11941d00143G05800L54275F2189i58723K07879A3461J12868f4980D20025O41440
11931A061465n19860h53962n95780g06721B15255K60963m800P1518j73424c922
11920E9236N14595J47078B03369c07732m6256J24709J00707A59556L67778L3954
11910E61288j74390Q3965J52605k86595b9951B52823M94079C59094f30740j39519
$$ plain form
11900 -770259 182234 872523 680886 581107 1114041 1346015 658461 -100176 -159229 6509
11889 -52881 149315 709835 629136 -437045 -1163657 -562816 319471 113461 -640048 -528084
11879 -528084 347497 650741 -9566 -650027 -497519 127606 490591 262786 -263766 -390860
11869 -390860 263287 1087087 1127211 519406 327982 759313 767083 -104395 -838862 -645472
11859 -645472 -205657 -280763 -349720 218966 779301 481074 -218159 -418070 -317361 -569295
11849 -569295 -849004 -453396 260088 410577 116063 164312 535364 535973 136305 -45813
11838 101705 171342 176592 409183 547305 37216 -737846 -801843 -118447 300714 -41140 -464841
11827 -464841 -307693 89689 41582 -418295 -616847 -159096 543732 685455 -2578 -811298
$$ packed form
11900g70259A82234O90289j91637r9779N32934K31974F58461a00176n9053F509
11889e2881A49315N60520q0699d37045p26612e62816C19471A13461f40048J11964
11879e28084C47497L03244i566o40461J52508A27606L62985k27805b63766j27094
11869c90860B63287Q23800M0124E19406j91424M31331P770a04395p34467J93390
11859f45472b05657p5106o8957B18966N60335k98227b18159j99911J00709k51934
11849e69295k79709L95608B60088J50489A16063M8249L71052O09A36305d5813
11838A01705O9637N250K32591J38122C7216g37846o3997a18447C00714d1140m23701
11827d64841J57148H9689D1582d18295j98552a59096E43732J41723b578q08720
$$ plain form
11817 -811298 -815437 -60164 480480 245352 -199334 -77401 537625 993621 930077 488077
11807 488077 45639 20023 492090 855124 424961 -452219 -665342 78385 847198 970240
11797 970240 859436 854132 445856 -527418 -1052033 -403067 488904 362685 -421010 -568180
11787 -568180 48856 368393 -42482 -456676 -261873 318657 830852 1024269 698937 -47453
11776 -489331 -51674 649272 483508 -448807 -785424 110223 1131553 1006890 132361 -59409
11765 771765 1380102 788451 -222123 -224394 707551 1059903 191257 -613198 -77982 1113345
11754 1423471 762968 299760 422529 457391 282682 584044 1296101 1355581 449260 -390056
11743 -430780 -171601 -128349 -24650 252287 227029 -31974 279511 1115473 1239568 232453
$$ packed form
11817h11298m139f0164D80480k35128a99334g7401E37625M55996o3544m42000
11807D88077D5639B0023M72067L63034D24961d52219k13123G8385P68813J23042
11797I70240j10804n304m08276e27418n24615d03067D88904j26219d21010j47170
11787e68180D8856L19537d2482m14194J94803C18657N12195J93417l25332d7453
11776d89331e1674F49272j65764d48807l36617A10223J021330j24663A32361e9409
11765G71765O08337n91651b22123k271G07551L52352A91257f13198g7982A113345
11754A423471o60503B99760J22769L4862j74709L01362P12057N9480D49260c90056
11743d30780a71601M3252b4650B52287k5258c1974B79511Q35962J24095B32453
$$ plain form
11732 -626825 -362398 291885 454810 529164 924182 876803 -101325 -1004021 -962670 -721111
11722 -721111 -1028844 -1049426 -73070 676561 -19448 -964619 -379493 968073 1028119 54082
11711 108139 1317455 1544846 61085 -1197276 -803469 101292 4608 -670442 -711127 -97477
11700 391395 502001 413471 145729 -131520 60026 696195 988536 499674 -174289 -342287
11690 -342287 -133120 31926 173241 388653 379083 -44603 -460802 -420249 -137825 -57862 -78244
11679 -78244 177284 513376 277409 -579526 -1153619 -710503 203505 409694 -205970 -476904
11669 -476904 205401 754611 -1965 -1307992 -1442044 -355945 277316 -268779 -796345 -366289
11658 253221 182179 -99897 13325 -22070 -648876 -975124 -263793 484723 63798 -796127
$$ packed form
11732f26825K64427B91885J62925P4354L95018m7379a01325r02696M1351K41559
11722g21111l07733k0582g3070F76561a9448r45171c79493I68073O0046E4082
11711A08139J209316K27391F1085a197276L93807A01292D608f70442m0685i7477
11700C91395J10606q8530A45729a31520F0026O36169K92341m88862a74289j67998
11690c42287a33120C1926J41315K15412r570d4603m16199M0553a37825e7862k0382
11679g8244A77284L36092k35967e79526n74093M43116B03505K06189b05970k70934
11669d76904B05401N49210a965j306027j34052c55945B77316b68779n27566c66289
11658B53221p1042i9897A3325b2070o26806l26248b63793D84723F3798g96127
$$ plain form
11647 -583146 447447 755364 85041 -322970 68365 425508 160348 -274623 -373365 -148579
11636 340397 961158 1112349 423663 -359121 -297967 245590 275434 -59404 178962 825516
11626 825516 730472 -177974 -575144 193516 1162437 1305874 822511 409476 310986 493435
11616 493435 836727 854102 117535 -835676 -957390 -223927 266435 -71680 -607159 -707739
11606 -707739 -631966 -773708 -898943 -634763 -57009 589774 1180297 1463135 1133347 399615
11595 -73245 6056 284229 434270 540104 660241 549093 65543 -492728 -668814 -306142
11584 294882 606183 391621 2357 -131053 -174637 -482443 -687909 -178618 556184 379697
11574 379697 -478622 -492555 527938 774668 -534607 -1483698 -471313 975527 617619 -799074
$$ packed form
11647e83146D47447L07917H5041c22970F8365L57143A60348b74623r8742a48579
11636C40397O20761J51191D23663c59121O1154B45590K9844e9404A78962O46554
11626H25516r5044a77974l97170A93516R68921J43437m83363D09476r8490J82449
11616D93435L43292J7375A17535h35676j21714b23927B66435g1680n35479j00580
11606g07739P5773j41742j25235K64180e7009E89774N90523K82838l29788C99615
11595g3245F056K78173J50041J05834J20137j11148F5543d92728j76086c06142
11584B94882L11301k14562B357a31053m3584l07806k05466a78618E56184j76487
11574C79697d78622j3933E27938K46730e34607r49091d71313I75527l57908g99074
$$ plain form
11563 -908379 265292 578152 -415442 -873092 -12409 702809 286116 -271308 -43613 315788
11552 24889 -502174 -613118 -345329 204525 1138630 1930611 1660371 484530 -403352 -549921
11542 -549921 -617248 -805592 -479797 310062 572186 104222 -104240 295735 392654 -172450
11531 -406518 259274 936059 876364 657852 850026 881948 274367 -238351 73079 624625
11521 624625 498934 -134615 -552051 -643127 -648632 -449161 34940 358781 215836 15646
11510 177646 438124 420132 293421 343680 460733 504792 596978 665369 338766 -324904
11499 -636752 -188857 589549 1076186 1098436 730796 65070 -589183 -805804 -507115 54701
11488 662698 1047564 829094 180959 -3358 552310 739862 -208344 -1080842 -393928 999320
$$ packed form
11563i08379B65292L12860d15442m57650a2409G02809B86116b71308d3613C15788
11552B4889e02174j10944K67789B04525R34105P91981k70240D84530d03352j46569
11542e49921o7327j88344L25795C10062K62124A04222a04240B95735R6919a72450
11531d06518B59274O76785n9695k18512J92174L1922B74367b38351G3079N51546
11521F24625j25691a34615m17436r1076n505J99471C4940L23841j42945A5646
11510A77646K60478j7992j26711N0259J17053M4059R2186O8391l26603c24904
11499f36752a88857E89549M86637K2250l67640F5070e89183k16621K98689E4701
11488F62698L84866k18470A80959c358E52310J87552b08344q72498c93928I99320
$$ plain form
11477 1061476 -93868 -379354 744958 1415496 532977 -574927 -523857 186139 597313 770958
11467 770958 812496 222936 -711004 -645356 578023 1194681 271745 -611363 61717 1215701
11457 1215701 1041913 -68865 -469140 -51763 -25649 -563932 -653713 -881 609709 741100 686390
11446 686390 526087 45212 -474748 -477515 -121059 -127888 -686066 -1252541 -1351761 -947891 -225684
11434 440854 593428 276582 134505 440940 575052 54231 -524832 -352284 302920 537901
11424 537901 191736 -107212 -65099 -42473 -273689 -494518 -473610 -379830 -418981 -432783 -97046
11412 560883 1028804 854288 286536 62669 443273 887942 934460 837705 891638 759045
11402 759045 152071 -434487 -488438 -376567 -562440 -606589 -59326 362017 -136917 -811748
$$ packed form
11477A061476i3868k85486G44958O70538E32977e74927N1070A86139M11174J73645
11467G70958M1538B22936g11004O5648E78023O16658B71745f11363F1717J153984
11457A215701j73788f8865m00275e1763b5649n38283q9781h81F09709J31391n4710
11446F86390j60303D5212d74748k767a21059o829n58178n66475r9220M03870b25684
11434D40854J52574B76582A34505L06435J34112E4231e24832J72548C02920K34981
11424E37901A91736a07212M2113K2626k31216k20829K0908R3780l9151j3802i7046
11412E60883M67921j74516B86536F2669L80604M44669M6518r6755N3933j32593
11402G59045A52071d34487n3951J11871j85873m4149e9326C62017a36917o74831
$$ plain form
11392 -811748 -472800 343987 169470 -776028 -848203 162403 646562 -12106 -421240 328418
11381 1139850 829120 -96228 -563485 -437720 -24816 626910 1132509 726242 -442211 -1144649
11371 -1144649 -834211 -364073 -412795 -513692 -239480 -5627 -60021 17475 222996 -101280
11360 -824864 -794617 288104 1164172 897589 118549 -267749 -268939 -88643 408320 919897
11350 919897 741504 56447 -191036 14004 -176481 -545502 27468 1156397 1045323 -381211
11339 -961719 134831 924412 301 -1169068 -996433 -370756 -518417 -536583 651209 1793325
11329 1793325 1205980 -316804 -824351 -214788 244530 275029 389546 360960 -149525 -398305
11319 -398305 193587 642894 26475 -663858 -178220 669451 410464 -416853 -230521 807806
$$ packed form
11392h11748L38948C43987A69470g76028p2175A62403M84159a2106m09134C28418
11381A139850l10730i6228m67257J25765b4816F26910N05599m06267d42211p02438
11371a144649L10438c64073m8722j00897b39480e627n4394A7475K05521a01280
11360h24864L0247B88104Q76068k66583A18549b67749j190h8643D08320N11577
11350I19897j78393E6447a91036A4004a76481l69021B7468J128929j11074c81211
11339i61719A34831P89581C01a169068J72635c70756j47661j8166F51209J142116
11329A793325n87345c16804n07547b14788B44530L0499J14517k8586a49525k48780
11319c98305A93587M49307B6475f63858a78220F69451k58987d16853J86332H07806
$$ plain form
11308 1202163 719267 425546 531353 222236 -562529 -968771 -746064 -472928 -448934 -558183
11298 -558183 -852125 -1199326 -955341 -13594 614382 314314 -33068 397779 891549 557996
11288 557996 -27471 18657 299559 193612 227388 820974 1016907 192078 -359903 516045
11277 1580426 1138291 -44051 -83252 866871 1231858 860723 777791 846111 172197 -723813
11266 -573636 245714 306729 -301853 -290757 351918 495727 134886 245359 686537 495492
11256 495492 -45223 85067 416866 -319010 -1535814 -1372758 119752 925336 314440 -350590
11245 -297072 -305721 -563842 -54425 1202372 1604940 555139 -458051 -281101 272565 178409
11235 178409 -143660 -781 233885 66763 -30533 457169 1006252 843893 159986 -237829
$$ packed form
11308A202163m82896k93721J05807B22236e62529m06242K22707K73136K3994j09249
11298e58183k93942l47201K43985a3594F14382l00068c3068C97779M93770l33553
11288E57996b7471A8657K80902j05947L3776N93586J95933A92078c59903E16045
11277A580426m42135d4051l9201H66871L64987l71135q2932O8320A72197g23813
11266e73636B45714O1015c01853J1096C51918J43809A34886J10473M41178j91045
11256D95492d5223H5067L31799c19010j216804J63056A19752Q05584C14440c50590
11245b97072q649k58121e4425A202372M02568E55139d58051J76950B72565r4156
11235A78409a43660g81B33885F6763c0533D57169N49083j62359A59986b37829
$$ plain form
11224 -51104 254496 89277 -574683 -1057689 -707490 102920 305872 -267264 -553947 -26415
11213 404676 68960 -235121 158069 372262 -332139 -878929 -186936 654472 125567 -956687
11202 -762877 377175 658015 10201 -5075 808472 995127 133520 -605422 -690314 -775324
11192 -775324 -906875 -372642 497891 496176 -312905 -621157 -185078 -57338 -399241 -205977
11182 -205977 549740 660938 -42137 -256837 451331 868631 311214 -266285 -56486 326888
11171 95710 -513800 -873061 -721311 -30316 866374 1047877 36972 -1165692 -1300421 -698457
11161 -698457 -538675 -805516 -608888 -10827 231332 255026 620768 811194 110047 -660041
11150 -349450 274673 -214158 -1133661 -769280 411469 482672 -425865 -394635 679600 921103
$$ packed form
11224e1104B54496H9277e74683m83006L50199A02920K02952b67264k86683b6415
11213D04676F8960b35121A58069K14193c32139n46790a86936F54472A25567i56687
11202g62877C77175K80840A0201e075H08472J86655A33520f05422q4892q5010
11192g75324j31551c72642D97891j715c12905l08252a85078e7338l41903J93264
11182b05977E49740J11198d2137k14700D51331M17300C11214b66285e6486C26888
11171I5710e13800l59261J51750c0316H66374J81503C6972a165692j34729O01964
11161f98457J59782k66841J96628a0827B31332K3694L65742J90426A10047f60041
11150c49450B74673b14158r19503L64381D11469P1203d25865L1230F79600K41503
$$ plain form
11140 921103 15301 -301630 369294 422047 -479770 -647117 340536 696328 -258511 -843935
11130 -843935 -179573 313294 -223167 -531468 129451 504364 -117029 -490919 12849 14591
11120 14591 -1149656 -1817426 -825984 389663 310073 -230455 55004 583121 351088 -81717
11109 121730 400902 62318 -289500 -86933 -44059 -644700 -926602 -166388 745977 938548
11099 938548 995006 1469454 1608106 914050 349229 564727 556153 -441022 -1302809 -838289
11089 -838289 179775 387792 -39939 -135408 141664 301164 389029 490274 228236 -297146
11078 -278613 294378 340029 -328810 -408057 591532 1264488 640270 -237285 -282590 -97180
11067 -408481 -593174 -176553 -39049 -659038 -907488 -114652 445988 -222556 -909975 -281238
$$ packed form
11140I21103A5301c01630C69294N2753d79770j67347C40536L55792b58511n85424
11130h43935a79573C13294b23167l08301A29451L74913a17029l73890A2849J742
11120A4591a149656o67770h25984C89663p9590b30455E5004N28117k32033h1717
11109A21730K79172F2318b89500h6933M2874o00641k81902a66388G45977J92571
11099I38548N6458M74448J38652o94056C49229K15498q574d41022q61787M64520
11089h38289A79775K08017c9939r5469A41664J59500Q7865J01245B28236b97146
11078b78613B94378M5651c28810p9247E91532O72956o24218b37285m5305i7180
11067d08481j84693a76553c9049o19989k48450a14652D45988b22556o87419b81238
$$ plain form
11056 779546 810495 225989 181831 402578 122366 -114413 393291 749508 -86533 -1149600
11046 -1149600 -842662 398756 832692 131513 -503589 -420664 -16623 393328 746945 746510
11036 746510 414551 486685 1153736 1326586 350300 -613572 -303181 599149 672900 46730
11025 -162378 101508 14894 -474442 -714393 -605954 -459847 -90284 721401 1385421 1262768
11015 1262768 700814 303889 -90898 -677717 -818484 -122347 485657 111274 -484853 -56503
11004 969943 1044041 -128665 -1176725 -989852 65591 936319 1089507 812284 717456 973371
10994 973371 1041975 517291 -17706 252277 979206 1097091 530621 162914 166416 -122154
10983 -624617 -513391 47386 -31652 -670938 -531147 560234 1121596 535083 -6728 246612
$$ packed form
11056G79546L0949B25989m4158K20747A22366a14413C93291L56217h6533j063067
11046a149600L06938C98756M33936A31513e03589Q2925a6623C93328L53617m35
11036G46510l31959P2134O67051J72850C50300f13572c03181E99149P3751D6730
11025a62378A01508A4894d74442k39951J08439J46107i0284G21401O64020j22653
11015A262768n61954C03889i0898n86819j40767a22347D85657A11274d84853e6503
11004I69943P4098a28665j048060J86873F5591Q70728J53188k77223r4828K55915
10994I73371O8604E17291a7706B52277P26929J17885E30621A62914L502a22154
10983f24617J11226D7386c1652o39286J39791E60234N61362E35083f728B46612
$$ plain form
10972 493758 279544 358876 833555 635647 -222852 -186399 1052709 1693539 876536 94076
10961 300852 279028 -599361 -752721 584498 1431603 371592 -772824 -65290 1121754 602824
10951 602824 -750232 -637067 733853 1290306 551344 -245434 -569597 -772977 -671217 -46015
10940 308046 -129256 -351800 411607 1029123 387269 -496642 -260015 406619 240322 -191592
10929 243063 974662 929387 637079 986915 1282122 692029 141852 527775 672500 -522063
10918 -1549010 -598465 1156000 1402081 430210 124476 502386 286958 -191545 233647
10908 827361 75784 -1234825 -1116541 120882 485468 -196587 -409473 -16461 -144845 -470292
10898 -470292 281161 1453205 1205013 -72922 -244195 740218 737904 -640444 -1231424 -81858
$$ packed form
10972D93758k14214P9332M74679j97908b22852L6453A052709O40830q17003I4076
10961C00852k1824e99361j53360E84498Q47105C71592g72824f5290A121754n18930
10951F02824g50232J13165G33853N56453E51344b45434l24163k03380J01760d6015
10940C08046a29256k22544D11607O17516C87269d96642K36627D06619j66297a91592
10929B43063P31599m5275k92308L49836K95207n90093A41852L85923J44725e22063
10918a549010e98465A156000K46081D30210A24476L77910k15428a91545B33647
10908H27361G5784a234825J18284A20882L64586a96587k12886a6461j28384l25447
10898d70292B81161J172044k48192g2922j71273G40218k314f40444n90980h1858
$$ plain form
10887 1013048 671066 -44050 121903 574420 300393 -403184 -706348 -467342 45797 600569
10877 600569 801590 414476 -44197 36537 352506 297183 84327 182669 305138 123101
10866 144173 640097 755667 70807 -210660 746848 1617122 999987 -117420 -123602 410790
10855 87352 -499857 52649 1098651 1016585 158089 -31164 138621 -496304 -1142866 -211182
10844 1480351 1799123 955438 867993 1456903 952082 -474053 -877349 -212819 -312846 -1128402
10834 -1128402 -603329 1290197 1970583 500646 -902914 -641311 44862 -189875 -622462
10825 -622462 -341349 85794 75677 116496 380542 162763 -481655 -429275 472873 927245
10815 927245 391205 -69821 246485 609286 352297 -149512 -473977 -695498 -698770 -287641
$$ packed form
10887A013048l41982d4050A21903M52517k74027d03184l03164K39006D5797N54772
10877F00569K01021l87114d4197C6537L15969n5323H4327R8342J22469A23101
10866A44173M95924J15570G0807b10660G46848Q70274o17135a17420o182D10790
10855H7352d99857E2649J046002q2066A58089c1164A38621d96304o46562b11182
10844A480351L18772q43685q7445N88910n04821d74053m03296b12819j00027q15556
10834a128402N25073A290197O80386E00646i02914K61603D4862a89875m32587
10825f22462K81113H5794j0117M0819K64046A62763d81655N2380D72873M54372
10815I27245C91205f9821B46485L62801k56989a49512l24465k21521l272b87641
$$ plain form
10804 88239 48880 257377 1144626 1504449 346543 -826528 -85727 1461156 1194952 -653838
10793 -1415145 -471177 117457 -380374 -270620 1007342 1597879 565979 -475397 -279315
10784 -279315 155848 -165842 -534210 -283564 -70821 -293540 -219085 349281 436429 -246801
10773 -653474 -315442 -92121 -406704 -547429 -250353 -189632 -465960 -368876 77657 111396
10763 111396 -140280 90494 427096 -96662 -872349 -448183 724113 827873 -107990 -295257
10753 -295257 460162 449831 -586303 -849783 171865 739345 79326 -291635 508848 1132726
10743 1132726 482359 -546736 -869924 -683352 -323503 330611 768027 228256 -525198
10733 -57498 1030504 853307 -257585 -65335 1457971 1724119 4737 -1145654 -193337 938765
$$ packed form
10804H8239l9359K08497Q87249L59823C46543h26528h5727A461156k66204f53838
10793a415145d71177A17457c80374J09754A007342N90537E65979d75397J96082
10784b79315A55848a65842l68368K50646g0821k22719P4455C49281Q7148b46801
10773f53474c15442i2121l14583j40725b50353O0721k76328R7084G7657L3739
10763A11396a40280I0494L36602i6662p75687M24166G24113J03760a07990j87267
10753b95257D60162j0331e86303k63480A71865N67480G9326b91635E08848O23878
10743A132726D82359e46736l23188J86572c23503C30611M37416B28256e25198
10733e7498A030504j77197b57585f5335A457971K66148D737a145654a93337I38765
$$ plain form
10722 367939 -786123 -803258 -184267 -165784 -511367 -501781 -366315 -367014 -104659 293736 62199
10710 -440245 126409 1565974 2012563 951901 5168 44073 59680 -348585 -42808 1135947
10699 1555541 576306 -342018 -297431 -186742 -384567 124228 1276311 1358786 60404 -635448
10688 197772 932701 474017 19235 377269 375039 -534768 -862297 81315 630270 -242205
10677 -999834 -387882 345357 -78405 -699276 -402634 23079 -242555 -324669 412405 850180
10667 850180 265542 -135980 484297 931550 291956 -273758 203509 605944 -79179 -747391
10657 -747391 -221974 621801 598401 255328 435455 551875 -23160 -490349 -74420 622469
10646 982018 1403177 1895969 1546681 441157 44815 603324 444541 -955765 -1674319 -541129
$$ packed form
10722C67939g86123j7135a84267J8483l45583R586J35466o99a04659B93736F2199
10710d40245A26409J439565M46589I51901E168L8905J5607c48585d2808A135947
10699A555541E76306c42018M4587J10689j97825A24228J152083Q2475F0404f35448
10688A97772P34929m58684A9235L58034k230e34768l27529H1315N48955b42205
10677i99834c87882C45357g8405o20871K96642B3079b42555q2114D12405M37775
10667H50180B65542a35980D84297M47253B91956b73758B03509M02435g9179o68212
10657g47391b21974F21801k3400B55328J80127J16420b3160m67189g4420F22469
10646I82018M21159M92792l49288D41157D4815N58509j58783i55765p18554e41129
$$ plain form
10635 796553 668454 -42629 102437 604660 358042 -301075 -533084 -423100 -167089 552246
10624 1335017 1011468 -249515 -733170 70247 639042 176519 -131315 441007 845454 453865
10614 453865 252275 774349 1032504 452905 -208157 -517751 -805303 -719517 231919 819293
10604 819293 -318554 -1560509 -371030 1842644 1328446 -1484467 -2114419 536832 2278869
10595 2278869 749023 -988429 -284348 843695 213486 -539940 259718 874094 -192591
10585 -1024749 -40371 880548 176488 -296184 851019 1433658 -123860 -1346252 -66901 1489705
10574 770477 -549872 -29758 943595 146618 -1055973 -484990 539968 -160889 -1336245
10565 -1336245 -754816 529498 351027 -475987 -76316 767297 496371 55521 721564 1077092
$$ packed form
10635G96553j28099d2629A02437N02223k46618c01075k32009J09984a67089E52246
10624A335017l23549b49515m83655G0247N68795A76519a31315D41007M04447l91589
10614D53865k01590N22074K58155D52905b08157l09594k87552Q5786B31919N87374
10604H19293c18554j241955c71030A842644n14198a484467o29952E36832J742037
10595B278869G49023i88429b84348H43695B13486e39940B59718O14376a92591
10585a024749d0371H80548A76488b96184H51019N82639a23860j222392f6901A489705
10574G70477e49872b9758I43595A46618a055973d84990E39968a60889j175356
10565a336245N81429E29498j78471d75987g6316G67297k70926E5521O66043L55528
$$ plain form
10555 1077092 -299240 -1624280 -947890 197789 -228379 -898377 37523 1037670 104678
10545 -1082172 -138495 1489040 1203956 20451 310990 1116796 139318 -1648276 -1732099
10536 -1732099 -537085 -76412 -42365 775372 1217526 -89563 -1393722 -615484 700398 221992
10525 -770907 -25004 1118276 283792 -1163383 -575608 947543 739215 -328549 234165
10515 1498775 936981 -562525 -427555 618912 253425 -574488 431264 1842627 692184
10505 -1752929 -1821343 178258 814481 -248550 -320529 797637 754942 -358617 -149863 1219037
10494 1230424 -134496 -412774 691080 1116440 568404 539837 741255 -220930 -1282745
10485 -1282745 -377388 1311949 955675 -891002 -1339687 -356108 -255379 -883972 -131343
$$ packed form
10555A077092b99240j325040O76390A97789b28379o69998C7523J000147A04678
10545a082172a38495A489040k85084B0451K90539Q05806A39318a648276q3823
10536a732099e37085g6412L4047G75372M42154h9563j304159f15484G00398B21992
10525g70907b5004A118276B83792a163383e75608I47543k08328c28549B34165
10515A498775n61794e62525J34970F18912B53425e74488D31264J411363F92184
10505a752929o8414A78258O36223b48550p1979G97637m2695c58617a49863A219037
10494A230424a34496k78278F91080M25360n48036k8567K01418b20930j061815
10485a282745c77388A311949l56274h91002m48685c56108J00729o28593a31343
$$ plain form
10475 1439513 1326032 -98221 -260117 692089 415125 -790397 -551077 725652 552637 -565552
10464 115468 2073672 2009229 -174754 -1068882 303609 1250794 546014 -5221 310730 -24896
10453 -1155087 -1305902 -361724 -78486 -525541 -129693 836517 699926 -10258 580877 1734557
10443 1734557 1202773 -294680 -133587 1240853 1048272 -572835 -837625 436909 703379
10434 703379 -285265 -132727 1408109 1946273 949204 345509 572358 251909 -349004
10424 237282 1152283 411238 -975752 -528185 883155 503331 -927224 -433363 1334142
10414 1023384 -1102053 -1463380 343506 1053115 -128266 -511282 579569 798116 -201986
10404 -64549 1332683 1378102 -208915 -764644 322149 813751 210488 348145 1161908 673720
$$ packed form
10475A439513j13481i8221j61896F92089k76964g90397K39320G25652j73015e65552
10464A15468J958204o4443a74754q94128C03609R47185E46014e221C10730b4896
10453a155087j50815c61724g8486m47055a29693H36517j36591a0258E80877J153680
10443A734557n31784b94680a33587A240853j92581e72835k64790D36909K66470
10434G03379b85265a32727A408109N38164I49204C45509K26849B51909c49004
10424B37282R15001D11238i75752M47567H83155l79824i27224d33363A334142
10414A023384a102053l61327C43506P09609a28266l83016E79569K18547b01986
10404f4549A332683M5419b08915n55729C22149M91602B10488J37657Q13763m88188
$$ plain form
10394 673720 -630212 -256811 1414536 1610549 424144 541560 1880707 1758344 284709
10384 184847 1284979 698038 -1422309 -1876645 -336406 250957 -646395 -549002 770172
10374 930548 8400 474428 1983146 1721229 -48847 -343349 782589 503253 -981787 -775246
10364 -775246 829235 764478 -743176 -586237 1040445 1036782 -401526 -278763 1007723 469331
10353 -1120894 -475741 1342984 499987 -1906479 -1346842 1515827 1739190 -711154 -1068366
10344 -1068366 1000128 950878 -1510923 -1725881 771416 1285806 -849447 -1027658 1460245
10334 1966913 -357957 -932475 1156082 1470849 -656028 -579497 2158162 2254673 -1129025
10324 -2155516 959135 2568675 70442 -1705465 -56374 935240 -910253 -1570546 779734
$$ packed form
10394F73720f30212b56811A414536J96013D24144J17416J339147j22363B84709
10384A84847J100132n86941a422309m54336c36406B50957f46395R7393G70172
10374I30548H400M66028J508718k61917d8847k94502G82589k79336i81787K06541
10364g75246H29235o4757g43176J56939A040445l663d01526J22763A007723D69331
10353a120894d75741A342984D99987a906479N59637A515827K23363g11154l57212
10344a068366A000128m9250a510923k14958G71416N14390h49447j78211A460245
10334A966913c57957n74518A156082L14767f56028P6531B158162R6511a129025
10324b155516I59135J609540G0442a705465e6374I35240i10253o60293G79734
$$ plain form
10314 1812045 -434962 -1567996 580355 1744378 -358189 -1653123 199396 1449792 -38115
10304 -749148 987767 1484314 -640247 -1362870 647272 1114024 -1241029 -1763239 979755
10294 1980306 -595810 -1651889 1063157 2598132 390384 -977963 1000186 1921144 -589518
10284 -2097728 -103267 1288084 -155495 -536748 1709353 2185165 -487238 -1337281 1255346
10274 2106421 -567489 -1478470 1191586 2013257 -757327 -1325244 2144032 3406335 223624
10264 -1030901 2130789 3226295 -309278 -1548554 2492193 4437929 417435 -2251538
10255 1181864 3846033 321086 -2945954 811391 7250032 9476946 8302790 6560226
10247 6560226 2997218 -1520663 -1766878 2038205 2661516 -1145151 -1886730 2159858 3152175
$$ packed form
10314A812045d34962j133034E80355J164023c58189j294934A99396J250396c8115
10304g49148I87767M96547f40247p22623F47272M66752a241029n22210I79755
10294A980306e95810j056079A063157J534975C90384i77963A000186R20958e89518
10284b097728a03267A288084a55495l81253A709353M75812d87238q50043A255346
10274B106421e67489r10981A191586Q21671g57327n67917B144032J262303B23624
10264a030901B130789J095506c09278j239276B492193J945736D17435b251538
10255A181864K664169C21086b945954H11391O438641K226914j174156j742564
10247F560226B997218a520663k46215B038205O23311a145151p41579B159858R92317
$$ plain form
10238 3152175 -935736 -1871547 2616753 3831608 -837497 -2330309 2215364 3335754 -2009417
10228 -3711339 1770953 3894449 -1385487 -3244067 2678597 5126945 -633035 -2892562
10220 -2892562 3445554 6075197 -650446 -3843203 2931515 6547101 -17121 -3515463 3254569
10210 6570070 -885003 -4490524 3384875 6885409 -2334414 -6959034 2814762 8681542
10202 8681542 -878890 -7226390 2402068 9036242 -857896 -7385810 3863579 11456011
10194 11456011 -612789 -9453610 2952092 12690391 262065 -8709924 6618332 17360010
10186 17360010 -28052 -12621136 7515819 23262032 923867 -17628288 8677296 31677098
10178 31677098 -155501 -29564915 12149731 54720507 -2609405 -68872647 49107900
$$ packed form
10238C152175i35736r35811B616753J214855h37497j492812B215364J120390b009417
10228c711339A770953K123496a385487j858580B678597K448348f33035k259527
10220b892562C445554K629643f50446l192757B931515L615586a7121l498342C254569
10210F570070h85003l605521C384875L500534b334414m624620B814762N866780
10202H681542h78890o347500B402068O634174h57896o527914C863579P592432
10194A1456011f12789q840821B952092R738299B62065h709924F618332J0741678
10186A7360010b8052j2593084G515819J5746213I23867a7628288H677296K2999802
10178C1677098a55501k9409414A2149731M2570776b609405o6263242D9107900
$$ plain form
10170 315567899 439822652 266628871 1334540 -83045363 -1358798 44546016 -4653491
10162 -35871889 779945 26117120 -1804899 -22304751 599488 17937113 -1572657 -16662690
10154 -16662690 656789 14802119 69279 -12814834 -315283 10830182 -703697 -11163617
10146 -11163617 -1155261 7895292 -1667012 -10110431 -1148404 6874966 -1099421 -7669531
10138 -7669531 1260013 8622299 215340 -7863935 -1088675 6252361 184811 -6471828
10129 -635203 5780403 312200 -6027490 -1440623 3866275 -1091969 -6490840 -1783423
10120 3709084 -153767 -4656403 -304929 4467921 650278 -3546295 433495 4375270 -104835
10110 -4759271 -938768 3609486 219826 -3991061 -627909 3634409 595924 -3627484 -1209164
$$ packed form
10170C15567899J24254753j73193781A334540h3045363a358798D4546016d653491
10162c5871889G79945K5337175a804899k0499852E99488J7337625a572657j5090033
10154a6662690F56789J4145330F9279a2814834c15283A0830182g03697j0459920
10146a1163617a155261G895292a667012q443419a148404F874966a099421o570110
10138g669531A260013P362286B15340g863935a088675F252361A84811f471828
10129f35203E780403C12200f027490a440623C866275a091969n398871a783423
10120C709084a53767m502636c04929D467921F50278c546295D33495L941775a04835
10110d759271i38768C609486B19826c991061f27909C634409E95924c627484a209164
$$ plain form
10100 2248574 -514028 -4133106 -1709632 1843224 195965 -2329883 -575315 1472448 912646
10091 912646 3298283 9688931 10269667 1506359 -4792475 -765762 4023921 446105 -4048519
10081 -665222 3907818 764598 -4236679 -2072438 2548284 1084983 -2622179 -946502 2429752
10071 529290 -2819850 -940939 2181370 -17515 -3346808 -1000568 2929220 1311332 -2291570
10061 -834633 2584779 1301666 -1681600 52608 3371677 1648794 -2255364 -1562569 1523192
10051 678203 -2138072 -1099913 1693711 533993 -2470107 -1584963 1358087 838192 -1628389
10041 -1122097 698638 -515560 -2387773 -404070 2531523 1154996 -1979047 -1300848 1277295
10031 611238 -1434094 -91743 2317122 718560 -2482925 -1715604 1109481 460235 -2036539
$$ packed form
10100B248574e14028l619078a709632A843224A95965b329883e75315A472448n59802
10091I12646K385637O390648N80736A506359d792475g65762D023921D46105d048519
10081f65222C907818G64598d236679b072438B548284A084983b622179i46502B429752
10071E29290b819850i40939B181370a7515l329293a000568B929220A311332b291570
10061h34633B584779j283113a681600E2608L319069A648794b255364O92795A523192
10051F78203b138072J038159A693711E33993b470107Q85144A358087n19895a628389
10041a122097F98638e15560j872213d04070B531523A154996a979047O78199A277295
10031F11238a434094i1743B317122G18560b482925P67321A109481D60235b036539
$$ plain form
10021 -986929 2013320 1376171 -1700973 -1682678 685093 229366 -2463127 -2499830 -326284
10011 -447175 -2312728 -1637752 854451 846694 -1055970 -760760 1069138 545454 -1459046
10001 -1073031 700652 34911 -1789346 -753076 1602409 682370 -2185678 -1841991 1171528
9991 1714063 -538254 -1205211 225651 206389 -1198901 -502474 1812863 1814866 -324463 -686157
9981 -686157 904580 956265 -571735 -357103 1436037 1348353 -594450 -978482 389288 401516
9971 401516 -1146259 -1443808 -296991 16678 -275720 604326 1291405 -483042 -2470559 -1052184
9960 1801597 1416220 -1300545 -1575326 525175 597150 -1662553 -2121077 -146794 506565
9950 -962090 -1211925 521637 1135460 -210696 -833896 -27606 -9011 -932593 -575731 752117
$$ packed form
10021i86929B013320o37149a700973J8295F85093B29366b463127l6703c26284
10011d47175j865553O74976H54451p757a055970K95210A069138n23684a459046
10001a073031G00652C4911a789346g53076A602409F82370b185678L43687A171528
9991A714063e38254o66957B25651j9262a198901e02474A812863K003c24463l61694
9981f86157I04580N1685e71735K14632A436037q7684e94450l84032C89288J2228
9971D01516a146259k97549b96991A6678b75720F04326O87079d83042j987517a052184
9960A801597l85377a300545k74781E25175P1975a662553m58524a46794E06565
9950i62090k49835E21637O13823b10696o23200b7606i011r23582L56862G52117
$$ plain form
9939 499179 -902468 -613479 971750 798377 -868420 -833858 838519 936571 -677735 -911598
9929 -911598 457888 512570 -823200 -545139 1354572 1553828 -347078 -1107956 2742 136624
9919 136624 -1314268 -1539691 105960 834612 -225913 -644664 339832 501035 -742936 -1214848
9909 -1214848 -374994 -182622 -895455 -619222 461383 75089 -1512748 -1576534 44336 722660
9899 722660 33906 115297 939206 304345 -1303348 -1096230 533546 336673 -1635327 -1825124
9889 -1825124 259927 1039397 -581152 -1375370 104937 1135948 192639 -529438 221490
9879 508056 -519714 -776414 496960 1064153 24099 -478768 497476 945376 -35306 -578131
9869 -578131 73322 135089 -870256 -959368 250361 483886 -797841 -1130871 370641 1333678
$$ packed form
9939D99179i02468K88989I71750j73373h68420L4562H38519R8052f77735k33863
9929i11598D57888N4682h23200K78061A354572J99256c47078p60878B742J33882
9919A36624a314268k25423A05960P28652b25913m18751C39832J61203g42936m71912
9909a214848c74994a82622p12833K76233D61383G5089a512748o3786D4336O78324
9899G22660C3906Q1391Q23909C04345a303348K07118E33546j96873a635327j89797
9889a825124B59927P79470e81152p94218A04937J031011A92639e29438B21490
9879E08056e19714k56700D96960N67193B4099d78768D97476M47900c5306n42825
9869e78131G3322O1767h70256q9112B50361K33525g97841l33030C70641R63037
$$ plain form
9859 1333678 556693 3493 765951 1082792 87907 -372938 582611 1096262 154146 -593977
9848 -142380 204911 -146917 129590 1209437 1312090 137720 -387120 212229 164066 -808139
9837 -817669 255967 272321 -810166 -439606 1549364 2043811 180708 -899342 377470 1328616
9827 1328616 53006 -1317800 -880684 -279574 -1091651 -1755883 -847630 119831 -175641 -294175
9817 -294175 826536 1426602 219684 -973041 -463679 375666 -62861 -726560 -321174 108148
9806 -510678 -953597 -91740 800041 385648 -378036 -310342 -152967 -696551 -1029244 -493452
9795 -148075 -620833 -828994 -348912 -527190 -1699187 -1988367 -544868 707635 291855 -512328
9784 -312833 94992 -163777 -261725 256747 221256 -675774 -816330 291969 742022 -306538
$$ packed form
9859A333678E56693C493P62458L16841H7907c72938E82611N13651A54146e93977
9848a42380B04911a46917A29590J079847J02653A37720c87120B12229m8163h08139
9837h17669B55967J6354h10166L70560A549364M94447A80708h99342C77470R51146
9827A328616E3006a317800M37116b79574q12077o64232h47630A19831a75641j18534
9817b94175H26536O00066B19684i73041d63679C75666f2861o63699c21174A08148
9806e10678m42919i1740H00041C85648c78036O7694a52967n43584l32693d93452
9795a48075m72758k08161c48912j78278j171997k89180e44868G07635B91855e12328
9784c12833I4992a63777r7948B56747l5491f75774j40556B91969M50053c06538
$$ plain form
9773 -891992 155166 990448 239861 -408331 517161 1416437 682329 -212006 475538 1444658
9763 1444658 812216 -437406 -468220 31508 -454526 -1051154 -119026 1360016 1134856 -569256
9752 -1475897 -767531 238221 410557 -191046 -1132634 -1801034 -1381211 29394 1016313 637521
9742 637521 -312877 -726052 -667510 -570052 -310504 -10074 -341814 -1168292 -1326540 -521342
9731 133486 75983 19613 180613 -159965 -739058 -285160 852601 595878 -1342606 -2461037
9721 -2461037 -1268528 488638 861542 468020 609211 968403 909711 940300 1246574 824129
9711 824129 -424571 -835226 295361 1296125 910459 251544 427468 539474 -227396 -774167
9701 -774167 -196649 373696 -118145 -675756 -183956 569193 513341 121530 54532 -174435
$$ packed form
9773h91992A55166Q35282B39861d08331E17161Q99276F82329b12006D75538R69120
9763A444658o32442d37406l0814C1508d54526n96628a19026A360016k25160e69256
9752a475897P08366B38221J72336a91046r41588o68400M19823B9394R86919l78792
9742F37521c12877m13175N8542R7458K59548a0074l31740q26478j58248e21342
9731A33486n7503A9613J61000a59965n79093b85160H52601k56723a342606j118431
9721b461037J192509D88638L72904l93522J41191L59192n8692L0589L06274m22445
9711H24129d24571m10655B95361J000764l85666B51544J75924J12006b27396n46771
9701g74167a96649C73696a18145n57611a83956E69193n5852A21530E4532a74435
$$ plain form
9690 -753526 -736452 13189 127518 -738160 -968186 109959 869868 372304 63730 855991
9680 855991 1238151 190157 -689407 -19603 949966 837761 516240 906441 966606 75836
9669 -177480 1101434 2018755 1090214 -84477 180066 693194 88373 -296966 790941 1572276
9659 1572276 332388 -1086639 -388002 966814 381990 -1171844 -1036122 348142 594522
9650 594522 -135464 96037 845106 39456 -1783862 -1996315 -357156 709809 223204 -390162
9639 -419488 -696245 -1166836 -694097 456306 696726 -74340 -300716 419161 800977 342221
9628 -174 193650 271917 128475 367043 776645 512889 -221477 -446243 -188476 -261359 -563411
9617 -563411 -377564 16472 -133540 -356042 290796 1211653 1053072 132045 -5576 774184
$$ packed form
9690g53526J7074A3189J14329g38160k30026A09959P59909C72304F3730P92261
9680H55991L82160A90157f89407a9603I49966j12205l21521L90201O0165G5836
9669a77480A101434R17321r28541h4477A80066N13128H8373b96966G90941P81335
9659A572276C32388a086639c88002I66814C81990a171844J35722C48142K46380
9650E94522a35464I6037P49069C9456a783862k12453c57156G09809B23204c90162
9639d19488k76757m70591M72739D56306K40420g4340k26376D19161L81816C42221
9628a74A93650P8267A28475K38568M09602k63756b21477k24766a88476p2883l02052
9617e63411J85847A6472a33540k22502B90796R20857j58581A32045e576G74184
$$ plain form
9606 1086261 485181 10270 189548 351704 112933 -70191 -5058 -26596 -89251 176316 559122
9595 559122 517026 128274 -166278 -350915 -467745 -139020 602092 881748 385979 109905
9584 626747 944089 374239 -8682 604604 937418 -141950 -1161912 -256168 1492194 1618817
9574 1618817 224562 -461879 146605 506643 -2883 -261599 227716 574884 407285 436320
9564 436320 779153 572426 -362088 -1032119 -785372 -77616 381071 263901 -387122 -963101
9554 -963101 -645086 229129 193924 -947892 -1253233 346786 1846295 1060173 -837021 -1216247
9544 -1216247 -163893 153404 -576209 -625083 361330 812540 193235 -266027 -96191 -265095
9534 -265095 -893607 -744597 379946 962877 272708 -411193 59627 970919 1050205 263919
$$ packed form
9606A086261D85181A0270J79278J62156A12933g0191e058k1538o2655A76316L82806
9595E59122m2096A28274a66278j84637j16830a39020F02092K79656C85979A09905
9584F26747L17342C74239h682F04604L32814a41950j019962b56168A492194J26623
9574A618817B24562d61879A46605L60038b883k58716B27716L47168j67599K9035
9564D36320L42833k06727c62088o70031K46747g7616C81071j17170c87122n75979
9554i63101L18015B29129l5205i47892l05341C46786J499509p86122h37021l79226
9544a216247a63893A53404e76209m8874C61330M51210A93235b66027i6191j68904
9534b65095o28512J49010C79946N82931B72708d11193E9627R11292P9286B63919
$$ plain form
9523 -456568 -445178 186488 708568 463101 -153852 24259 1054384 1362075 142245 -1051341
9512 -670419 232119 -185826 -1332503 -1224525 62074 623811 -384 -412902 -93363 -12721 -390672
9501 -390672 -236778 559825 863455 371241 60952 247319 114993 -501173 -734914 -401369
9491 -401369 -301565 -527192 -227831 615997 910404 307467 -248198 -185894 -53830 -304896
9481 -304896 -683231 -1004619 -1308859 -1244217 -537843 107988 -120962 -737191 -760788 -409297
9471 -409297 -447269 -523970 39569 493113 -255544 -1399217 -1317740 -393842 -328718 -1045551
9461 -1045551 -895285 229301 722158 263644 226360 830298 704771 -212310 -161916 1238560
9450 1969095 854644 -577726 -672418 85554 551429 686950 696992 230152 -481132 -400999
$$ packed form
9523d56568J1390A86488N22080k45467a53852B4259J030125L07691A42245a051341
9512f70419B32119a85826j146677J07978F2074N61737c84m12518i3363a2721l77951
9501c90672J53894E59825L03630C71241F0952J86367A14993e01173k33741L33545
9491d01369R9804k25627b27831F15997K94407C07467b48198O2304e3830k51066
9481c04896l78335l21388l04240O4642e37843A07988a20962o16229k3597L51491
9471d09297l7972p6701C9569M53544b55544j143673Q1477c93842O5124p16833
9461a045551J50266B29301M92857B63644l7284O03938j25527b12310N0394A238560
9450A969095H54644e77726r4692H5554M65875J35521J0042B30152d81132Q0133
$$ plain form
9440 -400999 446659 636326 -271072 -847931 -236402 455945 271682 2445 418737 713544
9430 713544 141461 -391757 115980 978221 1053425 583446 407185 399043 61710 -218191
9419 175014 846844 935963 375870 -238398 -520417 -403262 15198 271615 -116606 -779684
9409 -779684 -826528 -285339 -136926 -619460 -762797 -88112 533182 390153 92254 415193
9399 415193 1003526 1045653 466320 -206280 -513343 -215750 529039 960865 520433 -125626
9388 82537 810432 748404 -141793 -450708 280131 736337 68508 -732126 -646414 -326800
9378 -326800 -814568 -1720725 -1912420 -1222697 -416733 -16000 17400 -118806 -173839 52145
9367 363059 368396 143437 101560 231255 197472 95079 221737 271975 -207961 -761958 -604831
$$ packed form
9440d00999D46659J89667b71072n76859b36402D55945j84263B445M16292K94807
9430G13544A41461c91757A15980Q62241P5204m69979j76261q142F1710b18191
9419A75014O71830Q9119C75870b38398k82019J17155A5198K56417a16606o63078
9409g79684m6844b85339a36926m82534j43337h8112E33182j43029I2254L22939
9399D15193N88333M2127D66320b06280l07063b15750E29039M31826m40432a25626
9388H2537P27895o2028a41793l08915B80131M56206F8508g32126Q5712L19614
9378c26800m87768r06157j91695O89723d16733a6000A7400a18806n5033E2145
9367C63059N337A43437m1877J29695l3783I5079J26658N0238b07961n53997J57127
$$ plain form
9356 -604831 -52549 -35869 -388915 -157406 494488 395902 -527389 -1011065 -563669 -118193
9345 -253274 -430225 -349483 -409290 -470205 152056 1130055 1295740 655766 375597 495457
9335 495457 -199595 -1596633 -1900180 -625820 415492 136029 -181512 499224 1055022 472960
9324 -167147 204099 567830 -146149 -767005 115389 1361153 921442 -803625 -1656314 -1074790
9314 -1074790 -454466 -524712 -521096 25776 512238 506054 363073 362901 307364 149005 180568
9303 180568 485870 775577 750778 313440 -313914 -508210 142162 983937 882077 -129540
9292 -819027 -671040 -554262 -981430 -1138701 -449032 291832 336283 239701 611905 884430
9282 884430 521706 238016 689801 1112376 687011 174407 609205 1323625 989792 -92254
$$ packed form
9356f04831e2549J6680l53046a57406D94488r8586e27389m83676M47396a18193
9345b53274j76951Q0742n9807o0915A52056R77999J65685o39974k80169J19860
9335D95457a99595j397038l03547f25820D15492A36029a81512D99224N55798D72960
9324a67147B04099L63731a46149o20856A15389J245764m39711h03625q52689N81524
9314a074790d54466p0246L616B5776M86462o184j42981j72n5537A49005L1563
9303A80568L05302K89707k4799C13440c13914j94296A42162Q41775j01860a29540
9292h19027J47987J16778m27168j57271d49032B91832M4451r6582L72204K72525
9282H84430l62724B38016M51785M22575m25365A74407M34798P14420l33833i2254
$$ plain form
9271 -501916 -14135 274316 -148118 -722533 -1062319 -1248094 -1010960 -18057 1036625 958278
9261 958278 -165058 -847239 -153447 1121537 1527837 614953 -699511 -1097550 -214637 859260
9250 807266 -113910 -319033 738331 1566415 800928 -706205 -1149222 -308756 528216 655591
9240 655591 538621 557761 505972 353122 376945 434348 69029 -549236 -672447 -110664 448898
9228 435051 45866 -273246 -422328 -473091 -342040 56514 515446 621390 187878 -433239
9217 -651313 -394354 -280301 -672225 -947747 -387806 549576 828483 520383 648899 1290446
9207 1290446 1275018 229085 -532949 16855 1011303 1102346 455730 142705 304033 181038
9197 181038 -436240 -904395 -710583 22910 841168 1212841 808333 1914 -335156 20233
$$ packed form
9271e01916a4135B74316a48118n74415l39786j85775K37134a8057A036625p8347
9261I58278a65058o82181a53447A121537M06300F14953f99511l98039b14637H59260
9250H07266a13910k05123G38331Q28084p65487g06205m43017c08756E28216J27375
9240F55591j16970J9140n1789j52850K3823N7403F9029e49236j23211a10664D48898
9228D35051D5866b73246j49082n0763J31051E6514M58932J05944A87878d33239
9217f51313K56959J14053l91924k75522c87806E49576K78907l08100J28516O41547
9207A290446j5428B29085e32949A6855R94448R1043D55730A42705J61328j22995
9197A81038d36240m68155J93812B2910Q18258L71673m04508A914c35156B0233
$$ plain form
9186 273680 -132351 -590099 -309004 409570 647750 152830 -560329 -999001 -979244 -510490
9176 -510490 57410 139199 -371926 -860304 -783822 -265289 326161 777123 827282 331715
9165 -159449 119469 850135 874447 54110 -385876 108823 468129 -92466 -647022 -216806
9154 443332 169103 -549486 -463270 225033 278813 -347344 -437221 346733 840147 256304
9143 -560034 -371643 723855 1439963 904987 -301222 -825914 -202609 508635 157429 -776494
9132 -824324 191435 779112 55648 -897643 -750257 117790 424279 -64604 -525236 -504239
9122 -504239 -307024 -236907 -282566 -383290 -411766 -127255 416260 735275 523061 3740 -510053
9110 -872757 -821261 -193185 441720 275866 -443048 -639262 -98339 284525 176593 288455
$$ packed form
9186B73680a32351m57748K81095D09570K38180A52830e60329m38672J9757M68754
9176e10490E7410Q1789c71926m88378P6482b65289C26161M50962N0159C31715
9165a59449A19469P30666K4312E4110c85876A08823L59306i2466n54556b16806
9154D43332A69103e49486Q6216B25033N3780c47344q9877C46733M93414B56304
9143e60034J88391G23855P16108n34976c01222n24692b02609E08635A57429g76494
9132h24324A91435N87677E5648h97643J47386A17790L06489f4604m60632K0997
9122e04239J97215P0117m5659j00724k8476a27255D16260L19015k12214C740e10053
9110h72757N1496a93185D41720j65854d43048j96214i8339B84525j07932J11862
$$ plain form
9100 288455 764874 688479 -130942 -492183 178918 744092 345753 -99038 358846 1002940
9090 1002940 919760 704319 1099388 1280446 284220 -985148 -1033550 -135525 393573 429582
9080 429582 687890 893185 247942 -783189 -1015445 -495959 -208991 -242744 33809 361277
9070 361277 -50819 -819967 -817595 -143421 53644 -352667 -292733 533654 1139493 890086 239521
9058 -332558 -815159 -1000219 -587809 -36356 -111427 -574474 -504218 136663 499491 349191
9048 349191 272248 406532 275166 -73999 -55354 258270 190818 -216231 -220289 187140 179067
9037 179067 -385793 -643088 -209493 247613 272171 268168 463966 339213 -363474 -957904
9027 -957904 -711993 214051 1107616 1435285 1046295 237380 -254937 89411 853513 1166458
$$ packed form
9100B88455M76419p6395a30942l61241A78918N65174C45753i9038C58846O44094
9090A002940q3180k15441L95069J81058B84220i85148m8402a35525C93573L6009
9080D29582K58308K05295B47942g83189k32256d95959b08991l3753C3809L27468
9070C61277e0819p69148K372a43421E3644c52667N9934E33654O05839k49407B39521
9058c32558m82601j85060M12410c6356p5071m63047P0256A36663L62828j50300
9048C49191p6943J34284j31366g3999J8645B58270o7452b16231m058A87140q073
9037A79067c85793k57295b09493B47613K4558m003J95798j24753c63474n94430
9027i57904K45911B14051Q93565L27669l88990B37380b54937H9411P64102L12945
$$ plain form
9017 1166458 853749 495563 444107 472908 343164 62531 -348527 -761957 -791187 -324404
9006 72637 -79453 -382227 -242260 114490 153788 70990 324574 580489 256651 -217042
8995 92829 1032219 1486874 1049570 421534 139666 -9094 -225196 -345360 -365494 -457298 -429679
8984 -429679 19345 555923 522635 -73563 -646421 -935340 -1039371 -803458 -66998 689072
8973 852784 643872 689110 888393 638171 -39688 -520825 -529796 -244431 217977 593040
8963 593040 258462 -792678 -1353942 -534158 699746 816129 -12771 -430193 -185823 -177789
8953 -177789 -468244 -126527 854337 1264591 655688 48949 215948 630558 621572 341368
8943 341368 90099 -253001 -667634 -780317 -547287 -325009 -117548 353629 786305 532221
$$ packed form
9017A166458l12709l58186n1456K8801j29744F2531c48527m13430k9230c24404
9006G2637g9453l02774J39967A14490L9298G0990K53584K55915B56651b17042
8995I2829R39390M54655m37304D21534A39666i094k16102j20164k0134r1804K7619
8984d29679A9345N36578l3288g3563n72858k88919j04031K35913f6998F89072
8973H52784k08912M5238J99283k50222c9688m81137q971b44431B17977L75063
8963E93040B58462g92678n61264e34158F99746J16383a2771m17422a85823Q034
8953a77789k90455a26527H54337M10254o08903D8949J66999M14610q986k80204
8943C41368I0099b53001m14633j12683K33030K22278a17548C53629M32676k54084
$$ plain form
8933 532221 -206497 -472919 -7980 416120 297253 37765 43721 104694 -59321 -366579 -641998
8922 -641998 -716696 -340186 382607 744255 356788 -87005 164399 643338 440131 -261950
8911 -602399 -496035 -407107 -183022 497494 999263 559955 -194408 -149001 314885 -39348
8900 -1031713 -1286712 -526230 200818 422920 527258 339712 -576736 -1360184 -737347 591482
8889 743541 -157936 -120824 1145735 1573948 353187 -572934 194742 1250760 924928 -117999
8878 -474705 -328423 -486413 -671356 -407660 -262648 -699177 -931811 -320262 311798 100393
8867 -316484 -48003 391634 66570 -732940 -1134987 -1069592 -851956 -362451 245753 105930
8856 -908014 -1410307 -483944 677900 541202 -407691 -668901 -209052 -170503 -664091 -629630
$$ packed form
8933E32221b06497k66422g980D16120j18867C7765N956O0973e9321l07258k75419
8922f41998p4698c40186C82607L61648C56788h7005A64399M78939k03207b61950
8911f02399J06364Q8928a83022D97494N01769m39308a94408M5407C14885c9348
8900a031713k54999e26230B00818K22102J04338j87546e76736p83448O22837E91482
8889G43541a57936L7112A145735M28213C53187e72934A94742J056018l25832a17999
8878d74705J46282j57990j84943K63696J45012m36529k32634c20262C11798A00393
8867c16484d8003C91634F6570g32940m02047O5395K17636c62451B45753A05930
8856i08014n02293d83944F77900j36698d07691k61210b09052L8549m93588L4461
$$ plain form
8846 -629630 249097 1000527 829864 25076 -660997 -731934 -154362 504804 422158 -410556
8835 -910626 -342789 538847 580145 -90539 -408231 -29272 318128 26209 -628934 -968677
8825 -968677 -694711 -155187 19164 -332949 -610925 -299226 138854 -49754 -557602 -420607
8815 -420607 306534 576544 181710 103531 643388 735837 -169043 -971916 -608597 341711
8804 715100 398723 -14078 -253075 -211837 298567 871010 592947 -444176 -877806 -146481
8793 439256 -260616 -1364403 -1450656 -799674 -688929 -1237676 -1417706 -764985 123760 500930
8783 500930 46251 -1002020 -1682126 -1025239 454089 986464 -1554 -869458 -177568 1154220
8772 1394622 555118 -116106 -254587 -370934 -414131 29558 540652 356181 -245276 -348156
$$ packed form
8846f29630B49097P51430j70663B5076f60997p0937a54362E04804q2646d10556
8835i10626c42789E38847M1298i0539l17692b9272C18128B6209f28934l39743
8825i68677K73966a55187A9164c32949k77976b99226A38854d9754n07848J36995
8815d20607C06534K70010A81710p8179N39857R2449a69043q02873L63319C41711
8804G15100l16377a4078k38997M1238B98567N72443k78063d44176m33630a46481
8793D39256b60616j103787q6253O50982J10745n48747j80030O52721A23760L77170
8783E00930D6251a002020o80106O56887D54089N32375a554q67904a77568A154220
8772A394622E55118a16106j38481j16347m3197B9558N11094j84471b45276j02880
$$ plain form
8762 -348156 108327 425082 395894 339732 236228 -88605 -289028 -55081 75037 -500997 -1278590
8751 -1278590 -1290691 -518557 287326 716749 730351 197366 -630428 -860960 -190348 368048
8740 46847 -306202 276116 977934 427841 -913665 -1377629 -613761 255879 626040 765407
8730 765407 478494 -676957 -1873703 -1618011 -90987 864908 435353 -175518 69873 503759
8720 503759 175865 -545703 -748651 -398613 -99977 -68180 -56186 100648 347540 528572
8710 528572 426392 4109 -343534 -168467 422759 927882 1095172 1008473 757847 483906
8700 483906 458707 648080 577612 122821 -112872 197115 416567 57933 -196237 358403
8689 1008280 642528 -344166 -627189 -66636 276318 39710 -94023 68781 -53302 -406595
$$ packed form
8762c48156A08327L16755k9188n6162j03504h8605k00423e5081G5037e00997p77593
8751a278590j2101e18557B87326M29423J3602A97366f30428k30532a90348C68048
8740D6847c06202B76116P01818D27841i13665m63964f13761B55879L70161J39367
8730G65407k86913f76957j196746K55692i0987H64908m29555a75518F9873M33886
8720E03759A75865e45703k02948L50038i9977L1797J1994A00648K46892J81032
8710E28572j02180D109c43534a68467D22759N05123J67290q6699k50626k73941
8700D83906k5199J89373p0468A22821a12872A97115K19452E7933a96237C58403
8689A008280l65752c44166k83023f6636B76318C9710i4023F8781e3302l53293
$$ plain form
8679 -406595 -188801 499530 449556 -612415 -1236744 -378966 903475 962795 -105027 -799896
8669 -799896 -403906 293816 379834 6079 -82231 334084 768726 862660 913024 1256343 1477160
8658 1477160 922975 -50537 -262686 560535 1183864 595139 -540900 -985430 -696362 -484217
8648 -484217 -530413 -393157 -85353 -23906 -146853 -80486 43549 -127524 -328830 -51917 495851
8636 678307 375815 -145022 -803458 -1284908 -783332 693875 1564105 678786 -643431 -376402
8626 -376402 1006645 1225748 -135784 -1041851 -384006 432804 105768 -535997 -355890 61343
8615 -267364 -763522 -307458 713242 987422 372964 -48010 241668 608418 456286 -10295
8604 -346571 -450876 -403260 -218390 57110 268382 283472 112615 -84853 -104343 85947 269063
$$ packed form
8679d06595a88801D99530m9974f12415o24329c78966I03475N9320a05027o94869
8669g99896L95990B93816Q6018F079h2231C34084M34642R3934N0364L43319K20817
8658A477160n54185e0537k12149E60535O23329n88725e40900m44530K89068K12145
8648d84217m6196J37256h5353b3906j22947O6367D3549a27524k01306e1917D95851
8636F78307l02492a45022o58436m81450N01576F93875Q70230F78786f43431K67029
8626c76402A006645K19103a35784r06067c84006D32804A05768e35997J80107F1343
8615b67364m96158c07458G13242K74180C72964d8010B41668L66750j52132a0295
8604c46571j04305M7616J84870E7110K11272J5090A12615h4853j9490H5947J83116
$$ plain form
8593 269063 265408 170792 106664 -42865 -331325 -468563 -275988 -131963 -422027 -832308 -830916
8582 -830916 -581766 -631299 -905666 -865665 -536156 -480653 -749930 -734601 -165395 522512
8571 918901 1018559 850602 451690 178040 298904 399410 22612 -326546 100009 773943
8561 773943 472332 -590378 -808132 235237 883554 -44314 -1332322 -1254361 -208895 97719
8550 -591774 -840813 77841 1091357 1056681 387000 178934 453804 267023 -588401 -985888
8540 -985888 -37710 1388326 1580566 245866 -1083452 -1108818 -289542 199555 125691 -18465
8529 -147915 -434559 -501224 105587 900282 984418 400242 -65823 -205857 -401572 -533846
8519 -533846 -163342 292366 -42484 -857760 -876496 50405 603838 190592 -113255 451524
$$ packed form
8593B69063l655r4616o4128d2865k88460j37238J92575a31963k90064m10281J392
8582h30916K49150m9533k74367M0001L29509N5503k69277J5329a65395E22512
8571I18901R9658j67957l98912A78040J20864J00506B2612c26546A00009O73934
8561G73943l01611e90378k17754B35237O48317d4314j288008P7961b08895I7719
8550e91774k49039G7841J013516l4676C87000A78934K74870j86781e88401l97487
8540i85888c7710A388326J92240B45866a083452k5366b89542A99555p3864a8465
8529a47915k86644o6665A05587P94695Q4136D00242f5823j40034j95715j32274
8519e33846a63342B92366d2484q15276j8736E0405N53433A90592a13255D51524
$$ plain form
8508 944338 407072 -397408 -257392 492205 688712 334642 359537 781989 623067 -345863
8497 -1096197 -868597 -169330 163514 83672 37371 120106 84950 -107877 -244412 -268800
8487 -268800 -351889 -510900 -486851 -184042 11649 -303927 -865488 -971185 -497429 -164600
8476 -480083 -920790 -712036 -49445 163694 -348562 -892956 -868591 -532619 -471742 -750114
8466 -750114 -867409 -378430 584084 1347723 1326501 669123 78125 -68922 -23213 21485 294270
8455 294270 771022 816781 110375 -654292 -697969 -279406 -136865 -295047 -262289 5737 197076
8444 197076 318959 464803 350031 -83501 -167265 423858 762877 14393 -980301 -880196
8434 -880196 -9879 288397 -26745 94550 576886 334344 -409735 -192632 954541 1181428
$$ packed form
8508I44338D07072c97408J40016D92205J96507C34642K4895M22452j58922c45863
8497a096197K27600a69330A63514p9842C7371Q2735l5156a07877j36535k4388
8487b68800q3089j59011K4049a84042A1649c03927n61561j05697M73756a64600
8476d80083m40707K08754d9445A63694c48562n44394K4365L35972O0877k78372
8466g50114j17295c78430E84084P63639k1222o57378G8125f8922b3213B1485K72785
8455B94270M76752M5759A10375f54292m3677b79406a36865j58182L2758E737J91339
8444A97076J21883J45844j14772h3501q3764D23858L39019A4393i80301J00105
8434h80196i879B88397b6745I4550M82336k42542d09735a92632I54541K26887
$$ plain form
8424 1181428 -46342 -799505 187344 1395242 1037724 -183343 -614795 -363977 -482220 -667138
8414 -667138 64259 1181130 1241171 305486 -207142 76053 91179 -564848 -916228 -369056
8403 336825 482181 380780 417320 228387 -388330 -707867 -131881 678401 681192 29040
8392 -211537 279520 687755 436581 12364 3127 93712 -265169 -684987 -256283 962874
8381 1760567 1282725 43965 -850934 -909339 -398150 127515 140870 -435061 -867119 -367978
8370 541978 399308 -991155 -1861445 -891649 763692 1094165 7698 -959170 -1063571 -884491
8360 -884491 -770567 -397534 136418 223952 -126498 -303565 -238676 -341299 -404609 69963
8349 542980 -32042 -1254598 -1465534 -216892 998865 987719 367718 206050 459257 534775
$$ packed form
8424A181428d6342p53163A87344J207898l57518a83343m31452K50818j18243j84918
8414f67138F4259J116871O0041C05486b07142G6053J5126e64848l51380c69056
8403C36825J45356j01401L6540j88933c88330l19537a31881F78401K791B9040
8392b11537B79520M08235k51174A2364C127R0585b65169m19818b56283I62874
8381A760567m77842D3965h50934n8405c98150A27515J3355d35061m32058c67978
8370E41978j42670i91155q70290h91649G63692L30473G698i59170j04401J79080
8360h84491J13924L73033A36418Q7534a26498j77067O4889j02623o3310F9963
8349E42980c2042j222556k10936b16892I98865j1146C67718j61668K53207P5518
$$ plain form
8339 534775 341387 66039 -229778 -259671 395557 1423507 1853713 1339765 549672 81008
8328 -118849 -152407 7668 42804 -324044 -542986 -12069 607268 320657 -251404 270533 1372716
8317 1372716 1107002 -598540 -1546019 -770737 88207 -151612 -363031 345952 752021 -52984
8306 -647679 209735 1074811 168331 -1446460 -1551472 -321735 381825 269435 565096 1319824
8296 1319824 1321601 452690 -123549 -66192 -157913 -563710 -636906 -398567 -442893 -463758 325380
8284 1356968 1179621 -114507 -813882 -263799 219545 -314332 -924212 -486164 464804 692444
8274 692444 108217 -415531 -525975 -705566 -1258697 -1702833 -1363499 -310973 568490 581479
8264 581479 115109 65554 449688 333259 -653961 -1601960 -1605240 -959652 -473611 -351637
$$ packed form
8339E34775j93388F6039b29778k9893C95557J027950M30206n13948E49672H1008
8328a18849l3558G668L5136c24044k18942a2069F07268k86611b51404B70533J102183
8317A372716k65714e98540r47479g70737H8207a51612k11419C45952M06069e2984
8306f47679B09735Q65076A68331a446460j05012c21735C81825j12390K95661P54728
8296A319824J777D52690a23549N7357r1721m05797p3196K38339m4326k0865C25380
8284A356968j77347a14507o99375b63799B19545c14332o09880M38048D64804K27640
8274F92444A08217d15531j10444j79591n53131m44136L39334c10973E68490J2989
8264E81479A15109m9555L84134j16429f53961r47999l280O45588d73611J21974
$$ plain form
8254 -351637 -422889 -696217 -952495 -585843 345215 752163 106416 -494818 66605 1108969
8244 1108969 1195320 286331 -507133 -747491 -820399 -681847 59904 975305 1099843 410675
8233 -122527 18880 397548 528247 382883 28449 -450935 -755404 -721684 -628173 -623331 -363219
8222 -363219 185927 318730 -256986 -671991 -248764 289943 89215 -298737 5025 487925
8212 487925 198507 -345812 22156 950329 1080446 368419 -8057 138061 -150533 -878395
8202 -878395 -821418 284057 1051896 536702 -438793 -658101 -41228 703241 973919 487248
8192 487248 -523289 -1166542 -809094 -69327 49105 -240758 22642 735990 841419 186918
8181 -247524 -94810 -69663 -460538 -610201 -246433 25174 -60034 15509 392255 450830 -5385
$$ packed form
8254c51637p1252k73328k56278L66652C45215M06948A06416d94818F6605J042364
8244A108969Q6351B86331e07133k40358p2908J38552E9904R15401J24538D10675
8233a22527A8880L78668J30699j45364B8449d50935l04469L3720R3511M842K60112
8222c63219A85927J32803b56986m15005b48764B89943H9215b98737E025M82900
8212D87925A98507c45812B2156R28173J30117C68419h057A38061a50533p27862
8202h78395N6977B84057P67839n15194d38793k19308d1228G03241K70678m86671
8192D87248e23289o43253L57448f9327D9105b40758B2642P13348J05429A86918
8181b47524i4810K5147l90875j49663b46433B5174f0034A5509L76746N8575e385
$$ plain form
8169 -309965 -60909 331699 513254 623824 693460 562786 442813 552088 359214 -608618
8158 -1472902 -1028200 142939 349901 -450066 -582925 403792 886398 -71679 -1143684 -954816
8148 -954816 -126442 64569 -371966 -685135 -665294 -377624 278291 907737 682478 -186213
8137 -327602 654074 1355240 821540 116812 437132 1067113 695387 -347564 -734420 -252400
8126 175239 48520 -340368 -650665 -634761 -46794 777166 894080 72914 -635125 -409834
8116 -409834 171707 329028 391559 867899 1236295 905231 477606 743116 1207274 960678
8106 960678 270680 -57144 -164007 -527136 -599546 281581 1213871 783476 -539681 -953120
8096 -953120 -168045 240579 -471695 -1108718 -687011 50378 130772 -118618 -77491 -151529
$$ packed form
8169c09965f0909C31699J81555J10570O9636j30674j19973J09275j92874f08618
8158a472902M44702A42939K06962d50066j32859D03792M82606g1679j072005J88868
8148i54816a26442F4569c71966l13169J9841K87670B78291O29446k25259a86213
8137c27602F54074P01166n33700A16812L20320O29981l71726c47564l86856b52400
8126A75239D8520c40368l10297J5904d6794G77166J16914G2914f35125K25291
8116d09834A71707J57321O2531M76340L68396l31064m27625K65510M64158k46596
8106I60678B70680e7144j06863l63129p2410B81581R32290m30395e39681m13439
8096i53120a68045B40579d71695o37023M21707E0378Q0394a18618M1127p4038
$$ plain form
8086 -151529 -880446 -1601244 -1272102 -149571 505542 179978 -415269 -547378 -275739 -1768
8075 53378 -233659 -853724 -1329290 -1002526 15475 704437 378240 -382021 -590761 -253558
8064 -137776 -392055 -383991 12599 57844 -485109 -666724 159390 1026657 637267 -593203
8053 -1016337 -86369 989207 1027110 234974 -475539 -671712 -519059 -338705 -365520 -538137
8043 -538137 -433854 176094 781680 678341 -32508 -559097 -430792 162121 830336 1166717
8033 1166717 763484 -223846 -865558 -605545 -180433 -458076 -929143 -600035 144881 140458
8023 140458 -427697 -266167 692937 1048722 261410 -550659 -549572 -244729 -176156 -157674
8013 -157674 -264492 -899118 -1452081 -719707 853407 1347871 412610 -57149 845293 1498751
$$ packed form
8086a51529p28917p20798L29142a49571E05542A79978d15269j32109K71639a768
8075E3378b33659o20065m75566L26764A5475O88962l26197c82021k08740b53558
8064a37776k54279Q064A2599M5245d85109j81615A59390Q67267l89390e93203
8053a016337h6369I89207L7903B34974d75539j96173J52653J80354k6815j72617
8043e38137J04283A76094O05586j03339c2508n26589J28305A62121O68215L36381
8033A166717m03233b23846o41712K60013a80433k77643m71067L29108A44881m423
8023A40458d27697J61530F92937L55785B61410e50659J087b44729O8573J8482
8013a57674j06818o34626n52963g19707H53407M94464D12610e7149H45293O53458
$$ plain form
8003 1498751 715335 -163452 161959 547222 -340091 -1379642 -984869 -11356 -117293 -645574
7993 -645574 129092 1716190 2152746 1286856 611169 386722 -318228 -1075624 -430329 1192934
7982 1657454 514275 -323326 194020 805471 457136 -29265 190870 445918 3165 -543863
7971 -432279 32428 295901 432891 482869 84322 -587878 -693792 -103926 291359 128433
7960 105622 470436 443970 -171727 -324659 471667 1090824 588437 -273697 -413885 -123955
7949 -180722 -379337 -233052 -148650 -571849 -840994 -283335 332696 -61867 -885029 -719284
7939 -719284 310600 671436 -123853 -840783 -589065 -90497 -275270 -768026 -598179 285490
7928 996954 878021 114491 -639709 -855936 -439114 259527 702954 561361 -67369 -735127
$$ packed form
8003A498751G15335a63452A61959L85263c40091j039551L94773a1356j05937n28281
7993f45574A29092J587098M36556q65890F11169k24447c18228p57396d30329A192934
7982A657454E14275c23326A94020O11451l48335b9265A90870K55048C165e43863
7971d32279C2428K63473J36990M9978H4322e87878j05914a03926B91359A28433
7960A05622L64814k6466a71727j52932D71667O19157n02387b73697j40188a23955
7949a80722j98615J46285Q4402m23199k69145b83335C32696f1867q23162J65745
7939g19284C10600L60836a23853p16930K51718i0497j84773m92756J69847B85490
7928I96954j18933A14491f39709k16227M16822B59527M43427j41593f7369o67758
$$ plain form
7918 -735127 -939642 -540845 14315 92735 -370145 -778442 -702700 -438288 -435817 -566780 -461157
7907 -461157 -284766 -507371 -973900 -940719 -218723 388780 196078 -342989 -315892 265367
7896 510664 68731 -298891 83944 712432 683589 153092 102329 723218 1035061 431798
7885 -311476 -239192 289641 212335 -536940 -943148 -459848 284006 502590 220191 -70863
7874 -116989 74376 461975 875576 1017324 842487 688575 809251 1009637 935310 541836
7864 541836 137916 93627 533538 1153536 1389742 1002121 416334 208381 367314 434641
7854 434641 252316 95232 107371 127857 110920 204474 338108 243886 -17533 -75563 83435
7842 17600 -414359 -733069 -524359 18476 466476 627574 460904 -1143 -447507 -485418 -200670
$$ packed form
7918g35127k04515L98797A4315P8420c70145m08297P5742K64412K471j30963J05623
7907d61157J76391k22605m66529L3181b18723C88780j92702c42989K7097B65367
7896E10664F8731b98891H3944O28488k8843A53092n0763O20889L11843D31798
7885c11476P2284B89641p7306e36940m06208d59848B84006K18584B20191g0863
7874a16989G4376L87599M13601J41748j74837j53912J20676K00386p4327l93474
7864E41836A37916m4289M39911O19998K36206l87621D16334k07953J58933O7327
7854D34641j82325I5232J2139K0486j6937R3554J33634r4222a7533n8030H3435
7842A7600d14359l18710K08710A8476M48000J61098j66670a143m46364l7911b00670
$$ plain form
7830 -2029 151314 624564 1094608 680987 -496321 -1007020 -125659 897862 656477 -260319
7819 -335015 345034 346393 -559230 -953078 -163856 622765 348644 -302362 -244579 278569
7808 470951 517560 996232 1427303 882570 -255423 -595907 168276 809646 474042 -184867
7797 -266659 56367 166475 80320 98836 35961 -343600 -597725 -222026 316177 104204
7786 -748067 -1092858 -336034 761325 1167800 809661 325386 117449 129396 231553 329826
7776 329826 228774 -193868 -684030 -796036 -453907 -126058 -301366 -839175 -990554 -227233
7765 952483 1324253 298318 -1211020 -1701989 -861475 72070 -63263 -844782 -914908 79989
7754 930784 506401 -644676 -1005140 -172231 657218 512934 25344 222447 716978 353632
$$ packed form
7830b029A51314M73250M70044m13621d96321n10699a25659H97862k41385b60319
7819c35015C45034J359e59230l93848a63856F22765k74121c02362N7783B78569
7808D70951M6609M78672M31071n44733b55423l40484A68276O41370l35604a84867
7797b66659E6367J10108H0320J8516C5961c43600k54125b22026C16177A04204
7786g48067l44791c36034G61325M06475l58139C25386A17449J1947J02157R8273
7776C29826j01052a93868m90162j12006L42129a26058j75308n37809j51379b27233
7765I52483L71770B98318a211020m90969Q40514G2070f3263p81519p0126G9989
7754I30784m24383f44676l60464a72231F57218j44284B5344J97103M94531C53632
$$ plain form
7743 -656604 -811444 230970 889272 131173 -786465 -321997 833394 914326 -66004 -530450
7733 -530450 -23613 316814 16473 1933 622515 783632 -135773 -1093374 -1101004 -756401 -955157
7722 -955157 -1290393 -987243 -420401 -341075 -374364 283838 1188497 1096297 -101300 -1141403
7712 -1141403 -1079749 -233649 555066 767628 354473 -248635 -328602 285822 832526 621694
7702 621694 48717 -95269 135962 164581 18916 111378 213213 -194156 -711206 -394974 612265
7690 1038919 322966 -595980 -707876 -203344 148723 87001 -181600 -463807 -556661 -259858
7679 211038 290025 -162017 -608851 -615076 -376391 -223253 -107025 117129 350058 484869
7669 484869 577567 549580 169813 -410434 -578185 -55432 616024 733267 255686 -337406
$$ packed form
7743f56604j54840B30970O58302A31173g86465c21997H33394Q0932f6004m64446
7733e30450b3613C16814A6473A933O20582J61117a35773r57601p630L44603j98756
7722i55157l35236L03150d20401P9326l3289B83838R04659r2200a01300j040103
7712a141403O1654b33649E55066K12562C54473b48635p9967B85822N46704k10832
7702F21694D8717i5269A35962K8619A8916R2462J01835a94156n17050L16232F12265
7690A038919C22966e95980j11896b03344A48723o1722a81600k82207r2854b59858
7679B11038P8987a62017m46834o225K38685J53138a07025A17129K32929J34811
7669D84869R2698k7987A69813d10434j67751e5432F16024J17243B55686c37406
$$ plain form
7658 -695901 -771474 -606622 -318468 -159425 -300427 -598372 -741072 -576591 -232170 19723
7647 11904 -115188 -58934 153461 26945 -730354 -1582923 -1679662 -936788 -124275 160058
7636 101237 116355 178151 -9577 -451845 -788035 -701046 -262848 110566 80754 -187734 -186048
7625 -186048 237946 618734 560077 335524 381874 521404 288310 -172025 -232633 203918
7614 504626 246163 -226013 -381406 -182599 41838 73883 -12360 41855 377768 672842
7604 672842 365413 -462516 -859838 -248075 557558 433764 -288311 -286526 616657 1099118
7594 1099118 398914 -566748 -750757 -487774 -578659 -786226 -322481 719430 1453230 1422192
7584 1422192 877563 94233 -767589 -1300824 -1150343 -600568 -202845 31690 371163 518385
$$ packed form
7658f95901p5573J64852K88154J59043j41002k97945j42700J64481b32170A9723
7647A1904a15188N6254A53461B6945g30354q52569r6739P42874a24275A60058
7636A01237J5118O1796i577m42268l36190Q6989b62848A10566k9812a87734J686
7625a86048B37946L80788n8657k24553M6350J39530k33094a72025o0608B03918
7614E04626B46163b26013j55393a82599D1838L2045a2360D1855L35913K95074
7604F72842l07429d62516l97322b48075E57558j23794b88311J785F16657M82461
7594A099118C98914e66748j84009K62983r0885k07567c22481G19430P33800l1038
7584A422192n44629I4233g67589n33235J50481N49775b02845C1690L39473J47222
$$ plain form
7574 518385 -54544 -975366 -1209616 -624763 -259297 -603215 -723746 76714 765040 73254
7563 -1148805 -823049 1082345 2035385 502872 -1609824 -1565532 311362 1331578 540812
7553 -165558 602390 1472188 643863 -1174980 -1876372 -1022380 -51250 90017 -185388 -457281
7543 -457281 -883153 -1231766 -788366 338309 1027183 760316 343946 474929 645315 193300
7532 -476191 -594501 -270253 -138698 -260686 -226029 -2947 133432 273411 672182 1010729
7522 1010729 656597 -288131 -900616 -586650 234676 824716 1008201 1001112 747870 25184
7511 -823741 -889373 154251 1267229 1085813 -275680 -1223854 -765524 214115 372028 -154413
7500 -251643 239574 419689 33824 -138216 172122 198013 -310689 -401444 366448 842095
$$ packed form
7574E18385e4544r20822k34250N84853b59297l43918j20531G6714O88326G3254
7563a148805L25756A082345R53040E02872a609824M4292C11362J020216E40812
7553a65558F02390Q69798F43863a174980p01392Q53992e1250I0017a85388k71893
7543d57281m25872l48613M43400C38309O88874k66867C43946J30983J70386A93300
7532d76191j18310b70253J31555j21988L4657b947A33432J39979L98771L38547
7522A010729l54132b88131o12485L13966B34676N90040J83485p089k53242B5184
7511h23741o5632A54251J112978j81416b75680r48174M58330B14115J57913a54413
7500b51643B39574J80115C3824a38216A72122K5891c10689r0755C66448M75647
$$ plain form
7490 842095 127554 -645292 22142 1356291 1247696 -435691 -1470366 -532573 1002124
7480 1297586 549724 105798 257661 279807 -23578 -179162 -150270 -362903 -702169 -556103
7470 -556103 79606 494435 386358 199970 163325 -104352 -695778 -983948 -569514 50881
7459 278310 240783 295842 322567 135047 59496 407117 804941 732518 344764 109840 25426
7447 -144066 -289520 -312781 -536856 -968560 -801198 301089 1105238 401779 -830897 -600509
7437 -600509 960446 1609854 403921 -945706 -863599 -152452 -250061 -834915 -702816 61221
7426 381604 41647 -183818 60262 314728 188899 -198738 -552690 -639351 -411987 -187191
7415 -283915 -393526 -28075 408293 115855 -473342 -118345 858770 570796 -1246572 -2179089
$$ packed form
7490H42095A27554f45292B2142J334149j08595d35691j034675e32573A002124
7480A297586E49724A05798J51863K2146b3578j55584K8892k12633l39266J46066
7470e56103G9606M14829j08077j86388l6645a04352n91426k88170M14434E0881
7459B78310l7527N5059K6725A35047E9496L47621L97824p2423C44764A09840B5426
7447a44066j45454k3261k24075m31704J67362C01089Q04149D01779h30897K30388
7437f00509I60446O49408D03921i45706Q2107a52452r7609n84854J32099F1221
7426C81604D1647a83818F0262K54466j25829a98738l53952q6661K27364a87191
7415b83915j09611b8075D08293A15855d73342a18345H58770k87974a246572r32517
$$ plain form
7405 -2179089 -705828 1187934 932566 -789696 -1435672 -509422 408594 595046 602440 363533
7395 363533 -615439 -1526741 -1111243 19046 202799 -433437 -383497 272665 15597 -1009597
7384 -928950 418810 881257 -357635 -1320343 -611179 343809 -41441 -885278 -659675 201062
7373 389286 26397 70169 420820 238800 -496983 -1016487 -876932 -237412 446226 547623
7363 547623 -143915 -738517 -207578 859006 870660 -239239 -856558 -377645 -36491 -447269
7353 -447269 -526627 186495 400889 -438563 -749905 466545 1583349 934562 -413914 -596196
7343 -596196 -1391 -110008 -671368 -468475 172151 69830 -420582 -97771 613462 250026
7332 -990194 -1415266 -566592 318856 530738 592334 709754 408434 -125803 -90572 347362
$$ packed form
7405b179089g05828A187934k55368g89696o45976e09422D08594J86452P394k38907
7395C63533f15439r11302M15498A9046J83753d33437M9940B72665A5597a009597
7384i28950D18810M62447c57635r62708f11179C43809d1441q43837K25603B01062
7373C89286B6397M3772L50651j82020d96983n19504J39555b37412D46226J01397
7363E47623a43915n94602b07578H59006J1654b39239o17319c77645c6491m10778
7353d47269p9358A86495K14394d38563l11342D66545J116804o48787d13914j82282
7343e96196a391j08617n61360K02893A72151F9830d20582i7771F13462B50026
7332i90194m25072e66592C18856K11882O1596J17420l01320a25803L5231C47362
$$ plain form
7321 143319 -730204 -1063909 -396403 265806 121493 -352299 -459852 -288626 -184817 -132857
7311 -132857 -41766 38987 170651 408163 491562 255127 87871 299758 436797 53472 -329093
7299 -35167 495567 398675 -103524 -153592 138545 -77486 -766438 -1000910 -536779 -83415 32167
7287 225357 572610 519053 -145632 -935337 -1360740 -1227110 -457233 552897 803864 -79069
7276 -954377 -643636 235019 269644 -441794 -621185 -89658 92445 -319325 -395284 107944
7265 279434 -226293 -616079 -484558 -392868 -541866 -363262 166584 294991 -15196 116187
7254 760294 860424 176515 -156686 263662 229132 -824472 -1437210 -435843 866408 552591
7244 552591 -852807 -1158758 147194 1213451 612427 -723960 -959005 198004 1270662
$$ packed form
7321A43319g30204l33705c96403B65806A21493c52299j07553J71226J03809N1960
7311a32857d1766C8987J31664K37512Q3399k36435H7871K11887J37039E3472c29093
7299c5167D95567r6892a03524n0068A38545g7486o88952k34472M64131h3415C2167
7287B25357L47253n3557a45632p89705m25403J33630d57233E52897K50967g9069
7276i54377L10741B35019L4625d41794j79391h9658I2445c19325p5959A07944
7265B79434b26293l89786J31521R1690j48998J78604A66584J28407a5196A16187
7254G60294J00130A76515a56686B63662l4530h24472o12738d35843H66408l13817
7244E52591h52807l05951A47194J066257o01024g23960k35045A98004J072658
$$ plain form
7235 1270662 969521 -260727 -929349 -486728 30636 -357023 -1033683 -779551 208606 572197
7225 572197 -39278 -475160 -48405 409806 116673 -272170 198370 1136498 1362500 620212
7214 -218773 -438315 -217375 -131445 -404537 -709209 -564353 12881 370311 35232 -547558
7203 -624599 -266458 -155458 -392464 -432958 -204492 -261380 -657597 -716960 -254108 7294 -288235
7191 -410784 245853 1048003 971562 31049 -808908 -812993 -99442 627991 681305 14683 -626199
7179 -524476 99921 498350 507882 501670 422139 -113880 -778176 -758324 -162616 12805 -417263
7167 -466796 224203 588725 -121750 -1022110 -986316 -342789 -128062 -446556 -638089 -481622
7157 -481622 -236245 52183 384783 357084 -277034 -915041 -757138 99045 859730 1063852
$$ packed form
7235A270662l01141b60727o68622M42621C0636c57023o76660K54132B08606L63591
7225E72197c9278m35882d8405D09806A16673b72170A98370R38128K26002F20212
7214b18773k19542b17375Q5930k73092l04672J44856A2881L57430C5232e47558
7203f24599b66458J11000k37006m0494b04492n6888l96217n9363b54108G294b88235
7191d10784B45853Q02150p6441C1049h08908m085i9442F27991N3314A4683f26199
7179e24476I9921L98429R532o212p9531a13880o64296J9852a62616A2805d17263
7167d66796B24203L64522a21750r00360L5794c42789a28062l18494j91533J56467
7157d81622b36245E2183L32600k7699b77034o38007J57903I9045P60685K04122
$$ plain form
7147 1063852 838964 437829 98383 106131 473141 768071 656173 329533 87771 -108906
7136 -323462 -344785 -130936 -114788 -602264 -1213184 -1335431 -846629 -93622 504485 610604
7126 610604 149656 -443809 -587084 -306523 -143230 -249332 -245255 -58744 -83208 -313847
7116 -313847 -230628 173855 214546 -263427 -511071 -214615 -109304 -583528 -791316 -79100
7105 712843 502177 -286419 -456600 57424 306519 13233 -113434 299111 729601 675436
7095 675436 316582 81407 104593 238322 243320 -12605 -299134 -166300 402144 802989 601790
7084 601790 143223 11874 254185 516773 594940 473845 181250 -82404 -64194 29464 -352068
7072 -1190062 -1696581 -1401406 -827351 -651247 -795010 -811935 -585437 -182329 389682 837156
$$ packed form
7147A063852k24888m01135I8383P748L67010K94930j11898l26640H7771a08906
7136c23462k1323a30936J6148m87476o10920j22247M88802i3622E04485J06119
7126F10604A49656d43809j43275K80561a43230j06102M077e8744k4464k30639
7116c13847Q3219A73855M0691b63427k47644b14615J05311m74224k07788g9100
7105G12843k10666b86419j70181E7424K49095A3233a13434B99111M30490n4165
7095F75436C16582H1407K3186J33729M998a2605k86529J32834D02144M00845k01199
7084F01790A43223A1874K42311K62588P8167j21095A81250h2404J8210B9464c52068
7072a190062n06519K95175N74055J76104j43763j6925K26498a82329C89682M47474
$$ plain form
7062 837156 651149 -24563 -321200 69339 354381 -26278 -427989 -141979 360071 279918
7052 279918 -156532 -266657 -210724 -566187 -1034349 -767516 191447 871728 765042 369560
7041 294134 525179 660559 387157 -254680 -774571 -626882 24684 355240 22246 -302690
7030 -12331 441066 270009 -431036 -881957 -690967 -164266 183953 54473 -385450 -517591
7020 -517591 -32770 383845 -16654 -565639 15151 1268429 1295284 -108962 -746492 471341
7009 1519279 489537 -1222093 -1257902 -131519 8873 -790490 -739787 110932 -56677 -1271351
6999 -1271351 -1454099 -111131 642953 -325642 -1269242 -552283 795016 1078863 562416 392865
6989 392865 464998 109867 -253738 128988 760837 611846 -150835 -525001 -306094 -94070
$$ packed form
7062H37156j86007b4563k96637F9339K85042b6278m01711a41979C60071q0153
7052B79918a56532j10125N5933l55463m68162K66833A91447O80281j06686C69560
7041B94134K31045J35380k73402b54680n19891J47689B4684L30556B2246c02690
7030a2331D41066j71057d31036m50921J90990a64266A83953E4473c85450j32141
7020e17591c2770C83845a6654n48985A5151J253278K6855a08962o37530D71341
7009A519279D89537a222093l5809a31519H873g90490N0703A10932e6677j214674
6999a271351j82748a11131F42953c25642r43600e52283G95016K83847n16447j69551
6989C92865P2133A09867b53738A28988O31849j48991a50835l74166K18907i4070
$$ plain form
6978 -28491 254865 585492 333637 -419865 -753400 -189449 572467 535619 -360208 -1190969
6968 -1190969 -1132195 -381971 135522 -61710 -471787 -410463 74506 495109 678212 635387
6958 635387 147311 -711338 -1066022 -292812 754728 769981 6934 -145475 478737 570072
6948 570072 -278079 -737827 -18323 719054 304509 -537181 -552206 -27461 -19872 -460809 -592754
6937 -592754 -578738 -1029913 -1413672 -669592 759449 1240590 427650 -220302 214376 821002
6927 821002 627591 225317 555391 1164700 988871 226825 58780 722894 1168069 738880
6917 738880 68122 -82581 81208 18221 -157195 -7248 396282 650879 689313 641109 363765
6906 363765 -214590 -602940 -364651 48364 -58449 -404159 -210831 279475 68670 -758210
$$ packed form
6978b8491B54865L30627k51855d19865l33535a89449E72467l6848c60208q30761
6968a190969N8774c81971A35522f1710m10077O1324G4506M20603J83103m2825
6958F35387A47311g11338l54684b92812G54728J5253F934a45475D78737R1335
6948E70072b78079m59748a8323G19054C04509e37181j5025b7461P589m40937j31945
6937e92754J4016m51175l83759f69592G59449M81141D27650b20302B14376O06626
6927H21002j93411B25317L30074O09309j75829B26825E8780O64114M45175m29189
6917G38880F8122h2581H1208A8221a57195g248C96282K54597L8434m8204k77344
6906C63765b14590l88350K38289D8364e8449l45710J93328B79475F8670g58210
$$ plain form
6895 -937110 -143571 351194 -142380 -469171 353634 1299921 968599 -131657 -588755 -420155
6885 -420155 -576286 -857627 -347715 507726 378055 -506271 -531921 486913 841469 -186644
6874 -1065888 -561402 335763 254167 -355229 -309583 204558 169729 -378174 -472149 132626
6863 622453 334849 -502918 -1143849 -963788 -26378 708310 295617 -806505 -1083381 -93653
6852 784075 412631 -404549 -323361 413869 594577 115929 -43967 350135 455217 -100690
6841 -607279 -499040 -168762 -161258 -341172 -290590 14390 287785 330247 122871 -182283 -271217
6830 -271217 35558 456940 511155 102021 -416610 -687517 -578410 -104204 514747 831303
6820 831303 601903 165262 29733 192610 271256 187750 219658 388354 328878 -94743 -478501
$$ packed form
6895i37110a43571C51194a42380l26791C53634R46287l31322a31657m57098J68600
6885d20155j56131k81341c47715E07726j29671e06271k5650D86913L54556a86644
6874a065888N04486C35763q1596c55229M5646B04558l4829c78174r3975A32626
6863F22453k87604e02918o40931J80061b6378G08310B95617h06505k76876i3653
6852G84075l71444d04549Q1188D13869J80708A15929d3967C50135J05082a00690
6841f07279J08239a68762P504j79914N0582A4390K73395M2462A22871a82283q8934
6830b71217C5558M21382N4215A02021d16610k70907J09107a04204E14747L16556
6820H31303k29400A65262B9733J62877P8646q3506L1908J68696n9476i4743l83758
$$ plain form
6809 -478501 -404582 -2767 217080 -42905 -541630 -697417 -173315 620279 791655 2415 -953491
6797 -1021513 -224525 413822 315912 67742 379653 938854 930853 365852 82499 407373
6787 407373 604454 38349 -731473 -666187 241753 888032 493840 -476659 -991034 -574108
6777 -574108 413874 1213305 1214440 474766 -172003 18585 616809 443983 -671747 -1389433
6767 -1389433 -692673 538594 706062 -277161 -1008557 -631499 235038 670886 599373 474536
6757 474536 531667 668616 627180 153620 -637858 -1115962 -833324 -248274 -135879 -417618
6747 -417618 -335469 263136 677064 490884 117683 -11283 -17082 -69071 -37613 66480 -16498
6735 -211337 -112059 188054 45071 -627434 -1001309 -545428 148114 298274 34120 -58017
$$ packed form
6809d78501P3919b767B17080d2905m98725j55787a73315F20279J71376B415i53491
6797a021513b24525D13822r7910F7742L11911N59201q001C65852H2499L24874
6787D07373J97081C8349g31473O5286B41753O46279l94192d76659n14375M16926
6777e74108D13874P99431J135D74766a72003A8585N98224j72826f71747p17686
6767a389433f92673E38594J67468b77161p31396L77058B35038M35848p1513j24837
6757D74536N7131J36949m1436A53620f37858m78104K82638b48274J12395k81739
6747d17618Q2149B63136M13928j86180A17683a1283n799n1989L1458F6480a6498
6735b11337R9278A88054D5071f27434l73875M55881A48114J50160C4120e8017
$$ plain form
6724 71323 70968 -69541 -66729 80488 82388 -174332 -480643 -543141 -247787 139514 89248 -504442
6711 -869488 -190315 1139302 1838060 1384297 535006 68455 -60453 -38726 296528 746399
6701 746399 513687 -599015 -1535346 -1299286 -297786 353310 289312 -55569 -329327 -454389
6691 -454389 -364972 -206197 -396990 -947843 -1201364 -785632 -243504 -126667 -132151 147470
6680 312164 -120799 -684862 -641947 -204525 -64579 -131448 156072 575494 378077 -303626
6669 -483720 139017 728419 618012 132010 -209251 -472668 -876364 -1207008 -1140431 -756744
6659 -756744 -378678 -138764 68211 360668 692575 808848 476998 -92093 -291667 145922
6648 724526 828658 504071 195126 21527 -169219 -297680 -193151 -58452 -189513 -350094
$$ packed form
6724G1323l55f9541K812H0488J900a74332l06311o2498b47787A39514n0266e04442
6711h69488a90315A139302O98758m53763E35006F8455f0453K1727B96528M49871
6701G46399k32712e99015r36331K36060b97786C53310o3998e5569k73758j25062
6691d54389Q9417J58775j90793n50853k53521M15732b43504J16837n484A47470
6680C12164a20799n64063M2915b04525f4579o6869A56072M19422j97417c03626
6669d83720A39017N89402j10407A32010b09251k63417m03696l30644O6577L83687
6659g56744L78066a38764F8211K92457L31907J16273l31850i2093j99574A45922
6648G24526J04132l24587A95126B1527a69219j28461J04529e8452j31061j60581
$$ plain form
6638 -350094 -55577 545909 707858 123868 -582170 -615086 74148 818964 1002616 656867
6628 656867 314335 278488 205580 -301645 -850983 -630305 312031 920037 598985 74638
6617 245352 870606 1115414 837033 517113 310778 -20528 -475762 -827845 -1065820 -1228981
6607 -1228981 -1081597 -535333 -51375 -16877 -116655 39616 147124 -187950 -577834 -469046
6597 -469046 -160639 -226578 -355612 116235 851081 917325 371843 157683 449112 400647
6587 400647 -295963 -860461 -751795 -412525 -284266 -121046 243070 394105 154865 78899
6577 78899 539157 995442 757528 -26710 -649112 -720287 -387545 2072 176111 117080 77909
6566 77909 206268 286454 173669 151562 343822 246679 -370032 -643375 167077 1115558
$$ packed form
6638c50094e5577E45909J61949A23868e82170l2916G4148P44816J83652l45749
6628F56867C14335l5847p2908c01645n49338K20678C12031O08006l21052G4638
6617B45352O25254K44808k78381l19920k06335b0528m55234l52083k37975j63161
6607a228981J47384e35333e1375a6877r9778C9616J07508a87950l89884J08788
6597d69046a60639o5939j29034A16235P34846O6244C71843A57683K91429m8465
6587D00647b95963n64498J08666L39270J28259a21046B43070J51035A54865p5966
6577G8899M60258M56285k37914b6710o22402p1175L32742B072J74039n9031l9171
6566G7909J28359Q0186j12785k2107J92260r7143c70032k73343A67077R48481
$$ plain form
6556 1115558 726695 -502856 -567208 886591 1808849 867247 -546841 -609083 232866 380457
6546 380457 -275566 -568629 -213186 -49930 -402592 -664860 -508684 -293034 -207239 -35397
6535 143244 -52194 -474454 -439721 238557 882331 855984 330892 -70669 -31887 217649 205050
6524 205050 -274397 -841987 -888186 -349068 188948 329445 355974 593777 812452 704240
6514 704240 447537 279150 20565 -385681 -428672 152257 645173 348679 -194960 13306
6503 770628 991858 509787 242902 487083 409221 -345221 -817888 -230706 713239 898767
6493 898767 401623 95301 217720 302231 208457 270607 521067 602850 480117 496788 624019
6482 624019 352767 -414046 -964976 -666774 157806 646302 433528 -103111 -451068 -419341
$$ packed form
6556A115558l88863e02856o4352H86591R22258H67247e46841o2242B32866J47591
6546C80457b75566k93063b13186d9930l52662k62268J56176K15650Q5795c5397
6535A43244e2194m22260L4733B38557O43774k6347C30892g0669c1887B17649j2599
6524B05050b74397n67590m6199c49068A88948J40497K6529K37803K18675j08212
6514G04240k56703j68387B0565c85681m2991A52257M92916k96494a94960A3306
6503G70628K21230m82071B42902K44181p7862c45221m72667b30706G13239J85528
6493H98767D01623I5301J22419Q4511r3774O2150K50460Q1783j22733J6671J27231
6482F24019k71252d14046n50930K98202A57806M88496k12774a03111l47957L1727
$$ plain form
6472 -419341 -61097 462264 860506 857533 511615 221074 281683 562302 717840 590645
6462 590645 286481 -16130 -184468 -162592 -41205 -21682 -170102 -296665 -231364 -108029 -177202
6451 -177202 -438418 -690105 -851930 -959183 -901869 -499710 148818 693148 935900 937450
6441 937450 737526 330599 -56465 -69635 277832 581459 618919 565366 547879 449113 303818
6430 303818 376097 620160 614273 316542 265425 623335 714009 132515 -356723 97966 973503
6419 973503 1051030 274868 -219126 87802 417809 71696 -563730 -827769 -739749 -618232
6409 -618232 -456074 -209732 -113683 -201153 -70316 379909 560560 104277 -379429 -120739
6398 659709 1073098 715499 -72007 -754241 -871252 -174736 888159 1257610 516121 -370300
$$ packed form
6472d19341f1097D62264L98242k973l45918B21074O0609K80619J55538j27195
6462E90645B86481a6130j68338K1876d1205J9523j48420j26563O5301a08029o9173
6451a77202k61216k51687j61825j07253N7314M02159A48818N44330K42752J550
6441I37450j99924C30599e6465j3170B77832L03627L7460n3553j7487r8766j45295
6430C03818P2279K44063n887k97731n1117L57910R0674A32515c56723I7966Q75537
6419I73503P7527B74868b19126H7802L30007G1696e63730k64039Q8020J21517
6409f18232J62158b09732R6049q7470g0316C79909J80651A04277c79429a20739
6398F59709M13389l57599g2007o82234j17011a74736H88159L69451E16121c70300
$$ plain form
6387 -318177 345361 535559 130265 -95406 54540 62569 -74933 172508 608715 422537 -232423
6375 -238420 505816 660294 -313394 -1051021 -457842 470904 349737 -324778 -224711 447208
6364 477180 -78140 -53549 609451 725068 59114 -178076 517986 997364 411211 -343400
6353 -127663 648487 879061 563104 525721 814270 592561 -409391 -1323466 -1270772 -450465
6342 203067 129002 -365480 -607682 -328195 178150 557550 791176 975499 1004382 759029
6332 759029 424442 305236 444360 644131 679434 334719 -415200 -1063474 -933162 -190472
6321 162396 -253792 -570933 -170695 178191 -278413 -715581 -24748 1084042 1021233 -108988
6310 -768711 -589093 -672226 -1250110 -1214864 -402929 -196880 -1083955 -1612659 -772175 410820
$$ packed form
6387c18177C45361J90198A30265i5406E4540Q029g4933A72508M36207j86178b32423
6375b38420E05816J54478c13394p37627d57842D70904j21167c24778J00067D47208
6364D77180g8140K4591F09451J15617E9114a78076E17986M79378D11211c43400
6353a27663F48487K30574l15957l7383K88549k21709d09391r14075N2694d50465
6342B03067p4065c65480k42202K79487A78150L79400K33626J84323K8883k45353
6332G59029l34587j19206J39124J99771L5303C34719d15200o48274J30312a90472
6321A62396b53792l17141a70695A78191b78413m37168b4748A084042o2809a08988
6310g68711J79618q3133n77884L5246d02929a96880q87075n28704g72175D10820
$$ plain form
6299 744735 621106 715782 628591 139303 189964 1121254 1467863 187048 -1302603 -1136080
6289 -1136080 137278 615321 -33182 -652296 -787539 -834077 -638409 129437 701803 148316
6278 -834709 -821427 85206 628535 562307 610926 704421 210254 -380399 -26362 765360 478899
6267 478899 -774190 -1230665 -279909 704976 688032 256320 149419 214419 273003 472699
6257 472699 445361 -352342 -1266070 -1048073 31295 462350 17285 -12259 642400 660203 -344847
6245 -972663 -513871 -103107 -442104 -537152 145771 416272 -366361 -808628 120874 1108693
6235 1108693 695187 -259367 -228870 385033 345690 -65730 78628 248527 -561148 -1596509
6225 -1596509 -1328060 -94145 395675 -156792 -420410 153960 654249 502683 212658 178086
$$ packed form
6299G44735j23629R4676q7191A39303N0661R31290L46609A87048a302603J66523
6289a136080A37278M78043c3182o19114j35243m6538J95668A29437N72366A48316
6278h34709J3282H5206N43329o6228M8619R3495B10254c80399b6362G65360k86461
6267D78899g74190m56475b79909G04976j6944B56320j06901O5000N8584J99696
6257D72699k7338c52342r13728K17997C1295M31055A7285a2259F42400J7803c44847
6245i72663M58792a03107l38997r5048A45771K70501c66361m42267A20874R87819
6235A108693m13506b59367L0497C85033l9343f5730G8628J69899e61148j035361
6225a596509K68449i4145C95675a56792k63618A53960N00289j51566B12658l4572
$$ plain form
6215 178086 142280 -3890 -104508 -339377 -786572 -706753 400136 1420838 897720 -612957
6204 -1205587 -520982 -61899 -490482 -663382 87582 685183 275214 -237318 137399 628784
6194 628784 -15540 -1333615 -1726778 -770061 379726 725792 449829 129595 -104190 -325446
6184 -325446 -394321 -212771 -57378 -249243 -607130 -601679 -128369 213142 -104959 -728334
6174 -728334 -846493 -320425 202376 328597 370413 544896 485974 -25352 -553657 -736121
6164 -736121 -801129 -802524 -194805 1014585 1574428 606771 -775474 -825852 327998 1019788
6154 1019788 630834 206804 420136 595791 246734 60493 547423 918983 292887 -831583
6143 -1258301 -705400 59444 301429 -62389 -566115 -499890 432926 1449100 1333215 138356
$$ packed form
6215A78086l5806c890j00618k34869m47195P9819D00136J020702n23118f12957
6204a205587e20982f1899m28583j72900H7582N97601B75214b37318A37399M91385
6194F28784a5540j318075l93163g70061C79726L46066k75963A29595a04190k21256
6184c25446o8875J81550e7378j91865l57887N451a28369B13142a04959o23375
6174g28334j18159c20425B02376J26221M1816J74483n8922b5352n28305j82464
6164g36121o5008j395a94805A014585N59843F06771g75474n0378C27998O91790
6154A019788l88954B06804K13332J75655B46734F0493M86930L71560B92887h31583
6143a258301N52901E9444K41985f2389n03726O6225D32926J016174j15885A38356
$$ plain form
6132 -601557 23773 905127 586041 -482589 -698264 140453 588924 -95706 -867806 -642454
6122 -642454 144727 518429 511616 734377 1063007 863678 216996 -120097 85431 292381
6112 292381 180054 36840 24592 -98596 -294267 -143552 225129 6214 -960821 -1635816 -1282518
6101 -1282518 -680984 -859924 -1361301 -1035190 -89304 123647 -712508 -1359200 -947649 -124902
6090 201744 141683 202454 294515 74162 -329865 -532777 -407727 -34628 391450 431130 -170652
6078 -793879 -514856 434038 763757 21506 -709092 -526704 -10484 -59635 -476375 -602920
6068 -602920 -471754 -382397 -146927 297734 327636 -332101 -818170 -433127 105525 -67622
6057 -303891 455705 1577385 1468324 121054 -814293 -523122 53045 49367 -117862 72384
$$ packed form
6132f01557B3773Q81354l19086d82589k15675A40453M48471i5706p72100K25352
6122f42454A44727L73702o813K22761L28630j99329B16996a20097H5431K06950
6112B92381j12327C6840j2248i8596j95671a43552B25129F214i60821o74995L53298
6101a282518O01534j78940n01377L26111h9304A23647g12508o46692M11551a24902
6090B01744o0061O0771R2061G4162c29865k02912J25050c4628C91450L9680a70652
6078g93879K79023D34038L29719B1506g09092J82388a0484m9151m16740j26545
6068f02920J31166Q9357a46927B97734K9902c32101m86069L85043A05525f7622
6057c03891D55705J121680j09061A21054h14293K91171E3045l678a17862G2384
$$ plain form
6046 181584 -288635 -850228 -694640 111951 731407 601464 6774 -294817 73511 586958
6036 586958 396213 -448260 -901611 -417918 214284 212993 142318 831283 1677287 1472043
6026 1472043 514004 277286 1016257 1332583 430543 -703383 -933669 -494798 -171241 -25084
6015 270089 623032 779370 788314 671045 217364 -413130 -537968 45873 494589 -13281
6004 -1070110 -1539820 -1019913 -234718 -27477 -379808 -543628 6726 900729 1273043 794204
5994 794204 -1591 -472631 -485249 -104489 659908 1371054 1161428 -90891 -1216844 -1180709
5984 -1180709 -434915 3611 97909 306641 294682 -438697 -1177124 -843888 76985 172334 -523957
5972 -634960 36024 95944 -896872 -1469671 -639818 482448 582120 148024 346733 1033261
$$ packed form
6046A81584b88635n61593J55588A11951O19456j29943F774b94817G3511N13447
6036E86958j90745d48260m53351d17918B14284j291p0675O88965Q46004k05244
6026A472043E14004k36718P38971L16326D30543g03383k30286M38871a71241b5084
6015B70089L52943J56338Q944j17269B17364d13130j24838D5873M48716a3281
6004a070110m69710N19907b34718b7477l52331j63820F726Q94003L72314m78839
5994G94204a591m71040j2618a04489F59908P11146k09626i0891j125953L6135
5984a180709d34915C611R4298K08732j1959d38697p38427L33236G6985R5349e23957
5972f34960C6024N9920h96872n72799f39818D82448R9672A48024J98709O86528
$$ plain form
5962 1033261 1171042 479044 -425165 -981310 -978383 -419375 294154 586001 503146 597668
5952 597668 791323 370942 -566690 -903587 -280302 197312 -234500 -759076 -462643 147290
5941 170744 -199871 -339227 -384394 -646989 -704161 -200850 253459 78725 -215776 -57453
5930 16569 -556126 -1018361 -459428 453770 461870 -187751 -263965 254806 220687 -596871 -1110652
5919 -1110652 -721765 -79706 218135 431212 825882 1047418 744024 111098 -429953 -602487
5909 -602487 -360875 -68106 -297149 -925903 -962756 -5888 812250 376254 -597670 -641435 106335
5897 229047 -528998 -898235 -280890 373153 314915 109374 366688 644367 361589 -211694
5886 -585304 -809111 -972442 -738929 -11988 616704 662488 398023 230672 45742 -337377
$$ packed form
5962A033261J37781D79044d25165n56145K927d19375B94154K91847q2855R4522
5952E97668J93655C70942e66690l36897b80302A97312b34500n24576K96433A47290
5941A70744a99871j39356m5167k62595n7172b00850B53459G8725b15776e7453
5930A6569e56126m62235d59428D53770Q100a87751p6214B54806l4119e96871n13781
5919a110652L88887g9706B18135K13077L94670K21536l03394A11098d29953j72534
5909f02487K41612f8106k29043o28754l6853e888H12250C76254e97670m3765A06335
5897B29047e28998l69237b80890C73153n8238A09374K57314K77679k82778b11694
5886e85304k23807j63331K33513a1988F16704M5784k64465j67351D5742c37377
$$ plain form
5875 -627277 -489839 -70807 298037 481941 366736 -159091 -758692 -775055 -157688 307493
5864 77968 -383769 -359481 102179 391233 218593 -128721 -200615 202038 838053 1182379
5854 1182379 1028434 830080 1020561 1217870 811881 151580 156211 728451 724528 -186353
5843 -837890 -344684 538065 654838 108069 -285491 -417072 -683005 -919536 -655474 -106610
5832 96787 -30045 47244 367805 466550 263272 132295 166304 140250 104746 256672 371285
5821 371285 179203 109357 678621 1295395 872609 -302158 -654568 322304 1139403 485541
5810 -852746 -1286226 -711127 -254730 -335365 -326708 59613 320609 161210 -102483 -281802
5800 -281802 -515060 -575618 37971 1034277 1334363 605355 -129067 -6044 435924 326775
$$ packed form
5875f27277J37438g0807B98037J83904j15205a59091n99601j6363a57688C07493
5864G7968c83769K4288A02179K89054j72640a28721p1894B02038O36015L44326
5854A182379j53945j98354J90481J97309m05989A51580M631N72240l923a86353
5843h37890c44684E38065J16773A08069b85491j31581k65933k36531K64062a06610
5832I6787c0045D7244L20561R8745k03278j30977L4009k6054l5504J51926J14613
5821C71285A79203o9846N69264O16774m22786c02158l52410C22304Q17099D85541
5810h52746m33480N75099b54730q0635Q657E9613K60996j59399a02483j79319
5800b81802k33258o0558C7971R96306L00086F05355a29067f044D35924j09149
$$ plain form
5790 326775 -40725 132134 553346 185169 -955622 -1591602 -991128 66171 515645 331180
5780 331180 139764 234413 531090 948168 1260559 1034296 278481 -234434 90896 739147
5770 739147 757564 127674 -281190 -48922 306673 324113 306261 627529 958329 808890
5760 808890 475703 690014 1383366 1576506 770145 -211993 -322930 219631 325601 -252725
5749 -532922 131509 980400 947655 180258 -343426 -295560 -185686 -247028 -110673 298199
5738 421783 -44772 -606694 -682850 -347915 -33575 61644 -23409 -193104 -264900 -164315 -241449
5727 -241449 -831091 -1423275 -1080895 42259 542612 -297780 -1321997 -1113677 -66944 260893
5716 -577172 -1483750 -1529669 -964220 -392314 32419 261140 45789 -542524 -903614 -700572
$$ packed form
5790C26775d0725A32134M21212A85169i55622o35980O00474F6171M49474j84465
5780C31180A39764R4649K96677M17078L12391k26263B78481b34434I0896O48251
5770G39147J8417A27674b81190d8922C06673J7440j7852L21268L30800j49439
5760H08890l33187K14311O93352J93140G70145b11993j10937B19631J05970b52725
5749e32922A31509Q48891l2745A80258c43426M7866J09874o1342a10673B98199
5738D21783d4772n61922p6156L34935c3575F1644b3409j69695p1796J00585p7134
5727b41449n89642n92184L42380D2259N00353b97780j024217K08320f6944B60893
5716e77172r06578m5919N65449c92314C2419K28721D5789e42524l61090K03042
$$ plain form
5706 -700572 -408169 -594903 -1003187 -871722 -32588 796832 882132 304762 -243737 -327702
5696 -327702 -182746 -245372 -509607 -577425 -244229 254981 579490 575874 227669 -339115
5685 -739927 -629098 -252809 -267263 -792995 -1129755 -746556 -85231 89868 -244956 -510810
5675 -510810 -441414 -257109 -84275 182479 446912 391957 9421 -269776 -136881 190644 294444
5664 294444 124542 79527 489044 1063686 1061238 213558 -717666 -767437 -55580 375163 56229
5652 -340433 -196547 124651 74349 -110068 42108 299633 160455 -220311 -351822 -301068
5642 -301068 -438242 -593103 -331580 154925 325170 282518 558835 987130 792083 -86699
5631 -712661 -467933 147141 360685 106685 -196403 -305945 -255160 -176570 -240795 -462664
$$ packed form
5706g00572K92403j86734m08284J31465c2588G96832Q5300C04762b43737q3965
5696c27702J44956o2626k64235o7818b44229B54981L24509l616B27669c39115
5685g39927J10829b52809j4454n25732l36760L83199h5231H9868b44956k65854
5675e10810O9396J84305h4275A82479K64433n4955I421b69776J32895A90644J03800
5664B94444A24542m5015M09517N74642k448B13558g17666m9771e5580C75163E6229
5652c40433J43886A24651n0302a10068D2108K57525j39178b20311j31511N0754
5642c01068j37174j54861K61523A54925J70245m2652K76317M28295j95047h6699
5631g12661K44728A47141K13544A06685a96403j09542N0785P8590o4225k21869
$$ plain form
5621 -462664 -538459 -261707 -11980 -274671 -750397 -659209 16149 385518 -21436 -550476 -440061
5610 -440061 108552 379502 175367 -120037 -192648 -44477 215303 448963 472634 223737
5599 -126258 -358998 -404263 -300743 -127608 -6077 -1229 -37157 -71780 -236666 -560808 -734179
5588 -734179 -505485 -151759 -111746 -286100 -213149 145818 368987 310734 279319 404387
5578 404387 414547 200519 57191 155381 252951 161364 68758 147982 213575 38441 -260677
5566 -393974 -286189 -142252 -213855 -506751 -652403 -249711 501245 811230 272263 -501525
5555 -637101 -96246 495317 771492 766249 474078 13454 -63491 532317 1062702 636045 -343802
5543 -672751 -200111 30159 -405649 -667593 -211217 265810 77175 -328318 -268532 35757
$$ packed form
5621d62664p5795b61707a1980k62691m75726R1188A6149L69369b1436n29040J10415
5610d40061A08552K70950A75367a20037p2611d4477B15303K33660K3671B23737
5599a26258k32740m5265J03520a27608f077a229l5928l4623j64886l24142j73371
5588g34179K28694a51759M0013j74354P2951A45818K23169n8253l1415J25068
5578D04387J0160B00519E7191R8190R7570r1587F8758P9224O5593C8441b60677
5566c93974J07785a42252p1603k92896j45652b49711E01245L09985B72263e01525
5555f37101i6246D95317K76175n243k92171A3454f3491E32317N30385m26657c43802
5543f72751b00111C0159d05649k61944b11217B65810G7175c28318N9786C5757
$$ plain form
5532 48845 -87798 7524 116563 -144529 -495223 -390307 62397 290246 139114 -31695 31919
5520 247786 426499 372204 -34642 -567427 -735149 -377778 134730 473952 693140 817914
5510 817914 651056 261044 86230 220230 197768 -124935 -137421 554297 1324391 1313571
5500 1313571 555255 -259839 -712391 -787477 -506833 -29447 214511 25528 -233148 -227952
5490 -227952 -168912 -299484 -381646 -222087 -189391 -578860 -953104 -813109 -468788 -464868 -550555
5479 -550555 -121308 572777 633106 -88642 -684711 -468928 143261 333486 -19515 -299730
5469 -299730 -46720 376619 169799 -782439 -1466772 -915552 343150 819663 123531 -518144
5458 -175313 476380 502734 270912 537147 867017 389543 -439359 -404213 359466 444898
$$ packed form
5532D8845h7798G524J09039a44529l50694J04916F2397K27849A39114c1695C1919
5520B47786J78713n4295c4642n32785j67722L57371A34730L39222K19188J24774
5510H17914j66858B61044H6230J34000k2462a24935j2486E54297P70094j0820
5500A313571E55255b59839m52552p5086K80644b9447B14511B5528b33148N196
5490b27952N9040j30572q2162J59559L2696l89469l74244J39995L44321L920q5687
5479e50555a21308E72777O0329h8642n96069K15783A43261J90225a9515k80215
5469b99730d6720C76619A69799g82439o84333N51220C43150M76513A23531e18144
5458a75313D76380K6354k31822K66235L29870C89543d39359L5146C59466Q5432
$$ plain form
5448 444898 -503100 -1131461 -555385 227691 -33025 -895201 -1020686 -260103 259535 -44525
5437 -403421 4087 756352 834341 191899 -136806 364117 786474 136515 -991584 -1139467
5427 -1139467 -209903 320319 -299156 -928221 -438161 443330 371670 -439185 -694367 -119516
5416 377907 383588 384907 550723 444840 56038 -119129 -147653 -590951 -1217013 -1098968 -293426
5404 -41014 -771265 -1261226 -557290 485761 575593 -103690 -456670 -211672 53479 125201
5394 125201 285987 483483 326348 -182619 -644938 -892857 -1022836 -988796 -726612 -459741
5384 -459741 -339614 -76410 487145 789158 258816 -667483 -1030934 -661002 -197320 29561
5373 223871 288565 -197787 -968809 -1039540 -124112 771109 731270 171300 9854 221398 63835
$$ packed form
5448D44898e03100o28361e55385B27691c3025q62176j25485b60103B59535d4525
5437d03421D087P52265P7989A91899a36806C64117M22357A36515i91584j47883
5427a139467b09903C20319b99156o29065d38161D43330p1660d39185k55182a19516
5416C77907N681J319J65816j05883E6038a19129k8524m43298o26062J18045b93426
5404d1014p30251m89961e57290D85761Q9832a03690l52980b11672E3479P1722
5394A25201J60786J97496j57135a82619m62319k47919j29979L4040K62184K66871
5384d59741J20127g6410D87145L02013B58816f67483l63451L69932a97320B9561
5373B23871O4694a97787p71022p0731a24112G71109l9839A71300I854K11544F3835
$$ plain form
5361 -596172 -1065416 -867884 -274823 254945 533178 441419 -116388 -828477 -1049449 -568190
5351 -568190 82391 378909 492334 827289 1193368 994455 197223 -404531 -92002 889892
5340 1571541 1293755 348901 -414727 -528887 -320616 -338232 -546095 -413331 189558 616061
5330 616061 252452 -589412 -985194 -495771 389351 863660 577973 -161015 -718316 -680677
5320 -680677 -249290 11343 -73652 -69549 322347 728193 749023 694312 983741 1184089 573186
5308 -489493 -834967 -241554 199461 -159211 -529459 -133094 388609 26198 -857858 -1026394
5298 -1026394 -252268 463184 487830 274472 296085 258064 -173413 -607612 -512807 -120317
5287 -102980 -520848 -685187 -163351 548450 657341 114144 -408022 -532336 -654234 -1139816
$$ packed form
5361e96172m69244J97532b74823B54945K78233r1759a16388p12089k20972M81259
5351e68190H2391K96518J13425L34955L66079j98913A97223d04531i2002H89892
5340A571541k77786C48901d14727j14160K08271j7616k07863J32764A89558M26503
5330F16061B52452e89412l95782M89423C89351M74309k85687a61015n57301L7639
5320f80677b49290A1343g3652M103C22347M05846K0830n4711K89429K00348E73186
5308d89493l45474b41554A99461a59211l70248a33094C88609B6198h57858j68536
5298a026394b52268D63184K4646k13358K1613l8021a73413m34199R4805a20317
5287a02980m17868j64339a63351E48450J08891A14144d08022j24314j21898m85582
$$ plain form
5277 -1139816 -1520259 -1060838 61471 804668 554160 -183085 -545117 -308174 111688 276603
5267 276603 98680 -183044 -267185 -169090 -231425 -525732 -557783 -51029 366466 35285 -515713
5255 -282697 477755 545578 -190459 -479752 115186 436122 -152771 -540691 95737 619916
5245 619916 -137095 -1118813 -647871 671953 838943 -254327 -690783 294375 1210204 879547
5235 879547 158264 219628 712080 721882 396324 441005 760870 679808 94832 -450086 -614741
5224 -614741 -552077 -478906 -393219 -165916 250830 587134 314501 -674394 -1547140 -1306121
5214 -1306121 -145076 626996 224190 -676652 -950477 -428391 154166 257498 104049 198260
5204 198260 575448 704740 226610 -372340 -282627 363289 458396 -441495 -1243478 -853528
$$ packed form
5277a139816l80443M59421F1471P43197k50508a83085l62032K36943A11688J64915
5267B76603I8680a83044q4141R8095o2335k94307l2051e1029C66466C5285e15713
5255b82697D77755O7823a90459k89293A15186L20936a52771l87920I5737N24179
5245F19916a37095r81718M70942F71953J66990b54327m36456B94375R15829l30657
5235H79547A58264O1364M92452R802l25558M4681L19865q1062I4832d50086j64655
5224f14741O2664P3171Q5687a65916B50830L36304k72633f74394q72746K41019
5214a306121a45076F26996B24190f76652k73825d28391A54166J03332A04049R4211
5204A98260L77188J29292B26610c72340Q9713C63289R5107d41495q01983L89950
$$ plain form
5194 -853528 131146 349144 -238670 -503900 -108826 159557 42656 276150 1017471 1222935
5184 1222935 300374 -761275 -764723 51691 593666 475777 155544 -51931 -276160 -572765
5174 -572765 -706650 -470847 38804 436058 331819 -191936 -523468 -288650 41388 -156475
5163 -610191 -545263 50710 447187 399169 397696 641954 746778 606714 562205 545687 104068
5151 -523202 -472767 283020 695813 276289 -183057 -12636 380205 544824 770082 1121002
5141 1121002 908800 10042 -442403 264580 1105224 845911 -25425 -198540 369745 653089
5131 653089 359435 173941 422178 691848 720286 673332 582519 315366 24618 -47001 -36774
5120 -36774 -146178 -157288 140584 432364 404025 317045 400806 255303 -343278 -663534 -32837
$$ packed form
5194h53528A31146K17998b38670k65230a08826A59557D2656K33494P41321K05464
5184A222935C00374g61275l448E1691N41975j17889A55544e1931k24229k96605
5174e72765j33885K35803C8804L97254j04239a91936l31532K34818D1388a56475
5163f10191O4928E0710L96477m8018j473K44258J04824j40064m4509j6518A04068
5151e23202N0435B83020M12793B76289a83057a2636C80205J64619K25258L50920
5141A121002k12202A0042d42403B64580Q40644k59313b5425j73115C69745K83344
5131F53089k93654A73941K48237K69670K8438m6954r0813k67153B4618d7001J0227
5120c6774j09404j1110A40584K91780k8339q6980Q3761j45503c43278l20256c2837
$$ plain form
5108 894035 970290 256221 -240609 -189562 -108280 -136721 90566 376180 13133 -908665 -1344850
5097 -1344850 -746232 221228 673108 455525 -99551 -627417 -742684 -273837 334384 427073
5087 427073 10681 -337471 -342494 -146918 277322 964861 1307598 602140 -671480 -1182004
5077 -1182004 -580805 75509 76759 51765 559576 824217 -49911 -1352499 -1519647 -338443
5066 777764 786809 245168 162934 489906 449852 -90073 -436461 -211516 108837 65261 -52166
5054 144075 305864 -69996 -578878 -378780 365273 558861 -109338 -585297 -28181 979530
5043 1399649 1068128 397044 -407310 -1037307 -822055 248018 935651 285618 -839010 -915939
5033 -915939 25592 636578 359792 -74376 -159066 -217591 -352522 -88446 592348 966943 717653
$$ packed form
5108H94035P6255B56221b40609N1047Q1282k8441I0566K85614A3133i08665m36185
5097a344850N98618B21228M51880k17583i9551n27866j15267b73837C34384R2689
5087D27073A0681c37471n023a46918B77322O87539L42737F02140f71480n10524
5077a182004e80805G5509J250k4994N07811K64641d9911j302588j67148c38443
5066G77764R045B45168q2234L26972m0054i0073l46388b11516A08837m3576e2166
5054A44075J61789f9996n08882K00098C65273J93588a09338m75959b8181I79530
5043A399649l31521C97044d07310o29997K15252B48018O87633B85618h39010p6929
5033i15939B5592O10986k76786g4376q4690n8525j34931h8446E92348L74595k49290
$$ plain form
5022 717653 386118 303773 29986 -663846 -1133858 -798720 -66345 273289 96280 -123525
5011 -58731 211745 420430 327106 -48659 -325820 -199618 58424 -15891 -278729 -183175 216672
$$ packed form
5022G17653l31535q2345B9986f63846m70012L35138f6345B73289I6280a23525
5011e8731B11745K08685r3324d8659k77161J26202E8424a5891k62838R5554B16672
$$ [...]
##END NTUPLES=NMR SPECTRUM
##END=
