##TITLE=PE2I
PROTON CDCl3 {C:\Spectra\data\SiimK\nmr} SiimK 55
##JCAMPDX= 6.0         $$ Bruker NMR JCAMP-DX V2.0
##DATA TYPE= NMR SPECTRUM
##DATA CLASS= NTUPLES
##ORIGIN= Bruker BioSpin GmbH
##OWNER= nmrsu
$$ 1.83.2.2 TOPSPIN		Version 3.2
$$ 2016-05-10 10:50:37.109 +0300  Siim@Siim-workPC
$$ Compression mode = diff/dup
##.OBSERVE FREQUENCY= 700.084323280578
##.OBSERVE NUCLEUS= ^1H
##.ACQUISITION MODE= SIMULTANEOUS (DQD)
##.ACQUISITION SCHEME= undefined
##.AVERAGES= 64
##.DIGITISER RES= 22
##SPECTROMETER/DATA SYSTEM= spect
##.PULSE SEQUENCE= zg30
##.SOLVENT NAME= CDCl3
##.SHIFT REFERENCE= INTERNAL, CDCl3, 1, 16.21602
##AUDIT TRAIL= $$ (NUMBER, WHEN, WHO, WHERE, PROCESS, VERSION, WHAT)
$$ ##TITLE= Audit trail, TOPSPIN		Version 3.2
$$ ##JCAMPDX= 5.01
$$ ##ORIGIN= Bruker BioSpin GmbH
$$ ##OWNER= nmrsu
$$ $$ C:/Spectra/data/SiimK/nmr/PE2I_700/1/pdata/1/auditp.txt
$$ ##AUDIT TRAIL=  $$ (NUMBER, WHEN, WHO, WHERE, PROCESS, VERSION, WHAT)
(   1,<2016-04-13 09:23:33.895 +0300>,<nmrsu>,<HP>,<go>,<TOPSPIN 3.2>,
      <acquisition in progress>)
(   2,<2016-04-13 09:25:32.847 +0300>,<nmrsu>,<HP>,<proc1d>,<TOPSPIN 3.2>,
      <Start of raw data processing
       efp LB = 0.3 FT_mod = 6 PKNL = 1 PHC0 = 0 PHC1 = 0 SI = 64K 
       data hash MD5: 64K
       BC 67 E3 51 4F 98 C2 B3 BF D8 0F 85 DF 39 42 6F>)
(   3,<2016-04-13 09:25:33.119 +0300>,<nmrsu>,<HP>,<proc1d>,<TOPSPIN 3.2>,
      <apk 
       data hash MD5: 64K
       5A F2 76 C4 63 69 18 E9 0D BE 86 B2 E8 62 2C AD>)
(   4,<2016-04-13 09:25:34.808 +0300>,<nmrsu>,<HP>,<proc1d>,<TOPSPIN 3.2>,
      <abs n ABSG = 5 
       data hash MD5: 64K
       63 F1 D8 C4 1E C5 62 DF 63 55 F3 5C E1 48 12 17>)
(   5,<2016-04-15 10:14:49.473 +0300>,<Siim>,<Siim-workPC>,<dataserver>,<TOPSPIN 3.2>,
      <new intrng file generated by interactive integration
       data hash MD5: 64K
       63 F1 D8 C4 1E C5 62 DF 63 55 F3 5C E1 48 12 17>)
(   6,<2016-04-15 10:17:41.989 +0300>,<Siim>,<Siim-workPC>,<dataserver>,<TOPSPIN 3.2>,
      <new intrng file generated by interactive integration
       data hash MD5: 64K
       63 F1 D8 C4 1E C5 62 DF 63 55 F3 5C E1 48 12 17>)
$$ ##END=
$$ 
$$ $$ hash MD5
$$ $$ FF 6E 3E 28 AC B1 11 39 DB C0 EC C8 A4 5A FF EA
##$RELAX= 
##$RELAX= 
##$RELAX= 
##$RELAX= 
##$RELAX= 
##$RELAX= 
##$RELAX= 
##$RELAX= 
##$RELAX= 
##$RELAX= 
##$RELAX= 
##$RELAX= 
$$ Bruker specific parameters
$$ --------------------------
##$DATPATH= <C:/Users/Siim/Desktop/nmr>
##$EXPNO= 1
##$NAME= <PE2I_700>
##$PROCNO= 1
##$ACQT0= -1.49159661862029
##$AMP= (0..31)
100 100 100 100 100 100 100 100 100 100 100 100 100 100 100 100 100 100
100 100 100 100 100 100 100 100 100 100 100 100 100 100
##$AMPCOIL= (0..19)
0 0 0 0 0 0 0 0 0 0 0 0 0 0 0 0 0 0 0 0
##$ANAVPT= -1
##$AQSEQ= 0
##$AQ_mod= 3
##$AUNM= <au_zg>
##$AUTOPOS= <55 >
##$BF1= 700.08
##$BF2= 700.08
##$BF3= 700.08
##$BF4= 700.08
##$BF5= 700.08
##$BF6= 700.08
##$BF7= 700.08
##$BF8= 700.08
##$BYTORDA= 0
##$CAGPARS= (0..11)
0 0 0 0 0 0 0 0 0 0 0 0
##$CFDGTYP= 0
##$CFRGTYP= 9
$$ [...]
2 2 0 0 0 0 0 0 0 0
##$TL= (0..7)
120 120 120 120 120 120 120 120
##$TUNHIN= 0
##$TUNHOUT= 0
##$TUNXOUT= 0
##$USERA1= <>
##$USERA2= <>
##$USERA3= <>
##$USERA4= <>
##$USERA5= <>
##$V9= 5
##$VALIST= <>
##$VCLIST= <>
##$VD= 0
##$VDLIST= <>
##$VPLIST= <>
##$VTLIST= <>
##$WBST= 1024
##$WBSW= 4
##$XGAIN= (0..3)
0 0 0 0
##$XL= 0
##$YL= 0
##$YMAX_a= 20182071
##$YMIN_a= -18253084
##$ZGOPTNS= <>
##$ZL1= 120
##$ZL2= 120
##$ZL3= 120
##$ZL4= 120
##$ABSF1= 16.24408
##$ABSF2= -3.893253
##$ABSG= 5
##$ABSL= 3
##$ALPHA= 0
##$AQORDER= 0
##$ASSFAC= 0
##$ASSFACI= 0
##$ASSFACX= 0
##$ASSWID= 0
##$AUNMP= <proc_1d>
##$AXLEFT= 0
##$AXNAME= <>
##$AXNUC= <1H>
##$AXRIGHT= 0
##$AXTYPE= 0
##$AXUNIT= <>
##$AZFE= 0.1
##$AZFW= 0.1
##$BCFW= 0
##$BC_mod= 0
##$BYTORDP= 0
##$COROFFS= 0
##$CY= 15
##$DATMOD= 1
##$DC= 0
##$DFILT= <>
##$DTYPP= 0
##$ERETIC= no
##$F1P= 10.5
##$F2P= -0.5
##$FCOR= 0.5
##$FTSIZE= 65536
##$FT_mod= 6
##$GAMMA= 0
##$GB= 0
##$INTBC= 1
##$INTSCL= 3.541982e-009
##$ISEN= 128
##$LB= 0.3
##$LEV0= 0
##$LPBIN= 0
##$MAXI= 10000
##$MC2= 0
##$MEAN= 0
##$ME_mod= 0
##$MI= 0
##$MddCEXP= no
##$MddCT_SP= no
##$MddF180= no
##$MddLAMBDA= 0
##$MddMEMORY= 0
##$MddMERGE= 0
##$MddNCOMP= 0
##$MddNITER= 0
##$MddNOISE= 0
##$MddPHASE= 0
##$MddSEED= 0
##$MddSRSIZE= 0
##$Mdd_CsALG= 0
##$Mdd_CsLAMBDA= 0
##$Mdd_CsNITER= 0
##$Mdd_CsNORM= 0
##$Mdd_CsZF= 0
##$Mdd_mod= 0
##$NCOEF= 0
##$NC_proc= -1
##$NLEV= 6
##$NOISF1= 0
##$NOISF2= 0
##$NSP= 0
##$NTH_PI= 0
##$NZP= 0
##$OFFSET= 16.21602
##$PC= 1
##$PHC0= 34.03676
##$PHC1= 5.444731
##$PH_mod= 1
##$PKNL= yes
##$PPARMOD= 0
##$PPDIAG= 0
##$PPIPTYP= 0
##$PPMPNUM= 2147483647
##$PPRESOL= 1
##$PSCAL= 0
##$PSIGN= 0
##$PYNMP= <proc.py>
##$REVERSE= no
##$SF= 700.080019640749
##$SI= 65536
##$SIGF1= 0
##$SIGF2= 0
##$SINO= 0
##$SIOLD= 65536
##$SPECTYP= <PROTON>
##$SREGLST= <1H.CDCl3>
##$SSB= 0
##$STSI= 65536
##$STSR= 0
##$SW_p= 14097.7443609023
##$SYMM= 0
##$S_DEV= 0
##$TDeff= 65536
##$TDoff= 0
##$TI= <>
##$TILT= no
##$TM1= 0
##$TM2= 0
##$TOPLEV= 0
##$USERP1= <>
##$USERP2= <>
##$USERP3= <>
##$USERP4= <>
##$USERP5= <>
##$WDW= 1
##$XDIM= 65536
##$YMAX_p= 463676654
##$YMIN_p= -12897
##$CURPLOT= <HP LaserJet 1010>
##$CURPRIN= <$HP LaserJet 1010>
##$DFORMAT= <normdp>
##$LAYOUT= <+/1D_H.xwp>
##$LFORMAT= <normlp>
##$PFORMAT= <normpl>
$$ End of Bruker specific parameters
$$ ---------------------------------
##NTUPLES= NMR SPECTRUM
##VAR_NAME=  FREQUENCY,     SPECTRUM/REAL,   SPECTRUM/IMAG
##SYMBOL=    X,             R,               I
##VAR_TYPE=  INDEPENDENT,   DEPENDENT,       DEPENDENT
##VAR_FORM=  AFFN,          ASDF,            ASDF
##VAR_DIM=   65536,         65536,           65536
##UNITS=     HZ,            ARBITRARY UNITS, ARBITRARY UNITS
##FACTOR=    0.215114507460057, 1,           1
##FIRST=     14097.5292463948, -1915,        -62951
##LAST=      0,             -12384,          -62943
##MIN=       0,             -12897,          0
##MAX=       14097.5292463948, 463676654,    0
$$ Real data points
##PAGE= N=1
##DATA TABLE= (X++(R..R)), XYDATA
$$ [...]
23905 83318 90602 99332 112305 133836 166561 217716 295217 405343 527240 605054 577821 462214
23893 462214 338688 251585 193439 153339 127364 110900 101088 94107 88184 83273 80296 78870
23881 78870 77633 76841 76872 77382 76964 76751 76800 77582 79062 79492 81979 84765 86021 86935 88908 91874 94595
23864 94595 98043 102956 107852 113718 120305 126564 134614 143866 153884 166523 180748 196646 215865
23851 215865 238068 263726 294392 330931 375269 432597 504777 593927 703921 837343 990396
23840 990396 1159309 1338287 1518963 1690922 1848510 1987694 2110375 2218333 2318288 2415293
23830 2415293 2517209 2628228 2756035 2904125 3076500 3268731 3473417 3676708 3865706
23821 3865706 4027584 4153427 4242509 4298362 4324959 4323913 4299599 4256399 4198338 4139528 4093960
23810 4093960 4075953 4090831 4134652 4196847 4264884 4325047 4368649 4390738 4392695 4373124 4334497
23799 4334497 4279468 4215555 4156191 4116439 4107180 4133560 4191836 4267793 4342086 4402091 4435810
23788 4435810 4441668 4417287 4363115 4274362 4148127 3985336 3793479 3585788 3378709 3184229
23778 3184229 3012883 2868196 2744513 2636108 2537272 2439183 2339151 2229853 2107663 1968226
23768 1968226 1809380 1633640 1447818 1259836 1080679 916521 772606 652315 554157 474939
23758 474939 411796 361306 320146 286206 258515 233980 212452 193281 176964 164703 152068
23747 152068 139571 130410 122110 113400 106776 101043 94941 89968 85443 82648 78946 75311 71504 68777
23733 68777 66631 64340 62012 60133 58024 57056 55235 54199 52338 50590 48447 46799 45423 44068 42701
23718 42701 41359 40606 40711 39320 37976 36391 36305 35535 34022 33033 32938 32155 31417 30521 29895 29464 28802 28769
23700 28769 28886 28766 28196 27611 27885 25586 25205 24691 23999 22793 22732 22376 21891 21799 22496 22210 21740 21969 21585
23681 21585 21053 21062 20736 20588 20441 20047 19604 18650 18452 18613 18380 18900 18751 18528 18042 18345 19292 19180 17830
23662 17830 17613 17352 17204 16359 16243 17152 17334 16603 17068 17020 17439 17417 16662 15877 14882 14891 15453 15559 14679 14546
23642 14546 13673 13716 14851 14979 13413 12243 12937 13581 13548 14509 13612 13513 14321 13182 12971 13728 13307 13216 12841
23623 12841 13149 12888 13067 13127 12214 13117 13069 12994 13057 12644 12604 11844 12021 11941 11196 12447 13148 12777 12287 11318 11431
23602 11431 10924 11759 11805 12317 12580 11845 11460 10904 10745 10397 10009 9916 10402 9902 10501 11769 11437 10276 10225
23583 10225 10643 11663 11884 10969 12421 12688 11772 11066 9913 9487 9787 9473 10204 9717 9271 9560 10204 10493
23565 10493 9692 9438 9262 9252 9614 8969 9909 10364 10702 10354 9928 9753 10044 11061 11579 11111 10461 11047 10972
23546 10972 11173 12653 12639 12884 12075 11549 10816 10702 10642 10641 11380 10689 10044 10041 10127 9733 11194 11588 11618 10716 11049
23525 11049 11511 11517 10677 9805 10040 10802 10833 10712 10629 11241 13276 12598 11400 11121 11710 11953 12077 12212 13138 13944
23505 13944 15468 16083 16215 17529 19188 20331 20938 21616 22004 22416 23717 24804 24910 26376 26785 28014
23489 28014 29224 30556 31707 32757 33251 35105 36698 38574 38935 38875 38685 39420 41766 41448 40276 40463
23473 40463 41477 41305 40976 41208 41378 42218 43086 43137 44157 45155 45110 44364 43728 43610 43422 43558 44154 44106 44078 45419
23453 45419 46023 45068 46466 46319 44865 45348 45807 44959 44585 42927 41678 40495 38691 37548 37141 35245
23437 35245 34777 34101 34154 32369 31992 31252 30875 29631 28493 27361 26541 25705 24499 22785 21778 21111 19815
23420 19815 18591 18244 17725 17843 16215 15461 15163 15343 14430 13960 12831 13568 13170 12607 11864 11405 12441 13624
23402 13624 12687 12607 12441 11426 10327 10094 9101 8162 8353 8843 10661 11679 11585 11255 10982 10852 9209 8669
23384 8669 9804 10406 9379 9120 8615 8382 8884 10001 10287 10166 10463 10902 10502 9106 8365 10126 9499 8226
23366 8226 7893 7749 7546 7918 7514 7924 7658 8067 7954 8161 9068 9631 9362 7578 7156 7656 7636 6567 6599
23347 6599 6599 6725 6514 5759 6176 5763 6209 6292 6032 5922 5657 6332 6949 6481 5974 6698 8211 7476 7524 5343
23327 5343 5099 6264 6702 7007 7338 8365 8402 7242 7435 7453 7322 6880 6348 7057 6984 7213 8208 7372 6801
23308 6801 6710 6842 7289 7365 7200 7034 6989 7139 5879 4865 5571 6326 6713 8101 8087 7580 7160 7636 7731 7443
23288 7443 7523 7422 6846 7001 7628 7692 7720 7932 7248 6373 6517 6499 7019 6837 6185 6792 7452 6822 6502 7340 6866
23267 6866 6898 6645 7309 6971 5974 5912 6462 5615 6067 6621 7055 7158 7109 6871 5992 5351 5751 6198 6392 6186
23247 6186 6355 7446 7212 7204 7733 7360 7735 7722 7443 7920 7920 8286 8041 7908 7483 6625 7241 6910 6765 6328 6592
23226 6592 6673 6445 6847 7123 7155 6517 6618 6600 5944 6088 5517 4997 6281 5984 7120 7980 7708 6375 6027
23207 6027 6969 7008 6814 6871 6304 6842 7461 7380 7404 7593 8097 7592 7649 7373 7235 7251 6902 6113 6815 7682 8005
23186 8005 7547 7234 7123 7691 7272 6843 6965 7107 7800 7485 7162 6614 7339 7645 7869 7474 7256 7279 7354 8407
23166 8407 7890 7029 6553 7991 7712 6485 6162 6299 7331 7145 6135 6869 6420 7084 6711 6871 7066 6934
23148 6934 7079 6959 7162 7153 7788 7933 7145 7222 7404 7380 7985 7851 7649 7738 7698 7825 7637 7379 7116 6776 6483
23127 6483 7196 7676 7930 8862 8976 8054 8029 8152 7826 7406 6721 6960 7139 7576 7022 7657 7398 8163 9158 8074
23107 8074 7009 7004 6745 6606 7161 8221 8193 7853 7787 6876 6828 7119 7600 7928 8478 7837 8260 9022 8382 8210
23087 8210 6912 7287 7639 8768 10358 11171 9856 9211 9376 9356 9783 9920 8571 7881 7184 8092 7625 7966
23069 7966 7754 7355 8033 7251 6671 8102 8576 8205 7253 7874 7994 7653 8135 8256 7843 8317 8096 7639 7249
23050 7249 8025 8147 8130 8735 7423 6425 7014 8826 9809 9119 8323 7275 6722 8016 8695 7949 7218 7671
23032 7671 8928 8324 8121 8164 8717 9656 10146 9996 9837 9987 9698 8128 7365 8319 9245 8884 9271 10257 9252
23013 9252 8599 9152 9431 10242 9293 8459 8163 8882 8904 9779 10772 10565 10119 9902 8399 8944 9941 10565 10079
22994 10079 10029 9986 9382 9522 10405 9674 9897 9893 9817 10022 10687 10915 10279 10256 10803 11115 11397 10284 9786 9055 9007
22973 9007 9793 11295 10031 9258 10173 10546 8938 8918 9824 10648 12162 11906 12182 11900 11813 12496 11782 11836 12206
22954 12206 12861 12501 13664 13325 12883 14163 14839 14733 15457 15303 16232 16181 16477 17466 17515 17454 17917 17465 17815
22935 17815 17756 17862 17742 17193 17698 18977 19061 19930 20365 20102 19815 19610 19137 19108 19602 20979 20931 21211 21835 21321
22915 21321 22604 24355 24074 24972 24492 24305 24884 25145 24734 24133 24620 23969 23596 24920 25836 26434 25944 26990
22897 26990 28332 27833 28601 28624 28048 29301 29971 31081 32157 32701 33434 34157 34539 34560 34774 35478 35579 35771
22879 35771 34733 34391 34290 34361 33793 33252 33409 33724 33752 34349 34029 34865 34975 34343 34733 35788 36870 38462
22861 38462 38698 39224 40850 41320 41245 41653 42258 41916 41782 42625 42280 42374 43078 43883 43575 43939 44280 44533 44688
22842 44688 45527 46649 46556 46259 48295 50040 50373 50042 49780 50967 52250 51763 51093 51481 51407 51904 53514 54043
22824 54043 53712 54993 56107 56158 56154 56549 56395 56003 55393 55401 56063 56175 55218 54580 53804 54061 53305 53021 52903 53415
22804 53415 53026 53134 54718 54194 54010 55467 56486 57445 56648 56737 56629 56121 55196 54414 52794 50613 48315
22787 48315 45703 44190 41045 38707 36011 33269 32752 31559 29928 29586 29268 29261 30082 31266 31105 30721 30533
22770 30533 30183 31607 32780 32534 32284 31937 32632 32037 30730 31009 31865 31072 30602 29590 29308 30175 29059
22753 29059 28614 28794 28052 26421 25639 25046 24160 24975 25919 26205 26438 27437 27478 27575 29754 31690 34121 35250
22735 35250 36190 37013 37068 37244 37153 35895 34375 33377 31623 30669 30077 29393 28436 26577 26024 25517 24797 24709 25971
22716 25971 26100 25826 25771 26709 28156 27441 26531 26587 26998 27118 26231 26849 27130 26430 24628 23188 23905 24214 23682
22697 23682 22818 21930 21405 21437 21824 22840 23157 22451 23139 24406 24013 23152 24597 25530 26824 27853 29280
22680 29280 31382 33834 36129 37377 36510 36281 36758 37188 37024 38572 39980 40874 41356 40125 38005 36892
22664 36892 36098 36283 36565 37347 38581 39184 40048 41434 43728 46092 48853 51068 51038 50805 50505 51088 51877
22647 51877 51816 52660 52867 52091 51372 49497 46853 44465 42290 41662 40186 39246 38616 38034 37907 36918 36713 36981
22629 36981 37160 36128 35420 34466 34683 35959 36542 36392 36530 37052 38526 39545 41137 42545 45357 47959
22613 47959 50556 53574 56310 57272 58351 57750 57008 58067 60087 62574 63616 64377 64007 62849 60802 58325
22597 58325 57143 56986 57205 58069 59692 60157 62246 64411 68026 71920 73488 74729 76569 78536 80355
22582 80355 82440 88588 97159 105506 109379 103834 95379 88505 85199 83144 81235 82077 82828 84645 87219
22567 87219 90734 94921 99137 103383 109495 115865 122101 129342 137666 147579 159795 174156 191109 210021
22553 210021 234495 264675 301708 346055 403191 472824 557282 657531 773561 903897 1045869
22542 1045869 1193520 1339960 1476532 1595472 1685751 1743493 1764788 1751238 1705807 1634540
22532 1634540 1545439 1449276 1355971 1275046 1215306 1184599 1190442 1233832 1319591 1450504 1625416
22521 1625416 1843325 2095580 2373757 2662657 2944904 3198607 3407211 3554538 3627871 3620571
22511 3620571 3535072 3378219 3166293 2916659 2647899 2378229 2125081 1901942 1717612 1577055
22501 1577055 1483970 1438866 1438465 1482584 1565411 1678680 1817604 1970408 2125081 2270340 2395473
22490 2395473 2493417 2560268 2594966 2604379 2594874 2573746 2550083 2530842 2519372 2515181 2514202 2510495
22478 2510495 2495080 2460596 2402706 2318907 2211087 2086107 1950072 1812811 1683534 1574472
22468 1574472 1493070 1446289 1440303 1480955 1570455 1708868 1897215 2131099 2403971 2701433
22458 2701433 3009530 3309092 3576374 3790806 3936745 4001079 3975410 3862164 3672825 3421851
22448 3421851 3130333 2820120 2510672 2222045 1969013 1762517 1606682 1501143 1447438 1444817
22438 1444817 1484652 1560981 1665932 1790559 1923050 2052553 2163285 2243647 2284586 2281460
22428 2281460 2229966 2133672 1999515 1834562 1650644 1459162 1271179 1094914 935276 796369
22418 796369 679261 582922 504988 442533 392687 351801 319118 293104 271948 255204 241148
22407 241148 229046 218835 209551 201537 196068 190528 185611 183051 180959 179134 180672 183349 187378 193737
22393 193737 201995 211956 223633 237949 253819 270816 293250 320164 350173 385487 430012 488747
22381 488747 566103 670111 812246 1010118 1281294 1640457 2080959 2544659 2912911 3065829
22371 3065829 2979243 2764235 2578191 2523003 2625130 2846056 3080703 3179740 3040153 2693044
22361 2693044 2268417 1881957 1584078 1380154 1258443 1211249 1237269 1340186 1527931 1814050
22351 1814050 2196609 2630988 3010764 3203637 3149891 2926262 2690565 2568412 2604634 2778225
22341 2778225 3001055 3127234 3027602 2694908 2243515 1801109 1435818 1154880 948435 799354
22331 799354 691588 612571 555224 513979 487093 471191 463620 462749 465612 472296 482514 499137
22319 499137 523176 554102 594656 648985 721556 818573 952712 1137618 1394379 1747653 2217613
22308 2217613 2803213 3443217 3998879 4293476 4250347 3976359 3690024 3560323 3649033 3920987
22298 3920987 4253084 4450064 4342091 3916674 3328941 2759765 2306685 1987637 1790890
22289 1790890 1702874 1715724 1832086 2062438 2424029 2914701 3491109 4033196 4368899 4381827
22279 4381827 4126839 3797757 3583455 3573571 3758780 4041336 4246564 4188027 3800119 3199331
22269 3199331 2567234 2023701 1599219 1280338 1043315 870556 741204 642260 565715 506289
22259 506289 461192 425246 396247 371731 348722 328046 309934 293594 279112 268820 259696 250718
22247 250718 244370 239320 235510 232551 232225 233116 231469 231092 232874 237090 244771 255411 269023 287713
22233 287713 311066 339143 373003 413041 460442 518131 589055 679344 796148 952719 1166648
22222 1166648 1457762 1841000 2316445 2866101 3441279 3981394 4436071 4776057 5004601
22213 5004601 5137864 5187862 5148020 5007845 4771080 4475147 4191085 4000029 3961375 4094921
22203 4094921 4372954 4738286 5123507 5479882 5791800 6073778 6344436 6606950 6830456
22194 6830456 6966968 6971557 6832403 6574068 6250550 5914885 5593441 5281718 4956525 4604399
22184 4604399 4234270 3884958 3615596 3473836 3482726 3624478 3849649 4087400 4280653 4395038
22174 4395038 4426333 4382655 4270338 4078443 3789724 3404223 2946332 2460110 1995186 1591343
22164 1591343 1267220 1019453 836291 700812 600468 524245 464113 415293 374050 336702
22154 336702 303553 275648 251544 228907 210462 192998 176953 164743 153801 144549 136201 128592
22142 128592 122882 118736 115096 110625 106079 102464 99230 97404 95554 92365 89878 86188 82911 80289
22128 80289 77093 73697 71892 69945 68550 66476 64369 63251 62571 61184 59578 58065 57299 57828 56654
22113 56654 53930 51962 51205 49025 47375 46816 47069 47685 46879 45285 44007 43195 43108 42120 42760 41996 41022
22096 41022 42322 41254 42085 42189 40891 40311 40332 39766 39611 38849 39145 39564 40148 39893 38951 38966 38965 38871 39841 40396
22076 40396 40049 38067 36965 38044 38001 38119 39220 39299 39508 40669 40240 38960 39778 40374 41334 42102 43296
22059 43296 44864 46517 47574 49376 51576 53349 54901 54199 54483 54640 55064 55930 57200 58626 57676 57460
22043 57460 56062 54260 53896 53673 53980 55915 57234 56912 57207 59560 62149 63949 66315 69061 69785 70707
22027 70707 71484 72731 75232 77227 79032 82080 83678 84776 86707 87743 88863 90861 92432 94825 99565
22012 99565 104915 110217 113746 119026 126216 133304 141751 151065 162087 176519 192221 210404 231931
21999 231931 256571 285694 316863 353215 398078 452715 522263 608779 716526 855008 1037233
21988 1037233 1283319 1618391 2070540 2649103 3321702 3985498 4484123 4706143 4695355 4624770
21978 4624770 4636528 4718471 4726410 4501805 4007105 3358943 2722099 2188035 1772599 1461656
21968 1461656 1237623 1083383 980126 913539 873480 855527 858693 882962 931310 1006735 1120099
21957 1120099 1283680 1520103 1856384 2314298 2895582 3554502 4170149 4590936 4736598
21948 4736598 4683663 4611071 4634606 4706504 4665401 4371251 3823665 3161239 2537027 2022493
21938 2022493 1621633 1319806 1098020 938771 825153 743575 682002 637111 604704 584313
21928 584313 576200 580005 597833 629324 676407 745433 846156 992496 1201665 1494422 1884130
21917 1884130 2358025 2849988 3246042 3444300 3450232 3386333 3383321 3459568 3512008 3403352 3069126
21906 3069126 2584975 2089088 1669639 1346183 1104148 929659 808651 725709 671413 638248
21896 638248 622415 622128 637584 669344 720968 794467 900220 1055134 1277050 1586284 1988657
21885 1988657 2461773 2929476 3276949 3419471 3390397 3323874 3331781 3403266 3419060 3252923
21875 3252923 2870325 2367850 1879140 1474750 1162114 926644 752561 625694 532808 462551
21865 462551 406811 359161 318731 284795 256421 230420 209086 188993 170516 155416 142314
21854 142314 131132 121407 113036 105742 100096 93921 87880 83840 80308 77416 73570 70651 67550 64709
21840 64709 62148 61053 59556 57824 55574 53316 51354 49772 48734 48033 46611 45478 44356 43323 42355
21825 42355 41001 39852 39146 38453 37662 37457 36216 36353 35411 34893 34686 33919 33785 33719 33537 32153 31293 30910
21807 30910 31447 31277 30149 29985 30059 30612 30332 29021 28332 27348 27171 26322 26752 26222 25491 25921 25853 25214 25170
21788 25170 25477 24924 24895 24748 24127 24619 24892 25244 24058 22534 21621 21684 21962 22428 21045 21252 22190 22271 21767
21769 21767 21068 20859 21143 20886 20856 20095 19135 19067 19688 19863 19293 18761 19190 19614 19071 19176 19311 19433 19885 18385
21749 18385 18278 18659 17924 17416 18264 18142 19063 19478 19030 18881 18617 18459 17956 18642 18544 17426 16931 17709 18434
21730 18434 18204 16539 15940 15188 15249 15982 17345 17113 16387 16139 15801 16340 17600 18301 17152 16923 16202 16936
21712 16936 17144 16636 16687 16084 16184 16259 15606 16136 15662 16225 16676 16230 15226 15871 15720 14758 15011 14947 15005 15337
21692 15337 15111 14841 14633 14866 15216 15327 15348 16024 16816 16407 15954 16509 16469 17258 19033 19905 20616 21642 22864
21673 22864 23261 25250 29029 32344 35466 36725 37668 37960 37303 36855 37687 36491 33887 30615 28518 24530
21657 24530 22539 22088 20121 18978 19707 19915 19126 18169 18251 19695 20327 21041 21484 22094 23730 25456 26234
21640 26234 27755 30137 32310 35230 36154 36426 36128 36677 36615 36618 35201 33259 31322 29310 25840 23952 21562
21623 21562 21060 20084 19407 18484 18053 17618 17190 16918 17512 18043 18159 17796 18129 19192 20076 20694 20565 21621
21605 21621 23938 26972 28872 30934 32349 33191 34549 33815 34723 35823 36629 37108 36738 34148 33219 32894
21589 32894 32312 31264 29492 29715 29435 28718 28606 26985 27580 28263 29691 29934 29801 31344 32643 33891 35298
21572 35298 37162 38088 38884 39226 38584 37159 36200 35770 34674 33751 31727 29153 26553 24294 22851 20750
21556 20750 19028 17782 16684 16609 16408 17744 17936 18515 18723 17986 18500 18822 18703 18836 19512 20608 22045
21539 22045 22740 23352 24617 26765 29138 31079 33872 35409 36674 36977 36927 36623 36291 35369 34079 34250 33587
21522 33587 33332 34768 36048 35772 35046 35085 36386 36731 35165 34318 32664 30806 28473 26687 24401 22860
21506 22860 22576 21334 19828 19352 17974 16948 17128 17347 16158 15606 16704 16030 15597 16155 16073 16246 15670
21489 15670 16393 16779 16631 17152 18289 18299 17245 17630 18165 18475 19407 19983 20849 21964 23830 25310 26022 26389
21471 26389 25681 25068 25640 26120 26631 25245 24789 25319 25572 25495 25289 25800 25615 26504 26292 25335 24007 23611 23606
21452 23606 22942 21298 20571 19561 18780 17881 17581 17239 16445 17613 17457 17929 17143 15801 16343 16720 16379 16811
21434 16811 16945 17237 17065 16778 17104 15868 17257 16802 16234 17162 17227 17190 15996 16379 17382 17894 18360 18782
21416 18782 19595 19168 18826 17951 18069 18961 18727 18060 18214 18576 19274 19174 19592 19594 19394 19462 19650 19939 19962 19569
21396 19569 21062 20840 20750 21227 21432 20914 20777 20172 19519 21155 21674 21812 21857 21726 21956 21332 20582 20771 22902
21377 22902 23636 24005 23353 23149 23028 22974 23286 22969 23077 24779 25987 26220 26538 27536 28125 28548 27613 28023 28687
21358 28687 29271 29623 29302 30752 31433 32101 32300 32196 32353 33223 34427 34001 34702 34908 35393 36697 38097 38283
21340 38283 39401 40901 41986 43752 44483 45245 45988 46724 47786 49735 51420 53065 55765 57851 60447
21325 60447 64132 66445 68498 73023 76834 80726 84030 88760 93679 101055 108967 117927 126175 136767
21311 136767 149936 164753 181313 201291 224009 251282 284094 325670 377599 443732 527550
21300 527550 635955 776292 951638 1162014 1399828 1649911 1893654 2109029 2281344 2396447
21290 2396447 2448168 2439378 2376819 2272701 2150232 2040252 1970731 1959523 2009351 2108971 2232985
21279 2232985 2352166 2442376 2484194 2467510 2387262 2247584 2055665 1827085 1582176 1342489
21269 1342489 1125022 939921 790049 674695 585722 519754 470907 433422 405034 384634
21259 384634 370459 360208 353018 351548 354896 363129 374578 390110 411545 439383 474841 518690
21247 518690 573522 642507 729259 841843 988925 1178280 1419886 1722861 2088805 2507655
21237 2507655 2958079 3410673 3830423 4184945 4448016 4606260 4651801 4594969 4455369 4265931
21227 4265931 4070651 3916005 3838537 3856486 3964037 4133697 4325437 4493226 4598844 4612328
21217 4612328 4518869 4318169 4017882 3639742 3208511 2759309 2326098 1934874 1599986 1325977
21207 1325977 1109531 940784 809690 709281 630562 566542 515392 474334 439363 410929
21197 410929 387756 369903 355452 345804 340588 338938 343043 352258 367059 387079 414755 452215
21185 452215 501022 567242 655577 772522 922447 1106563 1320544 1554455 1787232 2000426
21175 2000426 2175635 2298795 2362340 2367201 2315549 2218979 2097652 1978144 1888783 1851875 1874896
21164 1874896 1950491 2057201 2170798 2261847 2311531 2308026 2245515 2124336 1950804 1739047
21154 1739047 1505350 1269111 1050180 859844 703598 579904 484961 410722 353228 308964
21144 308964 274103 244876 218282 196629 179316 163855 149877 136017 124597 115090 106808 100548
21132 100548 94012 87305 82582 78533 74474 71610 68247 65247 62902 61113 59024 56532 55299 53075
21118 53075 51665 50538 48013 46847 46170 45179 42880 42251 42037 40479 38985 37356 36212 36401 36636 35920
21102 35920 36308 34836 34724 32901 32051 31751 30709 29932 29399 29099 29269 28460 28270 27682 27208 28002 27502 27114
21084 27114 27162 27475 26265 25814 25135 24430 24603 25194 25467 24662 24263 24514 24661 24223 24494 24770 23859 23256 23558
21065 23558 22319 22592 22808 22340 21307 21317 21169 21762 22315 21599 20880 19875 21161 21698 20900 19460 19902 20058
21047 20058 20817 20901 20171 19634 19147 19445 20119 21103 20445 20626 20419 19861 19788 19334 19951 19269 19274 18590 18347 19401
21027 19401 19051 18585 17647 18108 19162 18897 19049 18364 18167 18538 19478 19468 19140 18593 17856 17470 18463 18009 16872
21008 16872 17152 17125 17084 17012 17041 17066 17080 17307 17291 17733 18308 18947 17255 17050 18150 17647 17389 17728 18987 19584
20988 19584 19920 20584 22181 24189 24632 26189 27825 28170 28627 28246 27029 26798 26679 26882 26898 27279 26337 26560
20970 26560 27625 28206 28959 29887 29255 28908 27890 26738 25710 24408 23183 22475 21726 19968 17367 17209
20954 17209 18455 18351 18045 18321 17099 17328 17213 16408 16482 16519 17328 18077 17893 17959 17741 17904 18749 19197 19542
20935 19542 20185 20367 20154 20626 22481 24400 26997 27872 30057 32518 34368 35071 36944 37206 36922 36617 35675
20918 35675 36108 35847 34486 34499 34586 34817 35541 37125 36987 37014 38202 38157 36646 35850 33801 31717 29300 27427
20900 27427 25072 23823 22642 21347 19631 19817 18597 18404 18482 18516 16672 16178 17003 17220 16571 16918 16598
20883 16598 16656 14882 14919 14668 15616 16333 16231 16248 16723 18302 18457 18584 19355 20659 23265 23082 23149 23335 23757
20864 23757 25073 24756 24822 25562 24902 25331 24598 24015 23621 25140 24839 23890 23457 23448 24076 23256 24091 24866 23086
20845 23086 22410 21923 21232 19374 17683 16368 14911 15404 15555 15519 15580 15162 15542 15642 16034 15296 14893 14462
20827 14462 14821 14968 15146 14936 14723 14104 13516 13538 13656 12770 13954 14555 15326 14168 13575 13460 13721 13650 14257
20808 14257 13775 14443 14710 14744 14010 14030 14761 14430 14520 14346 14822 15869 16272 15867 15172 15713 15717 15650 15918 14748
20788 14748 14002 14326 14154 14092 15350 15376 15592 14847 14134 14413 14353 13863 13721 14037 14958 15540 15891 16167 15359 15216
20768 15216 15116 14544 13892 14636 14480 14736 15430 14756 14262 14010 13295 13525 13959 14941 15019 14541 14937 14973 14110 14302
20748 14302 14337 13757 14172 15068 14178 13814 14695 15342 14734 14601 15184 15298 14720 14332 13977 13918 14143 13855 13780 14278
20728 14278 14051 15253 15916 15571 14344 14335 14275 13785 13753 13360 13599 13066 13009 13306 13025 13109 13656 13730 13931 13954 14133
20707 14133 13975 14542 15091 14592 14091 14241 15048 14994 15451 14522 14405 14507 14796 15243 14488 14609 14137 14519 15124
20688 15124 14780 15499 14550 14074 14329 15095 15907 16081 14589 15111 15926 14804 14441 14721 15825 15520 15136 15073
20670 15073 15606 14991 15916 16020 15643 16096 15171 15665 15867 15340 14872 14883 15450 15285 15766 15758 16018 16330 16311 16070
20650 16070 15711 16052 16071 15607 15412 15713 16590 16501 16915 16212 16326 15737 15104 15158 15314 15813 15872 15605 15654 15049 14737
20629 14737 14188 14107 14607 14789 15260 15427 16130 16959 16542 15854 16022 16194 16399 16440 16445 16885 16488 15544 14782 15581
20609 15581 16852 16872 16122 15889 16504 16738 15661 16395 18109 16629 16979 15958 15919 16647 17083 17418 16816 15956
20591 15956 15366 16696 17662 17405 17700 17188 15977 16059 15594 16629 17667 18255 18052 16578 16237 17097 16569 16712
20573 16712 17933 18545 18037 17233 18326 19652 19309 19422 18927 18957 19051 20111 20035 19848 21913 24786 25922 26377
20555 26377 25896 25108 23693 21398 20510 19428 19379 20246 19343 19238 19192 18729 19992 19980 19996 20500 19810 20369 21303
20536 21303 22208 21669 21902 22810 23386 23567 24750 23918 24746 25730 26531 27533 27908 29632 31314 33083 36133
20519 36133 39796 43998 50957 58875 67515 82413 101999 130013 166719 208704 253818 297456 334124
20506 334124 357735 364641 352172 324832 284730 239407 195655 155454 120306 93768 74723 62209
20494 62209 54488 47831 42946 39517 36359 34787 33299 32142 30322 29246 27886 26302 25870 25448 26739
20479 26739 25793 24473 23814 24674 24442 23106 23418 23890 24166 24349 23381 22921 22531 23109 23183 24468 24657 25606
20461 25606 25741 26400 26585 27572 27967 28833 29204 28104 28211 27908 27538 27913 27616 27612 28167 28929 28729 29624 29897
20442 29897 29843 30633 30826 29050 27938 28139 27619 26578 26366 26194 26570 26397 27073 25673 24353 24501 24458 22508
20424 22508 22853 22503 22078 23424 24489 23844 23580 24073 24297 25060 26072 26477 26821 27777 29868 30665 31297 32709
20406 32709 33083 32882 33010 32692 31833 30339 31279 30936 30430 28704 27770 26004 26177 26080 26444 27152 28283 28762
20388 28762 29634 29086 29138 29280 28216 27642 28194 28988 29278 28959 30302 30297 31606 32103 32320 32967 35137 36122 36107
20369 36107 35426 35192 34162 34462 34230 34452 35375 35772 35342 35808 36652 36674 36801 37030 37338 39571 40825 41770
20351 41770 42140 41551 40329 40497 41561 41379 41411 42121 42868 43005 43277 43585 43996 44784 45706 46297 46185 47330
20333 47330 48460 47994 48700 50334 51641 53203 54230 55138 56499 57748 59481 60678 60581 60985 62079 63281
20317 63281 64840 66835 68321 70091 71411 71580 72125 73777 74738 76668 76849 78916 81952 84268 86395
20302 86395 89757 92835 95707 97612 99223 100428 100840 99331 99089 99049 99709 102323 106717 108969 111552 116020
20286 116020 120384 123518 125501 128344 133039 135227 138964 143668 146747 150005 154929 158793 163351 168198
20272 168198 173830 178968 184282 192215 199023 207041 216252 225547 235774 246725 259739 274422 291788
20259 291788 311111 332087 355613 383009 415044 449942 484205 514261 538849 561512 584573
20248 584573 610020 642150 681337 729683 788697 857446 937993 1035363 1152771 1296306 1474396
20237 1474396 1695185 1968433 2305073 2709568 3191507 3762877 4448229 5295734 6396340
20228 6396340 7908799 10070945 13202243 17638934 23567989 30842875 38943276 47079575
20220 47079575 54284347 59560688 62156383 61765733 58495906 52786919 45404484 37343482
20212 37343482 29527258 22609127 16981933 12767915 9797278 7744892 6311076 5280216
20204 5280216 4503729 3882868 3363529 2914374 2521270 2180275 1889561 1644974 1440628
20195 1440628 1271446 1133489 1018211 921727 841597 770767 708296 654113 606870 564577 527198
20184 527198 495188 466813 440862 416932 395857 376838 359840 344008 329058 315303 302035
20173 302035 289006 276712 265589 254374 245630 236828 227775 220068 211984 204057 196132 188061 182438
20160 182438 176919 169943 163627 159087 153695 148362 143543 136890 132112 127928 121896 117698 116070 115246
20146 115246 114119 112673 110552 109938 108604 106393 103239 101058 97666 94995 92775 90336 88085 85363
20132 85363 83291 81471 78991 76082 74209 72854 71586 70402 68336 66862 66391 66774 64513 62157 61389
20117 61389 61296 61230 61241 59240 57724 57663 57311 56282 55316 54932 53098 51434 51490 52379 52161 51839 52040 50429 49842
20098 49842 49100 49898 49041 48232 46904 46626 45597 45411 45350 44768 44733 44316 42433 41607 40751 39491 39168 40194
20080 40194 39950 39211 38738 38841 39543 40379 41218 40693 40033 39531 39446 38677 38659 39555 38961 38370 38951 39582 38917 38954
20060 38954 38580 39140 39609 40365 40104 40367 39653 39893 39427 37975 37260 37176 35513 34700 33949 33627 32879 32727 32835
20041 32835 34198 34665 33589 32766 32637 31310 30719 31217 31458 31505 31804 30976 30946 30963 30853 30374 31331 30289 30264
20022 30264 31198 31172 32011 32108 31246 32366 31343 30596 31517 31892 31064 30966 30554 31571 32757 34018 35190 37084
20004 37084 37020 36505 34879 33849 32807 30710 29337 29709 28574 27707 26353 25021 24941 25523 26266 26203 26448
19987 26448 26874 26366 26820 25654 24750 24644 24923 24999 24783 25356 26337 25951 26637 27056 26554 25485 24381 25005
19969 25005 25382 24625 24426 23898 24432 25074 25048 24429 24867 25151 25797 25625 25534 26816 28395 27771 27587 27428 28244
19950 28244 28141 28170 28049 28598 29310 29201 28535 28961 29053 29847 30940 31467 32406 34026 36142 38392 40906 43924
19932 43924 47132 51907 57665 65764 77649 95593 120581 154326 195096 240588 284813 322835
19920 322835 352002 364717 359425 337762 301814 257989 212067 170649 135693 107788 86659 72360
19908 72360 61813 54089 48353 44566 40661 39653 37338 34338 32912 31423 30797 30100 30264 29821 29100
19893 29100 28334 28202 28535 27502 26760 26613 25873 25194 25509 25529 23764 23259 23779 23482 23606 23454 23112 23916 23393
19874 23393 22753 22311 21259 21710 22592 22561 22121 22535 23205 23651 23689 23836 23027 21918 21365 21720 21887 22989 22718
19855 22718 22908 23582 24387 24435 25346 26714 27795 26539 26745 26701 26060 26162 25273 24551 23842 23360 24479 24807
19837 24807 25484 25827 25418 26104 26251 26905 29192 32779 36906 42120 49435 54957 51409 43152 36643 32522
19821 32522 30286 28043 27728 27898 28206 28737 28555 28421 27926 27431 26790 26537 25744 25389 25721 26140 25209 24943
19803 24943 25762 25151 25522 25404 26709 27772 28830 29804 31429 32983 33934 34848 35814 35352 35107 35000 35121
19786 35121 34862 34815 34964 33774 31871 30567 29683 28874 27728 27926 28486 28127 29774 30355 31864 31798 31837 32794
19768 32794 32885 33227 33923 34477 33756 33801 33773 33408 33888 33913 34000 35123 36066 35759 35835 35508 33831 33028 32965 32210 31424
19747 31424 30558 30310 29737 29516 29543 30479 31519 31841 31129 31402 32827 34429 35622 36518 36588 36897 36753 37008
19729 37008 37239 37662 37346 36472 36149 35207 33063 32141 30927 30748 29649 29085 29072 28911 29428 30144 30726 32327
19711 32327 34023 34666 34516 34463 34848 35277 35254 34630 33394 33700 33057 33034 32838 32463 32273 32934 33998 34806 34004
19692 34004 33750 32642 32835 31953 31466 30204 30430 30190 30586 29953 29517 30067 30070 29835 30527 31184 31310 31388 33185
19673 33185 33348 33131 32701 32200 31999 32092 31063 31247 30580 29034 27948 28088 29577 28902 28674 29207 29547 28217
19655 28217 29077 29616 28589 27657 27622 28387 28753 29486 29102 30349 31220 31624 30916 32367 31697 29925 30351 30231
19637 30231 30456 31086 30763 30544 30512 30977 30974 31866 31968 31876 32484 33503 33329 34222 33581 33852 34044 33176 33677 35371
19617 35371 36115 37094 36444 36359 36160 36660 36384 35979 37042 37370 37477 37783 37502 38253 38342 37950 38266 40727 41447
19598 41447 41093 40266 41562 42790 43952 44978 45246 46118 47929 48702 50304 51002 52311 53451 54256 55624
19582 55624 57153 58535 61616 62907 64735 67271 69778 72354 77343 81989 84988 90063 95436 102057
19568 102057 109638 117493 127943 141175 156064 173121 195320 223001 259002 304999 363510 437312
19556 437312 529343 638337 757707 872160 961454 1004209 990969 927717 837188 738298 646974
19545 646974 570525 512153 470168 444906 436026 441395 460598 496717 550681 626146 723584 841376
19533 841376 968123 1083320 1163637 1186709 1150359 1071926 979857 899064 846392 826060 840915
19522 840915 890138 964849 1052519 1130472 1174209 1165455 1106416 1014200 911086 814033 734355
19511 734355 675390 636678 615241 612887 628038 661386 715035 791858 898213 1039436 1216987
19500 1216987 1431923 1669710 1910361 2134117 2329865 2493295 2620301 2696525 2709155 2659810
19490 2659810 2559525 2417378 2238007 2028430 1807551 1599863 1426466 1297202 1213851 1175405
19480 1175405 1179997 1228889 1323903 1465473 1650865 1869112 2099849 2311341 2476136 2578672
19470 2578672 2615355 2587483 2500753 2371614 2234867 2132900 2100952 2148983 2267568 2422279
19460 2422279 2563858 2645210 2642549 2562463 2424524 2246226 2042365 1829112 1628218 1458867
19450 1458867 1331713 1247492 1206807 1209987 1259619 1356133 1504418 1703883 1946717 2212843
19440 2212843 2469450 2679118 2821481 2895968 2917710 2904600 2870184 2823845 2760239 2660263 2500704
19429 2500704 2281674 2025843 1767831 1535911 1344433 1198171 1096054 1035105 1016873 1047534
19419 1047534 1134605 1296342 1538086 1816543 2019921 2078846 2067746 2076149 2086015 2045828 1938314
19408 1938314 1786336 1621449 1476767 1373865 1322620 1328452 1387643 1492323 1621773 1744689
19398 1744689 1821473 1820636 1735642 1586766 1405968 1229236 1075550 951628 859726 798698 766694
19387 766694 760796 781574 831842 912365 1024328 1165910 1325610 1487727 1621207 1689668 1671292
19376 1671292 1565463 1397389 1201546 1008977 838244 694729 578761 486111 413706 357787
19366 357787 312915 277736 250101 227516 208011 190647 176711 163493 152682 144563 136286 129145
19354 129145 122082 116500 111047 105785 101219 97963 95178 92535 88640 86236 84596 83237 81269 79759
19340 79759 77184 75769 75254 73605 72771 72585 71211 70972 70190 69160 68967 69348 68611 68328 68093 66950 66734
19323 66734 66905 66821 66803 66416 65954 65255 64947 64256 63869 63530 63304 63657 63558 63548 63308 64329 66154 66337 67163 67357
19303 67357 68232 67583 68167 68431 68513 69141 68870 69728 70769 71966 73110 74049 74899 75841 77421 78498 80540
19286 80540 84078 88668 96447 105749 115486 117969 112185 105737 103529 104026 104923 107065 108839 111840 116939
19271 116939 123152 126965 133851 141455 149949 161240 173897 187859 203778 223496 247771 276204
19259 276204 312149 358432 417490 489427 579475 687236 811502 939144 1060425 1163610
19249 1163610 1239212 1283834 1303259 1296045 1260263 1194953 1105936 1007795 916164 841858 789839
19238 789839 760628 756467 778857 827879 903974 1003827 1121142 1245910 1361520 1456301 1527438
19227 1527438 1580823 1620601 1647858 1660730 1662706 1660972 1661889 1664018 1662489 1651765 1626168 1589025
19215 1589025 1538118 1469173 1379241 1273388 1163695 1063891 984339 929093 899385 897098 924527
19204 924527 979439 1066784 1184858 1330258 1495704 1667645 1832744 1991101 2148129 2310653
19194 2310653 2472519 2612863 2707763 2745712 2730307 2674706 2591589 2482467 2340391 2165963
19184 2165963 1969470 1771507 1589361 1442103 1337813 1277130 1261571 1290762 1366426 1489629
19174 1489629 1656213 1859170 2081424 2298134 2484377 2627345 2729578 2802329 2850576 2875605
19164 2875605 2874578 2853897 2821490 2787023 2746474 2695520 2631281 2549853 2444757 2309833 2141960
19153 2141960 1952061 1758343 1581984 1435414 1326675 1259419 1234400 1250539 1311057 1416326
19143 1416326 1566923 1753701 1964335 2176117 2365459 2516392 2625911 2696525 2729263 2712651
19133 2712651 2633293 2491215 2305060 2101296 1902566 1717296 1541923 1373092 1215996 1076467
19123 1076467 961770 871548 806571 765524 746193 748757 773536 818515 882854 962169 1048893
19112 1048893 1131948 1200967 1252239 1291490 1319735 1336472 1342819 1338978 1327274 1313181 1295238 1270524
19100 1270524 1237028 1197188 1152697 1099192 1032006 948986 857614 767394 687269 623584 577696
19089 577696 549835 539952 548555 572861 614401 673769 747807 828123 902962 961637 997308 1010604
19077 1010604 1004423 977723 929025 855578 764627 664717 566595 479041 405236 344830 295701
19066 295701 256797 225416 198937 177994 161477 147673 135977 125597 116749 109426 102587 96425
19054 96425 91775 86294 81300 78245 74564 71181 67885 64752 62864 61668 60087 59166 57246 55720 54051
19039 54051 53648 51909 50245 49539 47993 46299 45736 45638 45138 44971 43774 42323 43159 42128 41817 42457 41324
19022 41324 41262 40624 39964 39859 38882 39531 38564 38530 37150 36140 35038 35169 35795 35652 35778 34311 33864 34315
19004 34315 34580 35118 34173 33747 32380 33035 32606 31912 32397 31587 31478 31701 31486 31143 31013 31649 32731 32497
18986 32497 31468 31424 31661 31341 30793 30444 30161 29601 27840 28108 28889 28381 28573 29115 28465 27941 28066 27750 27954
18967 27954 29064 29557 29897 29285 28751 28452 28394 28260 28598 28528 28344 28376 28089 27595 27427 27430 27568 28017 28897 29117
18947 29117 30632 31650 31073 31073 31482 32271 32036 30905 30600 31063 31717 31314 30882 31535 30996 30572 30640 30210 30043
18928 30043 30389 30100 30719 31630 32135 30704 30419 30961 31402 31622 33312 33243 31896 31835 32121 33238 32800 30989
18910 30989 31877 33534 32956 31725 31677 31830 31638 31466 30989 30571 30254 29393 29711 30529 30715 30903 31882 32799 33416
18891 33416 34360 34856 35395 36927 37326 37675 38975 39496 39339 38249 38554 38391 37947 37584 35234 34302 34410 33166
18873 33166 32598 32668 32834 32908 32895 34448 33876 34113 34615 35674 36574 37805 37916 39950 39866 40514 41022 42184 41263
18854 41263 40979 40722 40165 39856 39454 38458 38029 36804 35684 34545 33991 33874 33970 33488 33325 32476 33157 34152
18836 34152 34750 35279 36310 37733 39345 41313 44382 45840 48538 50643 52414 52800 52362 52693 52995 50887
18820 50887 49576 46882 44311 42407 40352 38636 38101 37490 36874 36556 37683 38217 39059 39609 40864 41594
18804 41594 42635 44242 45350 45096 45909 47336 47012 45924 46175 45761 46000 46561 47406 47563 46307 44440 42544
18787 42544 41108 41279 41724 41577 42866 44175 44577 45113 46496 48692 48712 49286 48724 47546 45677 44754 44744
18770 44744 44238 44210 45015 44481 44646 44799 46339 47375 48463 49409 50454 51302 51987 52432 52419 52365 50358 47912
18752 47912 45573 43768 41843 40481 39241 38213 39798 39101 37518 37754 38704 39358 39947 40142 41084 42410
18736 42410 42597 42116 41536 41052 40767 40373 39905 39078 38534 37156 36733 37537 38581 38515 39453 39361 40135 41429 43813
18717 43813 44489 44615 44579 45376 44893 44353 43726 42822 41916 42733 43777 43662 43679 44429 44426 44644 45409 46514 47446 49093
18697 49093 49298 50852 51379 51005 50421 50264 50017 50213 49012 47428 47231 45963 44960 44470 44003 44060 43364 43504
18679 43504 42826 42773 41654 42530 42178 42404 41347 41522 41036 41040 40481 41168 41966 42427 41851 41269 41111 41637 41688 41366
18659 41366 40480 40056 40286 40319 40904 41849 41832 41637 41191 42308 43342 43810 43031 43136 44186 45172 45339 46124 46428
18640 46428 45858 46534 47640 47760 48724 48240 48537 48134 49319 48855 47734 47595 47755 47385 47594 47004 45992 46332
18622 46332 47403 47545 47950 47238 46056 46596 46736 46212 46421 46107 45494 45561 45026 44880 43909 43794 45359 45434 44795
18603 44795 44902 45910 45610 46883 47147 47677 47349 47130 48294 48273 48972 48729 49517 50374 50909 51670 51854 53024
18585 53024 54049 54629 55388 56046 56051 57398 58512 59555 61384 63022 62663 63643 65061 66227 67693 68992
18569 68992 69961 72964 74382 74213 74252 74432 76283 78596 81209 82684 84523 87102 89871 93208 97357 101608
18553 101608 105309 109153 114120 120602 127332 133805 142841 154443 166062 179215 195849 215439 239261
18540 239261 267980 302018 345230 398110 464602 548711 655234 788027 951163 1144532 1361951
18529 1361951 1587072 1799994 1980357 2106192 2165488 2152943 2073121 1938221 1768116 1584405
18519 1584405 1406461 1250043 1125027 1035063 981639 963909 981293 1033408 1124165 1251286
18509 1251286 1412053 1594746 1780467 1948488 2074934 2140694 2137264 2065573 1936512 1765918
18499 1765918 1577285 1394605 1234909 1105168 1011439 952766 925564 930063 965588 1035427 1143831
18488 1143831 1297190 1502901 1756296 2047239 2348551 2627391 2850158 2987465 3026071 2968056
18478 2968056 2827241 2627562 2400864 2177018 1987342 1855169 1793885 1810353 1903093 2073447
18468 2073447 2319904 2632021 2991411 3372861 3740561 4057391 4284189 4393229 4368976 4214605
18458 4214605 3945190 3592984 3197060 2795136 2420098 2096836 1839787 1652856 1533872
18449 1533872 1481461 1490117 1554470 1663591 1796183 1927244 2029413 2080127 2067038 1987488 1852946
18438 1852946 1680228 1494090 1316523 1163719 1043339 958537 906883 885719 892474 926802
18428 926802 989597 1084451 1215868 1387225 1595645 1835478 2083760 2314594 2500782 2615735
18418 2615735 2643110 2580684 2437525 2234379 2000775 1766522 1556209 1385623 1261579 1185808
18408 1185808 1153430 1165679 1223641 1327607 1475445 1663479 1879580 2101732 2301832 2448876
18398 2448876 2517238 2492395 2375228 2180127 1930127 1657697 1394547 1159697 960807 800381
18388 800381 671568 570320 489679 426430 374340 332450 297586 269953 246942 226486 209433
18377 209433 196363 183272 172208 162319 154594 148278 141964 136347 130037 125193 121334 117545 114259
18364 114259 110454 107436 105384 102795 100260 98154 97489 96751 93670 93017 90835 89993 89651 88111 87113 86309
18348 86309 84526 84025 83922 82320 80657 79441 78314 78280 78506 78738 77697 76851 76565 75886 75099 75718 75722 75634
18330 75634 75532 75289 74856 75095 74610 73929 73930 74013 73571 73461 73242 73137 73321 73663 73767 73571 73690 74831 73768
18311 73768 74949 74350 75230 75569 75665 75781 74847 75826 76966 77126 77843 79705 80718 80074 80809 81748 81743 83205
18293 83205 84916 86359 87899 89111 89664 91460 93360 95024 97991 99018 100414 102711 104912 107151 109648
18278 109648 112175 116050 119411 123868 128133 132799 137440 142507 148128 154046 160238 168658 177550 187817
18264 187817 199133 212313 228427 246889 266540 290466 319439 356655 401410 456741 528338
18253 528338 621875 743159 901486 1099790 1338891 1602050 1856749 2069882 2222293 2318173
18243 2318173 2382852 2434514 2470657 2468509 2413893 2314383 2205316 2133098 2129382 2205112 2350821
18232 2350821 2537063 2726564 2891124 3033858 3177792 3350531 3548979 3739357 3869926
18223 3869926 3900860 3828376 3687141 3529978 3398230 3299408 3216267 3124154 3020875 2933698
18213 2933698 2906915 2980450 3179078 3495984 3901650 4336851 4734519 5042531 5237385 5315138
18203 5315138 5274132 5105515 4805416 4395944 3931642 3480858 3100408 2826122 2670439 2636986
18193 2636986 2725906 2934202 3248266 3635173 4048425 4441683 4777240 5043271 5229829 5316181
18183 5316181 5276738 5088651 4769825 4378538 3993913 3683389 3486195 3407270 3425107 3499453
18173 3499453 3595685 3697302 3817493 3981775 4202849 4464813 4726058 4944775 5099525 5194227
18163 5194227 5253181 5291123 5299620 5246271 5092498 4831918 4502005 4169341 3905922 3761583
18153 3761583 3758329 3884674 4110437 4393188 4697205 5008860 5318652 5612262 5852003 5984003
18143 5984003 5967128 5791979 5483251 5084048 4634171 4166172 3707523 3282691 2912318 2613737
18133 2613737 2398675 2271918 2234766 2278960 2390677 2545828 2712043 2855700 2943523 2947698
18123 2947698 2856897 2675439 2427170 2143440 1858770 1597929 1377909 1203613 1072010 975089
18113 975089 908176 870424 858504 873521 915701 988214 1094590 1238322 1413506 1608074 1803554
18102 1803554 1974149 2093556 2140944 2109811 2004805 1844642 1654545 1462604 1289608 1146929
18092 1146929 1039013 967899 933881 933336 966521 1035199 1135991 1265967 1419333 1580797 1730815
18081 1730815 1846133 1906806 1900784 1827198 1694881 1520140 1324341 1129394 951027 797968
18071 797968 671483 569688 489329 425916 375547 333862 299314 272506 249987 231027 215419
18060 215419 201905 189787 180349 172167 165223 158987 152026 146104 140140 135574 131096 127162 123802 120876
18046 120876 118294 115321 112763 111658 110277 107015 105584 103728 101915 100912 99681 97033 95702 95096
18032 95096 94929 94457 93763 92902 91140 89658 89449 88699 88212 88241 86960 84980 84809 84045 83883 83263 82605 82475
18014 82475 83169 83558 84607 83798 82169 80925 81202 80874 80752 81706 81411 81086 82071 81880 81989 80738 81397 81676
17996 81676 82069 81342 82024 82681 82456 82847 83205 85078 87461 88908 90557 90882 91789 91817 93534 94858 96578
17979 96578 97832 99337 99530 100993 102331 104632 103504 103630 104360 104387 103866 103830 104292 105086 105037 104547 103945 103971
17961 103971 104088 103534 102601 102545 101416 101892 101253 101757 102632 104289 106056 107700 108611 110556 111828 113971 117434
17944 117434 117999 118556 121174 123804 126277 127733 130169 131764 134121 135930 138136 141436 145638 148146 150998
17929 150998 154616 159079 162897 167220 170495 175773 181202 186189 189757 193231 198262 202932 206218 210874
17915 210874 216748 221762 227585 235271 242709 250069 259414 269420 279917 291481 303104 316212 328507
17902 328507 343039 358819 375636 393788 412023 432857 454816 476748 501553 528505 558606
17891 558606 592512 629059 669023 714257 763256 818094 879608 948001 1023222 1109606 1208835
17880 1208835 1322684 1451747 1600443 1771741 1970345 2201896 2474007 2790908 3165408
17871 3165408 3607097 4126241 4735384 5444708 6257521 7169404 8150064 9146435 10072491
17862 10072491 10814628 11254313 11311086 10972199 10299082 9403473 8405800 7405265 6467497
17853 6467497 5625358 4890248 4258737 3723179 3269175 2883288 2555516 2277964 2040872
17844 2040872 1836901 1660372 1509010 1375198 1258955 1156907 1067317 988443 918836 854820
17834 854820 799117 748575 701084 657981 618498 582588 549653 519470 491141 466523 442835
17823 442835 420926 402057 384252 368405 352999 339240 326064 314427 303361 292564 282283
17812 282283 272075 261440 252521 242693 232854 224404 216533 209051 202351 195633 189891 184672 179411 173695
17798 173695 169216 165341 161596 159450 156844 153240 150505 149036 146295 143260 140062 136154 132671 129986
17784 129986 125977 122024 120455 118454 117182 115508 115060 113435 112200 109581 108433 107050 105257 103718
17770 103718 101792 99582 96895 95264 93560 91290 90166 86300 83764 82453 81543 80256 78530 77369
17756 77369 75851 73226 72694 72641 71000 69992 69891 69436 68523 67674 66805 65627 64795 63954 63605 63231 61757
17739 61757 60376 59410 58635 57297 56845 56502 55502 54942 54852 55070 54227 54399 53567 52025 51384 51768 51096 51217
17721 51217 51018 50312 49245 47687 47367 47833 48063 47318 45874 46233 45852 46218 45875 46264 46227 46045 45283 45706
17703 45706 46631 46903 45940 45924 45446 43113 42241 41409 41015 41296 41339 41282 41761 41338 40257 40470 39960 38969 38129
17684 38129 37459 38085 38457 38461 37137 37315 37334 37177 35998 35813 35648 35663 35706 35807 36622 37349 36594 36362 35821 34902
17664 34902 35268 36145 35269 34037 34070 34563 34907 34892 34154 33287 32998 34330 34267 32962 32386 31823 31231 31746 32658
17645 32658 32820 31610 30606 30674 31701 32209 32969 32381 30911 29085 28595 30265 30775 30253 30049 28849 29038
17628 29038 29563 30159 29640 29260 29249 28458 29898 29981 29644 29207 28748 29210 28890 28382 28401 28545 28533 27593 28146 28208
17608 28208 27320 27541 27755 28693 29224 29096 27465 27724 28914 27660 26727 26663 26850 27224 26876 27137 27095 26961 27537
17589 27537 27457 27018 26838 26930 27446 27441 27944 28786 28933 28912 28627 27173 27398 27224 26682 26692 27004 25692 26187 26560
17569 26560 27535 27339 26397 26579 27820 27550 27578 27548 27283 27329 26538 25773 26227 26205 25874 26454 26474 26775 26139 26083 26662
17548 26662 25846 26405 26585 26735 26407 26096 25146 25863 25713 25435 24488 24735 24930 24355 23814 24892 25393 25317 24204
17529 24204 24412 25445 25995 24891 24567 23204 23972 23784 23860 24787 25206 25264 24457 25533 25606 25050 25231 24906 26219
17510 26219 27418 27509 26287 24798 24356 26162 26229 26466 26111 26479 25569 24797 24271 23605 22820 23855 23425 22830
17492 22830 22241 22416 23345 23080 22672 22509 22144 22513 22738 23891 23215 22817 22145 22283 22864 22775 21672 22670 23401
17473 23401 23473 23649 23346 22561 23464 22843 22258 22646 24231 23462 23250 21577 21507 22085 22233 21253 21630 22089 23025
17454 23025 23499 24164 24315 23252 22973 23688 23117 22940 23038 23914 25453 26165 25978 25561 25271 26394 27143 26949
17436 26949 27232 27919 27276 27292 28879 30105 30057 31312 31473 31768 32062 32375 32274 34290 34495 34568 34019 33637 33886
17417 33886 34976 34062 34130 33465 33549 33304 32372 31745 32065 30748 30361 29892 31588 32432 32965 32689 32451 33227 34429
17398 34429 34881 35902 37450 39499 40130 40456 41426 42661 42399 42276 41523 42130 42410 40845 39489 39550 38899
17381 38899 38007 37031 36448 34169 32525 31737 31571 31786 31981 31064 31468 31648 31217 30080 30499 30162 29630 29201
17363 29201 29858 30181 31181 31057 31437 31554 32581 33398 33377 33049 33415 31880 30516 29460 29923 29082 28059
17346 28059 26454 26795 27494 27171 26000 25788 26274 26724 25797 24744 24194 24288 23504 23152 22824 22661 22453 21920
17328 21920 21630 21212 21558 21806 21491 21850 21665 21515 21381 20412 20544 21085 21097 22269 21794 21657 21267 20987 20818
17309 20818 20557 19932 20366 20979 20186 20362 20173 20363 20356 19926 19721 19576 20252 19790 20402 20867 21232 21026 21182 20617
17289 20617 21190 20953 21012 19963 19563 19561 19260 19771 20240 21020 21480 22539 22464 21040 19835 20095 20676 20594 20260
17270 20260 20271 19225 19848 20707 19674 20018 20001 19949 20462 20166 21142 20967 20480 20212 20848 22028 21528 21451 20532
17251 20532 20060 20128 20540 21304 21379 20998 20900 20830 20990 21049 20829 21038 21308 21641 21205 21006 20515 20409 19993 20889 21013
17230 21013 21055 19941 19594 19350 19708 21016 20417 19805 19055 19308 20058 20167 21208 20173 21217 20972 20392 19908
17212 19908 21124 21160 21110 20792 20686 21356 22319 22147 21771 20590 19893 20052 20539 20662 20892 20293 19375 19430 20924
17193 20924 21430 21656 21299 21135 21163 21755 21861 21296 21167 22010 22003 21298 20718 19793 19641 19956 20044 20636 20806 20784 21243
17172 21243 22040 21850 23167 23438 24336 24984 25300 25266 25720 24748 24221 23604 23817 22330 22202 21844 22262 22113 21539
17153 21539 22148 23708 24595 25351 25420 26338 25944 26196 25510 24020 23954 24500 23430 23327 22861 22947 23647 24764 24822
17134 24822 25275 26124 25411 24134 24195 24441 24610 24337 25049 24947 25138 25456 25685 26177 26282 26106 25929 25589 26568
17115 26568 26881 26075 26003 25609 25370 25808 25800 25747 25386 26529 26252 27055 27410 28761 28862 28707 27636 26598 26716
17096 26716 28433 28698 29515 28210 28232 28996 28542 28458 29019 27609 27745 27447 26312 25191 24410 23929 24147 24272
17078 24272 23623 23553 24213 23478 24990 25006 25724 25427 26139 25772 27203 28470 28904 29056 29630 30378 30545 29347
17060 29347 29300 29385 30011 31805 33971 33963 33570 33230 33470 33186 33624 34193 34399 33503 33459 33811 34900 34837 36107 37495
17040 37495 37666 38151 38736 38720 39818 40542 42119 43438 44255 43859 44624 46466 49283 51611 55112 57453 58639
17023 58639 58971 59715 61007 61698 62220 61440 60294 59230 59091 59339 58230 57518 56044 54773 54750 56851 58215
17006 58215 58868 58980 59721 61241 64619 67595 70823 74064 77757 81342 85687 90990 96222 99603 103207
16991 103207 104909 104669 104174 104092 104073 104414 104185 101819 98055 94423 90786 88355 85266 82184 78424 76984
16975 76984 76151 76229 75490 76537 77967 81014 83126 85661 88915 92703 96805 102364 107562 114127 117836
16960 117836 119855 120232 120260 119105 116898 114566 112962 110369 109139 107375 107118 105971 104755 101967 99632
16945 99632 96915 93848 90185 87407 85407 85002 86288 88659 90260 90452 90517 92205 94628 98199 100827
16930 100827 100553 98626 97320 98405 98159 99129 101868 104437 106807 106903 105694 105231 103582 99522 95174 92791
16914 92791 91497 90447 89847 90173 91113 92210 92979 94043 94871 95904 98957 101901 105589 110129 115923 123343
16898 123343 133474 150125 174254 212094 264540 310817 320727 285090 244766 223019 213633 207128
16886 207128 201645 198617 194606 190719 186317 181827 178732 177712 178677 181322 185099 190407 195303 199043
16872 199043 200981 200176 200282 202223 207737 215343 224863 241592 267880 311933 380081 478897 578688
16859 578688 617632 554364 455949 391517 356307 336682 324781 320885 323085 329553 338770 353776
16847 353776 371254 388975 406874 424390 437742 436396 416389 382172 341928 304422 270057 242036
16835 242036 218403 198445 181856 171051 167735 174460 192122 224340 261541 279825 249011 191022
16823 191022 147980 122460 105643 93634 86369 80118 74821 69040 63904 58639 54892 52145 50257
16810 50257 47416 45066 41862 38367 36631 34183 32917 31813 30141 29553 29242 28970 28082 28560 28403 27462
16794 27462 26268 26839 26472 26099 26117 24951 24561 24483 24053 24454 25161 25467 26427 27082 28081 29320 28506 27965 27168
16775 27168 25553 23573 21818 21879 21553 20547 21128 20691 20569 21069 21846 22091 22319 21234 19028 18985 19996
16758 19996 19193 19148 19306 19406 19364 20011 20430 22289 22644 22333 21335 20866 20891 21285 21242 21520 20629 20621 19895 19921 19739
16737 19739 20419 19837 19799 18837 18289 19841 19854 19329 20986 21970 22076 21138 20248 20416 19890 19887 19407 19032 18694 17741
16717 17741 16855 15323 16142 16576 17296 18636 18343 17950 18644 17728 18053 18790 19514 18696 17988 17916 18751 19546 20224
16698 20224 21787 23029 24837 26033 24426 22174 20696 19763 17899 18509 17820 17289 16553 16545 15770 14429 15539
16681 15539 15936 14707 14971 14618 15031 15154 14885 14157 14643 14351 14114 13768 14375 14739 15233 15709 16339 15755 17306
16662 17306 18004 17948 17679 16878 17100 18044 18554 17300 16490 15961 14601 14249 13247 13646 14687 15353 15020 15998
16644 15998 14653 13954 13165 12856 13506 13465 12480 13061 12607 12691 12946 13718 14124 13444 12742 13381 11910 11817 11659
16625 11659 11871 11433 12888 13537 13133 12939 13271 14155 14243 13503 14053 14086 14025 13335 14157 13847 14658 14172 13989 13309
16605 13309 14306 15193 14211 13415 13553 13176 13118 13862 14913 13930 13582 13412 13913 13586 13711 12790 12123 11588 11188
16586 11188 12267 13559 12125 12189 13046 12483 11987 12637 12049 11253 10424 11910 11347 10490 10368 11755 13620
16569 13620 12532 12597 13125 14055 14734 14524 15911 16534 16940 16610 16984 16148 15057 14781 15461 15579 16391 15699
16551 15699 17887 20674 22497 23674 27308 28880 26975 24430 22492 19903 18686 17004 14742 14732 15078
16536 15078 15125 13695 13454 14934 15190 15487 14226 13685 13287 13499 14842 16383 16232 15944 15982 16102 17373 19552
16518 19552 21185 24973 29730 34736 38495 42445 40553 34824 28524 24953 21681 20194 19430 18139 17211
16503 17211 17234 16185 14455 13604 13319 13926 13837 13270 14236 14113 14546 14121 14485 15243 14548 13597 13836 15234 17028
16484 17028 19423 20898 22511 25236 26111 25100 23049 20976 18842 16942 14211 13879 13260 13474 12765 12733
16468 12733 13239 12712 11978 11973 11623 11213 10553 11366 12211 12983 12183 12951 13230 12518 12562 11616 11920 11941 12401 11410
16448 11410 10933 11495 11867 11495 10512 11391 11970 12087 11782 11019 9549 10005 9794 9958 10656 11202 10106 9955
16430 9955 10446 10879 11718 11079 10996 11546 11741 11352 11084 11167 10229 9302 9917 11466 12148 11762 10802 9525 9544 9982
16410 9982 10268 10161 10263 10816 10199 9952 10527 9749 9323 8448 9272 9749 10411 10539 10171 10396 9343 9366 10162
16391 10162 10901 10918 10798 11119 10674 10919 10414 9723 10581 10779 10593 9826 9853 9739 9445 9584 10088 10328 10017 9360
16371 9360 9242 9032 7259 8417 9164 8838 9147 9923 11151 10609 10312 10976 9885 11251 12221 12098 11714 10802
16353 10802 10583 10482 10324 10638 9685 9960 9708 9616 9972 10666 11322 12224 11844 10194 10375 9679 9286 9602 10580
16334 10580 11140 10756 10892 9540 9086 8985 8393 9309 9748 9087 10271 10579 11015 10346 9867 9391 9674 9080
16316 9080 9115 8410 8788 9995 9459 9149 9698 9490 9576 9354 9431 9479 9891 9604 10338 10497 9287 9183 9614 10030
16296 10030 9682 9136 9135 8824 8736 8581 8977 8225 8705 8505 7797 8141 9132 9095 9462 9546 9259 8515 7807 9035
16276 9035 9840 9823 9920 9212 8935 8688 9609 9087 9914 9910 9968 10571 10280 9148 8519 7736 7557 8119 9181 9012
16256 9012 8655 8744 9001 9334 9746 8985 9532 9804 10252 9262 8814 8592 9505 10021 9964 8946 8981 9301 10123 8859
16236 8859 9061 8410 7685 7516 8015 8154 8342 7815 8597 8455 8707 7887 8040 8255 8087 7292 7819 7813 8040 7422
16216 7422 6638 6809 7059 6616 8020 7732 7737 8447 9498 9081 9251 9601 10170 9755 8544 8338 8659 7281 7573
16197 7573 8445 8761 9509 10175 9690 9759 9422 10270 10092 10025 9955 9545 9884 10366 9961 9474 9623 9878 9326 10584
16177 10584 10145 10963 10257 9003 9340 9143 8459 8265 8167 8755 8022 7414 6559 6728 7528 7361 7675 7897 6911
16158 6911 7077 6611 6936 7594 7539 7288 8559 7986 8556 8508 9303 8995 9593 8416 8285 8104 8981 8283 8055
16139 8055 7740 7467 7398 8052 8388 9423 10142 9972 8701 8987 7596 6456 5866 7570 7867 7561 6852 7120
16121 7120 6454 6548 6324 7845 8731 8262 7343 7727 6647 6059 5140 5138 4864 5828 6152 5749 6046 6190 5110
16102 5110 5825 5978 5937 5796 5358 4520 4726 5566 7472 8250 8520 8040 7474 7331 7509 8036 8138 7768 8007
16083 8007 8751 9490 9124 8767 8025 8501 8238 8835 8172 7803 8269 8070 7208 8159 7446 7316 8520 8876 8815
16064 8815 8635 9258 9240 7861 7241 7439 8027 7796 7284 7168 7005 6267 7232 7281 7697 7289 7534 8359 8633 8539
16044 8539 9148 8865 9137 8951 8107 7741 7914 7181 7487 7116 6069 5086 5597 6514 6675 6142 6786 7231 7641
16025 7641 7851 7175 6640 8157 8864 7908 6421 5954 7095 7570 6829 7630 7870 8057 8465 8297 7281 7330
16007 7330 6958 6645 7499 7160 8179 7589 6697 6666 7871 8071 7786 7409 6591 6317 6965 7607 7782 8545 7602
15988 7602 7455 7501 8067 7505 7877 6559 7229 7899 7561 6491 6050 6530 7126 7756 7357 6795 6778 6583 5649
15969 5649 5898 6309 7719 8064 7959 7703 8209 8486 7632 8292 8089 7566 6902 6212 7082 7065 7297 7127 7847
15950 7847 6890 6241 6850 5974 5366 5708 5837 4830 5047 5621 6043 6704 6875 7204 6805 6085 5954 7094 6975
15931 6975 6500 6941 6602 7070 7382 7827 9742 10699 11245 11987 11689 11003 9381 8588 8436 8098 7649 6986 6847
15912 6847 6976 7379 7421 6911 6037 7472 7422 7839 7482 6976 7255 6217 5858 6030 5678 6542 5756 5743 6532 7008
15892 7008 7285 7877 7509 7067 7090 6367 5320 5786 4963 5210 5234 5664 7095 8213 6344 5739 5787 6188 6557
15873 6557 6441 6463 6589 5999 6521 6537 6930 5870 5970 5536 6019 6404 5799 5196 5185 5866 6803 6655 5989 4478
15853 4478 4691 5347 5484 6202 6124 5463 5876 5134 5936 6658 6634 5480 6551 6322 6576 6080 5717 5712 5784 5747 5525
15832 5525 5116 5705 6293 6335 5726 6667 6721 6375 6172 6727 6295 5502 4949 5535 4879 6016 5522 5795 5379 6074
15812 6074 6193 6123 4380 4245 5232 6334 6157 6245 5720 5936 5795 5861 6461 7247 7524 7569 7302 8075 8061 7228
15792 7228 6692 6628 6618 7041 6353 5967 5820 5883 7024 6973 6706 7036 6091 6324 5698 5355 5596 6220 5942 6985
15772 6985 7134 6672 6803 7478 7159 6716 5867 5788 6099 8129 9309 9804 9706 9527 7623 7785 7869 8410 7551
15753 7551 8400 8422 8141 6684 6727 6225 6536 6035 6647 5970 6912 6242 6312 6033 6814 8629 8706 6681 5934 6384
15733 6384 7380 6762 8117 7623 8259 8529 8998 9716 10268 9553 10504 9797 9476 9025 9267 7696 9165 9267
15715 9267 8648 8070 8711 7740 7286 7421 8487 8906 9280 7646 6871 7671 8418 8017 8705 8389 9390 9650
15697 9650 10534 10287 10282 10422 11755 13169 13040 12599 13596 15052 15581 16022 17858 19981 22226 25063 27186
15680 27186 29400 33260 38755 47118 60965 82832 112849 155926 202897 238546 247125 227643 195538
15667 195538 167083 143876 125463 111793 102894 97053 93157 89993 85720 80302 75908 71290 68506
15654 68506 66731 66064 66668 68909 70669 73596 77359 82729 90268 104784 125969 161016 216084 297019
15640 297019 403644 513991 575749 544205 436922 328103 247634 190662 149925 124900 113481
15629 113481 108701 107344 108004 103379 92682 79110 65646 54173 48131 43779 41800 41134 42236 43851
15615 43851 46571 49578 54015 60434 70236 87481 113231 150648 198323 248579 285208 284671 241194
15602 241194 180232 132451 101329 80822 66939 59318 55974 55532 54302 52383 48364 43466 37662
15589 37662 33858 31613 30792 30747 30072 27933 27195 25308 23758 22267 20748 18243 17242 16350 14524 13688
15573 13688 14399 15024 15319 15470 15950 15431 14398 13584 12986 12100 11536 12059 13937 14087 15037 17036 18251 20432
15555 20432 22389 23947 25089 26887 26936 25185 22032 18748 15603 13648 11216 10509 11297 11258 11818 10811
15539 10811 10212 11032 10939 10194 10126 9643 9198 9589 10651 11126 11567 12172 11243 10819 10515 12044 11984 11416 13277
15520 13277 15619 16638 16531 15920 14505 12797 12120 11507 11581 11983 11882 10740 10723 10332 11621 12737 14421
15503 14421 14926 14078 13563 14304 14252 12749 11687 11358 9844 9922 10173 11196 12628 13402 13040 13054 11698 10660
15485 10660 10292 9817 7840 8879 9591 10172 9914 9670 10229 10430 9934 9520 9389 8896 9516 9683 8557 8715
15467 8715 7852 7403 6896 7813 7321 6724 6572 7595 6854 7061 7663 8657 8091 7853 8784 8816 7326 8054 6505
15448 6505 6803 7554 7791 6515 7043 7818 7548 6207 5647 6352 6509 5391 5241 5231 4591 4606 5673 5523 6092
15429 6092 5068 5200 6523 7859 7861 8400 8099 9277 8959 8111 6591 6636 5370 4962 5799 5817 5331 5402 4527
15410 4527 4188 4189 4860 5287 7065 6581 5142 4821 5291 4176 3759 4475 6001 6553 6077 5394 4914 3848
15392 3848 3944 4416 4641 4386 3542 3599 3630 4101 5023 5004 5006 4453 5488 4901 5118 3749 3847 5259 5009 4403 5298
15371 5298 4555 4408 4189 4245 4794 5107 4670 5217 4882 5011 4369 5548 5585 4764 3463 4242 4011 3710 3429
15352 3429 4353 3784 4399 3805 4289 4048 3867 4415 6028 6280 6022 4267 2991 2707 2640 2491 3208 3283 3937
15333 3937 4012 4325 3377 4106 4530 4790 4595 4744 4558 5242 4227 4273 4032 3858 4048 3443 2538 4009 3185
15314 3185 2510 2553 3319 3045 3869 4115 4261 3931 4333 2429 3381 3649 4034 3721 3475 2530 1975 2007 2955 3239
15294 3239 3846 3180 4516 3994 3738 3680 4492 3338 3659 3515 3928 4307 4916 3777 4573 3607 3517 3241 3242 3578
15274 3578 4294 3992 2845 3236 3070 1933 2463 2561 3462 3434 2836 2515 2791 2956 3534 2856 3151 3227 3615 2936
15254 2936 3739 2822 2908 2324 2732 2094 2852 3230 3595 2318 2319 3535 3396 2773 2590 2716 1717 2285 2936 2206
15234 2206 1763 734 1664 2395 3474 3139 3010 3709 4215 2754 2092 1546 2744 2552 1750 1426 1865 2208
15216 2208 2438 1707 1726 929 1680 1889 2938 3275 3181 2296 2746 2398 1464 1751 2202 2630 2950 2268 2369 1743
15196 1743 2186 2256 2031 1060 1628 1105 1259 1761 1879 1909 2711 2742 2709 2871 2639 2580 2658 2234 2990 3472 3653
15175 3653 2764 2659 2415 2881 2354 1788 1582 2279 2028 1605 1202 1611 1726 1523 2036 2871 2423 2252 2483
15156 2483 3265 2514 2063 1878 1866 2425 2610 3371 3486 2954 1916 1401 1600 1863 2278 3012 2798 1345 1296
15137 1296 2306 2761 2059 2287 3317 4289 2850 2908 2900 3065 3468 2617 2632 2387 2212 1933 996 370 560 829
15117 829 889 1227 1066 2215 2756 2387 2185 2437 2738 3206 2443 2117 2166 2440 1755 1510 2021 2419 2308 2627
15097 2627 2162 1881 2430 1751 1724 1087 349 1909 1576 1773 1842 2076 2520 2276 2450 2808 2149 1125 2336
15078 2336 2311 2196 1793 1747 1361 1969 1598 1453 1727 1779 1495 2016 2467 1981 1742 1312 838 565 -110 407
15057 876 964 868 1948 2991 2581 2099 2082 1713 1914 914 2459 2024 2204 2558 2638 3823 2869 2043 2621 1476
15037 1476 769 1005 2258 2139 1852 779 960 2407 2781 1687 1741 1098 1665 1814 1449 1466 1791 990 1365
15018 1365 1759 2117 2275 3162 2300 3780 2976 2683 3153 3590 3727 3878 3769 4451 4100 4693 3506 2486
15000 2486 2975 3694 3547 3205 1885 1646 1649 1779 615 1790 1680 2488 1813 1937 1643 1059 1281 2411 2247
14981 2247 3153 2579 3041 2687 2128 1587 2183 1309 1927 1712 3305 2752 3324 2782 2776 2360 3116 2109 3065
14962 3065 3202 2851 2163 1910 2057 2540 1130 323 567 1002 796 1169 642 1405 1097 1554 1035 1905 1595
14943 1595 1819 878 1329 978 1338 992 1505 1169 1803 1179 1642 1795 2130 1451 1073 1214 980 709 551
14924 551 16 604 702 1401 791 691 -69 74 -36 563 146 918 1626 1590 1672 2316 1291 2130 1356 1654 1269 1543
14902 1543 1980 1986 985 1221 554 1657 2246 1551 2011 2237 2060 2099 297 440 -205 794 681 1433 2140 2537
14882 2537 924 1151 745 1046 -55 1056 1169 1684 1007 883 1456 2461 1371 2 -845 617 501 346 6 1565
14862 1565 1391 1745 1852 2829 2093 2356 1256 1398 2133 2315 1024 1208 1356 921 322 967 298 913 200
14842 743 1245 1967 2116 1743 1205 3146 2595 2044 1946 2114 2369 2805 1914 870 1493 1747 821 1904 1986 1671
14822 1671 1191 2217 1508 1686 1680 2079 1891 2151 1132 1708 704 1011 1241 2405 2893 2135 2461 2913 2292
14803 2292 2684 2865 2857 1907 3179 3024 2467 2149 2812 2034 2050 2505 2386 341 308 -75 156 -562 -468 -628 380
14781 -484 943 2444 4488 5270 5962 6469 6589 5915 6309 5491 5165 4318 4562 3442 3038 2703 2568 991 1318
14762 1318 1184 175 -1366 -2281 -2414 -1265 -2111 -3091 -3578 -1700 -1651 -903 -270 -281 69 598 416 244 -448
14742 -25 -862 -1730 -2152 -1793 -1782 -834 -125 -1422 -2341 -2720 -2999 -1510 -747 -1002 -658 524 523 -775 -1720 -998
14722 -998 -415 -674 -572 -88 80 429 -1243 -2050 -1639 -742 -1226 -1115 -652 -284 1302 804 1405 1123 -24 -422
14702 -422 -33 276 108 -657 -775 239 -585 -1145 -102 -177 10 -419 -952 -677 -314 -932 -1340 -1619 -1782 -1439 -1539
14681 -1539 -899 -771 602 142 468 866 663 654 -472 -805 -1202 -995 -913 -578 -197 -87 -647 -208 526 704 541
14660 541 686 0 -460 -634 -856 -125 234 -293 35 -956 -467 -477 -33 -86 -131 -472 -727 573 -116 -789 -849 -993
14638 -993 -1632 -1493 -530 -523 96 -908 -400 185 401 -1230 -765 -1187 -1149 -650 -523 -1175 -1502 -1914 -1636 -1534 -674
14616 -1461 -1874 -666 -20 -175 -7 -1268 -760 -650 270 1125 298 -476 -50 -87 -196 -165 594 2021 2362 1283
14596 1283 1105 442 554 551 1041 8 -381 -260 -495 -643 -498 -73 1708 348 -341 -148 391 -899 -1301 -1622 -1688
14575 -1688 -945 -231 -880 -832 -1634 -1366 -1729 -1027 -1767 -907 -1041 -322 -302 -711 -1703 -1325 -2417 -1509 -2328 -1838
14555 -1838 -1274 -18 -659 -418 -64 39 20 1080 1726 1504 294 1260 1076 1285 879 1191 -375 56 -294 -323 -1435
14534 -1435 -2509 -3242 -2002 -1273 -1618 -2938 -1642 -992 408 222 330 -462 446 758 1052 1152 610 -728
14515 -299 -109 837 -599 -318 -329 -134 -373 459 671 1911 262 -109 32 774 -570 30 -1044 -228 -696 -181
14494 -697 77 -903 -460 -1378 -1201 -2069 -1685 -1423 -641 -1598 -1605 -989 142 -1119 90 -286 -1395 -1893 -2039 -2824
14474 -2824 -1210 -1163 -1562 -1927 -568 -1523 -1259 -1654 -1660 -2365 -1246 -2071 -1562 -2884 -1400 -1558 -2233 -2518 -779
14454 -873 -1095 -2105 -1108 -827 -324 -1227 -948 -1834 -975 -954 1137 980 -6 -85 500 -118 324 707 672 -276 670
14432 408 1026 -434 -687 -790 -335 -880 261 530 773 681 905 -541 -246 -70 1059 587 275 -611 -1022 -1050
14412 -1050 -932 -1162 517 684 953 -909 -625 -58 -595 -1673 -853 -1548 -1824 -1558 -1281 -1201 -1151 -1856 -1690 -1448
14392 -1448 -787 -1443 -912 -2253 -1863 -2168 -1259 -1469 -507 -860 -280 -639 1092 500 156 -24 887 566 1115
14373 1115 838 1639 196 -11 -666 457 243 318 -440 -91 -270 -416 -409 -21 -571 18 -1863 -2231 -1434 -1409 -1048 629
14350 295 1275 632 111 -670 157 160 350 -245 -505 -922 -607 -917 -856 -594 282 -768 -675 -1189 -978 -1414 -1361
14329 -1361 -608 -508 -830 -1437 -1853 -1529 -1603 -1165 -823 -518 -1058 -1054 -1875 -1190 -337 -1530 -2902 -2057 -1305 -1580
14309 -1580 -1893 -440 -878 -968 -1049 -247 -381 327 -626 -977 -1115 -769 -1093 -1848 -2232 -746 -745 -474 -446 -76 -221
14288 -221 -565 -1062 -1178 -1541 -1198 -1059 -1163 -1016 -883 -934 -819 -487 -161 -544 328 -150 -607 -857 -1395 -1450
14268 -1450 -1038 -1367 -1970 -2092 -1965 -1417 -1995 -1232 -1750 -1607 -83 169 25 48 1073 1091 574 11 192 677 464
14247 464 623 157 -80 784 1075 791 665 825 1554 1188 77 -792 -927 178 -54 -1530 -1019 -819 -306 -715
14227 -715 -716 -302 -453 -1708 -1434 -1635 -869 -1435 -1194 -519 -531 -1383 -787 -1005 -349 -552 -998 -981 -513 -1971
14207 -1971 -2430 -2227 -1921 -1603 -586 -759 -1141 -1056 205 592 1296 580 293 -768 -1261 -1549 -1221 -2241 -791
14187 -621 -1195 -670 -738 -1193 -991 -1653 -1279 -2186 -1098 -1053 -496 -357 -593 -813 -1129 -2054 -1805 -1952 -1362 -1274
14167 -1274 -218 -578 -585 -1947 -1418 -1448 -577 416 -204 -957 -613 -685 -150 -249 -504 -1620 -955 -2467 -2224 -3244
14147 -3244 -3574 -2724 -1407 -1693 -1351 -1346 -1459 -1388 -1568 -2199 -343 -832 -1114 -892 -256 -1124 -572 -1153 -1196 -1914
14127 -1914 -1557 -1663 -1589 -2437 -1713 -505 -689 -1686 -386 -1151 -269 707 922 -74 482 337 1344 -701 -443 -926
14107 -926 643 738 736 -436 717 342 264 -1809 -1728 -1803 -2832 -4254 -3576 -3009 -1465 -2130 -1534 -2669 -2190 -2543
14087 -2543 -2714 -3323 -1690 -1933 -1236 -1037 -21 -2918 -2143 -1527 -811 -2305 -1064 -116 243 -1074 -17 -899
14069 -899 7 -719 573 -835 -701 -681 1101 487 524 -110 -334 -2153 -1364 -1163 -1223 -2301 -1031 -2178 -1438 -1975
14049 -1975 -1321 -1656 -1468 -1885 -101 -163 617 40 861 -146 -181 -114 653 -130 280 -418 -291 -1449 -1230 -1405
14029 -1405 -716 -2443 -2672 -3740 -2069 -2007 -1660 -3174 -2747 -3105 -2203 -2994 -1981 -3210 -2527 -2583 -1663 -2121
14011 -2121 -1153 -2309 -1873 -3106 -1777 -1649 -1269 -3260 -3191 -3343 -1768 -1831 -1118 -1771 -902 -727 -1247 -2867
13993 -2867 -2140 -3548 -3344 -2990 -1722 -2304 -660 -1682 -1334 -2078 -1533 -2709 -2603 -2393 -1307 -2580 -2938
13976 -2938 -3563 -2517 -2955 -2144 -2363 -1718 -2360 -1242 -705 -176 -841 -299 -529 1529 -212 336 -611 -1751
13958 -1751 -2283 -1434 -2203 -1391 -1091 -274 -791 -235 -986 92 -893 31 21 -1051 -2409 -799 485 530 8 436 -251
13936 1025 775 807 484 384 -2376 -3035 -3170 -2933 -4082 -3073 -2932 -1921 -1584 -1126 -817 -1128 -2209 -1844
13918 -1844 -2647 -2269 -2275 -1535 -1868 159 -712 -823 -1425 -1925 -1832 -1216 -1838 -1093 -1004 -333 -684 -978 -1566 -1310 -1226
13897 -1226 -1043 -2280 -1842 -712 524 -1239 259 -12 26 -810 -80 -1185 -1457 -1231 -666 -2007 -1383 -1163 -1234
13878 -1234 -1248 -634 -1275 -922 -2158 -2633 -2063 -2455 -3062 -2200 -1164 -1699 -2604 -2570 -2442 -1996 -1515 -2097 -2762
13859 -2762 -2606 -3464 -2920 -2480 -3027 -2635 -1865 -2031 -1473 -1618 -47 -885 -1348 -538 -582 -689 -631 -1327 -824 -758 -607
13838 -607 -693 -1065 -903 -573 -630 38 -491 -1337 -1930 -2015 -1594 -1286 -1546 -2609 -3104 -2620 -3255 -2839 -2304 -2951 -2076
13817 -2076 -2461 -1949 -1376 -1126 -258 -22 -439 -840 -1792 -2273 -2247 -935 -548 -1367 -1509 -1256 -1867 -1874 -1699 -1643 -1201
13796 -1201 -302 -1229 -1083 -1250 -912 -127 331 -599 -574 -1535 -1138 -1644 -1713 -1779 -743 -618 -593 -626 -874 -1980 -321
13774 -670 -1441 -2123 -2717 -3249 -3279 -2436 -979 -1208 -1354 -1757 420 -185 -792 -634 -187 -218 98 -1249 -1842 -1952
13754 -1952 -961 -1876 -1102 -948 -524 -1663 -2084 -3064 -2595 -2677 -3085 -3254 -2050 -2970 -2215 -2625 -2453 -2929 -1684
13735 -1684 -3030 -1911 -3050 -2731 -3523 -2815 -3457 -3378 -3348 -2885 -3974 -1466 -1737 -1947 -3005 -1693 -2394 -3100
13717 -3100 -3844 -3366 -4240 -3373 -3886 -3272 -3269 -2020 -2522 -1817 -2521 -2550 -4068 -3357 -3919 -3288 -4450 -3900 -5435
13698 -5435 -4152 -5158 -5511 -5879 -4398 -5307 -4177 -3661 -3196 -4944 -3599 -4381 -2122 -2756 -1836 -2501 -2171
13681 -2171 -3356 -1736 -2545 -1772 -2116 -1840 -2123 -536 -514 338 -681 1436 1370 2089 2223 3808 2292 2457
13663 2457 1386 1525 349 572 -841 -50 -1132 -1012 -1371 -739 -2286 -1035 -1897 -948 -3922 -3199 -4160 -3451
13645 -3451 -3130 -1981 -3215 -2188 -3051 -1928 -3709 -3605 -5798 -5013 -4950 -3020 -5059 -4044 -4984 -4304 -5866
13628 -5866 -4774 -5200 -4408 -6105 -5651 -6759 -4361 -5437 -5295 -6582 -4361 -5244 -3802 -990 3593 4955
13612 4955 7619 5245 4744 1054 -1247 -4763 -5447 -5811 -3159 -3272 -2321 -3580 -2351 -1890 183 -1210
13595 1049 468 394 -1549 -246 -873 -210 -514 643 -1777 127 -195 1204 1130 1609 143 2569 1356 2082
13577 2082 1246 2661 2496 2849 1002 2990 1425 2369 2264 3179 1236 1004 28 249 -626 -211 -377 650
13558 -790 -267 -2406 -1661 -3325 -2005 -2455 -925 -1773 -1243 -1859 -762 -1249 871 519 1024 -417 774 447 770
13539 770 -781 -569 -1175 -784 -1940 -732 -758 316 -1199 -306 -1695 -571 -1554 -1067 -2204 -1165 -2091 -314
13520 -1354 -1339 -1621 -45 -768 -29 642 1298 48 957 698 1963 1864 1537 701 1232 65 1633 1951 2802 1360
13499 1670 1321 1917 487 1459 -28 995 -136 192 -349 827 1257 1637 710 885 217 1237 1210 1805 1082 1538
13479 1538 -51 600 -34 1949 1571 1024 775 1989 1707 1251 -219 1360 1364 938 -701 -623 -1071 -819 -773 -484
13459 -484 -315 952 1576 2093 785 1321 206 1252 1699 2040 1557 1767 1358 810 504 1353 335 994 1535
13440 1535 2422 1604 2573 1816 1858 1480 1856 1038 2385 1897 1654 1009 1217 638 459 754 357 -1178 -897
13421 -897 -195 -643 -677 -226 743 1671 2451 2073 1096 280 226 964 2186 2729 2400 2157 2015 2262 2256 2026 1862
13400 1862 2559 2250 992 129 65 289 375 1150 2059 2319 1688 1613 375 504 505 874 -285 -702 -231 1401 1376
13379 1376 1600 956 1518 1139 1589 1307 426 -73 566 651 516 0 35 479 285 -1194 -775 -1928 -1445 -2593
13359 -2593 -2711 -3195 -3896 -4232 -3159 -2483 -2626 -2788 -2357 -2788 -1887 -1451 -601 -695 164 -47 -479 -678 189 -531
13338 -456 -2954 -1526 -1473 -375 -657 -109 -54 994 908 3400 2527 3196 2956 4148 3118 3476 2543 3647 3534
13319 3534 4619 5287 6589 4527 4591 3159 2825 595 1610 -626 808 200 -46 -880 1126 508 2977 1148
13300 3543 3741 4961 3313 4897 3680 5508 5116 6534 4960 6545 4649 5861 5158 5912 4008 5777
13284 5777 4461 5773 4384 4862 3691 5929 6554 10769 14839 23739 29817 31299 23168 17655 11557
13269 11557 9528 5978 6868 5309 7118 5111 6415 4090 5241 4198 6120 4179 5395 3762 5223
13254 5223 3859 5900 4905 5455 3879 6977 6051 7785 7057 8636 6553 7273 6997 9415 7325 8951
13238 8951 7295 8593 5942 7167 6303 7304 4937 6861 5414 7335 6949 9192 7766 9521 8078
13223 8078 9395 6234 7113 5287 8205 5908 7203 5730 7622 5007 6601 4763 5950 2770 3845
13208 3845 2763 5376 4320 7172 5927 8822 5639 7508 6038 8181 4815 5705 5271 8959 6654
13193 6654 7997 5332 7279 5612 7501 4740 7222 5544 7131 5193 8501 6752 7928 6041 8386
13178 8386 6203 9807 8657 10754 8028 11162 9780 11275 9203 11025 8705 10583 8730 11626 9130
13163 9130 11671 10281 11746 10614 13026 9712 12410 10890 12786 10656 13952 11769 13879 12518 13686
13148 13686 11716 13721 11371 13366 10960 13219 10529 12385 10196 12976 10258 12226 10257 12928
13134 12928 10682 13008 11718 14401 12131 14358 13830 16812 14611 16621 14800 16504 14184 17206 14604
13119 14604 16398 15810 18908 17448 19897 18619 21412 19732 22585 19846 21234 18478 19879 16581 17559
13104 17559 14690 16240 13155 12108 8450 9799 7222 10447 10492 13605 12081 13396 12020 13953 12003
13089 12003 13186 11966 15381 13806 16267 14788 17789 16033 20162 20253 24123 24121 27610 27480 30356 28557
13073 28557 30423 27918 29138 26445 27902 27267 30370 30304 33385 32345 35061 35053 38515 38635 41329 41822
13057 41822 46878 47347 52640 55911 65307 72448 83929 98576 119269 136712 151980 156169 157006 156455
13043 156455 165462 183422 216722 263582 343508 474559 687406 1012563 1484666 2078782 2672047
13032 2672047 3032351 2980401 2530322 1901624 1322984 901654 620763 440003 320597 244397
13022 244397 195190 170284 158235 159547 166348 173173 171186 158539 137420 117621 98711 86545
13010 86545 75835 69146 63685 61575 59032 58269 56670 56511 55164 56739 57254 57224 57761 58731 58699 61755
12994 61755 63316 66208 70211 76391 81592 85755 86110 82879 76659 70113 64966 61350 57249 55791 55645
12979 55645 54816 54822 54890 54664 54122 53060 51479 49195 47171 48437 50230 50415 49938 50019 49964 50072 49907 50623 50560
12960 50560 52588 54881 58063 57946 60050 60940 63216 64188 67894 68676 71483 72070 73392 72866 74759 74441
12944 74441 76614 77072 78974 77389 76112 72840 74347 74653 78859 80656 86558 89863 92506 89201 88406
12929 88406 84129 84369 82970 86903 87819 91326 90708 94512 93463 97867 99302 105731 105691 111305 110943 114334
12913 114334 113731 118305 118233 123187 123654 128545 127053 131550 130370 135799 135572 142705 143631 153397 155775 163289
12897 163289 164670 172257 171539 176854 175041 178529 173751 178406 175760 183337 183454 191724 193766 202481 200480
12882 200480 205794 202882 209939 208440 217990 220265 231990 234327 246479 247307 257655 257969 267521 265595
12868 265595 275119 274120 287651 290829 307349 311090 326901 331470 347737 350144 365247 366469 379816
12855 379816 379881 393325 392218 407016 408443 425088 428181 445153 446631 464538 463896 477661 471826
12842 471826 484063 482261 502315 509508 540633 556405 597897 623624 666179 684416 719535 732546
12830 732546 765882 779929 815249 824839 855581 861935 894322 909256 952045 975112 1025869 1052716
12818 1052716 1107955 1138120 1197216 1232153 1299257 1341425 1415295 1461651 1544642 1601578 1698055
12807 1698055 1765760 1871802 1952533 2078307 2177751 2326022 2449000 2621824 2768033 2970350
12797 2970350 3148919 3387312 3602600 3883278 4146560 4492271 4826023 5249105 5678875
12788 5678875 6240549 6850988 7654294 8590959 9844790 11420110 13625233 16574498 20723561
12779 20723561 26212726 31705209 34661524 33677487 31937378 33574088 37987542 45296195
12771 45296195 55843323 71831987 95043430 129267403 177909078 242546678 320213668
12764 320213668 400510020 451702458 463676654 426938232 345007176 263084047 203047681
12757 203047681 158011362 118346626 88126959 67129196 52769659 42857102 36266857
12750 36266857 32142111 30608166 31418064 32956078 32245978 27460889 21573745 17550795
12742 17550795 14729439 12607560 10794309 9500353 8407166 7599763 6859455 6295464
12734 6295464 5745189 5334341 4918503 4610954 4282134 4040718 3770667 3579030 3359039
12725 3359039 3205317 3018729 2890422 2730661 2625517 2486488 2391884 2263853 2184199 2076192
12715 2076192 2011420 1916533 1861142 1778995 1735479 1659338 1612756 1534678 1486727 1413542 1376689
12704 1376689 1320482 1300325 1254450 1229936 1172126 1136754 1079007 1048020 997919 976613 937289
12693 937289 929401 905484 904611 881696 878236 850221 842302 812453 799220 765148 747995 710669
12681 710669 692044 658979 646267 618353 610121 588009 581781 558063 550837 528886 522403 501532
12669 501532 495986 477077 473127 455692 453682 440085 441317 429929 430871 419299 419674 406690 404845
12656 404845 390292 386847 373447 371762 359548 360376 350639 351840 342669 343647 334527 333605 321087 317984
12642 317984 305627 304271 295645 297212 289929 290927 281821 280210 269247 265408 255167 253279 245997 246650
12628 246650 239789 240060 234835 237317 232278 234963 230394 230484 224383 223934 217593 216994 211980 212900 207788 208826
12612 208826 204128 204790 199542 199192 195105 196021 193485 195058 191124 191147 187328 187027 184191 185481 181381 180259
12596 180259 174936 172080 164820 161662 157238 158177 157366 159566 158649 160162 157108 154629 148821 147397 142756
12581 142756 141274 138435 137874 136046 134573 131744 132184 131022 132505 133242 133961 133344 132601 130819 130006 129437
12565 129437 130227 130117 130568 128776 126305 123708 122051 120012 120252 119489 119167 119155 117035 113799 110545 108607
12549 108607 106637 103539 101866 100568 100321 99498 97163 95184 92173 90819 88677 86665 84746 84341 83405
12534 83405 82802 82697 83812 83385 83716 83646 84184 83650 85515 84163 84876 83949 84288 83519 84553 83806 84211 82803
12516 82803 82844 81271 80816 79300 80497 80121 82202 82629 85814 87172 90982 93340 99049 104095 113982 126374
12500 126374 145647 165735 186684 198327 202562 197229 195308 198551 214936 243853 298044 384162
12488 384162 531823 771901 1152534 1686928 2319954 2863462 3090710 2878053 2342787 1725970
12478 1725970 1221013 863140 621178 452542 340950 265615 222679 195621 185276 182250
12468 182250 186918 187211 182412 165528 147204 126716 113057 100983 95235 87123 83951 78778 77280
12455 77280 72850 72029 68565 68082 64694 64685 61692 62377 61226 64926 62280 63707 62444 64598 61811 63193
12439 63193 61263 63081 60829 64134 62691 63430 60453 60945 57470 59030 59254 62929 60317 62442 58863
12424 58863 58951 55327 54867 50857 51259 47157 47795 43928 43651 40044 41735 39105 40737 39946 42774 40767
12408 40767 43041 41077 44801 43515 44183 41537 44153 41282 43566 40391 42568 41839 43956 41388 43650
12393 43650 41282 43716 41203 42690 40817 42553 38920 40895 39388 41560 40027 42091 38182 39092 36081
12378 36081 38820 36490 38422 36732 38651 35167 37343 35469 37981 36578 37643 36046 37689 34877
12364 34877 37220 33691 35236 34592 36189 34315 37042 34345 35952 33141 34175 32135 33983 32075 34695
12349 34695 33143 36829 33981 34907 32247 33528 31477 34027 32277 35561 33188 35361 33838 35883 32468
12334 32468 33603 32018 34239 31177 31445 28773 31243 28527 30122 28377 30504 28067 31404 31160 33055
12319 33055 31614 33445 31165 33287 30245 31289 28608 29630 26917 28972 28367 30116 28060 29589 27398
12304 27398 30154 27014 27371 26360 27369 25251 25863 24402 26603 25729 27170 25093 26091 24832 25801 23628
12288 23628 24481 22645 24438 21290 23397 22420 24310 22690 24703 23209 23835 21849 25004 23830 25262
12273 25262 24318 25986 24338 25992 24547 26248 25568 27183 25033 25557 23554 25577 25281 26582 24071
12258 24071 25494 23342 23604 21275 21053 18444 19980 19813 21972 20510 22966 22370 24271 22425 23539
12243 23539 21817 22974 21987 23712 21280 21272 20642 21794 21583 21825 18928 19379 18408 19923 18729 20280 19915
12226 19915 21690 21072 21242 21006 22504 22524 23920 22188 22699 21444 22470 20942 21426 20107 19821 17825
12210 17825 18664 18335 19519 18892 20049 19070 20352 19705 20632 18854 19420 18213 18881 18171 19220 18989 20166
12193 20166 20503 21487 21131 22643 22223 22728 21518 22035 20818 21158 19803 20109 19590 19755 19460 20657 20172
12176 20172 20453 21432 22896 22141 22344 21206 21826 22283 22791 21746 20785 20432 20786 19719 19107 18725 18814 17620
12158 17620 17930 17380 17495 16875 16935 17459 17941 17548 17399 17748 18147 16979 15724 15691 16308 15038 15231 15995 15919
12139 15919 15792 15753 15938 17264 16810 17035 16862 17117 16106 15150 14953 14460 14694 14642 15432 15170 14658 14779 14978
12120 14978 14829 14295 13664 14008 13424 13333 13569 14591 15089 14681 14510 14030 13259 13348 13947 14328 14040 13949 14890 15248
12100 15248 14696 14961 14138 14422 13517 13312 12835 12652 12471 12114 11783 12640 12706 13355 12659 12387 12250 12464 12176
12081 12176 12645 11664 11544 11143 12161 11509 11635 12020 12660 11463 11568 11199 12821 12111 11640 10399 11998
12064 11998 13566 14174 12475 12517 12789 13449 12230 12617 11093 12044 11155 11190 10635 11533 11625 12720 11208 10863
12046 10863 10143 10093 9622 10717 10306 12164 11694 11494 10864 11583 11069 12553 11450 12589 11522 11944 11082
12029 11082 11150 11379 11882 10307 11045 10180 10380 9477 10490 9943 9444 9647 10808 9873 11221 10634 11316 9710
12011 9710 10891 10366 10812 10125 11018 11884 12029 11403 12147 11219 12874 12512 13344 11228 11775 10867 11157 11006
11993 11006 12144 11753 13404 12009 12723 11295 11334 11109 12109 10858 10815 9302 10617 10162 10222 9835 11508
11976 11508 10121 11843 11272 12367 11413 11974 10774 11560 10665 10962 8807 8313 8031 8532 7645 8591 7567
11959 7567 8509 7030 7116 5763 6662 6258 6874 5988 8166 6434 7938 7749 9161 8748 9447 7608 8698
11942 8698 7799 9627 9031 9114 7663 9061 7130 8363 8246 8517 6480 7663 7717 9437 8687 9983 9885
11925 9885 11486 11021 12103 11029 12852 12520 13977 12716 12383 9089 7468 3457 2746 2127 4912 8756
11909 8756 13716 14608 15287 14256 15195 14931 15175 13241 12855 11347 11914 10563 12312 12537 13702 12657 13721
11892 13721 12692 13791 11927 12931 12793 13697 12059 12296 11879 12798 12262 12725 10249 11485 10303 10874
11876 10874 9228 10009 8274 9383 9094 9075 8564 10494 9269 9272 8772 9495 7269 6993 5189 5543 4762 4967
11858 4967 2660 3947 4716 6478 6684 7949 8106 9421 8964 10069 8807 9914 9217 9826 9071 9776 8293
11841 8293 9044 7835 10074 10891 12097 11305 10980 9308 10603 10262 11636 10591 10516 9368 11577 10257
11825 10257 10595 10279 11455 10568 10347 9189 9559 8407 9773 8832 8418 8690 9153 8780 9773 9267 10438
11808 10438 9999 10982 10749 11273 8964 9913 9277 9873 9504 9090 8276 9608 8911 9097 8299 8393 8269 9578
11790 9578 8359 8862 8859 9537 9206 9288 8754 10316 10013 8663 8048 9006 7140 6961 7161 8593 6821 7562
11772 7562 8348 8322 7139 6507 5148 6395 5453 6173 6354 6783 6990 8570 9063 8998 8930 9132 7176 6945 6749
11753 6749 7398 5778 5293 6703 7721 6499 6741 6792 7876 7864 8106 7317 6209 5393 5346 4650 5316 6060
11735 6060 5441 5217 6196 6061 6623 7074 7974 7279 7233 7803 8522 7823 7053 5447 5702 5891 7577 7761 8092
11716 8092 8260 6973 6611 7683 6914 6388 6976 7662 7575 7205 6956 6988 7638 8021 8573 9108 9178 7978 7873
11697 7873 6829 6158 6732 7012 6923 6292 6379 6265 6041 5954 5015 5363 5120 5706 5912 5631 6446 6252 4948 4886
11677 4886 4675 4937 5125 5590 6317 6614 6314 7207 8193 7796 7623 8021 7723 7275 6932 7537 6630 7123 7642
11658 7642 7437 7367 8272 8347 8900 7633 7560 6269 5752 6090 6239 6042 6889 6356 6882 5729 5981 6934 7347
11639 7347 6249 7122 6930 6833 6394 6818 6413 6527 5516 5354 5092 6015 5751 6214 6217 6611 6068 5997 5360 5140
11619 5140 4852 5461 5210 5552 4943 4880 4164 4574 5893 6582 6874 6898 6860 7494 6644 7892 6436 6024 6356
11600 6356 7073 5049 5442 5985 6626 5733 6416 6246 5144 3955 4288 4235 5032 4032 3931 3995 4065 3085 3368
11581 3368 3849 4117 3824 4980 4060 4915 5307 6355 5783 5810 5248 3773 3641 5325 4031 3999 4119 5065
11563 5065 4055 3999 3268 3614 4019 5680 5192 5908 5039 5502 4903 5766 4279 5265 5638 5362 5195 5790 5028
11544 5028 5655 4863 5561 5027 5309 4182 5529 5341 6099 6022 6926 5996 6837 5097 5114 4605 5231 4944 6196
11525 6196 6232 6588 5870 6420 5280 5803 5149 5137 4036 4561 3439 5158 4603 4840 4307 5433 5433 5650 5047
11506 5047 6378 6881 6554 5880 7496 7202 7242 5323 5698 5538 5158 3865 3702 2504 3393 3003 4006 2448
11488 2448 3313 4067 4282 3019 3754 3390 4259 2503 3350 4047 5091 4772 5445 3892 4150 4351 5678 5836
11470 5836 5546 4515 5445 3741 3396 1813 2783 2317 3671 3059 3645 3687 4474 2803 3439 3091 3390 2469
11452 2469 3476 3655 4845 5143 6614 6099 6787 5857 6035 5243 6221 5061 4884 4242 4881 4723 5483 4857
11434 4857 5375 5518 7128 6131 6608 5802 6006 5223 5664 4213 4720 3803 3675 3152 3340 2353 3362 2951
11416 2951 3817 3439 4250 4196 4012 3460 4336 2677 4143 4666 5133 2947 2057 2413 3479 3165 4616 4326
11398 4326 4765 3642 4391 3575 3449 2990 3459 2626 4138 3891 4732 3996 3851 3615 3778 3859 4943 3667
11380 3667 4715 4233 3810 3455 4161 3501 4094 4155 5330 3981 3730 2358 2708 1718 2288 2113 2761 3646
11362 3646 4280 4215 4570 4232 3977 3578 4309 4686 5003 3972 3539 3119 3455 2976 2699 2023 2491 3806 3952
11343 3952 3369 4414 4010 4646 4840 5082 4205 4594 4647 4719 4375 3693 3004 2742 1866 3209 2296 2422 2318
11324 2318 2882 3986 3573 4273 4832 4852 4819 3435 3687 4439 4040 3601 3202 2904 3478 3209 3554 4401 5015
11305 5015 4020 5107 4426 4030 4035 4590 4543 4754 4596 4009 3010 2997 3486 4171 4525 4533 3382 2884 2755 2562 3731
11284 3731 3303 1714 2674 2599 2659 3882 3526 2784 2034 2469 1788 2034 2317 2843 3289 2726 2674 3869 5064
11265 5064 4180 4173 4261 4125 4238 4680 4189 3625 4038 4095 3830 2824 2366 2386 2071 1770 2953 3803 4091 4051 3749
11244 3749 3377 3063 3426 3666 2930 2710 3130 3505 3223 3616 3277 2499 2840 3553 2766 2124 2889 3740 4069
11225 4069 4770 3892 3629 3741 3610 2987 3552 3778 4018 3074 2458 2488 3048 3618 4246 4041 4674 5004 4636 4025
11205 4025 3966 4205 4319 3730 4303 4435 4830 4057 3723 3390 2657 1642 1472 1986 2878 2063 2763 2455 3040
11186 3040 2589 3832 3882 3175 3021 3220 2337 2921 2883 2955 2557 3050 3344 4388 3322 3352 2834 2026 1959 2470
11166 2470 2074 3135 2641 2657 2454 3359 2678 1836 1970 2309 1340 2635 2252 2885 3043 2591 1784 2201 2636
11147 2636 3651 2336 2852 3837 4548 4137 4387 3882 4155 4674 5454 4940 4921 4007 4453 3468 5315 5414 4908
11128 4908 3415 3184 2880 2825 2412 3345 2749 3025 3707 4699 4190 3762 3280 3322 2962 4046 3542 4821 2939
11109 2939 2516 3076 3042 1199 1320 569 488 1062 2427 2721 4390 3015 2481 1891 3016 1905 2472 1906
11091 1906 2193 1563 1650 2384 3272 2710 2644 2148 2721 1422 2206 1549 1948 1592 2619 3119 3601 2262 3256
11072 3256 3635 3657 3312 3367 3291 3580 2869 4254 4474 4978 4598 4531 3992 3990 3200 4180 3832 3751 2256 3182 3316
11051 3316 3846 2805 4567 4153 3659 3004 3166 2254 2941 3105 2826 2097 4078 3040 3523 2676 3525 2770
11033 2770 2651 3203 3308 3454 3547 2359 3757 3729 2912 2535 2712 2621 2350 1628 2242 1565 1507 1422 2205 2554
11013 2554 3830 3856 3755 2224 2033 1485 2124 1820 2170 2808 4004 3928 4483 3606 4401 3422 3782 4002 5116
10994 5116 5303 5066 5025 5571 4350 4793 4736 3964 1940 2280 1675 1517 616 2467 1678 701 1370 2387 1472
10975 1472 1055 305 1863 1857 2476 2639 4424 4388 4263 3627 4631 3818 3761 3347 3325 2878 3292 3865 3904 2710
10955 2710 2103 1981 2561 1844 2265 2642 2551 1579 2346 1753 2271 1699 1822 1289 1672 2050 2075 2232 2843 2301
10935 2301 1577 358 1623 2754 2695 422 149 1367 2626 2780 1649 1017 1573 2144 2959 3292 2753 2621
10917 2621 2849 2956 3810 3721 2792 1537 3427 3107 2771 3408 4363 3721 3658 3270 2913 2114 2707 1722 1632 2762
10897 2762 3327 2967 2732 2616 2364 2000 2695 2610 1520 1866 2751 2644 2775 2801 3274 3169 2592 2134 2523 2760
10877 2760 3375 2159 2350 2343 3008 3185 3173 3304 3620 4226 3868 2275 1308 934 2361 2367 2797 3432 3807 2862
10857 2862 2740 2512 2740 2880 2997 2652 3155 3361 2928 2938 3217 3702 2824 2783 2782 3349 4066 4496 5009 4733 4476
10836 4476 4107 4094 4156 3361 2566 2514 979 1077 640 789 1241 1666 1582 822 509 546 1747 3246 2533 3491 3249
10815 3249 3037 3076 3212 4160 3973 2497 2089 2120 2321 3033 2786 2561 2168 2007 1815 2424 2517 2666 3180 3505
10795 3505 4068 4647 4077 3006 3502 4040 2446 2798 3642 4113 3942 3885 3922 4265 3860 3520 3064 2723 3061
10776 3061 3036 3625 4379 4132 3698 4241 3804 4202 4122 3560 4798 4617 3062 2102 2152 2513 1925 1141 296 -1397
10755 -1438 -2328 -2917 -4108 -4201 -4123 -4186 -4543 -4125 -3811 -2351 -1536 -556 818 2404 2883 3676 3847 4056 2520
10736 2520 2652 2603 2943 1608 1265 126 12 -371 239 495 -54 -378 643 -258 -361 -295 573 -686 -1149 -1498
10716 -1498 -12 -697 -1182 -1064 -515 -1056 -752 -936 -709 -185 293 199 797 -64 -66 2 880 490 498 467 1189 -56 303
10692 494 1518 1132 -58 -487 -177 -73 1007 667 979 817 2001 1740 1485 936 1338 700 1259 549 614 538
10672 538 2555 2519 2453 2270 2429 2321 1635 167 1467 1358 1733 1819 2067 961 2035 1692 2463 2067 1197 333
10651 1308 1668 1912 1187 1811 1258 1151 750 2523 2000 2409 1050 1172 1013 303 343 922 -25 772 1678
10632 1678 1942 1207 1781 1091 1593 436 1091 937 1609 182 1332 1434 1528 1199 1878 1545 2805 2707 2249
10613 2249 1744 2096 922 1483 1440 2145 1294 2285 2290 3218 2025 1322 1311 2791 2507 2849 2738 2570 2275 1993
10593 1993 1573 2271 1501 1312 1562 1701 1010 1084 735 1399 514 422 -181 -487 -569 861 690 1428 1580 2055
10573 2055 1250 826 1146 1609 892 2422 1625 2141 2173 1610 694 1584 1526 1199 -191 1034 1731 2706 2027
10554 2027 1946 1061 2033 2384 1611 331 -59 -360 835 845 1391 1595 2073 1018 252 -389 192 1190 2178 2585
10534 2585 3354 2278 2712 2919 2617 1092 890 1229 1562 569 701 -427 1027 746 1059 737 -191 -31 238
10514 -288 641 -477 -193 -288 676 764 2066 2367 2829 2649 3051 3156 3034 1895 1490 1708 1669 863 1071 1418
10494 1418 1322 1426 1107 707 99 -44 811 392 1109 1030 1291 764 1098 1098 1473 905 173 332 1051 1275 2235
10473 2235 2537 3648 3917 2486 2069 2479 2896 3726 3372 2505 2149 2804 2119 1600 1141 749 281 1141 1443
10454 1443 1589 1871 1697 327 109 389 -246 152 579 1455 477 -392 34 821 1446 1319 1905 1488 1679 1751
10434 1751 918 542 985 826 2457 2150 1881 2644 3134 2411 1360 1263 799 1734 1910 1463 1768 1028 482
10414 822 1366 1204 1991 2577 2068 2454 2060 1752 1869 3253 2695 3124 2729 1278 857 807 736 896 931 38
10393 235 439 57 1499 1912 1964 1643 1459 2091 2279 1056 700 1209 556 869 1498 2653 3233 2489 1961
10374 1961 1470 1950 2328 2659 1464 1714 1019 893 1935 1263 1194 1907 1854 1284 918 1596 547 841 1832
10355 1832 1404 1890 2772 2337 3517 3197 1519 1384 2007 1223 1516 14 -433 445 1754 3184 3412 2648
10337 2648 1722 1371 2138 2599 1816 1354 1691 1373 858 822 1581 2572 3247 2402 1977 2198 2408 2338 2234 1358
10317 1358 1122 1293 1705 2337 2456 1578 2123 1007 1461 943 1188 1366 1246 219 798 199 -232 -908 133
10297 563 1446 1819 1498 985 1442 448 728 1000 1590 1597 1214 375 188 -638 264 996 1457 279 455 563
10277 563 530 47 -442 -54 319 1100 1840 381 582 -158 -453 117 827 -808 -53 334 1039 1238 956 878 1509
10256 1509 1351 1166 1725 1153 -189 -324 77 1106 -186 -349 -258 1116 66 57 54 768 1307 801 -418 130 332
10235 332 529 36 -112 -605 310 316 810 671 817 1504 2147 1556 2149 1489 1952 1631 1338 258 1200 752 983
10214 983 1803 3306 2192 2057 1441 1687 2301 3470 3118 2881 2095 2780 1932 1907 827 942 812 122 -336
10194 971 849 -389 -507 -204 -264 -776 240 1491 1189 2253 1883 1761 2058 2164 1041 794 700 1339 1135
10175 1135 1991 1871 2782 3189 2391 1461 1095 962 1683 120 274 453 639 226 849 628 1079 576 1964
10156 1964 1453 1619 1040 674 762 1852 1601 2691 1757 1680 1463 1801 1893 1446 1116 1859 2321 1100 -431
10136 327 -553 199 913 -12 -1094 204 226 647 443 126 -284 -141 -915 306 -51 594 155 97 -71 -278 -493
10115 -493 -298 -246 1155 655 738 101 -123 233 260 -619 78 -1366 -1636 -1811 -2159 -1627 -626 -664 -26 224 225 605
10093 605 704 -106 516 -64 503 743 803 -18 617 212 1082 392 136 -1098 -681 -1145 -476 -668 24 -367 -577
10072 -577 -729 -1149 -2314 -1412 -384 528 960 1325 980 1730 1079 1290 1456 1616 1868 1034 1216 2560 1102
10052 -378 -728 184 1529 2057 1701 1502 878 1902 1936 1895 1686 1896 986 304 988 1516 1224 1572 903 1300
10032 1300 1057 1416 1982 1341 444 491 451 -214 924 1212 1653 1498 1097 800 -155 -34 -162 489 520 -90 -798
10011 -798 117 451 407 -232 -444 -331 -507 303 502 8 493 243 -496 -1106 -836 -1393 -783 -117 209 -451 89
9989 953 573 1728 2116 1971 1430 1342 787 -102 235 -379 -591 -289 567 1259 796 923 87 -87 -710 -1247 -2282
9968 -2282 -2422 -2320 -2114 -859 344 313 592 1276 1801 861 1291 1924 1528 1857 1368 513 1375 409 283 -81
9947 -599 -79 944 959 883 483 30 895 422 705 1221 2051 2983 2276 1898 1069 2635 3519 2772 1752 1049 1272
9926 1272 1369 1382 2677 1992 1088 2026 2562 1317 1218 426 -719 -682 765 1654 2029 1585 916 758 1594 2259
9906 2259 1140 565 1139 581 1094 1417 2116 1563 1101 1064 1163 694 1133 80 -268 56 1284 1228 481 449 516
9885 516 891 1354 670 1005 414 723 730 -47 137 1271 1596 1274 414 290 248 953 555 262 -755 -486 -443
9864 -443 54 -429 870 1973 2657 1152 -116 -848 -215 909 1601 944 1410 1357 1789 1470 1052 515 681 617
9844 617 1820 2659 2554 1204 1411 393 617 1033 1607 310 -40 -469 -269 97 -113 -1624 -327 669 869 616
9824 616 72 433 959 1394 1801 858 847 1055 2163 1820 1962 1331 1883 1068 657 738 2860 2622 2235 1881
9804 1881 1316 1549 2926 2313 2116 956 1083 508 1771 2326 2891 1795 2241 2070 1624 882 352 699 1407
9785 1407 1266 1932 1778 1852 819 728 796 1075 243 -51 -439 633 623 -25 -17 1322 1750 1906 1039 902 2366 3444
9763 3444 2790 1240 714 1855 1485 2431 2910 3376 2618 2726 861 1216 2293 2530 2343 1463 918 607 182
9743 -49 -1231 -1065 146 791 123 820 -19 -96 489 2127 2559 1829 1740 2542 896 626 591 955 1072 1170 1374
9722 1374 2005 1989 2514 1576 1075 1152 2075 1021 1805 1354 1396 1289 1096 -544 712 1399 1140 271 -12 393 732
9701 732 -492 326 -176 24 1154 1282 1385 2227 1561 2584 2412 2067 1169 776 341 16 -193 310 976 459
9680 223 824 1060 3111 2750 1579 302 838 -8 94 472 2014 1748 1154 520 319 474 739 558 1683 1012
9660 1012 941 261 338 -225 612 636 803 712 1919 1059 395 -16 -158 -261 770 126 1203 640 37 520 -872
9638 -1019 -538 -453 371 324 -274 -734 639 632 -626 -39 -188 -776 -204 25 393 86 735 603 298 1071 1123 707
9616 707 -162 -339 766 435 146 -664 -716 49 528 21 568 1540 850 -21 786 367 359 541 -39 -124 303 398 -968
9592 -660 -212 -323 72 -36 617 863 737 968 939 939 1071 832 1490 1356 1064 1078 810 581 1295 1042 2197 2466
9570 2466 2315 1428 -59 48 713 956 1088 1772 1506 468 1255 901 1513 2217 1368 688 110 -148 -329 238
9549 383 1124 28 -991 -444 14 -609 -318 243 1373 1815 1486 1602 1763 1447 2527 1918 1710 2397 2417 1758
9529 1758 424 -149 -606 -1359 -779 173 304 1358 1872 2157 2279 1926 1327 -3 543 893 727 -234 -641 -287
9508 -401 -870 32 809 465 593 2146 1502 606 240 958 1175 877 466 37 67 90 695 1701 1243 1489 1137
9487 1137 429 36 615 -175 -42 899 251 -358 -68 649 737 -1411 -1234 -1308 474 810 341 84 1016 956 1200 504
9464 831 348 -13 -325 -380 -815 -58 595 1872 1803 1370 1794 2151 973 -644 -164 -22 -247 -234 -733 -146 750 1553
9442 1553 189 -543 -425 20 369 1034 1300 1215 996 2089 1645 2278 2736 2495 1713 2121 1980 1914 1473 1035
9422 1035 781 935 767 462 191 888 1108 1856 1766 1396 1158 1140 643 625 -194 -44 1041 2488 2766 2436
9402 2436 1401 879 -112 75 508 478 1083 1889 560 -793 -1213 204 -743 357 899 1132 574 111 110 194 -1253
9380 -388 -1256 -1253 275 429 -572 101 -278 739 1108 1264 -171 311 950 424 -1380 -446 1127 1695 737 1208
9360 1208 1447 1949 926 -273 -793 -161 205 436 1000 1136 851 667 -230 -1039 -1071 252 -405 212 -500 642
9339 3 -687 -1257 -297 -1447 -1384 232 732 24 245 547 627 593 1001 854 644 323 690 828 1111 1884 3188
9318 3188 2036 1270 4 584 395 604 1005 1464 1675 1965 2520 2802 1768 2118 1435 1231 434 108 1070 497
9297 -552 -1593 -2231 -367 611 1187 1224 1821 1188 814 1094 661 245 -551 -681 -577 -231 -55 -326 -128 235
9276 790 1153 719 -182 -163 116 -134 -334 612 -436 140 1506 1842 554 1088 13 -270 59 659 515 1252 519
9254 859 1030 1045 499 301 1008 1583 1007 774 266 263 111 849 977 1509 1179 867 386 441 743 690 -51 434
9231 482 954 17 388 640 367 896 1354 433 472 575 1768 1673 1407 791 1149 1369 741 321 1566 169
9210 -404 232 746 897 515 259 369 848 740 584 346 559 383 535 1986 642 238 -130 108 369 -666
9189 -365 1166 1537 1425 837 681 -465 -1072 -287 932 1090 1013 516 482 173 -140 -406 241 526 983 841
9169 841 1045 1269 1817 1823 1636 603 266 624 735 1358 1883 2136 1726 -307 371 890 -29 54 9 -84 395 1221
9147 1221 1227 785 1032 991 879 1726 1637 1204 841 702 282 -115 -513 735 979 755 212 -440 363 188 336
9126 336 429 661 -65 597 1457 1782 2092 1513 1565 1962 429 -268 44 303 289 224 1218 992 339 -487 110 292
9104 292 -122 450 528 810 1018 49 359 2064 1499 110 357 1218 1171 -94 -1410 -1029 -127 227 158 736 602
9083 602 -104 233 1497 2373 1275 1333 1074 949 328 481 -436 -462 -214 -294 -44 638 -56 222 937 1050 277
9061 972 1015 315 346 666 467 360 -261 845 2057 2332 1735 686 353 163 -677 -937 51 99 -102 607 214
9039 -137 76 2 139 415 252 -14 -705 22 417 205 -312 -860 -45 797 -459 -652 -1197 -692 353 391 696 1061
9017 1061 1042 728 -472 -169 -518 48 254 374 62 1397 1821 1294 237 1028 1291 1836 531 1597 1477 774
8997 774 537 2033 1810 1070 1163 687 -589 288 1451 1283 900 1215 817 1090 11 -138 -67 741 637 89 -160
8975 1146 2387 3254 843 48 -461 -440 -844 23 986 1463 246 -520 -166 -642 -954 -608 -509 70 -658 -494 791
8953 883 997 1621 408 1847 1562 1504 1507 1252 343 178 -885 238 1595 1675 649 832 900 430 627 841 1317
8932 1317 1650 611 1486 1938 764 -758 -648 -28 968 6 -859 -1075 62 229 97 732 236 -294 -128 55 262 130
8909 458 226 -109 4 -426 30 858 822 1062 1638 1018 675 1629 1473 871 -403 -228 416 -95 -744 -279 -891 -990
8887 -990 -135 17 -1115 -286 -269 -386 -353 170 -296 978 813 1610 1324 1802 31 306 97 1041 293 -283 -311 -430
8865 -430 415 1239 2329 1015 354 1222 1190 2219 1832 -241 -1907 -390 -558 -638 -1129 -393 -842 -799 -764 -250
8844 -791 -443 33 -28 -427 -165 -588 -686 -780 370 474 410 153 -77 -319 -246 4 295 -371 -589 -39 1473 1734 1387
8821 1387 228 504 -167 -810 -1107 269 1035 1490 1452 1058 606 38 -56 -196 -65 753 226 -66 164 -101 150
8799 1470 701 -242 -482 763 1594 1804 1153 656 -390 387 218 -490 -732 -75 991 1056 798 774 746 664 0 -559
8776 -1315 -546 235 390 1251 1223 -33 -160 113 -23 -37 627 728 792 -874 -1212 -1746 -1206 -249 113 413 346 406
8754 406 1902 2290 1725 1049 429 -619 -1396 -2772 -3481 -2701 -656 1261 2017 2619 2706 2508 2343 2180 2134 1289
8734 1289 1150 1890 2200 2643 3132 3186 4022 4223 4667 4592 4532 4036 3872 2634 2837 3295 4016 3218 3108 2892
8714 2892 2617 2395 2772 2088 774 1875 2172 1582 1606 615 1378 1267 595 791 -121 -46 -561 -178 -186 -323 -180
8693 -180 117 971 2353 2651 1306 245 315 370 826 1693 1125 1350 2138 2081 2380 1821 1583 1146 80 -912 309
8671 897 1276 1305 602 508 749 549 337 277 -214 -503 -805 -650 115 253 729 1649 1837 927 788 818 920
8650 920 872 449 -497 342 1050 1706 688 5 -309 -623 -688 -1257 -927 -1044 -749 392 807 906 1341 1388 2324 2125
8628 2125 2429 2788 1642 709 499 553 65 222 411 376 759 1437 429 360 -247 1347 2019 1969 1401 1718 1438
8607 1438 1739 2024 1599 1696 1680 735 996 1722 987 -193 -531 -1044 -880 -1161 32 1013 1050 685 1037 1204 1819
8586 1819 1261 1287 1657 2006 2261 1436 811 290 -861 -1690 -2485 -1374 -2057 -1977 -1140 -373 -126 -178 62 1116
8566 1116 978 898 465 -736 -798 780 296 1857 2651 3576 2938 2338 3055 3147 3629 3774 2419 1586 2038 2419
8546 2419 2069 2882 1810 1082 -10 -562 -1706 -2098 -2000 -551 337 1318 1348 1863 1357 1689 1622 1162 1175 2457
8526 2457 1674 2258 737 -244 -541 -157 748 1822 543 1020 1503 1708 1015 652 30 612 1299 1020 588 2239
8506 2239 1457 2532 2702 1095 103 -156 -1646 -1684 -740 -45 115 1489 2715 2448 1769 1067 1305 1154 -539
8486 -920 -462 -611 -630 -612 -437 1180 319 274 146 608 309 65 92 -149 25 291 -684 -371 -1567 -1444 -1348 -1245
8464 -1245 -1213 -1283 -1977 -1364 -296 632 1120 2110 1745 2602 2354 2127 2897 3210 3275 3993 4300 4335 4163 4228 3829
8443 3829 2963 1363 400 -102 -1271 -3306 -3441 -4100 -3210 -2835 -2215 -2021 -1179 -418 570 123 -13 -124 47
8423 -450 -1121 -616 472 -635 -1010 -1112 -911 -933 -15 -386 -472 -199 298 -48 93 829 722 396 -461 -1334 -120 -911
8401 -911 -2011 -2624 -1627 -475 436 1248 503 73 -42 -437 -449 -1851 -1680 -1438 -770 -443 169 -240 -349 923
8380 588 1044 1276 858 1856 1660 1055 548 -56 -938 -175 1868 1637 1155 1244 9 -1709 -2231 -2425 -3134 -3956 -4562
8359 -4562 -3185 -2476 -2676 -2759 -3034 -3081 -2394 -1465 -283 270 1195 1105 918 362 607 1463 1457 631 -53 -213 -276 51
8336 278 274 -18 28 360 484 -72 -730 -342 -1131 -933 -515 -127 -341 -952 -1616 -885 -1182 -974 -721 -843 -1226 -1496
8314 -1496 -1777 -1510 -892 -1227 -2181 -1386 -597 318 506 16 663 -100 -849 31 -3 -368 -1026 -1431 -2075 -2086 -1457
8293 -1457 -129 -112 112 -95 -1216 -1723 -1529 -824 -200 -389 -1120 -872 -1126 -1244 -842 -1389 -1799 -879 -882 -1263 -1261
8272 -1261 -1498 -1144 -866 385 888 -416 -400 -899 -843 -426 -794 -259 -528 123 -822 -459 483 986 1939 1945 713
8250 -241 -763 272 777 514 644 -199 -886 -1450 -508 156 1132 737 -175 -266 -408 -508 108 -86 -505 -1382 -738
8229 -738 -1127 -1856 -1727 -487 952 1926 2065 1845 1452 836 591 35 -691 -848 -144 -381 -514 753 889 746
8209 746 -209 -977 -304 -43 -456 681 121 -349 -705 -393 -118 -46 -166 -160 110 568 686 1105 1363 1151 523
8187 -507 -1073 -442 -890 -1551 -1851 -899 -520 -186 -562 469 297 806 1759 1620 471 -62 -343 1315 1700 1209
8167 1209 -169 -1047 207 342 32 472 1046 908 737 1524 1089 1078 1524 1375 355 -517 -699 301 -13 -636 488
8145 1165 716 2163 2813 1573 939 1173 899 721 147 548 680 103 607 1033 878 1394 1167 1560 1132
8126 1132 702 14 -1092 -1618 -1057 -323 1401 960 -22 292 836 -115 -279 -1496 -711 -320 956 456 614
8107 614 -20 -901 -583 -362 -710 -887 -823 -450 -536 -551 -60 568 42 -550 -295 -377 -125 -52 -1399 -1508 -1316 -332
8084 51 352 -445 -389 -87 -321 -596 100 -388 -420 -330 557 -577 -608 -897 -484 177 715 740 455 307 118 -637
8061 -142 -567 366 1180 582 -184 -588 -1057 -495 -410 419 103 587 -520 151 -131 -512 -258 518 262 -132
8040 631 1468 393 -155 -609 503 651 -640 -1010 219 696 954 1221 1212 1712 2667 768 -391 -682 -558 -202 -286
8019 -286 645 220 -584 -18 -931 -617 -881 -928 -1284 -1037 -684 -1000 -458 294 118 204 -388 -424 -106 -76 -1114
7998 -1114 295 -1 -455 168 143 -816 -450 -49 -134 487 315 -81 128 343 1160 1113 1350 870 688 271 1079 889
7976 889 658 766 901 2128 2148 1571 1418 1181 1451 1311 1988 1122 -146 -1039 -514 328 357 -123 -1360 -1675
7956 -1675 -1301 -905 -76 129 517 -325 -212 -492 -328 -1146 -902 -1087 545 1253 490 385 587 1330 1147 348
7935 241 -166 -466 277 517 -106 -828 -180 13 36 505 363 395 570 1170 -245 -996 393 1503 569 402 55
7913 -219 -243 533 -183 -998 -920 -765 -992 -491 -808 -567 633 -358 -1362 -958 -281 -447 -1191 -641 -26 -161 10
7891 629 166 125 518 339 -680 -1373 -1474 43 438 -5 -634 -417 -315 324 1192 829 744 1121 583 981 294 614
7869 614 566 -932 -10 1400 1047 1262 -28 -310 -287 640 238 354 202 122 639 627 -530 -925 -81 191 -667 771
7846 1451 739 680 427 785 203 651 173 42 293 621 -204 -388 283 967 1110 1579 822 -18 293 957 523
7825 523 -568 -432 62 -128 -187 135 -235 46 281 -101 761 435 609 881 748 886 182 72 76 82 -320 -49 -401
7802 -401 -1047 -354 -408 -125 655 756 1102 150 465 -92 -72 219 -159 492 445 251 164 500 229 -373 -566 339
7779 931 1324 2188 2088 608 339 583 382 -726 -614 -890 -302 -960 -431 -1809 -2577 -1540 -776 -810 -677 -610
7759 -610 -385 -795 -908 -686 -80 -24 339 607 1495 1300 799 -127 903 1003 485 98 -30 -536 -8 -709 -928 -819
7737 -819 -451 -835 -418 209 -221 284 519 297 381 -548 -1132 -619 -540 -1055 -495 -433 -169 -1410 -873 -213 587
7715 76 270 153 656 726 62 592 1191 479 425 827 264 -1127 -652 -1307 -1340 -1136 -1260 -783 -148 380 1412
7694 1412 669 504 502 522 454 202 -497 525 1101 455 -14 294 -588 -864 -208 25 -733 -761 -652 -446 -63 -21 509
7670 510 412 428 376 -9 -154 340 770 574 879 1327 915 2198 1295 192 -45 403 283 -198 -529 -811 -1360 -1094
7648 -1094 -1386 -419 673 745 463 52 -733 -117 1252 1077 375 1091 918 1072 86 -150 7 1147 661 1456 317
7626 311 760 2289 2268 1801 1111 184 -296 126 -1319 -200 1194 550 -150 -35 158 854 755 392 745 521
7606 521 -28 509 545 1017 613 390 -146 223 -545 -862 -273 927 634 380 1317 1513 1630 1305 392 347 -491
7584 -827 -616 7 -1347 -391 249 -393 -548 -178 -638 -1711 -2634 -2058 -1258 408 1026 30 -780 -990 -1369 -1422 -1309
7563 -1309 -1078 -1035 551 740 1382 797 -324 -620 -265 -704 -412 -1009 -733 -1192 -885 13 247 437 501 -147 -1148
7542 -1148 -452 635 76 -272 -487 -89 87 -1012 -1668 -1472 -1274 -1539 -1690 -1618 -1232 -1332 319 1747 66 57 1084
7521 1084 870 -669 -1414 -185 -101 -109 808 989 1594 703 -35 -611 231 36 -49 63 1381 982 315 1004 860 1314
7499 1314 1097 583 495 -718 -1214 -1134 -2106 -1733 -679 -415 -1398 -2157 -1670 -627 373 38 326 3 145 -143 -897
7478 -897 -751 -115 -114 81 -114 -16 -377 -585 -957 -456 649 1220 161 27 534 678 235 -489 -852 -10 862 673
7456 673 -386 -1283 -1057 -154 -988 -454 301 1020 1160 968 -67 0 -853 -542 -54 -497 186 -515 -548 -1110 -1076 449
7433 505 365 754 1486 594 502 356 206 371 287 864 28 -477 -289 -130 -527 -1154 -943 -747 -523 -146 -355
7412 -355 -31 620 937 839 130 204 1197 1517 -27 -73 -140 -568 94 358 1645 1630 284 -1117 -140 518 625 -297
7389 -881 -514 -77 -542 -862 -883 -822 -1125 -1265 -1154 -1131 -1138 -684 383 405 187 190 673 798 -119 574 173 -10 -257
7366 -257 -410 -919 -1087 -442 152 497 -275 -948 -35 -225 -524 -727 -289 297 -687 185 -270 -687 -287 -547
7346 -547 323 -889 -2353 -1905 -268 745 913 65 -1110 -1219 -665 -738 -845 -654 41 91 -311 -1334 -1496 -818
7326 -818 -11 257 47 -877 -1164 -896 -491 -896 -49 64 -767 -694 -4 -1000 -562 -324 -17 337 192 -262 -889 -1088 -1598
7303 -1598 -1102 -640 -185 1065 749 891 251 29 -489 -116 332 318 -513 -134 -25 78 -365 -599 -759 -121 1142
7281 533 446 88 140 -675 -1939 -1954 -659 263 135 173 -308 -334 -437 49 -419 -748 -281 622 -328 160 30 -255
7258 932 1317 738 1445 466 -599 -409 -4 394 -630 -1475 -933 -1763 -1395 -1137 -1105 -1126 96 240 -174 54 713 -132
7235 -416 -1586 -719 -46 497 -795 -642 -817 -1092 -494 -544 8 265 660 -117 8 1344 387 -680 -654 364 421 390
7213 390 81 303 76 334 217 18 -139 413 359 251 -152 739 92 401 380 -204 -75 717 925 642 -29 -272 -844
7190 -844 184 -492 -1226 -915 -542 -1183 -744 -1682 -656 -783 -621 -448 -700 -491 1089 580 -13 -70 254 -582
7169 233 177 874 574 643 1153 902 602 -77 -585 -1018 235 592 438 340 -413 -266 152 -183 -651 311 980
7148 980 22 -480 -540 -544 -616 218 -259 -686 -1178 -528 273 -361 -738 -169 638 -362 -609 -895 -252 -707 -1521 -1753
7126 -1753 -304 279 1649 1197 735 664 725 116 1080 637 63 -644 -385 -756 -14 -163 977 392 -157 425 474
7105 474 891 1352 666 449 414 597 372 -249 -506 -520 -1034 -843 1210 1481 1113 1639 1195 910 1491 2092
7085 2092 1318 -21 -1207 -947 -1648 -1414 -1461 -458 -187 -285 461 536 497 883 539 1486 130 -238 -777 -549 2 -1662
7062 -1569 -1607 -688 -429 -1292 -1297 -1416 -1202 -61 906 1193 1295 232 -202 385 1734 1215 919 1560 1443 1617 785
7040 -583 -425 312 -695 -1186 -804 -1265 -318 457 1414 2086 1171 410 210 1142 999 265 154 -186 345 195
7020 195 -722 -1241 -298 -512 -51 539 -675 157 74 -891 -226 -49 1294 878 207 -572 -337 -509 -764 -429 -695
6999 -695 -585 -1196 -1492 -4 683 -970 -1499 -1117 -400 363 423 506 28 -1036 -1550 -1657 -734 -599 -246 -89 -295 115
6976 1499 1411 563 442 -283 -397 996 128 -312 -632 -723 -1220 -1759 -731 -228 -394 -233 -220 -253 -503 -962 -1222
6955 -1222 -1147 -762 -351 -142 734 405 -177 38 -428 -10 1361 711 -370 208 854 1009 -127 -1084 -263 -345 -593
6934 -593 -293 359 -268 162 -231 -897 -1165 -893 164 530 -156 -82 512 226 -739 -451 494 391 -472 -802
6914 -802 -1849 -2246 -1392 74 -292 -274 -44 833 -451 -93 568 413 501 702 1069 235 -288 549 -123 -1242 -953
6893 -953 -205 310 -132 -1353 -1763 -1258 -723 -198 -719 -1271 -704 -845 -993 -874 -613 -379 1159 1033 482
6873 270 160 -1276 -1159 -1096 -1116 -122 24 -66 -56 618 175 -714 -491 -287 384 -527 -994 -757 21 443 -46 -907
6851 -907 -413 596 901 230 -44 -639 -233 -794 -904 255 -241 -1271 -1274 -1016 274 -635 -187 251 -295 -734 -187
6829 -837 -998 -936 -473 -768 -670 310 1337 1461 630 -249 -292 -884 -692 -78 -591 -884 -1222 -1245 -1199 -785 -510 55
6806 375 -493 -407 250 1335 982 938 972 231 89 874 1270 1257 42 177 1965 2428 773 1385 1582 1773 1284
6785 1284 773 -296 -257 -599 -376 -236 -759 -380 -982 -1121 -241 187 -291 -269 -334 -398 113 -1516 -1562 -742 -4 -937
6763 -937 -912 -1426 -1596 -1332 -533 -1701 -1303 -892 -1695 -2838 -1713 -733 -475 -212 -182 -81 125 -152 -754 157
6742 543 -1168 -1428 -591 96 -802 -2441 -2165 -1490 -688 112 -1339 -919 -1068 -510 56 397 1160 1225 759 626
6722 626 -1059 -942 -492 -1308 -1152 -601 -701 373 344 -431 165 271 -127 -335 105 417 191 -240 -1084 -315
6701 -4 -713 -323 49 -319 226 -340 -1138 -1484 -725 -1440 -1351 -1544 -2518 -1381 -696 -600 -47 57 72 186 339 -282
6678 275 266 -141 -702 -468 -634 -657 -615 926 947 233 296 420 154 208 404 1111 232 819 257 93 124 -591 -1002
6655 -1002 -1324 -1457 -1348 -2085 -1534 -952 -811 -285 192 -750 285 801 808 84 208 -449 -300 684 1372 1171 -526
6633 -513 -1355 -1774 -1384 -668 225 -1014 -2083 -1947 -1517 -1357 -393 -544 -247 371 684 831 966 351 -476
6613 -1275 -1280 0 486 -531 -892 77 179 -36 566 11 -598 -701 -178 -512 -585 -240 -108 -954 -2007 -2019 -1074 -1907
6591 -1907 -1895 -1742 -1286 -61 1174 584 -403 -66 186 482 991 1208 381 -886 -617 -288 683 631 -466 -273 -224
6570 -224 697 916 838 435 -185 452 186 -328 -391 -374 190 -88 -691 7 1575 1294 895 1107 626 914 432 515
6548 515 909 374 44 -616 830 715 288 210 -583 -471 -766 -516 -498 -142 379 572 607 259 -353 -89 -450 -1395
6526 -1395 -1469 -1386 -777 -151 -1649 -2306 -1450 -1215 -1037 -1268 -868 -303 -774 -797 -1354 -1442 47 -577 -503 -45 595 776
6504 776 251 649 1431 1228 826 -261 -1306 -1327 -1040 -1268 -1742 -1514 -1694 -1504 -742 -481 -208 -514 -193 -692
6484 -692 -701 -1083 -1133 -1925 -744 -107 -372 543 1021 1359 1209 -457 -751 -1474 -1305 -1058 -1166 -642 -1583 -1451 -743
6463 -743 -1974 -1189 -556 -28 -677 -155 398 179 -266 -1054 -1881 -1869 -1144 -1105 -1121 -1787 -1513 -1119 -963 263 -783
6441 -478 -744 -840 -1769 -2070 -1554 -887 -367 306 -75 848 1099 1005 809 398 -1201 -1938 -1280 -144 288 -253 -247
6420 -247 -428 -746 -503 -615 -369 186 843 -1286 -730 -444 15 575 968 1519 1159 -480 -1317 -859 -1017 -1517
6400 -1517 -1847 -1377 -720 -748 -1240 -1723 -1888 -1411 -1037 -1109 -831 -714 30 -248 -566 -380 199 -128 409 -584 -980
6379 -980 -120 -38 -130 -615 190 -296 -704 -651 -1087 -1509 -1625 -1390 -387 545 -225 -152 -195 -165 -578 -664 -502 75 191
6356 191 86 -186 -252 -1104 -1575 -1389 -343 -362 -991 -603 578 -294 372 -446 1338 2350 2740 1729 602 -332
6335 -232 168 132 -538 -1658 -1962 -1566 -1296 -217 175 -233 -624 -350 -686 -469 -641 -280 -307 -1351 -1350 -923 -921
6314 -921 -452 -392 760 351 748 1215 991 -281 -940 -1462 -485 -55 -390 1062 528 409 288 -419 -78 -335 -519
6293 -519 -438 187 -445 -836 -135 708 886 854 651 71 -397 -190 -704 -119 64 210 -267 -883 -943 209 605 691
6271 691 379 1277 1329 1134 49 817 1889 1466 720 1186 854 543 935 1705 1233 442 -467 -262 -133 676
6250 30 -507 57 103 -592 -976 -1641 -438 282 920 1827 1199 561 788 -351 301 -431 -1048 -142 596 272 129
6228 -421 -546 -313 40 -323 -600 214 1375 1285 218 -644 -478 202 468 -185 -603 -1274 -496 -158 -1055 -1387
6208 -1387 -831 -420 -350 -1073 -1272 -963 -496 -79 136 -695 -1207 -889 -589 -797 -403 287 365 80 -123 -248 -341
6187 -341 -410 490 516 347 720 -832 -1715 -1155 -896 124 805 689 875 675 -631 -1428 -964 -1358 -114 193 -301
6165 642 195 -39 -816 -108 -165 -758 -1843 -2467 -1939 -1114 -549 -1562 -1009 -818 -583 -222 281 -684 -602 116
6144 651 566 386 -1071 -1257 52 391 -111 105 113 -512 -196 -91 -457 15 289 -972 -1339 -1226 -1195 -403 -273 -1157
6122 -1157 -731 -775 -1180 -787 -519 -1400 -1992 -1580 -306 96 522 1396 1384 713 1377 1232 409 484 1477 864 397
6100 -156 -210 201 79 525 411 396 -379 739 66 -360 -399 48 227 -150 -151 -763 -1557 -867 -1565 -1254 -419 369 -162
6076 -1 -720 -1337 -1164 -343 405 57 -529 -1173 -1047 -963 -1046 -641 -371 -1547 -2726 -2453 -767 192 353 -762 -760 158
6053 281 266 53 -243 -259 -105 -235 375 -822 -547 -515 -226 -649 -533 -1305 -1508 -1073 -1548 -2111 -1936 -1559 -1594 -1368
6031 -1368 -1037 -1288 -2106 -1967 -1536 -987 -925 -328 157 435 1179 313 -116 183 -347 -371 232 566 1675 1480
6011 1480 652 749 1653 -339 -1210 -571 -260 -105 273 -169 -425 197 414 571 687 1141 1376 791 1268 841
5991 841 -410 -850 -679 -391 -402 -557 -220 -1448 -1077 -1014 -309 -1372 -1967 -1230 -58 -931 -1480 -2008 -1225 -2065
5971 -2065 -1645 -830 137 593 -4 -279 -198 -112 882 1128 1517 580 246 -212 469 119 -490 86 1551 1238 211
5949 -15 -261 -322 155 -404 591 431 589 476 -9 -1028 -1075 -510 -151 -888 -1218 -567 -523 -1123 -1484 -598 1068
5927 -130 -485 -315 270 127 -1013 -831 -1218 -1359 -105 -468 -1424 -1119 -127 307 -1314 -1407 -2111 -2036 -1335 -584
5906 115 -338 -288 -1048 -723 59 649 -120 75 692 114 53 -209 -1149 99 -982 241 573 -824 -1261 -632 -470 -342
5884 -342 -500 382 -674 -1083 -983 -1205 -1239 -1288 -1627 -1805 -1790 -1447 -611 1218 542 -46 44 -680 -700 -548 -753 -285
5861 -953 -422 -92 788 146 -670 -511 259 -241 -391 60 -83 498 -136 -875 -1199 -1252 -152 -604 -1205 -1432 -2310
5840 -2310 -2076 -1245 -1643 -1307 -2172 -2590 -1566 -1147 -275 250 -733 -447 155 698 1073 354 -125 -251 -675
5821 -675 -857 -51 944 691 16 -906 -1259 -465 -589 -853 -311 275 -646 -1167 -685 -706 -1044 -1278 -1809 -1798 -376
5799 -74 -450 97 57 -854 -1233 54 165 -585 -1445 -1550 -1035 9 83 -1228 -1640 -1119 -724 423 -897 -1300 -758 -399
5777 -399 -795 -533 912 555 -643 512 1002 144 563 1022 716 14 -285 -263 13 -408 -917 -431 278 755 550
5756 550 522 581 350 439 -944 -846 -718 559 642 13 -1049 -515 675 754 281 -52 -399 402 1015 1204 -14 -548 -831
5733 -831 -1201 -911 -918 -620 -560 -907 -1087 -3 1153 472 -224 -1114 -2073 -515 -163 -1221 -1752 -831 -950 -1204 -857
5712 -857 -368 -402 -1229 -195 1714 1780 276 -698 -701 -926 -689 102 1474 617 -216 183 403 372 39 392 -348
5690 -283 -189 693 523 -1 -260 -276 -1654 -1428 -1321 -479 297 158 455 289 166 300 -247 -676 -172 304 390
5669 390 544 172 -433 -384 163 -426 -850 -561 -1027 -281 11 -292 -1379 -1192 -515 -314 -1077 -1547 -1532 -1227 -675
5648 -675 -939 -1448 -1567 -986 157 411 416 -32 -661 -477 -122 -18 -375 -304 671 8 -1402 -1365 -779 -213 669 -737
5625 -1475 -365 -1201 -1223 -804 -400 -75 -678 101 256 150 -289 -471 -546 -1496 -1723 -999 -613 -399 -7 -233 185
5603 -586 -1159 -641 -487 -906 -79 890 1312 -249 473 879 -503 -602 446 1065 1084 1596 561 -498 30 997 168
5581 31 776 1250 28 317 20 -853 -1049 -1412 -852 -283 160 370 36 -626 -379 -595 -58 -281 -487 -351 -996 -1105
5559 -1105 -1417 -1862 -2655 -2578 -1430 -296 -188 -380 -386 136 -474 214 2190 2695 1731 850 964 1399 -30 -1372
5539 -1372 -1007 -193 -310 -115 -203 227 11 517 680 925 124 476 252 250 -605 -36 369 392 -232 -657 -1468 -738
5517 -738 -319 -35 -334 545 1049 281 -186 -1190 -1630 -1063 -792 -794 -842 -1112 -482 752 -307 -285 109 808 1167
5496 1167 52 -477 -180 301 37 -1329 -420 -657 -292 -1029 -241 -943 -6 529 445 -259 -316 124 279 -200 -983
5475 -983 -1038 -594 -768 43 477 998 -336 -111 -173 99 164 680 450 -28 511 60 -392 262 -849 701 301 -390
5452 -1213 -797 -557 139 518 1543 863 279 -302 -484 -580 -906 -1189 -1387 -671 -45 128 1043 959 -1183 -1609
5432 -1609 -708 -78 869 743 404 -164 -897 -810 322 1098 217 664 285 -343 1040 908 1054 1877 1304 317
5411 643 37 384 -427 -697 103 -836 -1286 -1096 -1113 -1121 -1118 -1156 42 1169 1397 2134 1864 2338 1749 923 682 688 673
5388 673 1201 851 231 122 -25 -582 -721 -1071 -930 -958 -1316 -608 -888 -439 30 314 -422 -689 -373 -519 -9 176
5365 92 320 700 572 221 -961 -1397 -1003 -1142 -1112 86 741 161 -246 272 -827 -610 -1297 -1346 -1166 -567 370
5343 258 -70 334 378 489 617 -129 -137 93 -532 -183 680 434 -160 256 -588 -795 -1182 -914 -350 514 708 387
5321 387 -457 -588 37 697 -147 84 -541 -1250 -451 398 505 -67 -718 -1339 -1513 -1303 -608 -1584 -1494 -601 -348
5300 -348 -923 -205 418 -67 -501 664 364 -107 -227 -437 -1127 -1458 -974 -1263 -507 -286 -47 587 -91 871 1054
5279 1054 300 17 331 1171 443 -53 -239 -776 -629 -686 -791 -1454 -1030 -741 -1070 -1015 -1010 -564 -181 -144 -49 19 -360
5255 -770 -914 95 -610 -243 -703 -1375 -1263 -1311 -1404 -1954 -2224 -1100 -669 -282 -775 -1056 -950 -853 -336 -71 -360
5234 -360 -1074 -1114 -600 -696 -1644 -1151 -532 5 -83 574 -256 -901 -807 -908 -935 -756 664 624 -273 -552 -1645 -1322
5212 -1322 -380 734 -397 -1033 -1762 -1373 -267 537 576 608 -197 -76 275 492 -519 -1068 -550 -720 -1572 -1433 -352
5190 608 953 845 -157 -626 -235 218 -115 -331 -166 436 -387 201 503 40 -243 0 552 600 868 -734 -102
5168 -441 -894 88 1523 701 411 45 -14 860 830 1262 1326 533 -360 250 -324 150 409 482 784 554 -568 -917
5146 -917 -1786 -2173 -692 -446 -787 -1657 -758 -391 -617 -169 -578 -256 338 -771 -1594 -669 -817 -620 -677 -177
5125 -1021 -658 -956 -890 -1316 -360 -41 -473 -1801 -2132 -1997 -1240 -177 180 -410 -241 510 -688 -1101 -352 106
5104 223 527 2202 2210 2684 1762 1526 989 1006 1484 1039 1037 658 -613 41 315 360 618 217 -639 -227 287 -459
5081 -1852 -2205 -1429 -42 -146 -333 -1226 -416 -695 -1338 -1727 -1441 -721 -112 -1137 -1696 -1608 -452 -331 777 -417
5060 -2243 -1938 -1369 -872 -1290 -1419 -787 63 333 -1523 -842 -1255 -1082 88 351 -262 -693 -907 -237 1247 1890
5040 1890 1145 197 162 988 1565 1287 1258 252 -489 157 342 -816 -935 -440 -317 -185 -894 -694 -862 273
5019 613 886 -180 281 519 190 95 971 264 -6 942 1471 1137 783 -192 184 686 713 705 1323 1225 1590 1436
4997 1436 993 766 913 724 180 -656 -871 -355 -11 -270 -440 -475 -637 -855 -645 -1467 -1219 -498 -269 294
4976 318 -236 -646 -1513 -1266 -1504 -686 -922 -213 81 -1391 -273 973 180 -469 -926 -312 -627 -575 -322 -368 -261
4955 -261 -534 -326 516 -375 -1464 -2109 -1319 -726 -232 824 290 -848 367 997 -184 -389 -546 -1313 -1571 -1511
4935 -1511 -859 -923 -770 -589 -322 345 33 948 836 618 509 248 -563 -340 -497 -1456 -1837 -1791 -564 -719 87
4913 495 79 292 -153 228 -885 -1341 -1020 -1155 -1134 -1676 -364 220 -612 189 -252 -385 -345 -667 170 426 386
4892 386 585 -391 -532 -184 375 734 130 425 469 750 692 24 201 74 426 438 -682 -1006 -592 -168 -110 -479
4870 -479 -921 -340 58 -22 -509 -581 -234 1043 863 444 -1198 -1485 -292 330 1 -545 -976 -1036 -379 250 743
4849 743 -73 -1859 -2209 -964 -362 43 379 33 -505 -554 -555 574 493 55 440 531 -678 -1345 -1366 -1057 -1292 -1170 -1229
4826 -1229 -524 582 342 1020 802 811 1218 1655 1242 582 -641 -843 -733 -374 -787 -1012 250 405 -8 -900 -311
4804 -94 291 -685 -2162 -2022 -1905 -1693 -1511 -398 -288 -273 447 27 -836 -287 -646 -467 -77 770 721 339 162
4782 -769 -140 -403 -498 -689 -165 -808 -216 -1099 -906 -351 -307 -524 -921 -1249 -2032 -2078 -1979 -2165 -2020 -775 57 -614
4759 593 712 -44 -522 -1072 -1344 -1958 -995 551 -172 -1149 -585 -612 -357 266 -418 -556 -862 -1125 -1010 -470 -350
4738 -350 140 144 175 -294 -1137 -1704 -1470 -1332 -1056 -712 738 1504 1394 388 666 768 -417 -1045 -1811 -1662 -194
4716 1421 1401 870 492 -362 -465 -561 -491 293 189 -292 -1056 -812 268 -555 -663 -914 -1022 -55 730 639 371
4695 371 -76 -114 324 -44 -347 381 353 -383 -1105 -111 294 251 -330 -623 -462 -1320 -732 41 173 -468 -898 -711
4673 -711 -170 -679 -43 1062 529 -235 -1031 -1161 -1396 -1338 -883 516 707 58 -728 -623 -908 -169 275 -104 45
4651 285 426 567 -60 -480 -1008 -571 -532 179 -237 -903 -1157 -1039 -1494 -1613 -1682 -747 -433 98 -1143 -819 -283
4629 -376 -1078 -1394 -1254 -1084 -493 -30 98 -111 -373 -1497 -1298 -514 -851 -1219 -1291 -845 -379 -627 -564 -485 -73 320
4606 -579 237 -386 -709 -1401 -377 -458 -764 -325 389 681 815 644 314 -99 1285 765 291 -803 -985 -343
4585 98 -163 -854 -1074 -218 -450 -725 -777 -944 -1359 -195 -361 -688 -857 -1601 -1969 -630 -378 -1044 -848 185 18
4563 418 51 189 -683 -140 679 266 631 1409 537 220 83 684 1022 1283 1094 1550 1274 -181 -1473 -1612
4543 -1612 -311 -872 -1483 -199 742 -73 593 878 -187 -1082 -1832 -1381 -1107 -75 1207 1091 900 687 918 -351
4522 527 943 651 369 498 295 -291 122 -107 -169 -469 152 -1151 -2930 -2361 -1925 -2025 -347 -302 -1005 -418
4501 -338 -692 -90 -315 -1125 -1371 -1425 -1238 -1129 -549 572 978 697 -366 -1241 -627 356 -272 -491 13 -448 -1165
4480 -1165 -226 -436 155 -599 -2024 -869 -687 -266 119 1272 1526 264 -95 -176 218 -956 -1085 -1031 -1183 -357
4459 381 -308 -598 -1878 -1414 -237 28 172 -73 -405 -507 -92 37 250 -472 -1116 -1041 -1293 -1211 -1293 -1453 -1559 -1697
4437 -1697 -2220 -958 -668 -698 -547 239 1197 510 -1088 -1277 -261 -103 -340 -44 -230 -591 -643 -412 21 62 -218
4415 181 -231 -403 205 -155 -525 -767 -1133 -1353 -1718 -1081 -337 -144 1261 347 -1026 -345 507 430 262 1716
4395 1716 1274 608 269 218 728 1507 2103 1364 -106 193 1311 581 -1042 -333 -661 -221 -553 -161 -40 358
4374 828 678 20 246 -575 -401 537 921 734 68 291 159 45 709 343 -642 -1059 -571 -929 -574 1100 765
4353 765 470 -29 -1139 -781 -397 1029 1431 345 665 1139 903 -308 -227 -290 827 2119 1935 987 1302 988
4333 988 237 -441 114 90 -62 -595 -862 -522 131 21 49 -776 -770 -1293 -255 -1577 -1584 -1596 -730 -907 -1485 -818 -1093
4310 -1093 -1226 -949 -1330 -1034 -618 -106 152 -1012 -691 320 -16 -297 -663 -485 -349 -547 163 -141 -493 -751
4290 -751 -533 160 34 53 412 1529 2430 1643 -638 -837 -716 -376 -428 93 -1057 -872 -514 315 501 285 -1048
4268 -877 -652 -119 -325 -387 -49 -456 -533 229 454 139 -308 1074 1660 739 -478 -875 -1094 -1047 -672 -266 -527
4247 -527 -511 -627 955 937 1064 -657 -1100 -1277 -536 851 238 821 55 -1445 -890 -1119 -24 -225 -225 179 -391 -1074
4225 -1074 -248 382 248 -835 -306 467 -233 38 -87 -98 -168 -343 -594 -913 -387 -291 -52 116 646 906 593 188
4202 270 1157 1625 1220 1087 27 616 -100 -366 297 229 -313 -274 -642 -615 -919 -861 -118 180 -30 -634 -1443 -1292
4180 -1292 -845 91 987 1143 669 1792 1561 -427 -1585 -1901 -1173 -1412 -1881 -1336 -1024 -1249 -1117 -907 -1813
4161 -1813 -1478 -1823 -1733 -1357 -68 148 -1082 -605 -5 -626 -1092 -1984 -1775 -887 127 140 -442 -512 74 -135 166 -113
4138 -471 -232 -563 -841 -135 -23 -38 -52 17 -1196 -782 -379 979 624 647 240 -27 132 -163 -108 -342 -592 -888
4116 -888 -1048 -314 -577 66 299 1077 567 -344 -75 200 351 -459 -506 906 444 -259 -478 -430 -496 -784 -1339 -250
4093 -75 760 247 239 156 -33 193 190 -422 -353 -1055 -906 -111 25 -250 -235 -601 -1262 -163 391 630 536 -419 -220 -307
4069 -307 128 255 729 -346 -459 299 527 460 -492 -112 590 664 1531 1104 24 388 36 -1150 -752 -612 -602
4048 -602 -935 -334 312 288 513 630 1313 1821 1371 362 322 -9 -59 835 1172 1361 521 6 -1233 -261 -738 -1355
4026 -1355 -250 -446 615 -124 61 476 -890 -371 227 350 856 -291 -865 -420 -1111 -689 790 1175 406 -635
4005 -911 -1545 -1302 -84 215 454 -821 -1138 -92 259 1119 1543 413 97 728 1508 644 -907 -895 -815 -1165 -945 -1212
3983 -1212 -681 -1012 -1155 -1257 -400 303 -121 -602 -1039 -525 -634 -938 -1260 -866 -837 -374 -796 -217 -620 -598
3963 -598 -595 -61 -251 -480 -72 -158 -208 -213 -773 -147 -3 246 -79 -223 -73 -88 86 191 -452 -668 -300 430 1232 1425 113
3937 166 472 376 233 -262 -839 -437 497 -16 -443 539 683 -132 557 811 688 321 12 271 283 295 -545 -266
3914 515 1022 1278 842 -539 464 362 261 6 518 799 1250 1389 1412 850 514 169 118 -162 -1488 -2565 -1375
3893 -1375 268 710 423 1473 1276 1036 1086 635 1099 1952 965 58 -457 298 -513 -714 1029 1690 2266 2667
3873 2667 1363 923 573 509 323 100 345 369 214 162 732 490 -111 -116 -450 -982 -1172 -231 -7 188 567 720
3851 720 -25 543 -86 -11 428 1145 1204 1243 388 779 316 -309 -140 137 663 -357 -137 162 664 1500 -7 -381
3829 -381 -202 1228 770 521 255 -454 -1145 -462 -1090 -1071 -1444 -1679 -1815 -2243 -1921 -647 -233 -132 -889 109
3808 1089 1294 -50 78 -1 66 -26 -803 -885 -162 653 637 230 -104 -403 277 362 -223 254 188 -95 -91 -1110 -364 -1105
3784 -1105 -812 -283 -773 -716 -456 -737 -543 -643 -225 399 222 -296 792 360 945 641 1354 1400 349 286 816
3763 816 299 -64 -104 -461 315 763 473 -403 -144 -716 -926 389 880 392 44 -112 -258 -573 297 783 802
3742 802 -61 -887 -214 -231 195 94 -27 420 893 336 -231 -67 692 613 -124 -173 748 615 75 -706 144 -158 -384
3719 -384 -541 -1081 -1139 -911 -543 -731 -462 161 -231 8 -20 12 -230 -440 -528 -494 -224 -258 391 993 604 317 660
3696 660 706 255 -432 -814 -582 -465 -66 -1169 -364 -313 -653 -584 -155 0 -439 -417 -416 -489 -442 -230 -1585 -1012 -162
3672 -326 -225 6 1214 424 428 920 1026 548 1014 1035 -425 -1145 212 1368 1299 1674 2053 1533 193 -7 655 316
3649 -102 691 -106 67 -364 -306 409 626 -551 -892 -391 459 260 -724 -656 -1267 -375 146 -474 -870 218 395
3628 395 -412 -1347 -914 -88 -142 -1096 -2458 -1653 -545 52 -5 221 50 -855 -58 500 -902 -587 -283 161 -64 -732
3606 -732 -432 -355 276 186 152 -502 -879 -916 -1170 -1097 -1365 -1167 -326 -686 1119 114 -1080 -364 -109 -239 -556
3585 -556 -486 -1165 -1462 -1211 -501 -451 -744 -994 -41 401 765 832 -108 -544 -174 352 -125 -423 -75 -290 -932 35
3562 252 -578 -51 -1757 -2146 -2284 -915 -565 -988 -2039 -1524 -861 -1094 -1736 -514 -725 -667 419 1051 191 -199
3541 -83 -64 -1164 -464 499 232 -383 -1105 -866 -1285 -841 902 1181 985 393 547 475 40 -664 474 1863 1124
3520 1124 548 718 485 238 124 409 219 18 82 334 990 298 -1130 -223 -444 -472 423 928 -252 -51 -145
3499 -145 -476 -822 -1442 -677 -850 -986 -829 470 274 -1092 -1266 -1841 -1273 -163 -300 -434 -612 -483 30 -30
3478 -106 -479 -264 232 1351 1134 728 974 732 896 626 -680 -176 -41 -506 -601 -1213 -779 -356 488 307
3458 307 -1037 -907 221 -453 86 580 880 957 1045 168 873 459 158 -477 -1671 -1737 -618 178 -615 -1199 -703
3437 -703 -1612 -1507 -1361 -498 -381 -219 645 659 55 -3 -48 -596 -26 -567 214 -434 -1291 -325 -445 -1344 -1354 -117
3414 492 805 860 300 -170 -145 234 1478 999 718 257 -153 571 538 986 146 146 -644 230 -156 -849 33 621
3392 621 1270 998 1067 1007 687 269 1441 1782 331 1018 449 173 -646 119 -182 75 779 807 440 805 144
3370 -78 324 -192 -1335 106 764 429 549 854 1087 1139 391 247 630 564 -543 929 1084 1214 1283 1634 1158
3349 1158 -284 -536 -400 74 668 147 -1049 -88 589 73 841 612 -776 -485 -626 -399 139 -588 -1199 -972
3329 -972 -936 -1152 182 329 705 516 -500 -926 -633 42 1186 661 -67 -616 -1037 -103 432 -454 -973 149 1258
3308 1258 796 -398 -792 -787 -456 -664 -647 -1149 -452 442 712 1025 919 258 -580 -1925 -1658 -855 -409 287
3287 -479 -1349 -1930 -787 -419 -369 143 344 -411 -363 -63 -670 -607 439 1154 782 234 735 -277 -596 -86 701 1015
3265 1015 1372 1497 1581 1200 68 -376 878 1763 2022 1355 800 -163 187 53 -50 490 615 495 305 -91 1102
3243 2044 1953 1128 502 698 928 766 351 592 1174 816 1440 1169 329 -592 -865 -124 639 485 438 11 141
3222 141 -336 196 1094 322 319 205 -1441 -1191 104 659 -601 -8 278 -557 -306 -38 -556 -206 288 -139 -234 512
3199 -325 -226 185 -552 -1162 -699 260 684 315 -681 -1368 -1501 -1817 -1400 -279 -415 -456 -480 -958 -806 -1994 -1915
3178 -1915 -750 -42 981 641 -687 -406 -217 287 648 567 274 -638 331 1137 1030 687 -214 -309 -176 99 145
3157 145 984 947 264 60 -397 184 -505 -412 -118 656 604 170 -48 -203 236 -73 -9 658 4 -66 1228 1008 879
3134 879 1097 517 -357 -243 -88 367 974 100 472 1779 1450 426 -332 545 789 401 -158 -6 -7 -344 357
3112 1520 1103 610 309 334 -46 361 942 1403 397 476 882 -989 -385 1263 1041 954 481 680 888 -33 -271
3091 -271 -254 34 -51 -110 36 660 29 -534 259 816 763 311 -390 -1327 -1232 209 1218 1537 1054 818 446 254
3069 254 533 410 63 -413 -1170 -1131 -460 -552 -670 -171 -253 -903 -1485 -633 591 1221 376 -426 -903 -386 -354 -285
3047 -285 -166 753 917 161 -768 -1621 -812 -315 134 446 752 -178 -1601 -925 -218 -271 -597 -801 -661 745
3026 391 -290 -310 -257 -36 409 904 631 789 1220 240 -146 -991 -570 -904 -9 254 -318 -116 -24 -552 -328 -971
3004 -971 -1278 -528 -207 -882 279 48 -1092 -1036 -702 45 559 360 -168 -922 -1051 -902 -151 368 635 263 -17
2982 41 111 479 772 520 1075 2236 1434 251 181 108 -908 -523 -44 -897 -470 -138 412 -268 -1648 -963 434
2960 1556 884 221 6 442 1656 2392 1131 764 1374 1576 1401 425 541 367 180 -80 -545 -1136 -884 -343
2939 -478 -725 -674 -758 -84 -373 325 162 -226 -738 -1443 -452 597 1449 572 -16 957 1105 670 -528 477 1123
2918 1123 437 415 -240 242 480 -313 -685 -722 -1194 -1841 152 526 306 -464 -1371 -1212 -899 42 986 1502 2406
2897 2406 1652 559 93 113 304 1088 1153 866 989 717 32 -402 -1172 -1831 -1501 -774 -493 1059 236 -925 -977
2876 -977 -522 -712 106 -78 237 119 251 -329 330 718 267 539 414 -857 -366 374 483 302 -30 61 -478
2854 -506 -402 -910 -804 -845 127 40 -1063 -1020 185 518 -169 -730 -48 -223 -39 -193 -696 -5 243 -739 18 -715
2831 -129 -34 1236 1271 486 716 372 568 1030 252 215 -4 0 433 484 835 788 660 -547 -517 66 -42 1071 -1218
2807 -939 -255 21 -671 491 12 -896 -45 1129 -40 -169 -153 -890 -449 789 18 -1019 -384 399 1599 915 300
2785 418 347 -96 -568 -179 1273 2655 2104 2015 1643 1368 961 307 -66 -29 504 918 676 302 1662 1355 1384
2764 1384 1614 1715 1095 655 1415 1835 1456 -84 206 618 1602 810 162 165 730 283 370 385 -15 -72 -414 -332
2742 -332 -940 -1009 -755 -280 407 480 888 1495 553 415 214 -84 -981 -1682 -1096 -1114 -883 -554 -69 792 892 -193
2719 -119 238 143 1382 893 111 -233 -949 -1447 -961 -578 -1254 -612 -73 5 203 666 737 1460 1557 565 56 -198
2696 -278 -1034 -1526 -841 -1196 -490 0 352 -117 -250 52 294 256 -302 423 -717 -469 137 593 97 504 321 675
2674 675 363 1150 490 1164 1052 396 -183 -316 -672 -2026 -1281 -788 130 -393 -453 95 205 556 419 122
2653 147 500 428 791 926 229 -988 -380 496 -119 -420 72 -168 -40 -48 205 534 1066 690 185 516 627 297
2630 340 -275 119 281 1047 39 -305 -284 -184 78 576 531 523 467 1311 1476 1228 1116 802 834 570 60 -146 -342
2607 -342 -648 -266 -1325 -629 -104 -698 553 1320 974 372 181 -437 215 480 -145 -536 -407 104 431 504
2587 504 1216 1291 1023 1084 905 -1 117 300 106 112 -351 -182 871 1154 117 759 1628 779 1002 270 1195 1285
2565 1285 124 166 1207 1115 -145 364 -557 -577 -51 0 -130 -296 -239 374 706 -93 9 218 -199 -551 -62 -926 -1343
2542 -1343 -934 -463 -267 -1022 -1414 -1029 -250 525 276 458 775 392 123 789 97 -36 469 812 627 1082
2522 1082 282 -462 -504 303 295 14 -753 -41 511 -982 -316 907 683 1559 653 -152 -281 -576 -839 -702 -208
2500 10 -374 -959 -1239 -402 -416 135 -82 -227 78 767 1344 1925 1386 1152 880 368 134 -356 -350 5 562 1009 929
2477 929 874 -289 -105 69 -87 -541 -441 -487 -962 -1280 -273 882 514 1076 1100 357 555 607 593 750 730 526 572
2454 572 62 -431 -706 -738 -618 -1091 176 1178 981 987 650 767 557 -238 794 2419 2479 1654 -225 -483 -1092
2433 -1092 -1506 -1537 -431 323 49 226 -636 -599 88 384 18 459 552 -621 -206 830 1037 1304 1385 964 -560 -744
2411 -744 637 1091 1286 476 350 -298 282 168 211 279 -596 -993 -416 -320 1049 1192 1021 1382 616 545 885
2390 885 165 -621 -788 -418 -81 -312 -327 505 -8 -194 -439 64 404 -525 -319 406 290 571 -910 -1234 -666 750
2367 78 -553 -204 -60 -373 -28 81 1022 1014 1189 301 -733 -4 649 -240 -721 -545 -1148 -364 125 -678 -447 31 -517
2343 166 1176 1782 1337 -79 -705 -160 638 -570 -498 424 1280 790 1264 1458 407 -85 995 303 -542 -1049 -1009
2322 -1009 -788 -891 150 979 875 919 1456 1173 954 333 -308 636 696 -115 60 89 18 279 -137 166 223 5
2299 -714 -918 254 -31 -436 -104 154 619 372 -410 -211 581 -462 -753 28 501 1067 538 -302 -954 -466 -122
2277 224 166 455 96 15 810 -539 -402 -1384 -805 395 206 1352 865 -81 -633 -461 -189 -523 268 492 25
2255 -1145 -873 -573 -681 572 742 861 -188 -1130 -439 -100 117 459 1926 1399 454 219 647 315 290 -238
2234 -203 -110 181 -776 -1469 -154 93 -223 10 -243 -314 -225 -684 -525 77 777 32 403 164 -6 249 260 -427 -572
2211 -572 982 362 -746 -854 -30 713 706 1344 605 722 1000 -482 -1149 -244 47 -104 407 1206 861 1464 874
2190 874 790 1338 1769 560 201 352 1081 1353 671 -1214 -1771 -507 -317 278 -312 -950 6 -19 -834 -1685 -1565
2169 -1565 88 834 -140 98 239 87 493 1395 1233 739 -27 1520 1378 873 953 1363 642 211 186 709 319
2147 815 564 280 345 -269 -791 63 -371 230 -471 -595 232 -232 -63 85 48 923 902 968 936 252 -1223 -109
2124 248 562 603 -52 365 1097 705 819 121 -677 155 160 339 -281 -926 719 591 799 426 403 613 1085 1258
2102 1258 811 1005 126 -1158 -1057 -544 -844 -329 634 777 454 -129 356 756 1237 51 -474 740 228 -640
2081 -713 -789 -433 100 359 200 -409 -1886 -1453 -86 1563 1130 1022 56 68 -772 -817 673 272 -521 118 -9 -783
2059 -783 -662 -286 -39 -241 853 1100 -220 -949 -959 525 1439 560 -161 -638 -1079 -1249 -1072 -1405 -1237 -527 28
2037 924 -12 -937 -1399 -874 32 600 1334 1114 -148 412 -183 -1594 -1410 -1344 -1176 -1100 -682 -292 326 738 -267
2015 -1238 -1489 209 359 327 -39 -186 349 609 -160 -123 -677 -596 -310 -702 -581 -405 -812 -250 445 785 -5 109
1992 123 -249 -1143 -411 -347 -479 -366 -66 613 1133 116 -1543 -2275 -896 -175 245 555 848 354 761 1109
1972 1109 917 593 979 888 1807 834 -179 570 1555 1403 1447 647 227 521 100 246 1073 543 1458 1255
1952 1255 502 326 839 791 501 354 150 1022 313 485 573 15 -565 205 856 909 255 -239 158 681 1347
1931 1347 932 1027 1281 586 -270 -335 -407 312 199 109 -1204 -2186 -1609 -1182 -105 711 683 464 -229 -756 -582
1910 -582 -428 -917 -228 -261 -787 -1360 -528 -863 -387 571 154 -294 655 892 328 685 1683 1939 1904 1415 547
1888 610 476 241 723 1082 205 172 10 67 -124 641 1301 927 100 -267 -309 -54 -243 470 1641 549 74 167
1866 167 624 928 716 434 -715 140 250 -898 -767 -8 -95 -422 -283 -254 -482 114 996 1856 1522 2012 1496
1845 1496 1533 1671 118 130 762 600 852 1165 1320 1785 1818 1142 1209 864 1536 1344 1917 1956 1536 483 -713
1823 -34 -422 -182 -577 -1255 -1881 -861 -211 -37 443 617 -13 -497 249 427 439 627 2101 2693 754 88 376
1802 376 407 212 234 192 -239 351 786 930 591 1264 731 952 1309 -71 -716 -826 -441 -551 -397 873 1749
1781 1749 1839 1196 362 51 -541 -1231 -464 -448 -857 -538 1264 700 1180 1282 500 1138 540 460 1169 268 -450
1759 -182 237 -495 -292 23 389 207 772 1321 1375 38 250 -1151 -1286 -7 500 275 290 -529 377 1020 1000 -405
1736 -31 162 -405 -1008 -555 -1174 -877 761 1158 884 570 946 663 188 479 403 1220 1431 883 590 169 1039
1715 1039 796 764 1238 623 0 -1077 20 179 -297 -264 -83 123 -173 86 94 747 815 -528 -347 634 552 -28 924
1691 954 1140 719 1196 255 46 -89 325 -59 -376 263 533 1618 1422 631 743 -58 -1360 -914 -63 -314 -479
1670 -479 -1042 -833 656 1926 -196 -367 829 1397 1072 1074 902 1059 1448 1240 1005 119 -747 -310 381 776
1650 776 -42 -442 -160 356 -172 -521 -1071 -375 -3 146 850 1270 2304 979 543 1030 997 1434 1605 1299 407
1628 -258 -25 -437 355 706 401 639 389 160 -2 598 1573 509 176 475 190 180 341 -62 -1182 -1006 -786
1607 -786 90 487 113 735 1086 511 159 43 -327 -774 -487 -374 -350 -709 262 1534 1706 846 646 203 742
1586 742 1874 2265 1507 1608 3053 1705 222 253 493 679 322 -2 -600 -451 -396 733 536 839 727 224
1565 203 491 -274 -913 296 699 976 1416 806 982 853 1252 595 215 87 2208 2074 1254 222 309 1021
1545 1021 1045 558 901 2358 1461 1405 191 -436 1225 1715 1029 169 797 1403 1411 1406 768 -372 -639 344 1352
1524 1352 1289 1297 1830 1752 1471 1517 663 223 683 1256 456 528 1537 720 383 485 922 2127 2159 1709 1620 1068
1502 1068 1775 972 323 -333 -939 -178 681 1042 1351 1225 621 329 336 376 -38 1467 1724 761 339 888 865
1481 865 526 489 776 778 379 559 114 343 475 685 1239 1251 1110 -435 -116 304 -609 651 1057 880 1734
1460 1734 1462 -41 -457 -809 -181 42 12 58 -444 400 242 1434 1023 1114 1203 1760 1339 11 387 671 770 1757
1438 1757 1590 816 61 -82 1124 1370 1121 922 1238 690 537 -120 -583 -301 -832 -1046 -276 -152 291 1036
1418 1036 -468 -932 -564 -390 592 474 12 588 1394 785 1308 262 -694 64 38 910 483 215 984 259 762
1397 762 930 1513 1574 1142 1173 2103 2529 2735 1157 569 1415 2110 744 277 114 572 1623 1192 942 1311
1377 1311 762 -72 170 -324 -30 1331 1047 1349 1633 1073 946 1123 1027 1044 259 98 252 508 347 -165 740
1355 1185 1172 490 -396 -1057 -26 810 499 1099 875 1243 1294 812 -255 -327 44 870 781 1251 1257 580 644 594 -462
1331 450 1795 1855 1722 1289 916 518 958 1281 855 410 -1241 381 808 544 1328 487 262 528 1018 1118
1311 1118 1041 1596 1296 475 432 235 645 -87 -843 -514 286 1568 936 -44 87 715 749 570 1305 1076 385
1289 92 608 1403 1371 2189 1046 -565 -1057 -596 -965 -1772 -1511 -1588 -1774 -299 -618 -95 755 579 -486 -1120 337
1267 859 450 -109 275 1309 631 -388 409 90 -559 401 959 328 -275 -589 8 491 -559 -419 408 -24 -503
1246 -503 157 219 545 -142 -232 -906 -1148 -78 938 -288 -455 437 1012 1032 511 899 800 391 -150 -423 30 309
1224 309 691 304 375 951 387 684 722 264 587 121 -182 629 1148 1501 1347 596 1416 1556 1242 807 784
1203 784 1241 886 430 664 906 885 905 989 175 -696 -343 -355 -573 -265 1385 1944 1019 1285 1755 1716 1327
1182 1327 334 -263 -667 -824 -199 -559 -707 -275 -25 -597 -285 -404 -381 94 -58 2 1102 1434 374 -668 -4 235
1159 54 75 -328 -600 712 832 394 168 807 893 907 1545 916 583 476 -660 47 447 478 112 1257 1186 417
1136 5 1618 2318 1706 509 533 657 898 672 1011 876 532 -318 -800 93 130 1443 1205 1682 1301 1129 1068
1115 1068 143 34 -343 -560 -737 -100 473 22 -141 460 742 -412 -329 -410 -1232 -851 -830 -232 259 572 1259
1094 1259 1400 906 862 -267 -468 160 467 543 526 890 2284 1748 541 621 1281 653 44 -12 -91 -490 1010
1072 1441 1241 -214 -107 737 787 1398 1496 444 177 -756 -1019 -415 -413 -583 1158 1135 248 821 792 1197 1365
1051 1365 2131 1642 1085 709 1142 937 1253 777 888 997 456 337 492 555 -191 -149 -98 -38 563 453 337
1030 337 424 239 227 49 414 830 964 644 588 736 1129 1583 1036 -258 -55 297 160 -468 -395 194 203 753 1750
1007 1750 1977 1182 753 220 -578 -966 97 181 20 -509 -1214 -247 643 12 -297 21 728 -73 -357 -58 533 -341
984 377 456 299 327 -279 -90 723 46 62 956 1153 -104 -309 284 585 1344 -178 -714 -1370 573 771 298 591
962 591 -551 23 979 353 139 4 -50 -530 670 -818 -659 -1 -1039 -911 -837 -749 303 -259 502 282 -62 864 832
939 832 457 -661 -626 -728 -683 -37 -270 -871 -1312 -1153 -1823 -1299 -1002 -485 406 348 276 -415 236 1225 1576 1336
917 1336 752 1204 1079 435 427 1062 1153 -447 377 158 114 -164 -774 -1267 -973 -312 203 898 738 35 154 163
895 163 -628 -361 -187 -24 81 419 785 -1396 -802 -354 203 195 -643 -1103 -628 -1099 -607 -128 167 -63 -1150
874 -1150 -1457 -253 935 395 -193 76 935 1302 1377 1278 -403 -477 -40 819 400 -904 -1627 -240 -790 -918 -434 -630
852 -630 101 1051 269 -416 -738 607 252 -31 771 27 -601 434 307 733 1004 503 785 500 -126 718 448
831 448 39 -306 -595 -44 -274 492 792 554 257 613 851 614 -56 -477 -107 338 922 -386 -1448 -1090 -397
809 -351 -783 -1658 -1166 -417 -529 -420 -574 -474 -349 367 738 -256 -230 520 205 -390 -803 -642 -542 -524 221
787 -263 -693 -1546 -1817 -1017 -1732 -1523 -635 -577 -771 -1229 -971 -748 -196 -1422 -808 -992 -1334 -1384 -1031 -743 -640
766 -640 -588 -713 -1015 -925 -1497 -1710 -1701 -1643 -1776 -1196 -1200 -2268 -1978 -2213 -1851 -1227 -913 -46 301 228 927 728 1150
743 1150 1853 1655 190 13 -956 -867 -661 -514 -771 -712 -63 -416 -385 -151 278 237 76 -711 168 102 -1143 -1897
721 -1897 -1032 -1667 -2455 -2011 -993 -1054 -1069 -276 -105 -918 -746 0 -737 -982 -932 -1176 -1512 -1399 -1401 -1188 -565 -650 152
697 238 -927 -777 -64 17 569 -352 -739 -653 -465 -325 55 -1189 -1583 -1486 -1395 -2094 -1876 -1242 -702 -1710 -1112 -827
675 -827 -618 -598 -794 -1610 -1760 -2073 -2079 -2137 -1946 -1692 -1424 -691 -479 -1321 -1964 -1030 -505 -1203 -1043 -1926 -2049 -1436
653 -1436 -1344 -975 -1433 -1441 -1388 -2166 -1251 281 -36 -656 -1021 -1980 -2244 -2385 -2107 -640 -541 -1691 -2245 -1850 -1259 -721
631 -721 -914 -1564 -1746 -2354 -2074 -2328 -1622 -1379 -908 -958 -570 -945 -1490 -1208 233 -210 -403 -1497 -2583 -2199
611 -2199 -1074 -1630 -1469 -1008 -2342 -1889 -2696 -2020 -1082 -1561 -1690 -1862 -1758 -1504 -1581 -2353 -1898 -1814 -1971 -2028
591 -2028 -1967 -2423 -2280 -2215 -2198 -2388 -2522 -2163 -2370 -2104 -1877 -2216 -2025 -1127 -1616 -1405 -1508 -2252 -2718 -2241 -2063
570 -2063 -1034 -988 -1622 -1913 -1671 -1269 -1675 -2744 -2515 -2353 -2239 -1642 -2111 -1907 -1919 -2489 -2746 -2814 -1500 -1291
550 -1291 -1412 -1136 -1592 -2194 -1824 -2100 -2650 -2319 -1737 -2186 -2695 -2192 -1762 -2183 -3113 -3293 -2370 -3115 -3376 -2920
530 -2920 -2754 -2862 -2379 -1361 -1203 -2251 -2718 -2717 -2699 -2951 -2846 -2452 -3187 -3461 -2711 -3390 -3341 -2859 -2726 -2196 -2819
509 -2819 -3190 -4012 -3973 -2760 -2589 -3023 -3584 -4056 -3775 -2327 -2817 -3462 -2499 -1944 -1371 -2449 -3336 -2830 -2599
490 -2599 -2983 -2812 -3956 -4075 -3400 -4219 -4142 -3693 -3013 -3154 -3060 -3336 -3369 -3139 -2954 -3312 -2793 -2644 -3001 -3261 -3431
469 -3431 -2634 -2256 -2870 -3065 -2999 -3326 -3910 -3207 -2864 -3261 -3206 -3622 -4865 -4103 -3539 -3257 -2696 -3371 -3428 -3158 -3523
448 -3523 -3304 -3798 -3986 -4804 -5344 -3631 -3077 -3952 -3576 -2383 -2842 -3594 -3870 -4063 -3899 -3987 -3871 -4083 -3758 -3768
428 -3768 -4295 -3835 -3386 -3490 -3539 -3659 -3355 -2894 -3177 -3676 -4738 -5095 -5290 -4993 -4428 -4529 -3739 -4325 -5061 -4911
408 -4911 -4791 -4672 -4075 -4349 -4686 -5208 -4606 -4291 -4958 -5488 -3952 -4013 -4416 -4519 -4025 -4744 -4531 -4965 -4124 -4044
388 -4044 -3990 -4462 -4598 -4931 -4747 -4193 -4072 -4318 -4487 -5175 -4531 -4712 -5416 -5328 -4358 -4054 -4313 -4431 -4457 -4935 -4642
367 -4642 -5039 -5179 -4992 -4823 -4164 -3784 -3149 -3845 -4997 -4691 -4747 -4999 -4292 -4696 -5295 -5039 -5259 -5215 -4798 -4657
347 -4657 -4776 -4814 -4560 -3800 -4256 -4716 -4637 -4627 -4775 -4772 -5040 -4690 -4999 -5527 -5217 -4866 -4560 -5116 -5215 -5034 -5982 -5606
325 -5606 -5258 -5429 -5744 -5474 -5533 -5736 -5001 -5345 -5520 -5926 -6492 -6237 -5952 -5501 -5340 -5325 -5072 -5033 -5314 -4608 -4160
304 -4160 -4836 -5398 -5975 -6155 -6386 -6399 -6290 -5449 -4763 -5166 -4935 -4751 -5799 -6595 -6699 -6787 -6117 -5529 -6032 -7138
284 -7138 -7264 -7534 -6383 -5870 -6102 -6152 -5624 -5542 -6030 -6717 -6815 -7268 -6841 -6613 -6269 -6293 -6496 -6746 -6973 -6870 -6584
263 -6584 -6600 -6679 -6807 -6809 -7569 -7217 -7210 -7033 -7407 -7092 -6675 -6825 -6378 -6173 -6217 -6560 -6958 -6295 -6375 -6858 -7336 -7283 -7067
240 -7067 -7258 -8212 -7187 -6658 -6922 -6670 -6514 -6908 -6889 -6820 -7128 -7390 -7154 -6882 -6523 -7052 -7179 -7435 -8117 -8173 -7761
219 -7761 -8004 -7562 -7347 -7607 -7546 -7305 -7536 -7419 -7342 -8141 -8489 -7678 -7772 -9151 -8772 -7638 -7626 -7490 -8269 -8459 -7909
198 -7909 -7448 -7916 -8160 -7937 -8186 -7599 -7758 -7356 -7227 -7462 -7349 -7262 -6774 -7589 -7584 -7659 -8256 -8567 -8697 -8242 -7101
177 -7101 -7634 -8251 -8436 -8988 -8652 -8776 -8116 -8461 -9286 -8718 -7734 -7677 -7872 -8464 -8200 -7757 -8714 -8774 -9167 -9134 -8721
156 -8721 -8408 -8227 -8484 -9758 -9674 -8997 -9127 -9434 -9240 -8942 -8355 -8449 -8150 -7792 -9062 -9276 -8825 -8995 -8832 -9034
136 -9034 -9807 -10073 -10015 -9440 -9290 -9491 -9367 -9375 -9103 -8991 -9408 -9003 -9359 -9923 -10328 -9593 -9262 -9315 -10214 -10109 -9850
115 -9850 -9113 -9234 -9661 -9573 -9677 -10359 -10528 -10633 -10081 -9427 -9344 -9395 -9464 -9191 -9180 -9501 -9856 -10681 -10431 -10527 -9971 -9732
93 -9732 -9345 -9422 -10133 -10970 -10311 -10315 -10683 -10768 -10600 -10649 -10550 -10227 -10027 -10465 -10256 -9939 -10125 -10743 -11017 -10917 -11072 -11034 -10909
70 -10909 -11336 -11446 -11568 -11349 -11510 -11642 -11143 -11140 -11897 -11726 -11377 -11551 -11774 -11572 -11552 -11439 -11195 -10879 -10577 -10708 -10847
49 -10847 -11571 -11693 -11379 -11017 -11259 -10932 -10861 -11023 -11249 -10690 -10220 -11189 -11575 -11512 -11417 -11445 -12026 -11093 -10699 -11309 -12290
28 -12290 -12318 -12179 -11646 -11208 -11371 -11471 -11217 -11315 -12101 -11819 -10719 -10729 -11221 -11491 -11517 -11170 -11646 -11383 -11546 -12168 -12897
7 -12897 -12123 -12573 -12363 -12611 -12489 -12529 -12384
0 -12384
$$ Imaginary data points
##PAGE= N=2
##DATA TABLE= (X++(I..I)), XYDATA
65535 -62951 -62835 -62520 -62484 -61898 -61910 -62017 -62026 -61715 -61046 -60729 -60091 -59866 -59124 -59428 -58856 -58908 -59003 -57798 -58039 -57750 -57689
65514 -57689 -57143 -56599 -56457 -56438 -55279 -54973 -54313 -54723 -54683 -54468 -54348 -54226 -53839 -52843 -52518 -53146 -53351 -52634 -52702 -51984
65494 -51984 -51593 -50902 -50427 -50348 -49337 -49542 -49560 -50090 -49722 -48907 -48324 -48464 -49025 -48131 -47457 -47914 -47340 -46536 -46228
65475 -46228 -46687 -46085 -45023 -44570 -45067 -44404 -43621 -43670 -43865 -43973 -43616 -42774 -42786 -43218 -42721 -42196 -41842 -42021 -42013 -41009
65455 -41009 -40269 -39898 -39690 -39554 -39462 -39438 -38757 -38704 -38578 -37852 -37680 -37201 -37075 -36573 -35649 -36677 -36841 -36046 -35653 -35047
65435 -35047 -34223 -34245 -34064 -33719 -32804 -32533 -33120 -32631 -31938 -31271 -31314 -31769 -31872 -32426 -31315 -30648 -30062 -29652 -29599 -29673
65415 -29673 -28987 -28025 -27739 -28358 -28388 -27956 -27473 -27081 -26379 -26263 -26558 -26524 -26314 -25810 -25897 -26435 -26509 -26138 -25693 -24993
65395 -24993 -24173 -24310 -23846 -23514 -23786 -23167 -22931 -22550 -21496 -21394 -20970 -21162 -20676 -20648 -20003 -19514 -18936 -18737 -18976
65376 -18976 -19011 -18431 -18111 -18016 -18085 -17564 -17510 -16548 -16184 -16098 -15678 -15279 -15767 -15277 -14602 -14749 -14278 -13879 -14267 -13902 -13173
65355 -13173 -12860 -12640 -12658 -12343 -11447 -11530 -11524 -11195 -10912 -11120 -11271 -11292 -10382 -10529 -10488 -9832 -8931 -8784 -9024 -7820 -7385
65334 -7385 -6654 -6238 -6776 -6866 -6964 -6343 -5705 -5817 -5489 -4636 -4904 -4840 -4263 -4651 -4508 -3898 -3197 -2527 -3107 -2490
65314 -2490 -1957 -1895 -1554 -998 -1333 -1125 -529 135 -156 -192 -480 -318 509 1030 1324 1517 1531 1638 1568 1810 2703
65293 2703 3579 3442 3709 3857 4191 3914 4520 5110 4458 4702 4555 4700 4371 4605 5526 5145 5116 6029 6445 6011
65273 6011 6600 7041 7608 7981 8272 8386 8129 9058 9762 10134 10515 10346 10713 11257 11143 11093 11563 11896 12966
65254 12966 12640 13036 13207 12812 13967 13639 13319 13444 13334 13400 13628 14485 14605 14364 14908 15709 15539 15382 15332
65235 15332 16279 17348 18303 18090 17809 17611 17712 19029 19099 18762 19204 19576 19999 20002 20066 19884 20372 20114 20921 21214
65215 21214 20857 21053 21324 21771 22491 23300 23499 24214 23876 23480 23819 24727 25271 25127 24871 25178 24905 24875 25291
65196 25291 26157 26897 26513 26573 26173 27380 26214 25732 26698 27481 27717 27857 28117 28478 28183 28783 29236 29323 28649
65177 28649 29321 29489 29307 29890 30410 31265 31758 31627 31150 31615 32929 33228 32903 32463 32166 32044 31953 32959 33251
65158 33251 32623 32911 32435 32797 33547 34029 34473 35282 34629 34622 35645 36082 36045 36718 36503 37699 37957 37515 36655
65139 36655 36558 37256 37652 37643 37630 37674 38464 38794 38579 38451 38944 38685 39840 40072 40322 40745 40733 40667 40847 41034 41381
65118 41381 42000 41598 40888 41826 41678 41557 41385 42641 42807 43091 43008 42800 43507 43987 44704 45029 44624 44720 44904
65099 44904 44300 45435 46158 46498 45983 45953 46323 46415 46673 47694 47107 46631 46613 47464 48381 48543 47691 47922 47805
65080 47805 48329 48424 48643 48303 48364 49399 49806 49503 50450 51123 51165 50884 51616 51713 52082 52767 52339 52120 51875 51659
65060 51659 52480 52374 52509 52590 53099 53675 53545 54008 53943 55054 55684 55347 54227 54041 54702 54660 54612 55009 55000 55836
65040 55836 56124 55930 55036 55134 56268 56439 56320 56412 56228 56554 57095 57909 57606 57588 57670 57705 58200 58385 58377 58236 59233
65019 59233 58534 58949 59932 60327 60728 60601 60616 61088 61457 60529 59418 60802 61006 59814 60723 61121 61033 61869 62103
65000 62103 61653 62996 63126 62262 61378 62067 63252 63591 63034 62860 63160 63263 63097 63292 63338 63073 62843 63504 63733
64981 63733 63893 63991 64721 65608 66348 66241 66092 65798 65927 65937 66193 66728 66689 66781 66740 67328 66858 67073 66460 66686 66680
64960 66680 67589 68008 68435 69051 68035 67591 68155 68238 68617 68874 69219 69284 69362 69613 69275 68769 68902 68981 69354 70101
64940 70101 69618 69672 70359 70511 71217 72007 71360 71401 71951 70723 71688 72090 71954 72861 72754 71849 72476 71959 72165
64921 72165 72348 72417 72820 73467 73278 73926 73895 73213 73918 74639 74190 73865 74064 73511 73204 74114 74215 74734 74861 74974
64901 74974 74647 74570 74227 75005 75409 74702 74565 75490 76076 77363 77532 76608 76404 75824 75935 76769 77017 76700 76814
64882 76814 78156 77079 76895 76136 77156 78495 79434 78592 78290 78564 78850 78214 77901 78394 77929 78315 78845 78544
64864 78544 78455 79419 80313 80280 79940 80474 79963 79606 79318 79629 79606 79287 79319 79706 80976 80647 80030 79920 81255 82051
64844 82051 82851 82046 81272 81000 81897 82585 82351 82500 82928 84021 83294 82488 81769 82021 82337 81749 81261 81451 81777
64825 81777 82125 82405 82801 82092 82104 82870 82974 83586 83759 84548 84135 84272 85029 85194 85258 85189 84884 84917 85297 84956
64805 84956 84664 84615 84421 85238 85366 83916 83208 84983 85851 85252 85786 85940 85245 84390 85229 86131 86317 86977 87983
64786 87983 88232 87408 86346 86882 86804 86439 86546 86531 87822 88196 87186 86612 86805 86623 87187 87119 87362 87591 87334
64767 87334 88903 89082 88914 90151 89653 89507 89456 89746 89078 88928 88448 89540 88990 88479 87902 88165 87781 87921
64749 87921 88482 88698 89088 89919 90221 89786 90069 89599 89169 88915 88736 89262 89847 89714 90238 90311 90546 91051 90817
64730 90817 89996 90003 90902 90757 91356 91625 91717 91938 91144 90461 90640 91338 90849 90709 90762 90767 90881 90287 90296 91062 91362 91765
64708 91765 91263 90527 90972 91936 92804 92340 92099 92745 92835 93846 93034 93261 93119 92575 92190 92453 92515 91461 92897
64689 92897 93648 93396 93379 93292 93510 93725 93817 93396 93567 93824 94241 93708 93829 93686 93862 94107 94405 94671 92987 92950
64669 92950 93087 93564 94282 94055 93711 93779 93608 93401 93841 94390 94407 93796 93988 94720 95028 94134 94227 93900 94029 94996
64649 94996 94507 94350 94728 94505 94851 95695 94827 94977 95037 95287 95199 95386 95186 94687 95169 95972 95541 95284 95473 95084
64629 95084 94949 95341 96245 96112 95604 95091 95229 95777 95475 96232 96364 96099 96202 96342 96125 96579 97105 96279 96602
64610 96602 98154 97527 96894 97285 97088 96998 96967 97219 97875 97995 97719 96754 97096 97252 97650 98173 97980 96749 96980
64591 96980 98259 98036 97572 97748 97296 97379 97596 96905 97175 97826 98412 98617 97934 97540 98078 98127 98382 98161 97603
64572 97603 98028 97974 97976 99205 99481 99010 98464 97668 97761 97794 98374 98981 99141 98445 97695 98118 99835 99644 98349 97663
64552 97663 98806 99181 99376 99073 98790 99188 99355 99173 99017 98453 98405 99591 99315 99298 100220 99660 99361 99164 99339
64533 99339 100459 100737 100627 100158 100086 99953 99387 99268 100013 101224 100178 99512 100102 99308 99525 99639 99358 98802
64515 98802 98766 98286 98782 99107 99728 100079 99864 99251 98716 98402 99584 100329 100051 99780 99379 99124 98284 98968 99222
64496 99222 98152 98518 100329 100030 98444 98723 99640 100242 100108 99226 99001 100843 101751 99976 99932 100195 99670 99205
64478 99205 99209 98690 99709 100433 100099 100089 100432 100934 100545 100593 101018 101687 100867 101057 102670 102065 100795 100574 99779
64459 99779 99160 99544 99712 100506 101083 100678 101291 101364 100968 101165 100962 100413 99916 100667 101881 100996 100759 101763 101995
64440 101995 102044 101455 101551 101957 101714 101414 100635 101339 100375 100555 100732 100815 101384 101506 101858 102492 102644 102012 102269 102576
64420 102576 101956 101726 101758 101955 101603 101341 101012 101379 102233 102659 102775 102725 102328 102576 102447 102585 101832 102118 102564
64401 102564 102180 101951 101877 101962 101608 101890 102941 103086 102626 102006 101665 101905 101492 101077 102454 102329 101573 101946 101873
64382 101873 101482 101686 101756 101652 101454 101533 101535 101424 101471 101828 101221 101407 101268 101255 101735 102425 102657 102420 102369 102322 101553
64361 101553 101219 101253 101881 101854 101533 101390 102291 102710 103296 102591 102228 101932 103509 103492 102692 102504 102319 102189 103300
64342 103300 103499 102964 103232 103774 102414 102414 102361 101372 100960 101062 102046 102517 102751 103072 102405 101792 102027 102544 103801
64323 103801 104135 104403 104013 102457 102301 103945 102998 102370 102240 102389 102538 103161 103002 102660 102246 101517 101307 100864
64305 100864 101670 101865 100912 101964 102367 101950 102885 102537 103288 102647 102920 103092 103030 102468 102900 102399 102630 103472 103746
64286 103746 103709 103235 102249 102287 102597 102958 103206 104198 104496 104589 103347 103152 102472 102215 103273 103579 102637 102565 103193
64267 103193 104118 104230 104188 104201 103954 104382 105210 105199 105206 103643 102774 103274 104549 104087 104465 104168 102158 102350 102219
64248 102219 103226 103249 102309 102425 102243 103302 103217 104003 103847 103876 103951 103659 104511 104554 104324 103641 102923 103491 103656 103992
64228 103992 104064 104892 105011 103303 102711 102704 102923 103533 104088 104269 104295 104142 103673 102942 103541 103485 102877 103870 103695 103064
64208 103064 102982 103375 104175 104404 103886 103369 102415 103197 103960 103876 103785 104249 104012 103711 104600 103823 102959 103255 103731 104707
64188 104707 104564 103488 103164 102283 103381 104781 104641 103868 102987 103685 104213 104065 104417 104199 102777 102307 102390 102607
64170 102607 102894 102545 103060 102825 102899 102899 103634 105841 106121 105192 104677 103965 104190 104624 104807 103426 103254 102985 103231
64151 103231 102699 103084 104687 104873 103775 104209 104911 104352 103182 103399 103352 103497 103798 103892 103674 103726 103999 103783 103422
64132 103422 103719 105536 106167 105438 103538 103039 103005 104001 104293 104768 104660 103731 103473 103822 103825 103702 104527 103990 104223
64113 104223 104635 105302 104764 103912 103647 104104 103970 103603 103530 103315 103228 103406 102519 102649 103757 104086 103909 104245 103999
$$ [...]
##END NTUPLES=NMR SPECTRUM
##END=
