##TITLE=	labeled_M9_sacculi 13C 1D and 2D.10.fid
##JCAMPDX=	6.0	$$ NMR Plug-in 1.13 of MestReNova 11.0.4-18998
##DATATYPE=	NMRSPECTRUM
##DATACLASS=	XYDATA
##NUMDIM=	1
##ORIGIN=	Bruker BioSpin GmbH
##OWNER=	ecaudill
##.OBSERVEFREQUENCY=	125.72761525999999321
##.OBSERVENUCLEUS=	^13C
##.SOLVENTNAME=	
##.PULSESEQUENCE=	cp
##LONGDATE=	2017/07/28 10:22:42.000
##.ACQUISITIONMODE=	SIMULTANEOUS (DQD)
##$ORIGINALFORMAT=	Bruker XWIN-NMR
##$PARAMETERFILE=	(acqus, ASCII, d:/Desktop/NMRFAM/labeled_M9_sacculi%2013C%201D%20and%202D/10/acqus, 0)
$$ ##TITLE= Parameter file, TOPSPIN		Version 3.2
$$ ##JCAMPDX= 5.0
$$ ##DATATYPE= Parameter Values
$$ ##NPOINTS= 7	$$ modification sequence number
$$ ##ORIGIN= Bruker BioSpin GmbH
$$ ##OWNER= ecaudill
$$ $$ 2017-07-28 10:22:42.997 -0500  ecaudill@devon.nmrfam.wisc.edu
$$ $$ /home/ecaudill/NMR/labeled_M9_sacculi 13C 1D and 2D/10/acqus
$$ $$ process /opt/topspin_CPMAS/prog/mod/go
$$ ##$ACQT0= 0
$$ ##$AMP= (0..31)
$$ 100 100 100 100 100 100 100 100 100 100 100 100 100 100 100 100 100 100
$$ 100 100 100 100 100 100 100 100 100 100 100 100 100 100
$$ ##$AMPCOIL= (0..19)
$$ 0 0 0 0 0 0 0 0 0 0 0 0 0 0 0 0 0 0 0 0
$$ ##$ANAVPT= -1
$$ ##$AQSEQ= 0
$$ ##$AQ_mod= 1
$$ ##$AUNM= <au_zgonly>
$$ ##$AUTOPOS= <>
$$ ##$BF1= 125.715042
$$ ##$BF2= 499.96
$$ ##$BF3= 499.96
$$ ##$BF4= 499.96
$$ ##$BF5= 499.96
$$ ##$BF6= 499.96
$$ ##$BF7= 499.96
$$ ##$BF8= 499.96
$$ ##$BYTORDA= 0
$$ ##$CAGPARS= (0..11)
$$ 0 0 0 0 0 0 0 0 0 0 0 0
$$ ##$CFDGTYP= 0
$$ ##$CFRGTYP= 9
$$ ##$CHEMSTR= <none>
$$ ##$CNST= (0..63)
$$ 1 1 1 1 1 1 1 1 1 1 1 0 1 1 1 1 1 1 1 1 1 0 1 1 1 0 1 1 1 1 1 5000 1 1
$$ 1 1 1 1 1 1 1 1 1 1 1 1 1 1 1 1 1 1 1 1 1 1 1 1 1 1 1 1 1 1
$$ ##$CPDPRG= (0..8)
$$ <> <> <swftppm_13> <> <> <> <> <> <>
$$ ##$D= (0..63)
$$ 0 5 0 0 0 0 0 0 0 0 0 0 0 0 0 0 0 0 0 0 0 0 0 0 0 0 0 0 0 0 0 0 0 0 0 0
$$ 0 0 0 0 0 0 0 0 0 0 0 0 0 0 0 0 0 0 0 0 0 0 0 0 0 0 0 0
$$ ##$DATE= 1501255362
$$ ##$DE= 7.699996
$$ ##$DECBNUC= <off>
$$ ##$DECIM= 532
$$ ##$DECNUC= <off>
$$ ##$DECSTAT= 4
$$ ##$DIGMOD= 3
$$ ##$DIGTYP= 12
$$ ##$DQDMODE= 0
$$ ##$DR= 21
$$ ##$DS= 16
$$ ##$DSPFIRM= 4
$$ ##$DSPFVS= 21
$$ ##$DTYPA= 0
$$ ##$EXP= <4mm_CPMAS_13C_CP_100KHz.lz.2016>
$$ ##$F1LIST= <>
$$ ##$F2LIST= <>
$$ ##$F3LIST= <>
$$ ##$FCUCHAN= (0..9)
$$ 0 1 2 0 0 0 0 0 0 0
$$ ##$FL1= 90
$$ ##$FL2= 90
$$ ##$FL3= 90
$$ ##$FL4= 90
$$ ##$FOV= 20
$$ ##$FQ1LIST= <freqlist>
$$ ##$FQ2LIST= <hetcor.jos>
$$ ##$FQ3LIST= <freqlist>
$$ ##$FQ4LIST= <freqlist>
$$ ##$FQ5LIST= <freqlist>
$$ ##$FQ6LIST= <freqlist>
$$ ##$FQ7LIST= <freqlist>
$$ ##$FQ8LIST= <freqlist>
$$ ##$FRQLO3= 1.79769313486232e+308
$$ ##$FRQLO3N= 0
$$ ##$FS= (0..7)
$$ 83 83 83 83 83 83 83 83
$$ ##$FTLPGN= 0
$$ ##$FW= 625000
$$ ##$FnMODE= 0
$$ ##$FnTYPE= 0
$$ ##$GPNAM= (0..31)
$$ <> <> <> <> <> <> <> <> <> <> <> <> <> <> <> <> <> <> <> <> <> <> <> <>
$$ <> <> <> <> <> <> <> <>
$$ ##$GPX= (0..31)
$$ 0 0 0 0 0 0 0 0 0 0 0 0 0 0 0 0 0 0 0 0 0 0 0 0 0 0 0 0 0 0 0 0
$$ ##$GPY= (0..31)
$$ 0 0 0 0 0 0 0 0 0 0 0 0 0 0 0 0 0 0 0 0 0 0 0 0 0 0 0 0 0 0 0 0
$$ [...]
$$ 0 0 0 0 0 0 0 0
$$ ##$SguType= 2
$$ ##$ShimPowMaxUA= (0..63)
$$ 130000 130000 130000 130000 130000 130000 130000 130000 130000 130000 130000
$$ 130000 130000 130000 130000 130000 130000 130000 130000 130000 130000 130000
$$ 130000 130000 130000 130000 130000 130000 130000 130000 130000 130000 130000
$$ 130000 130000 130000 130000 130000 130000 130000 0 0 0 0 0 0 0 0 0 0 0
$$ 0 0 0 0 0 0 0 0 0 0 0 0 0
$$ ##$ShimPowMaxUC= (0..63)
$$ 130000 130000 130000 130000 130000 130000 130000 130000 130000 130000 130000
$$ 130000 130000 130000 130000 130000 130000 130000 130000 130000 130000 130000
$$ 130000 130000 130000 130000 130000 130000 130000 130000 130000 130000 130000
$$ 130000 130000 130000 130000 130000 130000 130000 0 0 0 0 0 0 0 0 0 0 0
$$ 0 0 0 0 0 0 0 0 0 0 0 0 0
$$ ##$ShimPowMaxUG= (0..63)
$$ 524287 524287 524287 524287 524287 524287 524287 524287 524287 524287 524287
$$ 524287 524287 524287 524287 524287 524287 524287 524287 524287 524287 524287
$$ 524287 524287 524287 524287 524287 524287 524287 524287 524287 524287 524287
$$ 524287 524287 524287 524287 524287 524287 0 0 0 0 0 0 0 0 0 0 0 0 0 0 0
$$ 0 0 0 0 0 0 0 0 0 0
$$ ##$ShimPowRcbType= 3
$$ ##$ShimPowRes= (0..63)
$$ 1e-20 1e-20 1e-20 1e-20 1e-20 1e-20 1e-20 1e-20 1e-20 1e-20 1e-20 1e-20
$$ 1e-20 1e-20 1e-20 1e-20 1e-20 1e-20 1e-20 1e-20 1e-20 1e-20 1e-20 1e-20
$$ 1e-20 1e-20 1e-20 1e-20 1e-20 1e-20 1e-20 1e-20 1e-20 1e-20 1e-20 1e-20
$$ 1e-20 1e-20 1e-20 1e-20 0 0 0 0 0 0 0 0 0 0 0 0 0 0 0 0 0 0 0 0 0 0 0 0
$$ ##$ShimPowRng0= (0..63)
$$ 1 1 1 1 1 1 1 1 1 1 1 1 1 1 1 1 1 1 1 1 1 1 1 1 1 1 1 1 1 1 1 1 1 1 1 1
$$ 1 1 1 1 0 0 0 0 0 0 0 0 0 0 0 0 0 0 0 0 0 0 0 0 0 0 0 0
$$ ##$ShimPowRng1= (0..63)
$$ 1 1 1 1 1 1 1 1 1 1 1 1 1 1 1 1 1 1 1 1 1 1 1 1 1 1 1 1 1 1 1 1 1 1 1 1
$$ 1 1 1 1 0 0 0 0 0 0 0 0 0 0 0 0 0 0 0 0 0 0 0 0 0 0 0 0
$$ ##$ShimPowRng2= (0..63)
$$ 1 1 1 1 1 1 1 1 1 1 1 1 1 1 1 1 1 1 1 1 1 1 1 1 1 1 1 1 1 1 1 1 1 1 1 1
$$ 1 1 1 1 0 0 0 0 0 0 0 0 0 0 0 0 0 0 0 0 0 0 0 0 0 0 0 0
$$ ##$ShimPowRng3= (0..63)
$$ 1 1 1 1 1 1 1 1 1 1 1 1 1 1 1 1 1 1 1 1 1 1 1 1 1 1 1 1 1 1 1 1 1 1 1 1
$$ 1 1 1 1 0 0 0 0 0 0 0 0 0 0 0 0 0 0 0 0 0 0 0 0 0 0 0 0
$$ ##$ShimSysFunc= (0..63)
$$ 1 2 3 4 5 6 7 8 9 10 0 37 38 35 16 15 14 13 12 11 28 27 26 25 24 23 36
$$ 22 30 29 20 21 34 33 32 31 17 18 19 0 0 0 0 0 0 0 0 0 0 0 0 0 0 0 0 0 0
$$ 0 0 0 0 0 0 0
$$ ##$ShimSysMatrix= 0
$$ ##$ShimSysType= 4
$$ ##$TFXNUM= 0
$$ ##$TRIPLO2= 0
$$ ##$VTU= 1
$$ ##$VTUETH= <no>
$$ ##$VTUTY= <tty05>
$$ ##$WBREFAM= (0..15)
$$ 99.6 100 100 100 100 100 100 100 100 100 100 100 100 100 100 100
$$ ##$WBREFLM= (0..15)
$$ 1 0 0 0 0 0 0 0 0 0 0 0 0 0 0 0
$$ ##$WBREFPH= (0..15)
$$ 0.22 0 0 0 0 0 0 0 0 0 0 0 0 0 0 0
$$ ##$WBSGU= (0..15)
$$ 0 0 0 0 0 0 0 0 0 0 0 0 0 0 0 0
$$ ##$XFAC= 2
$$ ##END=
$$ 
##$DECIM=	532
##$DSPFVS=	21
##XUNITS=	HZ
##YUNITS=	ARBITRARY UNITS
##FIRSTX=	30925.330430442423676
##LASTX=	-6650.2980939937551739
##XFACTOR=	-18.356437969924854769
##YFACTOR=	7.5165200195312504214e-06
##NPOINTS=	2048
##XYDATA=	(X++(Y..Y))
$$ plain form
-1684 1739320 4669608 5591797 3093725 -462667 -1820501 -364952 1695497 2154961 1026799 -122738
-1674 -122738 -384013 -443734 -1336016 -2741854 -3034036 -1196529 1560598 2654306 952852 -1546726
-1664 -1546726 -1591494 1485675 4405835 3228197 -2081308 -7234764 -8162907 -5210642 -1977133 -547690
-1654 -547690 553161 3174519 5860206 5167971 446393 -4617683 -6196453 -4798655 -3984478 -5199753
-1644 -5199753 -6015265 -4168813 -1423649 -1417395 -4375363 -6357178 -4444429 -716671 606545 -1176944
-1634 -1176944 -2776363 -2047320 -1032481 -2370018 -4491835 -3113750 2602941 7989584 8235322 4081797
-1624 4081797 315122 -378318 376232 497139 639789 1891690 2408876 -567147 -5612726 -7251734
-1614 -7251734 -2747135 3417212 4426688 -318159 -4452657 -3004223 1230515 1730572 -2940980 -7339645
$$ packed form
-1684A739320K930288R22189k498072l556392j357834J455549K060449M59464j128162j149537
-1674a22738k61275n9721q92282j405838k92182J837507K757127J093708j701454k499578
-1664a546726m4768L077169K920160j177638n309505n153456r28143K952265L233509J429443
-1654e47690J100851K621358K685687o92235m721578n064076j578770J397798Q14177j215275
-1644e199753q15512J846452K745164O254k957968j981815J912749L727758J323216j783489
-1634a176944j599419P29043J014839j337537k121817J378085N716691N386643K45738m153525
-1624D081797l766675o93440P54550J20907J42650J251901N17186k976023n045579j639008
-1614g251734M504599O164347J009476m744847m134498J448434M234738N00057m671552m398665
$$ plain form
-1604 -7339645 -6256955 -911200 3456552 4328205 3895990 4848537 6680109 7063044 5178334 2199952
-1594 2199952 -671235 -3064888 -4573742 -4610191 -3524587 -2604869 -2255716 -1254559 1113166 3042451
-1584 3042451 1976836 -1710752 -4539822 -4114681 -2057665 -1493524 -2675354 -3044042 -1429061 40716
-1574 40716 -816951 -2885166 -3529520 -2799971 -3397221 -6121169 -7727919 -4965008 680284 4499714
-1564 4499714 4466292 3268364 3814407 4971257 3739208 437470 -978115 1857903 6403125 8434573
-1554 8434573 7086128 4814094 3169820 1054694 -2362375 -5289087 -5643550 -4529714 -5101254 -7965381
-1544 -7965381 -9864229 -7926380 -3625380 -808716 -613858 -478081 1568755 3718630 2900461 -718271
-1534 -718271 -3653793 -3372741 -890329 1346368 2474607 2810069 1662003 -2186404 -7606373 -10799570
$$ packed form
-1604g339645J082690N345755M367752Q71653m32215R52547J831572L82935j884710k978382
-1594B199952k871187k393653j508854l6449J085604R19718L49153J001157K367725J929285
-1584C042451j065615l687588k829070M25141K057016N64141j181830l68688J614981J469777
-1574D0716q57667k068215o44354P29549n97250k723948j606750K762911N645292L819430
-1564D499714l3422j197928N46043J156850j232049l301738j415585K836018M545222K031448
-1554H434573j348445k272034j644274k115126l417069k926712l54463J113836n71540k864127
-1544g965381j898848J937849M301000K816664J94858J35777K046836K149875q18169l618732
-1534g18271k935522K81052K482412K236697J128239L35462j148066l848407n419969l193197
$$ plain form
-1524 -10799570 -9287092 -5231234 -3120069 -4385716 -6013533 -4902599 -1903352 -150374 -470932 -568234
-1514 -568234 1103364 2733092 1737852 -1332979 -3388862 -2974519 -1819543 -1654770 -1495343 154376
-1504 154376 1678704 -260157 -5316225 -8182454 -4878115 1123693 2064978 -4484969 -11970371 -12588660
-1494 -12588660 -6787056 -2163275 -3395814 -6740360 -6127877 -1913773 14661 -2762805 -5163130 -1599567
-1484 -1599567 5634207 8573639 3854619 -2741171 -3656416 969168 4140390 1599195 -2755408 -2395876
-1474 -2395876 3163407 7820795 6513814 886853 -3517978 -3946101 -2614296 -2937183 -5495857 -8201076
-1464 -8201076 -9064301 -7727903 -4931624 -1797036 219328 -215670 -3010289 -6033854 -6548096 -3622443
-1454 -3622443 927854 4054319 3922758 1095642 -2291017 -4338080 -4634539 -4127683 -3950195 -4312252
$$ packed form
-1524a0799570J512478M055858K111165j265647j627817J110934K999247J752978l20558r7302
-1514e68234J671598J629728r95240l070831k055883M14343J154976J64773J59427J649719
-1504A54376J524328j938861n056068k866229L304339O001808R41285o549947p485402o18289
-1494a2588660N801604M623781j232539l344546O12483M214104J928434k777466k400325L563563
-1484a599567P233774K939432m719020o595790r15245M625584L171222k541195m354603L59532
-1474b395876N559283M657388j306981n626961m404831m28123J331805l22887k558674k705219
-1464h201076q63225J336398K796279L134588K016364m34998k794619l023565n14242K925653
-1454c622443M550297L126465j31561k827116l386659k047063k96459N06856J77488l62057
$$ plain form
-1444 -4312252 -4426196 -3472825 -1656393 -307224 -828275 -3300678 -5975303 -6348426 -3235567 1904919
-1434 1904919 5881796 6391511 3903908 922053 -490819 -246061 410865 313325 -1125435 -3978152
-1424 -3978152 -7309587 -8819142 -6396530 -901014 3435751 2765347 -2100172 -6209036 -5704094 -1721206
-1414 -1721206 1493370 1400555 -1107911 -4171673 -7081066 -9179557 -8471594 -3524798 3406867 7217550
-1404 7217550 5009969 -593602 -4180007 -2983842 1309602 5397424 7241204 6107580 1931608 -3776202
-1394 -3776202 -7585513 -6964216 -3605154 -2046878 -4101667 -6227391 -4039655 1552363 5024188 3295365
-1384 3295365 -153461 193516 4547503 7261634 3691403 -4309357 -10651759 -11420085 -7690522 -2860014
-1374 -2860014 855542 2962861 3459304 2423936 365637 -2029973 -4378661 -6154523 -6175294 -3770843
$$ packed form
-1444d312252j13944R53371J816432J349169n21051k472403k674625l73123L112859N140486
-1434A904919L976877N09715k487603k981855j412872K44758O56926r7540j438760k852717
-1424c978152l331435j509555K422612N495516M336765o70404m865519m108864N04942L982888
-1414a721206L214576r2815k508466l063762k909393k098491P07963M946796O931665L810683
-1404G217550k207581n603571l586405J196165M293444M087822J843780j133624m175972n707810
-1394c776202l809311O21297L359062J558276k054789k125724K187736N592018L471825j728823
-1384C295365l448826L46977M353987K714131l570231q000760o342402p68326L729563M830508
-1374b860014L715556K107319M96443j035368k058299k395610k348688j775862k0771K404451
$$ plain form
-1364 -3770843 -639592 -108513 -3392266 -7313451 -7250352 -2464459 2793851 4058095 1415181 -1543593
-1354 -1543593 -2703001 -3531090 -5883194 -8455651 -8097010 -4251214 -369331 -121821 -3111074 -5436219
-1344 -5436219 -4309719 -1043012 976078 512568 -276844 1099126 3985393 4959815 1768157 -3689562
-1334 -3689562 -6860346 -5032165 69692 4321934 5385063 4348373 3502818 3504836 3349878 2470541
-1324 2470541 1610529 1342540 755888 -1411088 -4661759 -6812148 -6429283 -4418753 -2666915 -1732816
-1314 -1732816 -762541 580864 1306824 705810 -165312 294910 1751852 1875642 -711119 -4207005
-1304 -4207005 -5274304 -2760020 1008300 2766853 1440137 -1612615 -4657219 -6848506 -7610137 -6109273
-1294 -6109273 -2337517 1752901 3399110 1767678 -1066839 -2448818 -2072898 -1836497 -2834495 -3536012
$$ packed form
-1364c770843L131251N31079l283753l921185O3099M785893N258310J264244k642914k958774
-1354a543593j159408q28089k352104k572457L58641L845796L881883K47510k989253k325145
-1344e436219J126500L266707K019090m63510p89412J375970K886267R74422l191658n457719
-1334c689562l170784J828181N101857M252242J063129j036690q45555K018j54958q79337
-1324B470541q60012k67989n86652k166976l250671k150389L82865K010530J751838R34099
-1314a732816R70275J343405P25960o01014q71122M60222J456942J23790k586761l495886
-1304d207005j067299K514284L768320J758553j326716l052752l044604k191287p61631J500864
-1294f109273L771756M090418J646209j631432k834517j381979L75920K36401r97998p01517
$$ plain form
-1284 -3536012 -1758618 1987807 4318859 2666176 -1493950 -3974197 -2423542 1199851 3041631 1655243
-1274 1655243 -815031 -1580737 -447324 372997 -836608 -3398629 -5318157 -5580096 -4882841 -4381591
-1264 -4381591 -4326934 -4103438 -3215117 -1892897 -843179 -658237 -1427492 -2647284 -3444121 -3169411 -2047720
-1253 -2047720 -1164836 -1533837 -3059539 -4571644 -5018781 -4559195 -4339442 -5253552 -7127618 -9167321
-1243 -9167321 -10909218 -12354156 -13164948 -12232982 -8634332 -3176393 1391312 2267482 -972952 -5815139
-1233 -5815139 -8783653 -8185805 -5228053 -2785983 -3123892 -6361115 -10523775 -12870931 -11607514 -6995196
-1223 -6995196 -1155856 3339819 5065527 4321429 2450556 716053 -330689 -790848 -996591 -1006748
-1213 -1006748 -257139 2202676 6719889 12110918 16093194 17171990 16213525 15864572 18254903 23424908
$$ packed form
-1284c536012J777394L746425K331052j652683m160126k480247J550655L623393J841780j386388
-1274A655243k470274p65706J133413Q20321j209605k562021j919528k61939O97255N01250
-1264d381591N4657K23496Q88321J322220J049718J84942p69255j219792p96837K74710J121691
-1253b047720Q82884l69001j525702j512105m47137M59586K19753r14110j874066k039703
-1243i167321j741897j444938q10792R31966L598650N457939M567705Q76170l240434m842187
-1233e815139k968514N97848K957752K442070l37909l237223m162660k347156J263417M612318
-1223f995196N839340M495675J725708p44098j870873j734503j046742m60159k05743j0157
-1213a006748P49609K459815M517213N391029L982276J078796r58465l48953K390331N170005
$$ plain form
-1203 23424908 30029017 37072110 44315729 51012814 55085760 54395727 48868201 40780811 32611874 24966682
-1193 24966682 17143094 9527736 4418619 3663178 5837111 6990856 4895774 1859284 2112968 6354564
-1183 6354564 10270749 9558234 5583344 4211346 8642094 15214423 17972274 16515886 16954383 24508836
-1173 24508836 37389595 50058719 61608315 78371968 107906450 152776699 211462180 282437259
-1165 282437259 362962590 443292550 506234314 536669327 531970172 501410792 455617843 398908608
-1157 398908608 332429713 261559093 196532517 145534140 109426986 84004297 65444235 52035139
-1149 52035139 42084109 33017207 23426146 14619743 9047430 7562396 8646921 9714246 8737381 5489796
-1139 5489796 2129010 1804752 5195900 8660829 7674234 2623360 -784575 1562599 6464986 7288085
$$ packed form
-1203B3424908O604109P043093P243619O697085M072946o90033n527526q087390q168937p645192
-1193B4966682p823588p615358n109117p55441K173933J153745k095082l036490K53684M241596
-1183F354564L916185p12515l974890j371998M430748O572329K757851j456388M38497P554453
-1173B4508836J2880759J2669124J1549596J6763653K9534482M4870249N8685481P0975079
-1165B82437259Q0525331Q0329960O2941764L0435013m699155l0559380m5792949n6709235
-1157C98908608o6478895p0870620o5026576n0998377l6107154k5422689j8560062j3409096
-1149E2035139r951030r066902r591061q806403n572313j485034J084525J067325r76865l247585
-1139E489796l360786l24258L391148L464929r86595n050874l407935K347174M902387Q23099
$$ plain form
-1129 7288085 3093016 422716 4406420 11045126 11895830 5404429 -707805 317160 5317777 5835489
-1119 5835489 -239079 -6130500 -5823125 -2037243 -1716877 -6125325 -9616519 -8032285 -4184684 -3062906
-1109 -3062906 -4553360 -4284488 -624275 2856293 2697356 302983 -714142 16194 -190725 -1925065
-1099 -1925065 -2012535 1606279 5672173 4948636 -802681 -5785748 -4940781 59923 3146184 1262566
-1089 1262566 -2510529 -3483940 -1257088 358752 -1225096 -3741098 -2831253 2181552 6668661 5576119
-1079 5576119 -610891 -5935446 -5432512 -680932 2188685 -165663 -4376737 -4612444 248100 5253407
-1069 5253407 5236475 552149 -3872894 -4224755 -1271944 1409063 1167536 -2034026 -6231727 -8742508
-1059 -8742508 -7736784 -3979107 -885433 -1521540 -5142039 -7738011 -6615430 -3467711 -1936286 -2929083
$$ packed form
-1129G288085m195069k670300L983704O638706Q50704o491401o112234J024965N000617N17712
-1119E835489o074568n891421L07375L785882L20366m408448l491194J584234L847601J121778
-1109c062906j490454K68872L660213L480568j58937k394373j017125P30336k06919j734340
-1099a925065q7470L618814M065894p23537n751317m983067Q44967N000704L086261j883618
-1089A262566l773095r73411K226852J615840j583848k516002R09845N012805M487109j092542
-1079E576119o187010n324555N02934M751580K869617k354348m211074k35707M860544N005307
-1069E253407j6932m684326m425043l51861K952811K681007k41527l201562m197701k510781
-1059h742508J005724L757677L093674o36107l620499k595972J122581L147719J531425r92797
$$ plain form
-1049 -2929083 -3937518 -2896156 -878919 -43734 -342356 -23971 1098571 917625 -1819520 -5196092
-1039 -5196092 -6308150 -5002721 -3900242 -4711875 -5966973 -5060812 -1624863 2070058 3639660 2635770
-1029 2635770 257812 -2018941 -3237092 -3062899 -1676680 508458 3075711 5287810 5732931 3281551
-1019 3281551 -973688 -3518276 -1391216 4679504 11189327 16045903 20554570 26513011 32641724 35581054
-1009 35581054 34022881 30000966 25765415 21253019 15789572 10629164 7611754 5945192 2948824
-1000 2948824 -1440796 -3464472 -698709 3376212 2864559 -2839334 -7906074 -7666227 -4624480 -4510661
-990 -4510661 -8076059 -10262987 -7551023 -2674079 -341378 -913230 -1216287 -198406 -20208 -1183454
-980 -1183454 -389455 4310763 8770708 6950747 -552364 -5970687 -3809896 2054715 3413105 -1737319
$$ packed form
-1049b929083j008435J041362K017237Q35185k98622L18385J122542j80946k737145l376572
-1039e196092j112058J305429J102479q11633j255098R06161L435949L694921J569602j003890
-1029B635770k377958k276753j218151J74193J386219K185138K567253K212099M45121k451380
-1019C281551m255239k544588K127060O070720O509823M856576M508667N958441O128713K939330
-1009C5581054j558173m021915m235551m512396n463447n160408l017410j666562k996368
-1000B948824m389620k023676K765763M074921n11653n703893n066740K39847L041747J13819
-990d510661l565398k186928K711964M876944K332701n71852l03057J017881J78198j163246
-980a183454P93999M700218M459945j819961p503111n418323K160791N864611J358390n150424
$$ plain form
-970 -1737319 -7086946 -6533251 -1485159 2101310 1622894 -195790 -519571 -345650 -1993403 -4811298
-960 -4811298 -5653126 -3159491 333902 1602995 72703 -2082591 -2603630 -1155407 946224 2256231
-950 2256231 2378312 1980603 1717958 1176919 -640581 -3481891 -5184482 -3869885 -625797 1276493
-940 1276493 314340 -1310974 -678577 1749341 2699998 665296 -1988044 -2372275 -990522 -563976
-930 -563976 -1703225 -1985168 209025 2936588 3246337 1318649 111514 1090336 2278439 1281015
-920 1281015 -1266154 -2630432 -1611060 242669 903178 -11618 -1665478 -3298293 -4370981 -4392585
-910 -4392585 -3652665 -3516932 -4757680 -5881224 -4646224 -1569025 -311063 -3347382 -8259696 -10085594
-900 -10085594 -7217821 -3229098 -2236844 -3973219 -4792408 -2679574 534002 1990552 1192835 -198768
$$ packed form
-970a737319n349627N53695N048092L586469m78416j818684l23781J73921j647753k817895
-960d811298q41828K493635L493393J269093j530292k155294n21039J448223K101631J310007
-950B256231J22081l97709k62645n41039j817500k841310j702591J314597L244088J902290
-940A276493r62153j625314O32397K427918R50657k034702k653340l84231J381753M26546
-930e63976j139249k81943K194193K727563L09749j927688j207135R78822J188103r97424
-920A281015k547169j364278J019372J853729O60509r14796j653860j632815j072688k1604
-910d392585P39920J35733j240748j123544J235000L077199J257962l036319m912314j825898
-900a0085594K867773L988723R92254j736375q19189K112834L213576J456550p97717j391603
$$ plain form
-890 -198768 -761088 -242211 1338505 4038245 7120709 8836027 7737537 3901802 -1341169 -6266364
-880 -6266364 -9015509 -7978319 -3199953 2646244 5885178 5072133 2123473 -103154 -734143 -894261
-870 -894261 -1534955 -2334875 -2625495 -2332169 -1726883 -1156079 -1429590 -3476253 -6725946 -8676258 -7519734
-859 -7519734 -4940690 -4560131 -7109298 -8908949 -6576512 -1967587 -127777 -2457601 -4455956 -1520800
-849 -1520800 4904968 9144446 8356117 5229696 3403659 2852719 1488237 -514287 -658551 1971649
-839 1971649 5319537 7508933 9141273 10982532 11281277 8031524 3260657 1942172 5589956 9424404
-829 9424404 8103546 2826389 -124418 2238937 5718638 4779376 -104670 -3580390 -2870185 -925943
-819 -925943 -1457905 -3585497 -3635891 -820851 1734143 1775309 1146218 2711419 5624197 5938282 1873011
$$ packed form
-890a98768n62320N18877J580716K699740L082464J715318j098490l835735n242971m925195
-880f266364k749145J037190M778366N846197L238934q13045k948660k226627o30989j60118
-870h94261o40694p99920k90620K93326O05286N70804k73511k046663l249693j950312J156524
-859g519734K579044L80559k549167j799651K332437M608925J839810k329824j998355K935156
-849a520800O425768M239478p88329l126421j826037n50940j364482k002524j44264K630200
-839A971649L347888K189396J632340J841259K98745l249753m770867j318485L647784L834448
-829I424404j320858n277157k950807K363355L479701r39262m884046l475720P10205J944242
-819i25943n31962k127592n0394K815040K554994M1166o29091J565201K912778L14085m065271
$$ plain form
-808 1873011 -3454806 -5487542 -3372873 -505784 -280675 -2381854 -3545542 -1358829 3120707 6300486
-798 6300486 5393483 1060012 -3055569 -3597733 -584735 2745388 3199931 632596 -2263461 -2745395
-788 -2745395 -370591 2952678 4603644 3141629 -527399 -3596929 -3815158 -2143769 -2236105 -6145918
-778 -6145918 -10941408 -11270994 -5905093 -175107 -285540 -5905836 -10497166 -9318506 -4963585 -3380641
-768 -3380641 -5904093 -7971434 -5904840 -2178463 -1935566 -5671152 -8143148 -4977498 1786779 6162836
-758 6162836 5047683 860954 -2265133 -3038626 -3114271 -4109495 -5952895 -7787606 -9154095 -9962203
-748 -9962203 -10181220 -10099736 -10367816 -11205110 -11847354 -11318170 -9611300 -7604694 -5895211 -4326523 -2770358
-737 -2770358 -1726683 -1753771 -2764367 -4350939 -6349728 -8357972 -9058073 -7285408 -4176505 -3053214
$$ packed form
-808A873011n327817k032736K114669K867089K25109k101179j163688K186713M479536L179779
-798F300486r07003m333471m115581n42164L012998L330123M54543k567335k896057m81934
-788b745395K374804L323269J650966j462015l669028l069530k18229J671389r2336l909813
-778f145918m795490l29586N365901N729986j10433n620296m591330J178660M354921J582944
-768c380641k523452k067341K066594L726377K42897l735586k471996L165650O764277M376057
-758F162836j115153m186729l126087p73493p5645r95224j843400j834711j366489q08108
-748i962203k19017Q1484k68080q37294o42244N29184J706870K006606J709483J568688J556165
-737b770358J043675k7088j010596j586572j998789k008244p00101J772665L108903J123291
$$ plain form
-727 -3053214 -5906406 -10410303 -11900429 -8701428 -4273494 -3136898 -5507527 -7414871 -6005214 -3048949
-717 -3048949 -2240143 -4105140 -5243146 -2711452 2190478 5338246 4353696 876078 -1554199 -1027585
-707 -1027585 1561999 4239062 6197387 8272323 11418191 14985273 16944140 16275997 14918998 16331959
-697 16331959 21510082 27248700 29710773 29594651 31966222 39801823 48950174 51699956 45554736 36411610
-687 36411610 31668059 31567856 29658000 21687467 11480903 6395398 8443296 12370622 12620499 9995982
-677 9995982 10077936 16206722 25700506 32719852 33292447 27321935 17461984 7486706 946729 -593175
-667 -593175 1188910 2665610 1595363 -994757 -2484686 -1684475 347603 1991416 2581665 2254608
-657 2254608 1357525 593524 993172 2789990 4573577 4513622 2525250 324696 -1010303 -2555402
$$ packed form
-727c053214k853192m503897j490126L199001M427934J136596k370629j907344J409657K956265
-717c048949Q08806j864997j138006K531694M901930L147768r84550l477618k430277N26614
-707a027585K589584K677063J958325K074936L145868L567082J958867o68143j356999J412961
-697A6331959N178123N738618K462073j16122K371571P835601R148351K749782o145220r143126
-687C6411610m743551j00203j909856p970533j0206564n085505K047898L927326K49877k624517
-677I995982Q1954O128786R493784P019346N72595n970512r859951r975278o539977j539904
-667e93175J782085J476700j070247k590120j489929Q00211K032078J643813N90249l27057
-657B254608q97083p64001L99648J796818J783587n9955j988372k200554j334999j545099
$$ plain form
-647 -2555402 -5679735 -9291492 -10440034 -8033530 -4720730 -3977665 -5813924 -6608081 -3427809 2390416
-637 2390416 6490942 5781571 967077 -4648670 -8043086 -8364467 -7024001 -6338895 -7322389 -8138506
-627 -8138506 -5323283 2403845 11674536 17205810 17897901 19364040 28756101 46539716 64372945 72217978
-617 72217978 67575031 57140861 49436684 46608161 43854294 36077840 23802453 12267910 5774204
-608 5774204 4048148 3942856 3281566 2066472 658703 -1487197 -4513040 -6654988 -5636704 -1819856
-598 -1819856 1210854 164163 -4263661 -8129470 -8615720 -6704194 -5174631 -4971357 -4635939 -2950726
-588 -2950726 -757230 337443 23750 -945498 -2525506 -5545591 -9756348 -12812360 -12293982 -8607158
-578 -8607158 -5062590 -4788879 -7853366 -11434846 -12392387 -9606517 -4508261 44419 1683250 136852
$$ packed form
-647b555402l124333l611757j148542K406504L312800P43065j836259p94157L180272N818225
-637B390416M100526p09371m814494n615747l394416l21381J340466O85106r83494q16117
-627h138506K815223P727128R270691N531274O92091J466139R392061J7783615J7833229P845033
-617G2217978m642947j0434170p704177k828523k753867p776454j2275387j1534543o493706
-608E774204j726056j05292o61290j215094j407769k145900l025843k141948J018284L816848
-598a819856L030710j046691m427824l865809m86250J911526J529563K03274L35418J685213
-588b950726K193496J094673l13693r69248j580008l020085m210757l056012N18378L686824
-578h607158L544568K73711l064487l581480r57541K785870N098256M552680J638831j546398
$$ plain form
-568 136852 -2728565 -4701496 -5145399 -4936689 -4716899 -4006935 -2380099 -626242 312774 1224853 4019230
-557 4019230 8775940 12756657 13712661 13464104 16172603 22519330 27484744 25846186 19334613 16057421
-547 16057421 21756817 32919566 40151553 38149968 30925087 26808929 29536097 35228389 37438328
-538 37438328 33691637 26834504 21218724 18664609 17812003 16262657 12868569 8505893 5330822 5269339
-528 5269339 8680912 14167015 19896575 25474247 32491225 42822952 56041062 68656974 76441041
-519 76441041 77820595 74848349 70617767 66010143 59541424 50367864 40536647 33468853 30511707 29896513
-509 29896513 29204194 27865801 26611923 25414917 23502122 21446680 21635368 25532087 31305730 35652674
-499 35652674 37871054 40566858 45631885 50797505 51610838 46409607 37910526 29855819 23691260 19239969
$$ packed form
-568A36852k865417j972931m43903K08710K19790P09964J626836J753857R39016R12079K794377
-557D019230M756710L980717R56004k48557K708499O346727M965414j638558o511573l277192
-547A6057421N699396J1162749P231987k001585p224881m116158K727168N692292K209939
-538C7438328l746691o857133n615780k554115q52606j549346l394088m362676l175071o1483
-528E269339L411573N486103N729560N577672P016978J0331727J3218110J2615912P784067
-519G6441041J379554k972246m230582m607624o468719r173560r831217p067794k957146o15194
-509B9896513o92319j338393j253878j197006j912795k055442J88688L896719N773643M346944
-499C5652674K218380K695804N065027N165620Q13333n201231q499081q054707o164559m451291
$$ plain form
-489 19239969 16937577 17398010 19365185 20605918 21697317 26780326 38347828 52190384 60362419
-480 60362419 60076817 57604894 61590743 73729565 88425296 101473996 116436067 141383419 182009185
-471 182009185 240817930 321320070 426909107 550831102 668264492 743672352 751315802 691787483
-463 691787483 590438846 480591091 386278290 315579557 264390389 224346788 189710938 160504404
-455 160504404 140534280 131718364 129892194 126832413 116888651 101219259 85273701 72917576 63761702
-446 63761702 55414471 46621831 37788237 29862936 23909327 20970284 20785393 20717854 17664553 11888383
-436 11888383 7680217 8684030 13047518 14988523 11581065 6407351 5293086 9444763 14515897 16224665
-426 16224665 14965476 14152504 15789036 19582220 25733892 36081928 51298813 68226168 81493998
$$ packed form
-489A9239969k302392M60433J967175J240733J091399N083009J1567502J3842556Q172035
-480F0362419k85602k471923L985849J2138822J4695731J3048700J4962071K4947352M0625766
-471A82009185N8808745Q0502140J05589037J23921995J17433390P5407860P643450n9528319
-463F91787483j01348637j09847755r4312801p0698733n1189168m0043601l4635850k9206534
-455A60504404j9970124q815916j826170l059781r943762j5669392j5945558j2356125r155874
-446F3761702q347231q792640q833594p925301n953609k939043j84891o7539l053301n776170
-436A1888383m208166J003813M363488J941005l407458n173714j114265M151677N071134J708768
-426A6224665j259189q12972J636532L793184O151672J0348036J5216885J6927355J3267830
$$ plain form
-417 81493998 87547274 86171001 78635012 66145936 50720043 36003220 25437101 19594953 16355085
-408 16355085 13783158 11881118 11271343 11350408 10773980 9264760 7860354 7415854 7774496 8509419 9473534
-397 9473534 10181724 9687908 8076419 7398357 9710267 14234942 18000865 19935178 22921366 30363843
-387 30363843 41444169 51644065 58148756 62938832 69540412 78163102 85829760 90655759 93727744
-378 93727744 96179132 96430897 92067112 83513354 73843158 64898553 55478945 44223415 32792312
-369 32792312 24543099 20511732 18279958 15039219 10527195 6415234 3892564 2812111 2542642 2496901
-359 2496901 2017580 861135 -98568 286089 1556967 1771686 378081 79206 4495618 14249463
-349 14249463 26631963 38936550 50256635 59349359 62894764 58291598 47640319 36471788 27926552
$$ packed form
-417H1493998O053276j376273p535989j2489076j5425893j4716823j0566119n842148l239868
-408A6355085k571927j902040o09775P9065n76428j509220j404406m44500L58642P34923R64115
-397I473534P08190m93816j611489o78062K311910M524675L765923J934313K986188P442477
-387C0363843J1080326J0199896O504691M790076O601580Q622690P666658M825999L071985
-378I3727744K451388K51765m363785q553758r670196q944605r419608j1255530j1431103
-369C2792312q249213m031367k231774l240739m512024m111961k522670j080453k69469m5741
-359B496901m79321j156445r59703L84657J270878K14719j393605k98875M416412R753845
-349A4249463J2382500J2304587J1320085R092724L545405m603166j0651279j1168531q545236
$$ plain form
-340 27926552 20279196 11434025 3740337 1587638 4838679 7813854 5925797 959996 -2191039 -2325322
-330 -2325322 -2591674 -4855069 -6767052 -5767428 -3332039 -2640234 -3436135 -2449332 1025934 3255187
-320 3255187 1367670 -1984987 -2044942 1211076 2964752 519113 -2929703 -3236941 -1386226 -1429439
-310 -1429439 -3434033 -2395322 4669797 13629750 17880930 16632997 15647793 19905722 28395169 37282267
-300 37282267 46138943 59322546 82693821 121232005 179040415 258382382 356817629 465826185
-292 465826185 572292748 659789280 708938443 702208540 635708988 528498782 415860494 327653905
-284 327653905 270892636 233092612 200604326 171087571 149410172 136894511 128661961 119906564 110548522
-275 110548522 102813323 97205517 92794733 89554474 87777959 85708843 80313874 71059633 61088659
$$ packed form
-340B7926552p647356q845171p693688k152699L251041K975175j888057m965801l151035j34283
-330b325322k66352k263395j911983R99624K435389O91805p95901R86803L475266K229253
-320C255187j887517l352657n9955L256018J753676k445639l448816l07238J850715m3213
-310a429439k004594J038711P065119Q959953M251180j247933r85204M257929Q489447Q887098
-300C7282267Q856676J3183603K3371275L8538184N7808410P9341967R8435247J09008556
-292D65826185J06466563Q7496532M9149163o729903o6499552j07210206j12638288q8206589
-284C27653905n6761269l7800024l2488286k9516755k1677399j2515661q232550q755397r358042
-275A10548522p735199n607806m410784l240259j776515k069116n394969r254241r970974
$$ plain form
-266 61088659 53604258 48491472 43846020 39593659 37411726 37263562 36367895 32658268 27617918 24072724
-256 24072724 22168394 19593857 15679837 13031473 13939341 16638449 16935942 13207660 8212953 5735290
-246 5735290 6710782 9184703 10849621 10520202 7915421 3648273 -326677 -1585259 477203 3616470
-236 3616470 4687825 2580465 -1011923 -3331899 -2590439 1286306 7036583 13182867 19605976 28120343
-226 28120343 40364703 54392195 64408260 65575919 59239095 52074047 49476631 50812397 51985899
-217 51985899 51506498 52105650 56321174 62363480 65516098 62660376 54184372 42190734 28783750 16517912
-207 16517912 8643803 7059221 10246374 14657418 18608084 23996500 33579441 46937051 59626637
-198 59626637 66189679 63857820 53942173 40496241 27732932 18021534 11671907 8241426 7557568
$$ packed form
-266F1088659p484401n112786m645452m252361k181933j48164q95667l709627n040350l545194
-256B4072724j904330k574537l914020k648364R07868K699108K97493l728282m994707k477663
-246E735290R75492K473921J664918l29419k604781m267148l974950j258582K062462L139267
-236C616470J071355k107360l592388k319976P41460L876745N750277O146284O423109Q514367
-226B8120343J2244360J4027492J0016065J167659o336824p165048k597416J335766J173502
-217E1985899m79401N99152M215524O042306L152618k855722q476004j1993638j3406984j2265838
-207A6517912p874109j584582L187153M411044L950666N388416R582941J3357610J2689586
-198E9626637O563042k331859r915647j3445932j2763309r711398o349627l430481o83858
$$ plain form
-189 7557568 9071413 10733652 9863573 5855148 1239780 -1005532 -881594 -893898 -2161207 -2632968
-179 -2632968 -259233 3262944 3889529 446389 -3351745 -3090560 1244483 5624000 6775003 5101319
-169 5101319 2924261 1568019 1045606 1426055 3238535 7155697 14617804 28360224 50398416 78640875
-159 78640875 106561203 127131218 136600676 134512811 122482181 105428810 92668603 93781670 112596234
-150 112596234 149785615 214831322 329965090 509958695 730234438 919913968 1000000000 940017148
-142 940017148 781276372 604144334 470698850 394079856 352925908 324315815 300079616 279890979
-134 279890979 260508120 236572350 207965975 180855492 160638630 146544496 134562863 124009692
-126 124009692 118886618 122328613 130913187 135623661 128857689 110599135 87887938 68425664 54698324
$$ packed form
-189G557568J513845J662239q70079m008425m615368k245312J23938j2304j267309m71761
-179b632968K373735L522177O26585l443140l798134K61185M335043M379517J151003j673684
-169E101319k177058j356242n22413L80449J812480L917162P462107J3742420K2038192K8242459
-159G8640875K7920328K0570015R469458k087865j2030630j7053371j2760207J113067J8814564
-150A12596234L7189381O5045707J15133768J79993605K20275743J89679530Q0086032n9982852
-142I40017148j58740776j77132038j33445484p6618994m1153948k8610093k4236199k0188637
-134B79890979j9382859k3935770k8606375k7110483k0216862j4094134j1981633j0553171
-126A24009692n123074L441995Q584574M710474o765972j8258554k2711197j9462274j3727340
$$ plain form
-117 54698324 43978605 33228383 23056034 16663002 15743182 18388528 21013341 21543651 20429581
-108 20429581 19243879 18977563 19400999 19379960 17870955 15243672 13581054 14759980 17841600 19267492
-98 19267492 16573113 11391348 7591029 6614228 6228509 4478771 3161754 5459855 10736195 14144620
-88 14144620 12382043 8044159 6413681 8732044 10895839 9115002 4700251 1805126 1901719 2812816
-78 2812816 3003156 4277541 8809553 15029688 18698940 18074681 16202144 17191283 21256852 24579420
-68 24579420 23675024 18835314 13255956 9764682 8824590 9030321 8822269 7869294 7246137 8179425 10308912
-57 10308912 11459713 9771564 6065461 3401284 3940858 6751783 9126005 9499491 8283082 6234013
-47 6234013 3439847 500962 -494850 2233400 7350211 10732298 9478675 5074646 1749458 1898409
$$ packed form
-117E4698324j0719719j0750222j0172349o393032r19820K645346K624813N30310j114070
-108B0429581j185702k66316M23436k1039j509005k627283j662618J178926L081620J425892
-98A9267492k694379n181765l800319r76801l85719j749738j317017K298101N276340L408425
-88A4144620j762577m337884j630478K318363K163795j780837m414751k895125R6593R11097
-78B812816J90340J274385M532012O220135L669252o24259j872537R89139M065569L322568
-68B4579420r04396m839710n579358l491274r40092K05731k08052r52975o23157R33288K129487
-57A0308912J150801j688149l706103k664177N39574K810925K374222L73486j216409k049069
-47F234013k794166k938885r95812K728250N116811L382087j253623m404029l325188J48951
$$ plain form
-37 1898409 3992586 5143633 4793458 5020635 7429280 10608031 11151776 7076994 75202 -5529773
-27 -5529773 -6139237 -1726618 4111150 6973984 5122425 693457 -2412951 -2070291 403528 1955469
-17 1955469 1086746 -624223 -305654 2941201 6690111 7316453 3639415 -1596287 -4068940 -1850432
-7 -1850432 2930202 6282468 6013131 3234062 709985 214845 1406134 2633705 2472885 863234
2 863234 -709595 -338018 2323558 5106966 5134043 2112021 -749810 -51456 3665594 6141106 4217895
13 4217895 -376449 -2929404 -986222 3370923 6420431 6681308 5281653 3649722 2350970 1928400
23 1928400 3109970 5297175 5991862 3232417 -1494897 -4009188 -1588448 4234616 9292792 10496674
33 10496674 7615550 2513618 -2029264 -3194548 220955 6042122 9724950 8573763 4734451 2815108
$$ packed form
-37A898409K094177J151047l50175K27177K408645L178751N43745m074782p001792n604975
-27e529773o09464M412619N837768K862834j851559m428968l106408L42660K473819J551941
-17A955469q68723j710969L18569L246855L748910O26342l677038n235702k472653K218508
-7a850432M780634L352266k69337k779069k524077m95140J191289J227571j60820j609651
2H63234j572829L71577K661576K783408K7077l022022k861831O98354L717050K475512j923211
13D217895m594344k552955J943182M357145L049508K60877j399655j631931j298752m22570
23A928400J181570K187205O94687k759445m727314k514291K420740N823064N058176J203882
33A0496674k881124n101932m542882j165284L415503N821167L682828j151187l839312j919343
$$ plain form
43 2815108 4539751 7065174 7024796 4795255 3422152 4185481 5191337 4560979 3102715 2597491 2753843
54 2753843 1816864 -122561 -605068 1562353 3855808 2983231 -410962 -2018911 778285 5511869
64 5511869 7673550 6073151 3693105 3703257 6315787 9770171 12645046 14101660 13285036 10610345
74 10610345 9442536 14146698 25057266 36511715 41596844 38757834 32468188 27432478 23817760 19046588
84 19046588 12704847 7507737 5478836 5274387 4488198 3321563 4074463 7107774 9219041 7197917
94 7197917 2104574 -1473081 -535213 3031728 4773793 2526394 -1853674 -5187717 -6207847 -5680237
104 -5680237 -4303183 -1840248 1402975 3335094 1605777 -3347771 -7598168 -7014845 -1452833 4775720
114 4775720 6906143 4000815 -900847 -4375948 -5572793 -5616771 -5206090 -3880068 -1446367 1097024
$$ packed form
43B815108J724643K525423m0378k229541j373103P63329J005856o30358j458264n05224J56352
54B753843r36979j939425m82507K167421K293455q72577l394193j607949K797196M733584
64E511869K161681j600399k380046J0152K612530L454384K874875J456614q16624k674691
74A0610345j167809M704162J0910568J1454449N085129k839010o289646n035710l614718m771172
84A9046588o341741n197110k028901k04449p86189j166635P52900L033311K111267k021124
94G197917n093343l577655R37868L566941J742065k247399m380068l334043j020130N27610
104e680237J377054K462935L243223J932119j729317m953548m250397N83323N562012O228553
114D775720K130423k905328m901662l475101j196845m3978M10681J326022K433701K543391
$$ plain form
124 1097024 2713091 3698027 4945345 6054901 5348289 2323444 -720449 -614783 3079201 7217057
134 7217057 8209132 5560131 1915465 47166 441109 1647978 2090032 1113657 -1070462 -3635265
144 -3635265 -5355429 -5282867 -3574744 -1385438 292494 1443194 2475580 3199826 2875497 1248828
154 1248828 -964000 -2801315 -3824476 -3849840 -2381760 900536 4966588 7424169 6338145 2111062
164 2111062 -2657249 -5155321 -4180034 -466799 4051718 7220514 7717358 5993553 4139105 4131369 5848917
175 5848917 7118328 6063374 3220795 941347 740489 1683582 1614590 -287341 -2517274 -2796332 -416178
186 -416178 2985790 4862333 3978032 1380453 -744756 -1236533 -965898 -1560669 -3169554 -3857184 -1558921
197 -1558921 3449127 8378445 10365862 8984796 6390693 5268500 6655070 9251788 10399175 8074608
$$ packed form
124A097024J616067R84936J247318J109556p06612l024845l043893J05666L693984M137856
134G217057R92075k649001l644666j868299L93943J206869M42054r76375k184119k564803
144c635265j720164P2562J708123K189306J677932J150700J032386P24246l24329j626669
154A248828k212828j837315j023161k5364J468080L282296M066052K457581j086024m227083
164B111062m768311k498072R75287L713235M518517L168796M96844j723805j854448p736J717548
175E848917J269411j054954k842579k279448k00858R43093o8992j901931k229933k79058K380154
186d16178L401968J876543q84301k597579k125209m91777K70635n94771j608885o87630K298263
197a558921N008048M929318J987417j381066k594103j122193J386570K596718J147387k324567
$$ plain form
207 8074608 2827819 -1957638 -2486313 1870380 7436063 9347644 6091407 622684 -3023015 -3526825
217 -3526825 -2338604 -880395 905378 3143138 4629675 4026755 1926271 471578 809385 1970068
227 1970068 2675265 3164547 4207690 5046591 3978883 1233153 -325077 1447622 4777025 5726194
237 5726194 3067078 -228159 -1005049 94040 262971 -674735 477433 5412174 10638486 10875937
247 10875937 5813706 1343865 3104399 10124373 16303922 17493186 15229521 13194261 11966824 9109955
257 9109955 3813992 -789018 -1035376 2625968 5898598 5535677 2776175 1348602 2925284 5642382
267 5642382 6934415 6549882 5989398 5699771 4233756 616751 -3460446 -4969941 -2995100 198381
277 198381 2028691 2680341 4229170 6972876 8192031 5520342 658235 -1855871 215792 4202314
$$ packed form
207H074608n246789m785457n28675M356693N565683J911581l256237n468723l645699n03810
217c526825J188221J458209J785773K237760J486537o02920k100484j454693L37807J160683
227A970068P05197M89282J043143Q38901j067708k745730j558230J772699L329403R49169
237E726194k659116l295237p76890J099089J68931r37706J152168M934741N226312K37451
247A0875937n062231m469841J760534P019974O179549J189264k263665k035260j227437k856869
257I109955n295963m603010k46358L661344L272630l62921k759502j427573J576682K717098
267E642382J292033l84533n60484k89627j466015l617005m077197j509495J974841L193481
277A98381J830310O51650J548829K743706J219155k671689m862107k514106K071663L986522
$$ plain form
287 4202314 5849090 4265036 2180827 1681192 1594832 -18974 -2334170 -2684145 -765160 220620 -2275365
298 -2275365 -6201087 -6926774 -2982766 1962595 3453763 1203874 -1452836 -2116715 -1556808 -1398516
308 -1398516 -1474636 -672025 676555 972120 -159032 -1140556 -861810 -575092 -2097073 -4646028 -5013471
319 -5013471 -1303656 4526972 8568052 8761027 6092193 2616959 -438216 -2555180 -3272453 -2602185
329 -2602185 -1455444 -566460 853118 4280402 9390616 13411152 13851779 11430903 9293399 9314031
339 9314031 10103980 9058912 5610141 1721611 -402967 -234206 1308869 2943228 3507985 2347679
349 2347679 213251 -628635 1558122 5491698 7447098 5189755 851960 -1158094 863045 4042774
359 4042774 4539600 2171512 366437
$$ packed form
287D202314J646776j584054k084209m99635q6360j613806k315196l49975J918985R85780k495985
298b275365l925722p25687L944008M945361J491168k249889k656710o63879N59907J58292
308a398516p6120Q02611J348580K95565j131152r81524K78746K86718j521981k548955l67443
319e013471L709815N830628M041080J92975k668834l475234l055175k116964p17273O70268
329b602185J146741Q88984J419578L427284N110214M020536M40627k420876k137504K0632
339I314031P89949j045068l448771l888530k124578J68761J543075J634359N64757j160306
349B347679k134428q41886K186757L933576J955400k257343m337795k010054K021139L179729
359D042774M96826k368088j805075
$$ plain form
362 366437
$$ packed form
362C66437
##END=	
