##TITLE=	labeled_M9_sacculi 13C 1D and 2D.19.fid
##JCAMPDX=	6.0	$$ NMR Plug-in 1.13 of MestReNova 11.0.4-18998
##DATATYPE=	NMRSPECTRUM
##DATACLASS=	XYDATA
##NUMDIM=	1
##ORIGIN=	Bruker BioSpin GmbH
##OWNER=	ecaudill
##.OBSERVEFREQUENCY=	125.72761525999999321
##.OBSERVENUCLEUS=	^13C
##.SOLVENTNAME=	
##.PULSESEQUENCE=	cp
##LONGDATE=	2017/11/06 18:45:07.000
##.ACQUISITIONMODE=	SIMULTANEOUS (DQD)
##$ORIGINALFORMAT=	Bruker XWIN-NMR
##$PARAMETERFILE=	(acqus, ASCII, d:/Desktop/labeled_M9_sacculi%2013C%201D%20and%202D/19/acqus, 0)
$$ ##TITLE= Parameter file, TOPSPIN		Version 3.2
$$ ##JCAMPDX= 5.0
$$ ##DATATYPE= Parameter Values
$$ ##NPOINTS= 7	$$ modification sequence number
$$ ##ORIGIN= Bruker BioSpin GmbH
$$ ##OWNER= ecaudill
$$ $$ 2017-11-06 18:45:08.050 -0600  ecaudill@devon.nmrfam.wisc.edu
$$ $$ /home/ecaudill/NMR/labeled_M9_sacculi 13C 1D and 2D/19/acqus
$$ $$ process /opt/topspin_CPMAS/prog/mod/go
$$ ##$ACQT0= 0
$$ ##$AMP= (0..31)
$$ 100 100 100 100 100 100 100 100 100 100 100 100 100 100 100 100 100 100
$$ 100 100 100 100 100 100 100 100 100 100 100 100 100 100
$$ ##$AMPCOIL= (0..19)
$$ 0 0 0 0 0 0 0 0 0 0 0 0 0 0 0 0 0 0 0 0
$$ ##$ANAVPT= -1
$$ ##$AQSEQ= 0
$$ ##$AQ_mod= 1
$$ ##$AUNM= <au_zgonly>
$$ ##$AUTOPOS= <>
$$ ##$BF1= 125.715042
$$ ##$BF2= 499.96
$$ ##$BF3= 499.96
$$ ##$BF4= 499.96
$$ ##$BF5= 499.96
$$ ##$BF6= 499.96
$$ ##$BF7= 499.96
$$ ##$BF8= 499.96
$$ ##$BYTORDA= 0
$$ ##$CAGPARS= (0..11)
$$ 0 0 0 0 0 0 0 0 0 0 0 0
$$ ##$CFDGTYP= 0
$$ ##$CFRGTYP= 9
$$ ##$CHEMSTR= <none>
$$ ##$CNST= (0..63)
$$ 1 1 1 1 1 1 1 1 1 1 1 0 1 1 1 1 1 1 1 1 1 0 1 1 1 0 1 1 1 1 1 5000 1 1
$$ 1 1 1 1 1 1 1 1 1 1 1 1 1 1 1 1 1 1 1 1 1 1 1 1 1 1 1 1 1 1
$$ ##$CPDPRG= (0..8)
$$ <> <> <swftppm_13> <> <> <> <> <> <>
$$ ##$D= (0..63)
$$ 0 5 0 0 0 0 0 0 0 0 0 0 0 0 0 0 0 0 0 0 0 0 0 0 0 0 0 0 0 0 0 0 0 0 0 0
$$ 0 0 0 0 0 0 0 0 0 0 0 0 0 0 0 0 0 0 0 0 0 0 0 0 0 0 0 0
$$ ##$DATE= 1510015507
$$ ##$DE= 7.699996
$$ ##$DECBNUC= <off>
$$ ##$DECIM= 532
$$ ##$DECNUC= <off>
$$ ##$DECSTAT= 4
$$ ##$DIGMOD= 3
$$ ##$DIGTYP= 12
$$ ##$DQDMODE= 0
$$ ##$DR= 21
$$ ##$DS= 16
$$ ##$DSPFIRM= 4
$$ ##$DSPFVS= 21
$$ ##$DTYPA= 0
$$ ##$EXP= <4mm_CPMAS_13C_CP_100KHz.lz.2016>
$$ ##$F1LIST= <>
$$ ##$F2LIST= <>
$$ ##$F3LIST= <>
$$ ##$FCUCHAN= (0..9)
$$ 0 1 2 0 0 0 0 0 0 0
$$ ##$FL1= 90
$$ ##$FL2= 90
$$ ##$FL3= 90
$$ ##$FL4= 90
$$ ##$FOV= 20
$$ ##$FQ1LIST= <freqlist>
$$ ##$FQ2LIST= <hetcor.jos>
$$ ##$FQ3LIST= <freqlist>
$$ ##$FQ4LIST= <freqlist>
$$ ##$FQ5LIST= <freqlist>
$$ ##$FQ6LIST= <freqlist>
$$ ##$FQ7LIST= <freqlist>
$$ ##$FQ8LIST= <freqlist>
$$ ##$FRQLO3= 1.79769313486232e+308
$$ ##$FRQLO3N= 0
$$ ##$FS= (0..7)
$$ 83 83 83 83 83 83 83 83
$$ ##$FTLPGN= 0
$$ ##$FW= 625000
$$ ##$FnMODE= 0
$$ ##$FnTYPE= 0
$$ ##$GPNAM= (0..31)
$$ <> <> <> <> <> <> <> <> <> <> <> <> <> <> <> <> <> <> <> <> <> <> <> <>
$$ <> <> <> <> <> <> <> <>
$$ ##$GPX= (0..31)
$$ 0 0 0 0 0 0 0 0 0 0 0 0 0 0 0 0 0 0 0 0 0 0 0 0 0 0 0 0 0 0 0 0
$$ ##$GPY= (0..31)
$$ 0 0 0 0 0 0 0 0 0 0 0 0 0 0 0 0 0 0 0 0 0 0 0 0 0 0 0 0 0 0 0 0
$$ [...]
$$ 0 0 0 0 0 0 0 0
$$ ##$SguType= 2
$$ ##$ShimPowMaxUA= (0..63)
$$ 130000 130000 130000 130000 130000 130000 130000 130000 130000 130000 130000
$$ 130000 130000 130000 130000 130000 130000 130000 130000 130000 130000 130000
$$ 130000 130000 130000 130000 130000 130000 130000 130000 130000 130000 130000
$$ 130000 130000 130000 130000 130000 130000 130000 0 0 0 0 0 0 0 0 0 0 0
$$ 0 0 0 0 0 0 0 0 0 0 0 0 0
$$ ##$ShimPowMaxUC= (0..63)
$$ 130000 130000 130000 130000 130000 130000 130000 130000 130000 130000 130000
$$ 130000 130000 130000 130000 130000 130000 130000 130000 130000 130000 130000
$$ 130000 130000 130000 130000 130000 130000 130000 130000 130000 130000 130000
$$ 130000 130000 130000 130000 130000 130000 130000 0 0 0 0 0 0 0 0 0 0 0
$$ 0 0 0 0 0 0 0 0 0 0 0 0 0
$$ ##$ShimPowMaxUG= (0..63)
$$ 524287 524287 524287 524287 524287 524287 524287 524287 524287 524287 524287
$$ 524287 524287 524287 524287 524287 524287 524287 524287 524287 524287 524287
$$ 524287 524287 524287 524287 524287 524287 524287 524287 524287 524287 524287
$$ 524287 524287 524287 524287 524287 524287 0 0 0 0 0 0 0 0 0 0 0 0 0 0 0
$$ 0 0 0 0 0 0 0 0 0 0
$$ ##$ShimPowRcbType= 3
$$ ##$ShimPowRes= (0..63)
$$ 1e-20 1e-20 1e-20 1e-20 1e-20 1e-20 1e-20 1e-20 1e-20 1e-20 1e-20 1e-20
$$ 1e-20 1e-20 1e-20 1e-20 1e-20 1e-20 1e-20 1e-20 1e-20 1e-20 1e-20 1e-20
$$ 1e-20 1e-20 1e-20 1e-20 1e-20 1e-20 1e-20 1e-20 1e-20 1e-20 1e-20 1e-20
$$ 1e-20 1e-20 1e-20 1e-20 0 0 0 0 0 0 0 0 0 0 0 0 0 0 0 0 0 0 0 0 0 0 0 0
$$ ##$ShimPowRng0= (0..63)
$$ 1 1 1 1 1 1 1 1 1 1 1 1 1 1 1 1 1 1 1 1 1 1 1 1 1 1 1 1 1 1 1 1 1 1 1 1
$$ 1 1 1 1 0 0 0 0 0 0 0 0 0 0 0 0 0 0 0 0 0 0 0 0 0 0 0 0
$$ ##$ShimPowRng1= (0..63)
$$ 1 1 1 1 1 1 1 1 1 1 1 1 1 1 1 1 1 1 1 1 1 1 1 1 1 1 1 1 1 1 1 1 1 1 1 1
$$ 1 1 1 1 0 0 0 0 0 0 0 0 0 0 0 0 0 0 0 0 0 0 0 0 0 0 0 0
$$ ##$ShimPowRng2= (0..63)
$$ 1 1 1 1 1 1 1 1 1 1 1 1 1 1 1 1 1 1 1 1 1 1 1 1 1 1 1 1 1 1 1 1 1 1 1 1
$$ 1 1 1 1 0 0 0 0 0 0 0 0 0 0 0 0 0 0 0 0 0 0 0 0 0 0 0 0
$$ ##$ShimPowRng3= (0..63)
$$ 1 1 1 1 1 1 1 1 1 1 1 1 1 1 1 1 1 1 1 1 1 1 1 1 1 1 1 1 1 1 1 1 1 1 1 1
$$ 1 1 1 1 0 0 0 0 0 0 0 0 0 0 0 0 0 0 0 0 0 0 0 0 0 0 0 0
$$ ##$ShimSysFunc= (0..63)
$$ 1 2 3 4 5 6 7 8 9 10 0 37 38 35 16 15 14 13 12 11 28 27 26 25 24 23 36
$$ 22 30 29 20 21 34 33 32 31 17 18 19 0 0 0 0 0 0 0 0 0 0 0 0 0 0 0 0 0 0
$$ 0 0 0 0 0 0 0
$$ ##$ShimSysMatrix= 0
$$ ##$ShimSysType= 4
$$ ##$TFXNUM= 0
$$ ##$TRIPLO2= 0
$$ ##$VTU= 1
$$ ##$VTUETH= <no>
$$ ##$VTUTY= <tty05>
$$ ##$WBREFAM= (0..15)
$$ 99.6 100 100 100 100 100 100 100 100 100 100 100 100 100 100 100
$$ ##$WBREFLM= (0..15)
$$ 1 0 0 0 0 0 0 0 0 0 0 0 0 0 0 0
$$ ##$WBREFPH= (0..15)
$$ 0.22 0 0 0 0 0 0 0 0 0 0 0 0 0 0 0
$$ ##$WBSGU= (0..15)
$$ 0 0 0 0 0 0 0 0 0 0 0 0 0 0 0 0
$$ ##$XFAC= 2
$$ ##END=
$$ 
##$DECIM=	532
##$DSPFVS=	21
##XUNITS=	HZ
##YUNITS=	ARBITRARY UNITS
##FIRSTX=	31125.898459832482331
##LASTX=	-6449.7300646036947001
##XFACTOR=	-18.356437969924854769
##YFACTOR=	1.0000000000000000871e-07
##NPOINTS=	2048
##XYDATA=	(X++(Y..Y))
-1695H14066p55444N85819J416868R21107o21470j729382j210562L52202J154854K91255j213414
-1684E899j758967j056924j26154K77696M29821P39297Q78980L66237m50639p17903k72167
-1673a684824K00826L02648M70569R84645J121062J38710j208293j236695L23736J547803
-1663I60187O59278j457852k204770o48273J226785J159721m53287j295025l32149J017046
-1653a368339J130194L69835J39668N15062J57182j368721k459739j441731J005183K406492
-1643i14914J419245o50864j538182n96652Q02286J090170J30566r20694q99664L18417J693676
-1632f6610J823586K40677j853048k481507r29497J275979J872721L56572j475912j611967
-1622b849006r086J610831J774598N49341r78473j823028j550067k80216J214653J769553
$$ plain form
-1695 814066 58622 644441 2061309 2982416 2360946 631564 -578998 -226796 928058 1219313 5899
-1684 5899 -1753068 -2809992 -2936146 -2658450 -2228629 -1489332 -610352 -244115 -694754 -1412657 -1684824
-1673 -1684824 -1483998 -1181350 -710781 273864 1394926 1533636 325343 -911352 -587616 960187
-1663 960187 1619465 161613 -2043157 -2691430 -1464645 -304924 -758211 -2053236 -2385385 -1368339
-1653 -1368339 -238145 131690 271358 786420 943602 -425119 -2884858 -4326589 -3321406 -914914
-1643 -914914 504331 -146533 -1684715 -2281367 -1479081 -388911 -258345 -1179039 -2078703 -1760286 -66610
-1632 -66610 1756976 1997653 144605 -2336902 -3266399 -1990420 -117699 238873 -1237039 -2849006
-1622 -2849006 -2858092 -1247261 527337 1076678 98205 -1724823 -3274890 -3555106 -2340453 -570900
-1612e70900Q66271n68571r74683M3610J203544J125762r390q81111p89000k76486p880J50616
-1600f88218M95102N86695j90896j387460j695538o31766P12554J071322N89371L15884M84353
-1589c38597K81902n71182j053400l27946P21967N13737q61493j472002j75551J574815J502098
-1578b05652m14813j829029j104728O22571J146873J62640n75695J15400J245239J166188
-1568C28994j36532j144536q85898N775M50988L58082L89167P61455R71735O60780J59320
-1557A919330l5324N5958J7189l74391r51404j393674j387488o89695N61694J576268J411806
-1546G10269N8442j239994j172703J44043J214065Q19638o31477j603299j094615M17426J582107
-1535g96098J458877K24988j097918j494105p46811L97744R19751N24872j04044j78618K04582
$$ plain form
-1612 -570900 295371 -273200 -1247883 -1204273 -729 1125033 1115643 234532 -554468 -830954 -838834 -688218
-1600 -688218 -193116 393579 202683 -1184777 -2880315 -3512081 -2799527 -1728205 -1138834 -822950 -338597
-1589 -338597 -56695 -627877 -1681277 -2009223 -1287256 -773519 -1635012 -3107014 -3282565 -1707750 -205652
-1578 -205652 -620465 -2449494 -3554222 -2931651 -1784778 -1622138 -2197833 -2082433 -837194 328994
-1568 328994 192462 -952074 -1837972 -1832197 -1381209 -1023127 -633960 127495 1099230 1760010 1919330
-1557 1919330 1884006 1939964 1957153 1582762 631358 -762316 -2149804 -2839499 -2277805 -701537 710269
-1546 710269 768711 -471283 -1643986 -1499943 -285878 533760 -97717 -1701016 -2795631 -2378205 -796098
-1535 -796098 662779 887767 -210151 -1704256 -2451067 -2053323 -1133572 -608700 -712744 -891362 -686780
-1524f86780K37502m34776j106927q47736K70665J171568J020031J26641n50526n32067j59437
-1513a491842M5516r794r7594r3609o2862m1864L0568J50466J69962n4003m90758r23006j049886
-1500c918706o55554J69917R59015J206522R08622O16571P59852J020536O77514l83173j306588
-1489E4528j139348R1819J391086J767777R57904o62248k375187l208121k317592P1327K265307
-1478c102748K389652M12655j566368j530695J88985J416456Q36210m94956o85579M96732
-1468a639656J396814O57670j089027k053439j357179K12148J303419J310805N54484k96985
-1458a000946o62386k60117O22904J132584N71529p20755j523497j019562K54720J014989
-1448a590537O79054j13112m46968k31187r1238l76046o63334l49958N04605J136157Q60114
$$ plain form
-1524 -686780 -449278 -884054 -1990981 -2838717 -2568052 -1396484 -376453 -249812 -800338 -1332405 -1491842
-1513 -1491842 -1446326 -1456120 -1553714 -1647323 -1710185 -1752049 -1721481 -1571015 -1401053 -1455056 -1945814 -2868820 -3918706
-1500 -3918706 -4574260 -4404343 -3445328 -2238806 -1330184 -713613 46239 1066775 1744289 1361116 54528
-1489 54528 -1084820 -993001 398085 2165862 3123766 2461518 86331 -3121790 -5439382 -5368055 -3102748
-1478 -3102748 -713096 -300441 -1866809 -3397504 -3208519 -1792063 -955853 -1450809 -2136388 -1639656
-1468 -1639656 -242842 414828 -674199 -2727638 -4084817 -3872669 -2569250 -1258445 -703961 -1000946
-1458 -1000946 -1663332 -1923449 -1300545 -167961 403568 -317187 -1840684 -2860246 -2605526 -1590537
-1448 -1590537 -911483 -1024595 -1471563 -1702750 -1793988 -2170034 -2833368 -3183326 -2678721 -1542564 -682450
-1437f82450j91053j119389j047305O0247J286111J544902O02366o87308j247059q58579k57278
-1426b596795j62669m46549m38455J05344O67390O73077K49577K9725K94452N98012L44224
-1415f82667m37627j065269r26886j28514N90030N40034k76167j115850j096638J0784J478302
-1404c110468K154083J441089j55897j439628j517066m88641P20551J160548N93768l92530
-1394a034191r48682p15749q9994K65863J49560l7512J22514N27917P77562P75045P72220
-1383E64553P73632L19604p84292j776227j572724k32430P56658J48365j348066j683428M5160
-1372d789195K273941K616564N95663j810420k382404r26894Q98794J585969J090488L12997
-1362e34497r6014j34697m4632L0938L0058m0575k6740K15909M82199K77241n61136j435947
$$ plain form
-1437 -682450 -873503 -1992892 -3040197 -2979950 -1693839 -148937 453429 -233879 -1480938 -2339517 -2596795
-1426 -2596795 -2759464 -3206013 -3644468 -3539124 -2871734 -2198657 -1949080 -1919355 -1624903 -1026891 -682667
-1415 -682667 -1120294 -2185563 -3112449 -3240963 -2650933 -2110899 -2387066 -3502916 -4599554 -4588770 -3110468
-1404 -3110468 -956385 484704 328807 -1110821 -2627887 -3116528 -2395977 -1235429 -641661 -1034191
-1394 -1034191 -1982873 -2698622 -2788616 -2522753 -2373193 -2410705 -2288191 -1760274 -982712 -207667 564553
-1383 564553 1338185 1657789 873497 -902730 -2475454 -2707884 -1951226 -1802861 -3150927 -4834355 -4789195
-1372 -4789195 -2515254 101310 696973 -1113447 -3495851 -4422745 -3523951 -1937982 -847494 -534497
-1362 -534497 -630511 -765208 -809840 -778902 -748844 -789419 -816159 -600250 -118051 159190 -401946 -1837893
-1350a837893j477618m99529P25869J226999P42028j79704q02163p81959k78913K46997L51591
-1339b564295l2200m49744l37085K69676O17739R6452q65507j125333j89754J041748J219398
-1328b318905J23476j061763j133626k02188O17282O26829K44091K34718O53041Q86659N98866
-1317g31520J96356K09913N06618M48927k19916r76693j139709o63420p2233K71894M86495
-1306a683288O93313O15544J1885o72053o18919K31494Q30951K50881r70833j338155l45385
-1295b994565P35229N01140o10671q45929L77758J462462P17465j191768j918364n06845J295280
-1284b978808J338212j46691j068243m40807M32570J02838q15560o10305Q68531J811072R28905
-1273e78286p59662j345860n22594L38665L19346R14J19374K56031k91370r91032o05866Q10680
$$ plain form
-1350 -1837893 -3315511 -3815040 -3089171 -1862172 -1120144 -1299848 -2102011 -2883970 -3162883 -2915886 -2564295
-1339 -2564295 -2596495 -3046239 -3383324 -3113648 -2495909 -2399457 -3264964 -4390297 -4580051 -3538303 -2318905
-1328 -2318905 -2195429 -3257192 -4390818 -4593006 -3975724 -3348895 -3104804 -2870086 -2217045 -1330386 -731520
-1317 -731520 -535164 -325251 181367 630294 410378 -566315 -1706024 -2369444 -2441677 -2169783 -1683288
-1306 -1683288 -989975 -374431 -362546 -1034599 -1653518 -1422024 -591073 -340192 -1311025 -2649180 -2994565
-1295 -2994565 -2259336 -1758196 -2368867 -3214796 -2837038 -1374576 -657111 -1848879 -3767243 -4274088 -2978808
-1284 -2978808 -1640596 -1787287 -2855530 -3296337 -2863767 -2760929 -3576489 -4186794 -3318263 -1507191 -578286
-1273 -578286 -1337948 -2683808 -3206402 -2867737 -2548391 -2547477 -2428103 -2172072 -2463442 -3454474 -4060340 -3249660
-1261c249660J607206P19611p37564r52235L7983M57789n13073j395844m97312J489310K164732
-1250h69057N89973j398133j531418O1644J239827P07607n22999p48010J67557Q15770K25269
-1239a261970r08929j145080k0042J459676J920726R83710m76210j284110j097866n70781
-1229b400876m20098n10950j04133J019333K061388K097210J215896L57210P6151l4411n22070
-1218B834650j149709j229590o35253N0393L71015M68704N99752O88639O63016P72505J089885
-1207D524007J071581L38174k77654N57199K619907L770667K480171L2179j027491l96891
-1197A3691849l97243k336750m109962k991348O1157J122021j347155l987662k871704J068678
-1187b098119L180528J348235j334856j054370J621604L071185J929908N69133J171815K762155
$$ plain form
-1261 -3249660 -1642454 -922843 -1660407 -2612642 -2574659 -2116870 -2629943 -4025787 -4523099 -3033789 -869057
-1250 -869057 -279084 -1677217 -3208635 -3146991 -1907164 -1199557 -1722556 -2470566 -2303009 -1487239 -1261970
-1239 -1261970 -2170899 -3315979 -3336021 -1876345 44381 1028091 551881 -732229 -1830095 -2400876
-1229 -2400876 -2820974 -3331924 -3436057 -2416724 -355336 1741874 2957770 3314980 3391131 3356720 2834650
-1218 2834650 1684941 455351 -179902 -129509 241506 710210 1309962 1998601 2661617 3434122 4524007
-1207 4524007 5595588 5933762 5656108 6213307 8833214 12603881 15084052 15116231 14088740 13691849
-1197 13691849 13294606 10957856 6847894 3856546 3917703 5039724 3692569 -295093 -3166797 -2098119
-1187 -2098119 1082409 2430644 1095788 41418 1663022 4734207 6664115 7233248 8405063 11167218
-1177A1167218L354731L222728M121959O443233R614063J4935083K4811974L7846665M7590160
-1168A63107814M9325695M6756401M7805844N2863598N1208419L2700272J389809k6717873
-1160D18439979m0119781m2555962m5419312n2549152n6694355n0493641l6409893k3428264
-1152G0769619j6613969j3439527r715404n407141l105454l259792l613253k719767j617274
-1143A1278038j551337j869031j298486j85867j378r85777j677311j011719K05155N28086
-1133C430373j54174o77358l08083M15371N81018K764p92406j218162r94224k08219O44707
-1122G21607R05919L87113l52816o53659n36412m82781n68928l65791K17014N94663L75315
-1111B41244N3614K44446N78066K01286o57715o43655P10573J796202P84585j687889k925823
$$ plain form
-1177 11167218 14521949 17744677 21866636 28309869 37923932 52859015 77670989 115517654 163107814
-1168 163107814 212433509 259189910 306995754 359859352 411067771 443768043 445157852 418439979
-1160 418439979 378320198 335764236 290344924 237795772 181101417 130607776 94197883 70769619
-1152 70769619 54155650 40716123 31000719 25593578 22488124 19228332 15615079 12895312 11278038
-1143 11278038 9726701 7857670 6559184 6373317 6371939 5386162 3708851 2697132 2902287 3430373
-1133 3430373 3276199 2598841 2290758 2706129 3287147 3289911 2497505 1279343 285119 76900 721607
-1122 721607 1627526 2014639 1661823 1008164 471752 -11029 -579957 -945748 -728734 -134071 241244
-1111 241244 294858 539304 1117370 1318656 660941 17286 727859 2524061 3308646 1620757 -1305066
-1100a305066j525028P88843J429461K54446n75901K25295J421302J246228q1544q79318m65954
-1089E32764J52770J04984n1520N17418J320012J093735l20942j649919j841916j202556n15215
-1078a860385J68902J101851J695095R05169j069771k400457j576425O88819K175642J648634
-1068A477074K4979r69214o92200J40930N72125K69301m90719j141989j100421k05702Q98191
-1057a217645J188955L87285n76293n80950L20218R76184O11248k35168n16332q9616J70648
-1046D38534l53506j124875j125112k00106O73597N61492k59575n97326J77783J229291J138486
-1035E58683l07918j594062j110163Q13684K047592J095369j031256j918247n94607J393136
-1025f47789J949527Q27448m98795q96570n91404j08913P58389K254317L599706L689438K775326
$$ plain form
-1100 -1305066 -2830094 -2041251 -611790 -357344 -933245 -707950 713352 1959580 1878036 998718 532764
-1089 532764 685534 790518 738998 1256416 2576428 3670163 3349221 1699302 -142614 -1345170 -1860385
-1078 -1860385 -1691483 -589632 1105463 2010632 940861 -1459596 -3036021 -2347202 -171560 1477074
-1068 1477074 1502053 532839 -159361 -18431 553694 822995 332276 -809713 -1910134 -2115836 -1217645
-1057 -1217645 -28690 358595 -217698 -798648 -478430 497754 1109002 873834 357502 267886 438534
-1046 438534 85028 -1039847 -2164959 -2365065 -1691468 -1129976 -1389551 -1986877 -1809094 -579803 558683
-1035 558683 250765 -1343297 -2453460 -1639776 407816 1503185 471929 -1446318 -2040925 -647789
-1025 -647789 1301738 2129186 1630391 733821 142417 33504 791893 3046210 6645916 10335354 13110680
-1014A3110680K401400L233368L798976K230866j150758l975420m549792l520870k511660
-1005I066790k030434j537119r57206r04608j362741j318749k97974O06312J61628j046059
-995C79840j247695o2892Q07343K2129j315232j133607N67901J573420N28029j157296j305195
-984b343255M2640R08139L37628l51014K86534J595908J746994L10106j237022j535589q38353
-973a077284j54901J81652M10801M43826K8323l90413J3787J057863J377644K05227j356696
-962G39829j645330o38209J33881j69164o33156k14354N64784N15287j94802k24063O91455
-951a073842J021907k86774j854757j469564P22506K100173J008448r71690j187838M64591
-941a526840J513612M21149j347855j468778Q4473J240603Q01851j40211p3675P71352R91253
$$ plain form
-1014 13110680 15512080 18745448 22544424 24775290 23624532 19649112 15099320 11578450 9066790
-1005 9066790 7036356 5499237 4542031 3637423 2274682 955933 657959 1264271 1425899 379840
-995 379840 -867855 -930747 -123404 -101275 -1416507 -2550114 -1982213 -408793 119236 -1038060 -2343255
-984 -2343255 -2300615 -1392476 -1054848 -1405862 -1119328 476580 2223574 2533680 1296658 -238931 -1077284
-973 -1077284 -1232185 -1050533 -639732 -195906 -167583 -557996 -544209 513654 1891298 2096525 739829
-962 739829 -905501 -1543710 -1409829 -1578993 -2212149 -2426503 -1861719 -1346432 -1541234 -1765297 -1073842
-951 -1073842 -51935 -338709 -2193466 -3663030 -2940524 -840351 168097 -803593 -1991431 -1526840
-941 -1526840 -13228 407921 -939934 -2408712 -2324239 -1083636 -281785 -421996 -495671 275681 1266934
-930A266934J39937p80052r12862o42392o90179q68994m71251M40061R60274O40659J46016
-919g71849K40281O19641L62978o25020j283058p21929N57050J182366N08953o83492j147690
-908a761769n48506L00888M68767n8611m66317j49264N27674O64749j9791p38249n50417M13970
-896a916876J018847M97623n88842j062243n58282J90821M41747K62997O7997j36035m89319
-885b271565n80725J90382J423071J676910K24073j627764j812803p6664J577294J359223
-875H1432j14684q17677p0308P14731J71269j109673j487175n28509N62458P05734K42000
-864a650402J19284M57452N65242Q0327n87190r21867q16051l11275N62702J369322J258228
-853A25772Q259j231440j047713L45879J139566K47727j109691r25414Q64208K197021J604355
$$ plain form
-930 1266934 1406871 626819 -286043 -928435 -1618614 -2487608 -2958859 -2518798 -1558524 -917865 -771849
-919 -771849 -531568 88073 451051 -173969 -1457027 -2178956 -1621906 -439540 69413 -614079 -1761769
-908 -1761769 -2310275 -2009387 -1540620 -1599231 -2065548 -2214812 -1687138 -1022389 -1042180 -1780429 -2330846 -1916876
-896 -1916876 -898029 -400406 -989248 -2051491 -2609773 -2418952 -1977205 -1714208 -1646211 -1782246 -2271565
-885 -2271565 -2852290 -2661908 -1238837 438073 662146 -965618 -2778421 -2855085 -1277791 81432
-875 81432 -33252 -850929 -921237 -206506 -35237 -1144910 -2632085 -3160594 -2598136 -1892402 -1650402
-864 -1650402 -1531118 -1073666 -508424 -428097 -1015287 -1937154 -2753205 -3064480 -2501778 -1132456 125772
-853 125772 134031 -1097409 -2145122 -1799243 -659677 -411950 -1521641 -2447055 -1582847 614174 2218529
-842B218529J56092J8694J652029L358986L488507K150230M91168q62298j952915k625693
-832H093329k487075j744329j241528j309446j212907k76803Q97254J081573J39878p15285
-822A224661n72950N877k9905o21653p68916j11996N30056M33176L0871J47770O59138O75062
-810A601191p5474q25969r08865o16851n11815m54044j8304M42248O3491j076356j655021
-799d035769q07632N08991P07236j58902l76540R26702K285372J752000l03580j430999k63770
-788a196891J625090J737821j38806j780888j500827j92615J36188q69650j598074q04949
-778d583601P33761J395571Q88633L97114O62813Q60945p6042j581994j846086k07792J643002
-767a713676J525493n02687k110548j540790K90674J161425M94889j07318N98127J548656
$$ plain form
-842 2218529 2374621 2393315 4045344 7404330 10892837 13043067 13534235 12671937 10719022 8093329
-832 8093329 5606254 3861925 2620397 1310951 98044 -178759 718495 1800068 1939946 1224661
-822 1224661 651711 657588 627683 6030 -762886 -874882 -344826 88350 119221 266991 926129 1601191
-810 1601191 1525717 699748 -209117 -825968 -1337783 -1791827 -1810131 -1367883 -1304392 -2380748 -4035769
-799 -4035769 -4843401 -4334410 -3627174 -3786076 -4162616 -3235914 -950542 801458 497878 -933121 -1196891
-788 -1196891 428199 2166020 2027214 246326 -1254501 -1447116 -1310928 -2180578 -3778652 -4583601
-778 -4583601 -3849840 -2454269 -1565636 -1168522 -505709 355236 279194 -1302800 -3148886 -3356678 -1713676
-767 -1713676 -188183 -690870 -2801418 -4342208 -4051534 -2890109 -2395220 -2502538 -1904411 -355755
-757c55755Q81080j183017k283514j021274J033634J338283k67369j443900n76774J159241
-747b719365J604569N16074m76251l91380J959j47830l14915K77145R36654K90689j381409
-736a804060k042832o37995J241489J437387J96578l25294O66094J428572L87616j341405
-726g93850j469898J05954J125640K68871r64064n71201R35875J318896l2395j217526o70499
-715a964197N95891O69975k88325l16807J241231K471361J433135j081196k430950j338173
-705a008055Q75321K232574K229357J644137J114234O99490M44421N26217Q81756J362981
-695A1002433K290885M083178O014202O109972L086021j836519n781601o936090n882902m246146
-685G903433k823155j497799l16664K65471J44312j60426j61785J74955P77281J576147J943519
$$ plain form
-757 -355755 525325 -657692 -2941206 -3962480 -2928846 -1590563 -1857932 -3301832 -3878606 -2719365
-747 -2719365 -1114796 -598722 -1074973 -1466353 -1464394 -1612224 -1927139 -1649994 -713340 -422651 -1804060
-736 -1804060 -3846892 -4484887 -3243398 -1806011 -1609433 -1934727 -1268633 159939 547555 -793850
-726 -793850 -2263748 -2157794 -1032154 -763283 -1727347 -2298548 -1362673 -43777 -76172 -1293698 -1964197
-715 -1964197 -1368306 -698331 -986656 -1303463 -62232 2409129 3842264 2761068 330118 -1008055
-705 -1008055 -132734 2099840 4329197 5973334 7087568 7787058 8231479 8757696 9639452 11002433
-695 11002433 13293318 17376496 23390698 29500670 32586691 30750172 24968571 18032481 12149579 7903433
-685 7903433 5080278 3582479 3265815 3531286 3675598 3515172 3353387 3528342 4305623 5881770 7825289
-674G825289P82854j956231m245469l656449l71072K465510K118203o31575k621972k150083
-664b440995n19680K96194K03710L72585J011217J133291L87140k46341o3090J41953o18937
-653c42953j680297j425213K52754J442855O80664j034102j571766m75337O74721O30013M6374
-642b802287J76865Q82598R21126q6545j006326p48039K83523Q22112M12397j57254L165Q45694
-630d52971J622041J810994J602704J647451K502909M228743O379206Q376694R811678J0217318
-620D7746767Q749934M766187q88834n722637p628927p130651o758380p819872q606649o685862
-610A0021076k487775O94163N45989j589541k699840j921638j047361j430158j976613r99123
-600b890821J032672J951878Q35955q31330j263898n56679j6555p2245K5897O08379Q71531
$$ plain form
-674 7825289 8608143 6651912 2406443 -1250006 -1621078 844432 2962635 2331060 -290912 -2440995
-664 -2440995 -2960675 -2664481 -2460771 -2088186 -1076969 56322 443462 197121 134031 275984 -342953
-653 -342953 -2023250 -3448463 -3195709 -1752854 -1072190 -2106292 -3678058 -4153395 -3478674 -2848661 -2802287
-642 -2802287 -2625422 -1742824 -821698 -908243 -1914569 -2662608 -2379085 -1556973 -1144576 -1301830 -1298665 -452971
-630 -452971 1169070 2980064 4582768 6230219 8733128 12961871 19341077 27717771 37529449 47746767
-620 47746767 56496701 61262888 60374054 54651417 47022490 39891839 33133459 25313587 16706938 10021076
-610 10021076 7533301 8227464 8773453 7183912 4484072 2562434 1515073 84915 -1891698 -2890821
-600 -2890821 -1858149 93729 929684 98354 -1165544 -1722223 -1738778 -1811023 -1785126 -1176747 -305216
-589c05216J86348p29222p03984K39663R42868P15370Q9564k16153l50650q17006j378281
-578b326699j227141k09582P74872Q41349J68149l33845j28278M95736Q94610O44714k27729
-567f33844j173609j299812j36170J547363K146891R36583q33322j133291M80165K236734
-557B137688K202367N46222p76030m55190P11558J049931J98630n30853N6580J458501K058019
-546H657423J081515m73881j009924j41732R77904J095226K37405n75415p33540o57071r30384
-535G527526j326365j167613m45433N2667j20906l83571j3960O66177P10888J07729J17644
-524E724783J635065L753724M640159L640824J837124M89307l29681j216547k216930k809344
-514A5148484k804103k503280j998032j064707M5546M84435j8290m95042l1972P29986M76936
$$ plain form
-589 -305216 -118868 -848090 -1552074 -1312411 -369543 345827 435391 219238 -131412 -948418 -2326699
-578 -2326699 -3553840 -3763422 -2988550 -2147201 -1979052 -2312897 -2441175 -1945439 -1050829 -406115 -633844
-567 -633844 -1807453 -3107265 -3243435 -1696072 450819 1387402 554080 -579211 -99046 2137688
-557 2137688 4340055 4886277 4110247 3655057 4366615 5416546 5615176 5084323 5140903 6599404 8657423
-546 8657423 9738938 9265057 8255133 8113401 9091305 10186531 10423936 9848521 9114981 8457910 7527526
-535 7527526 6201161 5033548 4588115 4640782 4519876 4136305 4122345 4788522 5499410 5607139 5724783
-524 5724783 7359848 11113572 15753731 19394555 21231679 21720986 21391305 20174758 17957828 15148484
-514 15148484 12344381 9841101 7843069 6778362 6823908 7308343 7290053 6795011 6763039 7493025 7969961
-503G969961m71527j20412K258894M334598L270390l93059l053951k516601n81899k37691
-493A0458703j567238k136442q83444M91884N10531L50227J830618M191501M945672L697607
-483B1889619K952552M418934O393501O398979N194845N984750R905409J4745279J9182067
-474I7065935K6473913M1978817O7281265R7548199J23294105J32765236J14423218O3178406
-466G64009094j1094895q2867126j24801636j26782837j01740265p2132129n1459313l8975134
-458A54155759k8884935j9781504j4058275j2053552j0823412q371977o076808n879040o997142
-449D1229114p007024n192356l137312k219808k044409j696803j297384j500165k184475k557067
-439A2392311k253461j572915p97751n0452K31954m15685j462425j513529r4568J340219J068067
$$ plain form
-503 7969961 7498434 7378022 9636916 13971514 17241904 16848845 13794894 11278293 10696394 10458703
-493 10458703 8891465 6755023 5871579 6363463 6873994 7224221 9054839 13246340 18192012 21889619
-483 21889619 24842171 29261105 35654606 42053585 47248430 53233180 63138589 77883868 97065935
-474 97065935 123539848 165518665 232799930 330348129 453642234 586407470 700830688 764009094
-466 764009094 752914199 670047073 545245437 418462600 316722335 244590206 193130893 154155759
-458 154155759 125270824 105489320 91431045 79377493 68554081 60182104 54105296 48226256 41229114
-449 41229114 34222090 29029734 25892422 23672614 21628205 19931402 18634018 17133853 14949378 12392311
-439 12392311 10138850 8565935 7768184 7717732 7949686 7534001 6071576 4558047 4463479 5803698 6871765
-428F871765n53530j419548m01000J325173K122774K090898K455330L354130L531120K307527
-418B1684639O41460l62243j038373k283027l669395l739932k238538q06286q12880j414605
-408E960820q20980R28197J710459J03950k578757l744591k476608k58540J036229J046987
-398I07166O67997O21342Q26333Q83804O43891K73332Q1522L37950J051168J895040K528285
-387A0717830K982936L523455M110427M287111L724587K637349J479845M56457m38552j142223
-377C2339222j659296k299080l244907l906560l390959j931405j165197k243747m029340m162352
-367D306379k022794L47018P75828m20996j239284q11624j41788m8692J31828J021799J580391
-356C478065M72681j402009j461380J092791L837623M162409K651476J934481K674387K620246
$$ plain form
-428 6871765 6318235 4898687 4497687 5822860 7945634 10036532 12491862 15845992 19377112 21684639
-418 21684639 22326099 21963856 20925483 18642456 14973061 11233129 8994591 8188305 7375425 5960820
-408 5960820 5139840 6068037 7778496 7882446 5303689 1559098 -917510 -1176050 -139821 907166
-398 907166 1575163 2196505 3022838 3906642 4550533 4823865 4905387 5243337 6294505 8189545 10717830
-387 10717830 13700766 17224221 21334648 25621759 29346346 31983695 33463540 33919997 33481445 32339222
-377 32339222 30679926 28380846 25135939 21229379 17838420 15907015 14741818 12498071 8468731 4306379
-367 4306379 2283585 2630603 3406431 2985435 1746151 934527 792739 744047 875875 1897674 3478065
-356 3478065 3950746 2548737 1087357 2180148 6017771 10180180 12831656 14766137 17440524 20060770
-346B0060770J35522l056586m032235k592959j280093j659397k425946j843539m84776j18943
-336B701818p58632o52434P52679J606057K79669k032873k700169j109815O80684P97982k56012
-325f91046q03699l17623L96988P18057P82392P05254K99165k45532l37362j9829j34361q25788
-313d73384p87889Q85175K700604K231432l19245j759800l8575K763612L267471J711251J701262
-302A1881914N073020R898896J5225103K5151482M4399967P0131397R2263966J03792705J07180024
-293D84998474J06223068R3525238N3542938j6968460r4512405j41762772j38499222r8532333
-285B48014526n4852200k9987793k2484560j8919563j2429304o647053n850553p706433p177801
-276H1959266l702979j184111k028150m261065m966926m192600l965078m821448n264473m401455
$$ plain form
-346 20060770 20196292 17139706 13107471 10514512 9234419 7575022 5149076 3305537 2820761 2701818
-336 2701818 1943186 1290752 2043431 3649488 3929157 1896284 -803885 -1913700 -1233016 -435034 -691046
-325 -691046 -1494745 -1812368 -1415380 -697323 85069 790323 1089488 843956 506594 486765 352404 -473384
-313 -473384 -1261273 -376098 2324506 4555938 4236693 2476893 2438318 5201930 8469401 10180652 11881914
-302 11881914 16954934 26853830 42078933 67230415 111630382 181761779 274025745 377818450 484998474
-293 484998474 591221542 684746780 738289718 721321258 626808853 485046081 346546859 248014526
-285 248014526 193162326 163174533 140689973 121770410 109341106 102694053 96843500 89137067 81959266
-276 81959266 78256287 77072176 75044026 70782961 65816035 61623435 57658357 52836909 47572436 43170981
-266D3170981l345471l434019m301970m642620m095239l294978k488516j384046m12464p51638
-256A5020020k388316l269943j687849R82261J479797j123903l829652l290607l9006K248107
-246D100909J380794r87129j991518j114976l9040J29753n9955M9310J44328m2205J29364
-235A699635J032930J567769M82877j359704j536205P62703L428366M143236L309539K948391
-225A6479537L345754K639642n517k599480k810440r99780P91485K129114M327815P088220
-215C0386350P271678K673507m208098q262009p469397m662683l245222l103833k057720J60245
-205G482818J608139J512129J626173L334336N080256M245777P83108k659271m035812l778245
-195A5199408l166118k424896j345778n63893p97489j383625j054362n3438L2568j138518
$$ plain form
-266 43170981 39825510 36391491 32089521 27446901 23351662 20056684 17568168 16184122 15771658 15020020
-256 15020020 12631704 9361761 7673912 8656173 10135970 9012067 5182415 1891808 1852802 4100909
-246 4100909 5481703 4494574 2503056 1388080 1349040 1478793 1418838 1468148 1612476 1570271 1699635
-235 1699635 2732565 4300334 4783211 3423507 1887302 2650005 6078371 10221607 13531146 16479537
-225 16479537 19825291 22464933 22459416 19859936 17049496 16049716 16841201 18970315 23298130 30386350
-215 30386350 37658028 40331535 36123437 27861428 20392031 15729348 12484126 9380293 7322573 7482818
-205 7482818 9090957 10603086 12229259 15563595 20643851 24889628 25672736 23013465 18977653 15199408
-195 15199408 12033290 9608394 8262616 7698723 6901234 5517609 4463247 4409809 4442377 3303859
-185C303859j800705p04317P49519N18088q09088p73416R99382J865102J11396k143292j873112
-174e56584L01764J016711o24238j564696M21056K973425K489805k62766r24500K187415N714831
-163A1172223O393637N835839P612190J1083851J1481571O376648p22728m408078k914753
-154E1910400J926489Q786144J9509258L9464484P6356830J33608856J96982422K28139000
-146G56683883J84354096N8962021r6284714k00530243k06723099j37982445o0273952k1389694
-138B76815853j9461613k5367489k2517624j7536869k0025387k6012544k5455933j7636671
-130A02801723j1119947j0712681j1619368p824259r55605K526226L1710n025182q596525
-121D9506092r840236r432578p429033m407053k447681k745087l408936j867140J086282K001757
$$ plain form
-185 3303859 1503154 798837 1548356 2066444 1257356 483940 1483322 3348424 3459820 1316528 -556584
-174 -556584 -254820 761891 137653 -1427043 -1005987 1967438 4457243 4194477 3269977 5457392 11172223
-163 11172223 17565860 23401699 31013889 42097740 53579311 59955959 59233231 54825153 51910400
-154 51910400 53836889 62623033 82132291 121596775 197953605 331562461 528544883 756683883
-146 756683883 941037979 1000000000 903715286 703185043 496461944 358479499 298205547 276815853
-138 276815853 257354240 231986751 209469127 191932258 171906871 145894327 120438394 102801723
-130 102801723 91681776 80969095 69349727 61525468 60569863 63096089 63127799 58102617 49506092
-121 49506092 39665856 30233278 22804245 18397192 15949511 13204424 9795488 7928348 9014630 11016387
-111A1016387k47504k539317j729592J021371K026251J45106k126084k476396j463961p02486
-101B923775l29387K54181M92925m51376j497806n63758J972139K868409L44145k835748k610759
-90E66740P97121K923618R94951k407893k962688k97542K006368J520054k36019o43347L39096
-79B600459Q46094L36179K14013J282841K312730J901123O07526J07808P45170J107381R5787
-68A2157111j546235k212090j382109q8949L30350m42740j531620j751440p62254M93964O91073
-57C955061l47572j304958r39681L03098R10787M16914m7535L44325O68840l06904j848621
-46A803754j872911K0028J583986Q59687j015551j325686L91073J724757Q92632p88147j009925
-35A263697J25986N06878n89486j401428n19490Q36558O81563o15267q26688P12175J976053
$$ plain form
-111 11016387 10768883 8229566 6499974 7521345 9547596 9692702 7566618 5090222 3626261 2923775
-101 2923775 2594388 2848569 3341494 2890118 1392312 828554 2800693 5669102 6013247 3177499 566740
-90 566740 1363861 4287479 5282430 2874537 -88151 -385693 1620675 3140729 2904710 2261363 2600459
-79 2600459 3446553 3782732 3996745 5279586 7592316 9493439 10100965 10208773 10953943 12061324 12157111
-68 12157111 10610876 8398786 7016677 6927728 7258078 6815338 5283718 3532278 2770024 3263988 3955061
-57 3955061 3607489 2302531 1362850 1665948 2576735 2993649 2946114 3290439 3959279 3652375 1803754
-46 1803754 -69157 -49129 1534857 2394544 1378993 53307 444380 2169137 3061769 2273622 1263697
-35 1263697 1389683 1896561 1307075 -94353 -613843 222715 904278 289011 -537677 174498 2150551
-24B150551J162462p13985j347309l65940M94926J78438l82133j64264K05166k98075j076872
-13a57035o51262Q68166J620907O84612m70284j51200R65045Q36371p54968j677893n37292
-2E75167J150155R88938q95097j941099o01285J624453K175849N54649j394384j874162q94100
8e30916L00573P27607L29398k80325l52299L46835J088611P57269p09194j815566j109546
19a247553Q46256J899769R09043q52485j421621o40912k4297l88440p74854j29784R08144
30i16734Q50558l92017j183621l10214J362737J944635P99795q59170j521312r22822N6165
41a092000N38787L78004q019j78490n9772M8134j28019l95871k54020L68038P87562L58513
53C62847n31973p59074J17899J201269J356561O07566o5697j16512K8960j08606k72437l393
$$ plain form
-24 2150551 3313013 2599028 1251719 885779 1380705 1559143 1177010 1012746 1217912 919837 -157035
-13 -157035 -808297 59869 1680776 2365388 1895104 1743904 2708949 3545320 2790352 1112459 575167
-2 575167 1725322 2714260 1819163 -121936 -723221 901232 3077081 3631730 2237346 363184 -530916
8 -530916 -230343 497264 826662 546337 194038 540873 1629484 2386753 1677559 -138007 -1247553
19 -1247553 -401297 1498472 2407515 1555030 133409 -507503 -531800 -920240 -1695094 -1824878 -916734
30 -916734 -66176 -458193 -1641814 -1952028 -589291 1355344 2155139 1295969 -225343 -1148165 -1092000
41 -1092000 -553213 -175209 -183228 -361718 -421490 -373356 -501375 -897246 -1151266 -783228 4334 362847
53 362847 -169126 -928200 -810301 390968 1747529 2355095 2289398 2172886 2201846 2093240 1820803 1817410
65A817410N11774P10190N42188M67426O41988Q28109J260461K761293N353887P338779O738269
76B8971774L621376J11601k100072l335476m535258n275287m400966k286566r58525j481265
86H331336k421485j901225l59270J38268q99304j528392l19731J265772Q52518j213908k017170
97g2591j17154K198692J829792r68229k889656j874593M67358J306674K33830p33382k11197
108h30456Q98019J043597J72924n29819m48047j42938k42464n28392m30469P7162M98776N17110
120E5003K93970J27870R9448Q8129l7879k74317m16538k07054K87167N40761J19415o24856
132E1119p91887o1274P74258P75078J00534k50798J09299M23622l0106q13737r66326m29004
144a109222o8327k79231l76978K36936R69312Q13128r8466n75103n9914N90823M15131k45611
$$ plain form
65 1817410 2329184 3039374 3581562 4048988 4690976 5519085 6779546 9540839 14894726 22233505 28971774
76 28971774 32593150 32704751 30604679 27269203 22733945 17458658 13057692 10771126 9812601 8331336
86 8331336 5909851 4008626 3649356 3787624 2888320 1359928 1040197 2305969 3158487 1944579 -72591
97 -72591 -189745 2008947 3838739 2870510 -19146 -1893739 -1426381 -119707 114123 -619259 -830456
108 -830456 67563 1111160 1284084 754265 306218 163280 -79184 -607576 -1038045 -960883 -462107 55003
120 55003 348973 476843 576291 664420 626541 352224 -64314 -271368 15799 556560 675975 51119
132 51119 -740768 -802042 -27784 747294 847828 597030 706329 1129951 1099845 286108 -680218 -1109222
144 -1109222 -1177549 -1456780 -1833758 -1596822 -627510 185618 87152 -487951 -547865 42958 458089 212478
156B12478l46156K39572N81876J86510k69436q9130K86348R13p39450q29681O9053Q97015
168A99912O29354l15271p30644k88771K17560J86484o1652p6559m9681k68938l47149K42191
180f63164J085247J130685J88615o57132n25751L7395l8871p04687r39576m05404Q7544N4659
192a350440K48949J289679K123706J149552j212005k451224j088372J198248J642881n704
202A545270j326818o60059P85400R78069J1656l92492J98251K56174j050519k082295q90127
213b627490J654539K547930N76111j934301k080613n7505J382150O96875o90043p36919M01119
224h68147R36956J79229o27068l07368N25512M72962n46520j129187k86580J252007J956291
235A558087J250629o3019q92996r09065n20677k11069r4133L6320L91025Q86984J145447R28923
$$ plain form
156 212478 -133678 105894 687770 874280 604844 515714 802062 802975 63525 -766156 -697103 199912
168 199912 829266 513995 -216649 -505420 -287860 -101376 -163028 -239587 -289268 -558206 -905355 -663164
180 -663164 422083 1552768 1741383 1084251 558500 595895 557024 -147663 -1087239 -1492643 -1405099 -1350440
192 -1350440 -1101491 188188 2311894 3461446 2249441 -201783 -1290155 -91907 1550974 1545270
202 1545270 218452 -441607 343793 1321862 1333518 941026 1139277 1395451 344932 -1737363 -2627490
213 -2627490 -972951 1574979 2151090 216789 -1863824 -1921329 -539179 157696 -532347 -1269266 -868147
224 -868147 68809 248038 -379030 -686398 -160886 312076 -234444 -1363631 -1650211 -398204 1558087
235 1558087 2808716 2745697 1852701 943636 422959 211890 117757 154077 545102 1432086 2577533 3506456
247C506456O29478J061703K473089L846672L592262J173184k098443m125231l905802k279979
257C873389q86647n77677q87396q50661j27270O94482P95215M9764p75401p97822Q304P41414
269A259694N84983k15519o17668m3968Q93487J130617M26371m36945p11467n37836n03402
280A228347o60091m83756J62384N42772o4221j204003j503031k65769J529418K183758J131535
291B597343m99522j231235q03810j59463r4564l86713l62971P2316L87302K97164K13773N81014
303F10634J048100P43679n62597j902920j985023n64306J236082J980591J200600l15114j306134
314A83592j087801m9284P13606L98691o43725j118089j35551J599497K293181J010599j097503
325B067213j913679o91061J126774J588171L77488j068921j348718m56870O77689J435124
$$ plain form
247 3506456 4135934 5197637 7670726 11517398 15109660 16282844 14184401 10059170 6153368 3873389
257 3873389 2986742 2409065 1521669 671008 543738 1238220 2033435 2083199 1307798 509976 518280 1259694
269 1259694 1844677 1629158 1011490 967522 1861009 2991626 3417997 2981052 2269585 1731749 1228347
280 1228347 568256 84500 246884 789656 725435 -478568 -1981599 -2247368 -717950 1465808 2597343
291 2597343 2097821 866586 62776 -96687 -191251 -577964 -940935 -868619 -481317 -184153 29620 610634
303 610634 1658734 2402413 1839816 -63104 -2048127 -2612433 -1376351 604240 1804840 1489726 183592
314 183592 -904209 -953493 -239887 158804 -484921 -1603010 -1738561 -139064 2154117 3164716 2067213
325 2067213 153534 -537527 589247 2177418 2554906 1485985 137267 -319603 358086 1793210
335A793210J855937K058541J909116J360273O76024P3754n66527j330814j816732j475961
345D536821m27233M44226L72076n25464j494408j900225
351A005793
$$ plain form
335 1793210 3649147 5707688 7616804 8977077 9653101 9726855 9160328 7829514 6012782 4536821
345 4536821 4109588 4553814 4925890 4400426 2906018 1005793
351 1005793
##END=	
