##TITLE=	20180606 dltA WTA.1.fid
##JCAMPDX=	6.0	$$ NMR Plug-in 1.14 of MestReNova 12.0.4-22023
##DATATYPE=	NMRSPECTRUM
##DATACLASS=	NTUPLES
##NUMDIM=	1
##ORIGIN=	Bruker BioSpin GmbH
##OWNER=	nmrmse
##.OBSERVEFREQUENCY=	161.8703181109999889
##.OBSERVENUCLEUS=	^31P
##.SOLVENTNAME=	H2O+D2O
##.PULSESEQUENCE=	zgig
##LONGDATE=	2018/06/07 09:20:34.000
##.ACQUISITIONMODE=	SIMULTANEOUS (DQD)
##$ORIGINALFORMAT=	Bruker XWIN-NMR
##$PARAMETERFILE=	(acqus, ASCII, /Users/Rodrigo/Downloads/OneDrive-2019-10-24/20180606%20WTA%20+%202%20mM%20std/20180606%20dltA%20WTA/1/acqus, 0)
$$ ##TITLE= Parameter file, TopSpin 3.5 pl 7
$$ ##JCAMPDX= 5.0
$$ ##DATATYPE= Parameter Values
$$ ##NPOINTS= 1	$$ modification sequence number
$$ ##ORIGIN= Bruker BioSpin GmbH
$$ ##OWNER= nmrmse
$$ $$ 2018-06-07 09:23:04.303 -0500  nmrmse@am400
$$ $$ /opt/data/nmrmse/AUGSBURG/1/acqus
$$ $$ process /opt/topspin3.5pl7/prog/mod/dirdata
$$ ##$ACQT0= -4.99745346615264
$$ ##$AMP= (0..31)
$$ 100 100 100 100 100 100 100 100 100 100 100 100 100 100 100 100 100 100
$$ 100 100 100 100 100 100 100 100 100 100 100 100 100 100
$$ ##$AMPCOIL= (0..19)
$$ 0 0 0 0 0 0 0 0 0 0 0 0 0 0 0 0 0 0 0 0
$$ ##$ANAVPT= -1
$$ ##$AQSEQ= 0
$$ ##$AQ_mod= 3
$$ ##$AUNM= <au_zg>
$$ ##$AUTOPOS= <>
$$ ##$BF1= 161.870343035
$$ ##$BF2= 399.87
$$ ##$BF3= 161.870343035
$$ ##$BF4= 161.870343035
$$ ##$BF5= 161.870343035
$$ ##$BF6= 161.870343035
$$ ##$BF7= 161.870343035
$$ ##$BF8= 161.870343035
$$ ##$BWFAC= (0..63)
$$ 0 0 0 0 0 0 0 0 0 0 0 0 0 0 0 0 0 0 0 0 0 0 0 0 0 0 0 0 0 0 0 0 0 0 0 0
$$ 0 0 0 0 0 0 0 0 0 0 0 0 0 0 0 0 0 0 0 0 0 0 0 0 0 0 0 0
$$ ##$BYTORDA= 0
$$ ##$CAGPARS= (0..11)
$$ 0 0 0 0 0 0 0 0 0 0 0 0
$$ ##$CHEMSTR= <none>
$$ ##$CNST= (0..63)
$$ 1 1 1 1 1 1 1 1 1 1 1 1 1 1 1 1 1 1 1 1 1 1 1 1 1 1 1 1 1 1 1 1 1 1 1 1
$$ 1 1 1 1 1 1 1 1 1 1 1 1 1 1 1 1 1 1 1 1 1 1 1 1 1 1 1 1
$$ ##$CPDPRG= (0..8)
$$ <> <> <waltz16> <> <> <> <> <> <>
$$ ##$D= (0..63)
$$ 0 6.5 0 0 0 0 0 1.7 0 0 0 0.03 0 0 0 0 0.0002 0 0 0 0 0 0 0 0 0 0 0 0 0
$$ 0 0 0 0 0 0 0 0 0 0 0 0 0 0 0 0 0 0 0 0 0 0 0 0 0 0 0 0 0 0 0 0 0 0
$$ ##$DATE= 1528381234
$$ ##$DE= 6.5
$$ ##$DECBNUC= <off>
$$ ##$DECIM= 4053.33333333333
$$ ##$DECNUC= <off>
$$ ##$DECSTAT= 4
$$ ##$DIGMOD= 1
$$ ##$DIGTYP= 12
$$ ##$DQDMODE= 0
$$ ##$DR= 23
$$ ##$DS= 0
$$ ##$DSPFIRM= 0
$$ ##$DSPFVS= 20
$$ ##$DTYPA= 0
$$ ##$EXP= <P31CPD>
$$ ##$FCUCHAN= (0..9)
$$ 0 1 2 0 0 0 0 0 0 0
$$ ##$FL1= 0
$$ ##$FL2= 0
$$ ##$FL3= 0
$$ ##$FL4= 0
$$ ##$FN_INDIRECT= (0..7)
$$ 0 0 0 0 0 0 0 0
$$ ##$FOV= 0
$$ ##$FQ1LIST= <>
$$ ##$FQ2LIST= <>
$$ ##$FQ3LIST= <>
$$ ##$FQ4LIST= <>
$$ ##$FQ5LIST= <>
$$ ##$FQ6LIST= <>
$$ ##$FQ7LIST= <>
$$ ##$FQ8LIST= <>
$$ ##$FRQLO3= 14447.5139999986
$$ ##$FRQLO3N= 2
$$ ##$FS= (0..7)
$$ 83 83 83 83 83 83 83 83
$$ ##$FTLPGN= 0
$$ ##$FW= 4032000
$$ ##$FnILOOP= 0
$$ ##$FnMODE= 0
$$ ##$FnTYPE= 0
$$ ##$GPNAM= (0..31)
$$ <> <> <> <> <> <> <> <> <> <> <> <> <> <> <> <> <> <> <> <> <> <> <> <>
$$ <> <> <> <> <> <> <> <>
$$ ##$GPX= (0..31)
$$ [...]
$$ 130000 130000 130000 130000 130000 130000 130000 0 0 0 0 0 0 0 0 0 0 0
$$ 0 0 0 0 0 0 0 0 0 0 0 0 0
$$ ##$ShimPowMaxUC= (0..63)
$$ 130000 130000 130000 130000 130000 130000 130000 130000 130000 130000 130000
$$ 130000 130000 130000 130000 130000 130000 130000 130000 130000 130000 130000
$$ 130000 130000 130000 130000 130000 130000 130000 130000 130000 130000 130000
$$ 130000 130000 130000 130000 130000 130000 130000 0 0 0 0 0 0 0 0 0 0 0
$$ 0 0 0 0 0 0 0 0 0 0 0 0 0
$$ ##$ShimPowMaxUG= (0..63)
$$ 524287 524287 524287 524287 524287 524287 524287 524287 524287 524287 524287
$$ 524287 524287 524287 524287 524287 524287 524287 524287 524287 524287 524287
$$ 524287 524287 524287 524287 524287 524287 524287 524287 524287 524287 524287
$$ 524287 524287 524287 524287 524287 524287 0 0 0 0 0 0 0 0 0 0 0 0 0 0 0
$$ 0 0 0 0 0 0 0 0 0 0
$$ ##$ShimPowNum= 0
$$ ##$ShimPowRcbType= 3
$$ ##$ShimPowRes= (0..63)
$$ 1e-20 1e-20 1e-20 1e-20 1e-20 1e-20 1e-20 1e-20 1e-20 1e-20 1e-20 1e-20
$$ 1e-20 1e-20 1e-20 1e-20 1e-20 1e-20 1e-20 1e-20 1e-20 1e-20 1e-20 1e-20
$$ 1e-20 1e-20 1e-20 1e-20 1e-20 1e-20 1e-20 1e-20 1e-20 1e-20 1e-20 1e-20
$$ 1e-20 1e-20 1e-20 1e-20 0 0 0 0 0 0 0 0 0 0 0 0 0 0 0 0 0 0 0 0 0 0 0 0
$$ ##$ShimPowRng0= (0..63)
$$ 1 1 1 1 1 1 1 1 1 1 1 1 1 1 1 1 1 1 1 1 1 1 1 1 1 1 1 1 1 1 1 1 1 1 1 1
$$ 1 1 1 1 0 0 0 0 0 0 0 0 0 0 0 0 0 0 0 0 0 0 0 0 0 0 0 0
$$ ##$ShimPowRng1= (0..63)
$$ 1 1 1 1 1 1 1 1 1 1 1 1 1 1 1 1 1 1 1 1 1 1 1 1 1 1 1 1 1 1 1 1 1 1 1 1
$$ 1 1 1 1 0 0 0 0 0 0 0 0 0 0 0 0 0 0 0 0 0 0 0 0 0 0 0 0
$$ ##$ShimPowRng2= (0..63)
$$ 1 1 1 1 1 1 1 1 1 1 1 1 1 1 1 1 1 1 1 1 1 1 1 1 1 1 1 1 1 1 1 1 1 1 1 1
$$ 1 1 1 1 0 0 0 0 0 0 0 0 0 0 0 0 0 0 0 0 0 0 0 0 0 0 0 0
$$ ##$ShimPowRng3= (0..63)
$$ 1 1 1 1 1 1 1 1 1 1 1 1 1 1 1 1 1 1 1 1 1 1 1 1 1 1 1 1 1 1 1 1 1 1 1 1
$$ 1 1 1 1 0 0 0 0 0 0 0 0 0 0 0 0 0 0 0 0 0 0 0 0 0 0 0 0
$$ ##$ShimPowType1= 0
$$ ##$ShimPowType2= 0
$$ ##$ShimPowType3= 0
$$ ##$ShimPowType4= 0
$$ ##$ShimSysAngle= <>
$$ ##$ShimSysFunc= (0..63)
$$ 1 2 3 4 5 6 7 8 9 10 0 37 38 35 16 15 14 13 12 11 28 27 26 25 24 23 36
$$ 22 30 29 20 21 34 33 32 31 17 18 19 0 0 0 0 0 0 0 0 0 0 0 0 0 0 0 0 0 0
$$ 0 0 0 0 0 0 0
$$ ##$ShimSysMatId= <no>
$$ ##$ShimSysMatrix= 1
$$ ##$ShimSysOffset= <>
$$ ##$ShimSysType= 4
$$ ##$ShimUnit= 0
$$ ##$TFXNUM= 0
$$ ##$TOSITY= <no>
$$ ##$TRIPLO2= 0
$$ ##$VTU= 2
$$ ##$VTUETH= <149.236.99.20>
$$ ##$VTUTY= <no>
$$ ##$WBREFAM= (0..15)
$$ 132.6 111.2 100 100 100 100 100 100 100 100 100 100 100 100 100 100
$$ ##$WBREFLM= (0..15)
$$ 0 0 0 0 0 0 0 0 0 0 0 0 0 0 0 0
$$ ##$WBREFPH= (0..15)
$$ 78.43 -67.85 0 0 0 0 0 0 0 0 0 0 0 0 0 0
$$ ##$WBSGU= (0..15)
$$ 0 0 0 0 0 0 0 0 0 0 0 0 0 0 0 0
$$ ##$XFAC= 2
$$ ##END=
$$ 
##$DECIM=	4053.33333333333
##$DSPFVS=	20
##XUNITS=	HZ
##YUNITS=	ARBITRARY UNITS
##FIRSTX=	2442.1812631562502247
##LASTX=	-2491.7281028490956487
##XFACTOR=	-0.30116031044407898243
##YFACTOR=	1.3137807617187500292e-06
##NPOINTS=	16384
##XYDATA=	(X++(Y..Y))
$$ [...]
-5949a5037660Q7850K08960L49982M70020N20817M63955K97369P0405j33994k40975k15857
-5938a3159128o5655J77328M66362P43771R51745J051586J035275R20414P36189N12643K78228
-5927f351242O1784j08516k13989k54239k43752j99789j36515o8185q572L6587P0848R8288
-5915g317292J18788J33371J45595J50011J26026N6252m8361j48726k02934j88854j11444
-5904g287568k086R0696J25295R1249Q969r2307j90578k68394l06756k90260k19264j15644
-5892h456648j3224O3895J18121J71166K36805L02747L41943L41400L20184L18763L67123
-5881e887725M58088N45654N70516M99532L51372J84959O0323K046j3546m0421j24020k69475
-5869c662697m38268n72173o27730n98598n11027l99540k87208j88011j20665j10761j75260
$$ plain form
-5949 -15037660 -14949810 -14740850 -14390868 -13920848 -13400031 -12936076 -12638707 -12568302 -12702296 -12943271 -13159128
-5938 -13159128 -13224783 -13047455 -12581093 -11837322 -10885577 -9833991 -8798716 -7878302 -7142113 -6629470 -6351242
-5927 -6351242 -6289458 -6397974 -6611963 -6866202 -7109954 -7309743 -7446258 -7514443 -7523015 -7486428 -7415580 -7317292
-5915 -7317292 -7198504 -7065133 -6919538 -6769527 -6643501 -6587249 -6635610 -6784336 -6987270 -7176124 -7287568
-5904 -7287568 -7289654 -7198958 -7073663 -6982414 -6973445 -7065752 -7256330 -7524724 -7831480 -8121740 -8341004 -8456648
-5892 -8456648 -8469872 -8405977 -8287856 -8116690 -7879885 -7577138 -7235195 -6893795 -6573611 -6254848 -5887725
-5881 -5887725 -5429637 -4883983 -4313467 -3813935 -3462563 -3277604 -3217281 -3215235 -3228781 -3269202 -3393222 -3662697
-5869 -3662697 -4100965 -4673138 -5300868 -5899466 -6410493 -6810033 -7097241 -7285252 -7405917 -7516678 -7691938
-5858g691938l04835m63986o11537p20588p80109p84329p27456o06960m25940j94293O5749
-5847a3246222L17055N19359O50501P16518P40278P40709P20070O66302N68055M31593K84867
-5836f890915J66634J10439J31275K18514L39120M52817N33707N83068O19997O57979O88803
-5825b388562O83522O07688M44188K09894m8104k75849m40111n42530o09375o64595p09356
-5814c733190p24477o89489o00735m76436l46302k33142j40597n6614L1401J23745K08037
-5803f637799K69649L01209L02044K71448K07115J12645M968q8035j39108j33107p0267M3369
-5791e555869K06838M16193O43001Q31604R27238R07869P91928O24211M58521L43300L05734
-5780I00568L40255M12277M75669M92855M49567L57609K42178J22352j924j47372l30725n49588
$$ plain form
-5858 -7691938 -7996773 -8460759 -9072296 -9792884 -10572993 -11357322 -12084778 -12691738 -13117678 -13311971 -13246222
-5847 -13246222 -12929167 -12409808 -11759307 -11042789 -10302511 -9561802 -8841732 -8175430 -7607375 -7175782 -6890915
-5836 -6890915 -6724281 -6613842 -6482567 -6264053 -5924933 -5472116 -4938409 -4355341 -3735344 -3077365 -2388562
-5825 -2388562 -1705040 -1097352 -653164 -443270 -491374 -767223 -1207334 -1749864 -2359239 -3023834 -3733190
-5814 -3733190 -4457667 -5147156 -5747891 -6224327 -6570629 -6803771 -6944368 -7000982 -6969581 -6845836 -6637799
-5803 -6637799 -6368150 -6066941 -5764897 -5493449 -5286334 -5173689 -5168721 -5256756 -5395864 -5528971 -5599238 -5555869
-5791 -5555869 -5349031 -4932838 -4289837 -3458233 -2530995 -1623126 -831198 -206987 251534 594834 900568
-5780 900568 1240823 1653100 2128769 2621624 3071191 3428800 3670978 3793330 3791406 3644034 3313309 2763721
-5768B763721p77145r75510j115180j185681j192895j148340j058022r19648p30678m98686
-5758f838064k44243L870K15334L64945M39719M44053L97437L22171K31131J29265K4787o8516
-5746d578111j41354j97707k54638l34279m47486n75173o66801o65097n38131k93533K7486
-5735h664824L64949O59052Q66565R64523R47073Q27407O36342M06269J53598j17462l93882
-5724c350390o40738q09683q59346p74678n76239l09512k0835K54641M85687O40721P00231
-5713e260141O70563N80534M64310L48167K50187J85793J67539J99406K74460L78019M87515
-5702a253648N65761N63831M48741K34967j8198k42421l94932m71420n00476n25372n78502
-5691b171669o61575p46362p96031p86209p10872n76891l97255j89851J9040J95227L09212
$$ plain form
-5768 2763721 1986576 1011066 -104114 -1289795 -2482690 -3631030 -4689052 -5608700 -6339378 -6838064
-5758 -6838064 -7082307 -7078437 -6863103 -6498158 -6058439 -5614386 -5216949 -4894778 -4663647 -4534382 -4509595 -4578111
-5746 -4578111 -4719465 -4917172 -5171810 -5506089 -5953575 -6528748 -7195549 -7860646 -8398777 -8692310 -8664824
-5735 -8664824 -8299875 -7640823 -6774258 -5809735 -4862662 -4035255 -3398913 -2992644 -2839046 -2956508 -3350390
-5724 -3350390 -3991128 -4800811 -5660157 -6434835 -7011074 -7320586 -7341421 -7086780 -6601093 -5960372 -5260141
-5713 -5260141 -4589578 -4009044 -3544734 -3196567 -2946380 -2760587 -2593048 -2393642 -2119182 -1741163 -1253648
-5702 -1253648 -687887 -124056 324685 559652 541454 299033 -95899 -567319 -1067795 -1593167 -2171669
-5691 -2171669 -2833244 -3579606 -4375637 -5161846 -5872718 -6449609 -6846864 -7036715 -7017675 -6822448 -6513236
-5680f513236L54087L52145L43167L63629M27079N12836N71671N52522M34894K41042K1141
-5669b339023j71887l01607l55361l40704k77612j92389j12413o0844n2589r1468j67609k58021
-5657d721527l35365l82195m02072m19565m63049n38352o16676o54265o29342n63522n08249
-5646a0234179n07828n68054o51571p01122o73446n60048l84198j82426J4909J95695L66984
-5635a3885284N41905P18244Q66775R45541R28458Q18394O36618M11514J80653r557j21431
-5624g968170j47018j09537m6627O143K3986o90n4984j12562j46861j38960q1333J7785J35599
-5611h623229K47884L45189M33030N13566N71257N80383N22254L94438K12186Q169j70850
-5600d965723k75817k75700j76431k0304J37263K55014L19426L43317L52381L65205L79945
$$ plain form
-5680 -6513236 -6159149 -5807004 -5463837 -5100208 -4673129 -4160293 -3588622 -3036100 -2601206 -2360164 -2339023
-5669 -2339023 -2510910 -2812517 -3167878 -3508582 -3786194 -3978583 -4090996 -4151840 -4204429 -4295897 -4463506 -4721527
-5657 -4721527 -5056892 -5439087 -5841159 -6260724 -6723773 -7262125 -7878801 -8533066 -9162408 -9725930 -10234179
-5646 -10234179 -10742007 -11310061 -11961632 -12662754 -13336200 -13896248 -14280446 -14462872 -14447963 -14252268 -13885284
-5635 -13885284 -13343379 -12625135 -11758360 -10812819 -9884361 -9065967 -8429349 -8017835 -7837182 -7846739 -7968170
-5624 -7968170 -8115188 -8224725 -8271352 -8265209 -8241223 -8241913 -8296897 -8409459 -8556320 -8695280 -8776613 -8758828 -8623229
-5611 -8623229 -8375345 -8030156 -7597126 -7083560 -6512303 -5931920 -5409666 -5015228 -4803042 -4794873 -4965723
-5600 -4965723 -5241540 -5517240 -5693671 -5713975 -5576712 -5321698 -5002272 -4658955 -4306574 -3941369 -3561424
-5589c561424L77187L34707K42818J13825k0310j20360j55690j15683j4184J15021K31827
-5578b572266L07919L38710L41822L43627L64709M12660M82228N57322O13057O20128N53150
-5567B363066M02973J85723o2002k98407m88143o06222o42545o10918n50045n05184n01209
-5556a312913n32623n75979o04338n91911n19308l84049k03803n100J92267L77761N37326
-5545c622670O47437O91684O80534O47769O26421O27029O30606N96986M86164K84167J6352
-5534B312479k63529m99838o57894p30655p31191o82673o13453n52121n16056n00911m83813
-5523c919655m40448l67066k92020k62995l14625m43506o11951p69327q67150q68501p61741
-5512i918985n68725l33895j02886Q7975K07996K31586J51170r390j96259l43197l94350l21644
$$ plain form
-5589 -3561424 -3184237 -2849530 -2606712 -2492887 -2513197 -2633557 -2789247 -2904930 -2919114 -2804093 -2572266
-5578 -2572266 -2264347 -1925637 -1583815 -1240188 -875479 -462819 19409 576731 1189788 1809916 2363066
-5567 2363066 2766039 2951762 2889760 2591353 2103210 1496988 854443 243525 -306520 -811704 -1312913
-5556 -1312913 -1845536 -2421515 -3025853 -3617764 -4137072 -4521121 -4724924 -4730024 -4537757 -4159996 -3622670
-5545 -3622670 -2975233 -2283549 -1603015 -955246 -328825 298204 928810 1525796 2011960 2296127 2312479
-5534 2312479 2048950 1549112 891218 160563 -570628 -1253301 -1866754 -2418875 -2934931 -3435842 -3919655
-5523 -3919655 -4360103 -4727169 -5019189 -5282184 -5596809 -6040315 -6652266 -7421593 -8288743 -9157244 -9918985
-5512 -9918985 -10487710 -10821605 -10924491 -10836516 -10628520 -10396934 -10245764 -10255154 -10451413 -10794610 -11188960 -11510604
-5500a1510604j29894J51634M83801Q29141J152009J409229J547544J521985J323814R90971
-5490b230370N92432J99788j33499l75870n12453n46211n02003m18322l27400k41330j55916
-5479d651154o2920M4171J72274L26350M98559O59057P60818P60350O41427M23407J50683
-5468b76978j25877l63037n33056o27952o60115o58510o60734o93456p51801p97846p85877
-5457f935239o93700n31186l25999j09600Q6386K34568L18804L34198K83735J80790N0573
-5446g106670q0841k03193l23850m49316n65137o36070o28800n36631l83830k11470o1412
-5435a1187220L5727O9825N6776L2758L1959O3019J07620J38817J38454J04614N1286L469
-5423a0352896j1232K5247J08620K08717K82479K96174K42750J44449L9533l9588q1912r3880
$$ plain form
-5500 -11510604 -11640498 -11488864 -11005063 -10175922 -9023913 -7614684 -6067140 -4545155 -3221341 -2230370
-5490 -2230370 -1637938 -1438150 -1571649 -1947519 -2459972 -3006183 -3508186 -3926508 -4253908 -4495238 -4651154
-5479 -4651154 -4714074 -4669903 -4497629 -4171279 -3672720 -3013663 -2252845 -1492495 -851068 -427661 -276978
-5468 -276978 -402855 -765892 -1298948 -1926900 -2587015 -3245525 -3906259 -4599715 -5351516 -6149362 -6935239
-5457 -6935239 -7628939 -8160125 -8486124 -8595724 -8509338 -8274770 -7955966 -7621768 -7338033 -7157243 -7106670
-5446 -7106670 -7187511 -7390704 -7714554 -8163870 -8729007 -9365077 -9993877 -10530508 -10914338 -11125808 -11187220
-5435 -11187220 -11151493 -11081668 -11024892 -10992134 -10960175 -10897156 -10789536 -10650719 -10512265 -10407651 -10356365 -10352896
-5423 -10352896 -10364128 -10338881 -10230261 -10021544 -9739065 -9442891 -9200141 -9055692 -9016159 -9055747 -9137659 -9231539
-5411i231539q1285l8295M3162J55390K71047L57997L97437L91048L56441L16076K85666K66635
-5399f510220K46301K04520J23999n9j54335l08671m24775m67484m15211k70266o4485J51913
-5387g888773L34745M63970N42123N79504N83621N61946N28967N03136M93344M91672M81679
-5376b324066M50924L93578L04839J77557P153j99483m21325o30392q00768r12189r50473
-5365d904645r10358q02112o54442n04217l78189k82693k07834j38237o3239J7144R1680J41359
-5353h595783J46193R7081R417p5884j12620p8718R196J07976J75784J93187J66068J16639
-5341g841464P0751M4167L3629K1928m546m2102p3469q3907p5011o2320n8790o1139n0262
-5328h182535j079J04434K64704M52513O22078P28327P45807O77002N48415L97238K55495
$$ plain form
-5411 -9231539 -9312824 -9351119 -9307957 -9152567 -8881520 -8523523 -8126086 -7735038 -7378597 -7062521 -6776855 -6510220
-5399 -6510220 -6263919 -6059399 -5935400 -5935459 -6089794 -6398465 -6823240 -7290724 -7705935 -7976201 -8040686 -7888773
-5387 -7888773 -7554028 -7090058 -6547935 -5968431 -5384810 -4822864 -4293897 -3790761 -3297417 -2805745 -2324066
-5376 -2324066 -1873142 -1479564 -1174725 -997168 -990015 -1189498 -1610823 -2241215 -3041983 -3954172 -4904645
-5365 -4904645 -5815003 -6617115 -7271557 -7775774 -8153963 -8436656 -8644490 -8782727 -8845966 -8828822 -8737142 -8595783
-5353 -8595783 -8449590 -8352509 -8343092 -8418976 -8531596 -8610314 -8601118 -8493142 -8317358 -8124171 -7958103 -7841464
-5341 -7841464 -7770713 -7726546 -7692917 -7670989 -7675535 -7717637 -7791106 -7875013 -7950024 -8012344 -8071134 -8132273 -8182535
-5328 -8182535 -8183614 -8079180 -7814476 -7361963 -6739885 -6011558 -5265751 -4588749 -4040334 -3643096 -3387601
-5317c387601J39883N2624r177m9096p8095j19348j94773l04030m22958n23871n93286o32799
-5305f122527o52207o62471o66451o51798n94580m71918k74047q922K98422O07883Q71603
-5294h327013J050140J126761J104932R93135P96191N22201J94858j45493m55057o99657q54759
-5283d693761q98785q15292o06999l10511M949K62773M11493M39645L66648K21985K8288k00010
-5271e789577m44930o76754q61416r77662j028403j036306j027592j015252r92635r41349
-5261a4791876q44734o96816n04455k83175m9457J82764L97290N70787O80974P23339P16047
-5250a3899312O87439O63226O63332O98670P61911Q24864Q54818Q37099P81192P08154O37274
-5239e781333N81414N45489N24266N00825M50907L58457K34309J18170N6215P0223J43485
$$ plain form
-5317 -3387601 -3247718 -3195094 -3204271 -3253367 -3331462 -3450810 -3645583 -3949613 -4372571 -4896442 -5489728 -6122527
-5305 -6122527 -6774734 -7437205 -8103656 -8755454 -9350034 -9821952 -10095999 -10104921 -9806499 -9198616 -8327013
-5294 -8327013 -7276873 -6150112 -5045180 -4052045 -3255854 -2733653 -2538795 -2684288 -3139345 -3839002 -4693761
-5283 -4693761 -5592546 -6407838 -7014837 -7325348 -7320399 -7057626 -6646133 -6206488 -5839840 -5617855 -5589567 -5789577
-5271 -5789577 -6234507 -6911261 -7772677 -8750339 -9778742 -10815048 -11842640 -12857892 -13850527 -14791876
-5261 -14791876 -15636610 -16333426 -16837881 -17121056 -17170513 -16987749 -16590459 -16019672 -15338698 -14615359 -13899312
-5250 -13899312 -13211873 -12548647 -11885315 -11186645 -10424734 -9599870 -8745052 -7907953 -7126761 -6418607 -5781333
-5239 -5781333 -5199919 -4654430 -4130164 -3629339 -3178432 -2819975 -2585666 -2467496 -2411281 -2341058 -2197573
-5228b197573K36077L15976L76522M29379M89009N64490O55810P48314Q13719Q23524P63733
-5217D018980O38017M61647K57457N5621j10886k18297k63481k66615k61441k75579l14126
-5206C721297l61701m00265m26891m57175n11765n98301p06054q15281r07628r70361r96624
-5195c430749r84713r36347q55378p48306o25057m97125l71489k44882j06422M8833K05140
-5184h546495L28555L92927M07282M15726M67759N82481P34356Q71446R50808R63474R33156
-5173a498525Q93685Q65074Q46161Q22956P80641P13256O26046N25407M06696K58987Q4562
-5162E324946r3906k53410l94731n39553p04401q80926j039008j144298j175969j134042j032386
-5151c067684q85372p02796m95262k78496p0136J13101K52860L29816L35103K84561K19605
$$ plain form
-5228 -2197573 -1961496 -1645520 -1268998 -839619 -350610 213880 869690 1618004 2431723 3255247 4018980
-5217 4018980 4656997 5118644 5376101 5431722 5320836 5102539 4839058 4572443 4311002 4035423 3721297
-5206 3721297 3359596 2959331 2532440 2075265 1563500 965199 259145 -556136 -1463764 -2434125 -3430749
-5195 -3430749 -4415462 -5351809 -6207187 -6955493 -7580550 -8077675 -8449164 -8694046 -8800468 -8751635 -8546495
-5184 -8546495 -8217940 -7825013 -7417731 -7002005 -6534246 -5951765 -5217409 -4345963 -3395155 -2431681 -1498525
-5173 -1498525 -604840 260234 1106395 1929351 2709992 3423248 4049294 4574701 4981397 5240384 5324946
-5162 5324946 5231040 4977630 4582899 4043346 3338945 2458019 1419011 274713 -901256 -2035298 -3067684
-5151 -3067684 -3953056 -4655852 -5151114 -5429610 -5499746 -5386645 -5133785 -4803969 -4468866 -4184305 -3964700
-5140c964700J88408K17921K97615L88418M48928M55198M01137K91434J42775j0530j20654
-5129a264050j42705n3316J37939L86537O22845P76022Q03245P07539N32311L35947J62910
-5118C005224K8016p9508j78704k79672l75867m47701m75605m54413l97645l27233k55706
-5107b38814j75975o7693Q7733K95141N37196P70718R39722J006668R74173Q73391P35322
-5096E737582N79621M25397K97013K12661J71477J55344J41722J13542O0355k1511j25569
-5085G747634k37416l45503m49488n58559o83343q28465r87138j137789j246084j276030j205820
-5074a208001j039998q09967n58715l18191j00435Q8156K29851K97725K72854J60525m155
-5063b990351j67917k87892l57883m07169m69724n51636o25151o49532n95542m57435k53872
$$ plain form
-5140 -3964700 -3776292 -3558371 -3260756 -2872338 -2423410 -1968212 -1567075 -1275641 -1132866 -1143396 -1264050
-5129 -1264050 -1406755 -1460071 -1322132 -935595 -312750 463272 1266517 1974056 2506367 2842314 3005224
-5118 3005224 3033240 2953732 2775028 2495356 2119489 1671788 1196183 741770 344125 16892 -238814
-5107 -238814 -414789 -482482 -394749 -99608 437588 1208306 2148028 3154696 4128869 5002260 5737582
-5096 5737582 6317203 6742600 7039613 7252274 7423751 7579095 7720817 7834359 7894714 7873203 7747634
-5085 7747634 7510218 7164715 6715227 6156668 5473325 4644860 3657722 2519933 1273849 -2181 -1208001
-5074 -1208001 -2247999 -3057966 -3616681 -3934872 -4035307 -3947151 -3717300 -3419575 -3146721 -2986196 -2990351
-5063 -2990351 -3158268 -3446160 -3804043 -4211212 -4680936 -5232572 -5857723 -6507255 -7102797 -7560232 -7814104
-5052g814104k1570J95865L60072M48086M58297M10070L37126K75308K49159K66034L21362
-5041d514295M07335N15211O33924P51127Q53619R23678R39814Q89467P84303O60170N56776
-5030C401129M91219M48022L96119L17236K17861J13552M790j28436l08326n33803p69267
-5019C650096r59648j061965j067474j000079q97888p91575o92469n95119m87551l62464k26654
-5008d492790j02685j9097N315k6460q8796j42979j51188r0934L4876J98456L58761M75305
-4996d042216N15544M59902L09686R2095j45464l51494m88639n44188n27242m56301l49201
-4985e527518k22428r1948L1239J43341K43507L32679M17477N08590O12988P29745Q47225
-4974a975103R37293R59218Q81963P07818M75103K37091L5278j11642k01929k42550k44550
$$ plain form
-5052 -7814104 -7835674 -7639809 -7279737 -6831651 -6373354 -5963284 -5626158 -5350850 -5101691 -4835657 -4514295
-5041 -4514295 -4106960 -3591749 -2957825 -2206698 -1353079 -429401 510413 1399880 2184183 2844353 3401129
-5030 3401129 3892348 4340370 4736489 5053725 5271586 5385138 5389928 5261492 4953166 4419363 3650096
-5019 3650096 2690448 1628483 561009 -439070 -1336958 -2128533 -2821002 -3416121 -3903672 -4266136 -4492790
-5008 -4492790 -4595475 -4614572 -4609257 -4635717 -4724513 -4867492 -5018680 -5109614 -5074738 -4876282 -4517521 -4042216
-4996 -4042216 -3526672 -3066770 -2757084 -2664989 -2810453 -3161947 -3650586 -4194774 -4722016 -5178317 -5527518
-4985 -5527518 -5749946 -5841894 -5810655 -5667314 -5423807 -5091128 -4673651 -4165061 -3552073 -2822328 -1975103
-4974 -1975103 -1037810 -78592 803371 1511189 1986292 2223383 2258661 2147019 1945090 1702540 1457990
-4963A457990k19590j79823j39337j11007r8805r6696r8354j05723j26005j62822k12409k65555
-4951c58136l06852l14508k69353j69587l8745Q3666J66590K07212K25185K36275K35874K08912
-4939i3467J52115Q6017M5839N7523J17075J90817K37018K31834J79240J00413J6853o1668
-4927A259609j40998k33735l40112m37973m97178n05181m75563m32819l95527l73827l73778
-4916b947082l99339m51423n24903o04923o65506o76505o20605n06264l59564k02784m2814
-4905h001712J23580K98115M71491O20170P15414P39814O95844O02017M83594L61373K42744
-4894b647556J23809K812j09695j92974k25680j96666j14094n370R2692J45738J32102N0248
-4882b944634q2432k39879l96450n29676o20171o52621o18870n21542l72745j90534l142J45311
$$ plain form
-4963 1457990 1238400 1058577 919240 808233 709428 612732 514378 408655 282650 119828 -92581 -358136
-4951 -358136 -664988 -979496 -1248849 -1418436 -1457181 -1373515 -1206925 -999713 -774528 -538253 -302379 -93467
-4939 -93467 58648 144665 190504 248027 365102 555919 792937 1024771 1204011 1304424 1321277 1259609
-4927 1259609 1118611 884876 544764 106791 -390387 -895568 -1371131 -1803950 -2199477 -2573304 -2947082
-4916 -2947082 -3346421 -3797844 -4322747 -4927670 -5593176 -6269681 -6890286 -7396550 -7756114 -7958898 -8001712
-4905 -8001712 -7878132 -7580017 -7108526 -6488356 -5772942 -5033128 -4337284 -3735267 -3251673 -2890300 -2647556
-4894 -2647556 -2523747 -2520935 -2630630 -2823604 -3049284 -3245950 -3360044 -3365414 -3272722 -3126984 -2994882 -2944634
-4882 -2944634 -3027066 -3266945 -3663395 -4193071 -4813242 -5465863 -6084733 -6606275 -6979020 -7169554 -7172696 -7027385
-4870g027385K08963J71588O0186p5745j96786k89599l57404l96224l82299k85376r3323J73215
-4858h490189M61190P00714Q32577Q29745O95374M47592J14371k57364n97787q31401r06291
-4847g001469q13349n85306k82795K1975K62366L97049M25111L85787L39152L35420L91144
-4836f124915M86954N84563O45487O39287N47071L69444J33579j10778l05418m04913l96997
-4825c936636l08994j94882j13159j04726j75200k90474l91357m19075l38696j55269Q2930
-4814f345538L04762M57500N37539N79614O16944O53313O65098O17965M82294K46289p1128
-4803a255348m17064p20496r20147r86908r31986q01956o59749n53018m90782m50815m08314
-4792h596583l53493k86985k10257j25462l8890M0053J04777J56572K01814K43020K73189
$$ plain form
-4870 -7027385 -6818422 -6646834 -6586648 -6662393 -6859179 -7148778 -7506182 -7902406 -8284705 -8570081 -8663404 -8490189
-4858 -8490189 -8028999 -7328285 -6495708 -5665963 -4970589 -4522997 -4408626 -4665990 -5263777 -6095178 -7001469
-4847 -7001469 -7814818 -8400124 -8682919 -8660944 -8398578 -8001529 -7576418 -7190631 -6851479 -6516059 -6124915
-4836 -6124915 -5637961 -5053398 -4407911 -3768624 -3221553 -2852109 -2718530 -2829308 -3134726 -3539639 -3936636
-4825 -3936636 -4245630 -4440512 -4553671 -4658397 -4833597 -5124071 -5515428 -5934503 -6273199 -6428468 -6345538
-4814 -6345538 -6040776 -5583276 -5045737 -4466123 -3849179 -3195866 -2530768 -1912803 -1430509 -1184220 -1255348
-4803 -1255348 -1672412 -2392908 -3313055 -4299963 -5231949 -6033905 -6693654 -7246672 -7737454 -8188269 -8596583
-4792 -8596583 -8950076 -9237061 -9447318 -9572780 -9611670 -9571617 -9466840 -9310268 -9108454 -8865434 -8592245
-4781h592245K78093K43113J63189N4453m3677q8708o5534N040Q7605J56560K01548K19457
-4769g381106K09375J75200J28209Q3852N4526M2298L6108K0109r793l9663n1128m0902k4699
-4756f797614j8726j5396J8135J14900K83822N05519P41672R47750J086982J141800J115847
-4745h75309J026962Q98505P51626N96354M27150K32117O019k46363n11231p65076r80884
-4734E59870j140430j240228j287339j289338j242576j131014r44445o97885m29004j79396
-4724i021785K0794J60442K48695L06173L48353L76974L86739L73228L30204K47048J19272
-4713f103863l8485j97772l37735m58893n74832o90552p88163q34126q02237o91120n23099
-4702a2040877l29496j37960L2597J72924K82046L62756M17904M50823M66419M67022M48501
$$ plain form
-4781 -8592245 -8314152 -8071039 -7907850 -7853397 -7897074 -7985782 -8051316 -8046276 -7958671 -7802111 -7600563 -7381106
-4769 -7381106 -7171731 -6996531 -6868322 -6784470 -6729944 -6687646 -6651538 -6631429 -6641222 -6680885 -6732013 -6772915 -6797614
-4756 -6797614 -6816340 -6831736 -6813601 -6698701 -6414879 -5909360 -5167688 -4219938 -3132956 -1991156 -875309
-4745 -875309 151653 1050158 1801784 2398138 2825288 3057405 3063424 2817061 2305830 1540754 559870
-4734 559870 -580560 -1820788 -3108127 -4397465 -5640041 -6771055 -7715500 -8413385 -8842389 -9021785
-4724 -9021785 -9000991 -8840549 -8591854 -8285681 -7937328 -7560354 -7173615 -6800387 -6470183 -6223135 -6103863
-4713 -6103863 -6142348 -6340120 -6677855 -7136748 -7711580 -8402132 -9190295 -10024421 -10826658 -11517778 -12040877
-4702 -12040877 -12370373 -12508333 -12475736 -12302812 -12020766 -11658010 -11240106 -10789283 -10322864 -9855842 -9407341
-4691i407341M04513L35498K52096J70491J03523N2053K966n8979j32618j93509k06885j49911
-4679h828103k6979J28024K62448L28052L06373K17682J05344R961m7669o7060n6290j7539
-4667g685756N7343J76770L35436N08786O59233P52983P78044P47494O86853O18660N54793
-4656a809361N00333M61085M42681M41722M41234M18759L61245K72622J66741N1618p9824
-4645A668855k38559m13666n56934n97363m81158k10252J50179N03395P70346R19861R62077
-4634B476781R23793Q31270P01656N37308L30335Q0556j91552m52284o71987q34420r36238
-4623B795218r82704r82726r44704q74912p78934o63942n36967m02389k66652j44588n3783
-4612c837083k39K8578N8442J15760K14107L46371M86160N94374O30085N69933M28242K56860
$$ plain form
-4691 -9407341 -9002828 -8667330 -8415234 -8244743 -8141220 -8089167 -8086201 -8145180 -8277798 -8471307 -8678192 -8828103
-4679 -8828103 -8855082 -8727058 -8464610 -8136558 -7830185 -7612503 -7507159 -7497198 -7544867 -7611927 -7668217 -7685756
-4667 -7685756 -7628413 -7451643 -7116207 -6607421 -5948188 -5195205 -4417161 -3669667 -2982814 -2364154 -1809361
-4656 -1809361 -1309028 -847943 -405262 36460 477694 896453 1257698 1530320 1697061 1748679 1668855
-4645 1668855 1430296 1016630 459696 -137667 -618825 -829077 -678898 -175503 594843 1514704 2476781
-4634 2476781 3400574 4231844 4933500 5470808 5801143 5881699 5690147 5237863 4565876 3731456 2795218
-4623 2795218 1812514 829788 -114916 -989828 -1768762 -2432704 -2969671 -3372060 -3638712 -3783300 -3837083
-4612 -3837083 -3837322 -3808744 -3750302 -3634542 -3420435 -3074064 -2587904 -1993530 -1363445 -793512 -365270 -108410
-4600a08410J17926M8892M4949O9739Q3650O8598L4660O289k07J0211J6720j740n4746j39553
-4586A96978k46385l61948m70837n57132o07211o14632n86897n47340n26899n49722o20070
-4575e492095p16825q00114q30520p89844o87521n47517l90597k29551p6283N5817J59498
-4564a0345552K38712L02587L57012M04414M45787M75803M80906M50467L88473L09957K28068
-4553f263366J46345O2366k3188j00792j54292j71883j58957j39447j41252j75993k26869
-4542g347328k55624k28253j40791k2607Q6706J65403K16748K53815K84974L14156L46942
-4531f325859L86088M18036M11138L36576J95028K1116j39381k57722l32127l77228m06007
-4520f070342m19509m09242l66295k87474j74262l0762J30723K80609L76024L83682L02939
$$ plain form
-4600 -108410 9516 58408 103357 173096 256746 325344 360004 366293 366086 376297 393017 391277 336531 196978
-4586 196978 -49407 -411355 -882192 -1439324 -2046535 -2661167 -3248064 -3795404 -4322303 -4872025 -5492095
-4575 -5492095 -6208920 -7009034 -7839554 -8629398 -9316919 -9864436 -10255033 -10484584 -10560867 -10505050 -10345552
-4564 -10345552 -10106840 -9804253 -9447241 -9042827 -8597040 -8121237 -7640331 -7189864 -6801391 -6491434 -6263366
-4553 -6263366 -6117021 -6054655 -6077843 -6178635 -6332927 -6504810 -6663767 -6803214 -6944466 -7120459 -7347328
-4542 -7347328 -7602952 -7831205 -7971996 -7994603 -7907897 -7742494 -7525746 -7271931 -6986957 -6672801 -6325859
-4531 -6325859 -5939771 -5521735 -5110597 -4774021 -4578993 -4557877 -4697258 -4954980 -5287107 -5664335 -6070342
-4520 -6070342 -6489851 -6899093 -7265388 -7552862 -7727124 -7757886 -7627163 -7346554 -6970530 -6586848 -6283909
-4509f283909J67902K8468p0713j00034m6311Q5687K70915M69166O39669P54868Q04952P94191
-4497b485149P33896O38666N28360M27229L50334K87737K09180R1866n6930k05089l18384
-4486B01716l79187l94110l89979l97979m33443m84890n21950n16429m58743l58157k35378
-4475d368529j18786m0389k1031n3220j03777j37680j35855r1285k120J22164K55598L69368
-4463d325542M50656N02682N30814N34783N09328M49090L55979K44025J32811L2887o0778
-4452f43265j58728k59706l46407l98967m13634m08851m13743m47029n03251n56997n79145
-4441e129723n51727m74597l64656k47710j45903o8099p013N6778J44356K64210M03332N34848
-4429e585904O39433P17587P80076Q27661Q43436Q04647O99300N31188L13956O5635j92061
$$ plain form
-4509 -6283909 -6116007 -6087539 -6158252 -6258286 -6304597 -6218910 -5947995 -5478829 -4839160 -4084292 -3279340 -2485149
-4497 -2485149 -1751253 -1112587 -584227 -156998 193336 481073 690253 782119 725189 520100 201716
-4486 201716 -177471 -571581 -961560 -1359539 -1792982 -2277872 -2799822 -3316251 -3774994 -4133151 -4368529
-4475 -4368529 -4487315 -4527704 -4548735 -4601955 -4705732 -4843412 -4979267 -5070552 -5072672 -4950508 -4694910 -4325542
-4463 -4325542 -3874886 -3372204 -2841390 -2306607 -1797279 -1348189 -992210 -748185 -615374 -582487 -643265
-4452 -643265 -801993 -1061699 -1408106 -1807073 -2220707 -2629558 -3043301 -3490330 -3993581 -4550578 -5129723
-4441 -5129723 -5681450 -6156047 -6520703 -6768413 -6914316 -6982415 -6989428 -6932650 -6788294 -6524084 -6120752 -5585904
-4429 -5585904 -4946471 -4228884 -3448808 -2621147 -1777711 -973064 -273764 257424 571380 637015 444954
-4418D44954m34486o37888p84287q62020q62889p85216o43483m68774k92279j26396L6593
-4407e416171K06931L77781N21576O04973O09805N41801M23254K80607J36826Q578r3501j60548
-4395a958088j80992j44545n6201N2737J31195J33189M7108r1116k16731k76303k55165j72266
-4383b987178n6838P0297K02837L43935M91991O28868P26347P67383P57083P10209O35517
-4372B290451N39804M41420L68777L42592L61418M04481M45624M63337M42758L77716K72286
-4361F750664J35125k6602k02676l70019m93762n45155n22490m52906l71611l00001k42367
-4350C358200j96631j63785j48935j56978j88342k38284k99696l62767m10164m18295l70823
-4339D03500k71876j44016j4136R7361J78171K23336K33164K06630J36885J7438j47886l41295
$$ plain form
-4418 444954 10468 -627420 -1411707 -2273727 -3136616 -3921832 -4565315 -5034089 -5326368 -5452764 -5416171
-4407 -5416171 -5209240 -4831459 -4309883 -3704910 -3095105 -2553304 -2130050 -1849443 -1712617 -1704039 -1797540 -1958088
-4395 -1958088 -2139080 -2283625 -2339826 -2287089 -2155894 -2022705 -1975597 -2066713 -2283444 -2559747 -2814912 -2987178
-4383 -2987178 -3044016 -2973719 -2770882 -2426947 -1934956 -1306088 -579741 187642 944725 1654934 2290451
-4372 2290451 2830255 3271675 3640452 3983044 4344462 4748943 5194567 5657904 6100662 6478378 6750664
-4361 6750664 6885789 6859187 6656511 6286492 5792730 5247575 4725085 4272179 3900568 3600567 3358200
-4350 3358200 3161569 2997784 2848849 2691871 2503529 2265245 1965549 1602782 1192618 774323 403500
-4339 403500 131624 -12392 -26528 70833 249004 472340 705504 912134 1049019 1066457 918571 577276
-4327E77276n32709o86857p75867p87814p24531n98171m33045k64219j28135n1917m6892j04893
-4315d557774j99058k93053l55054l68581l36875k80749k26378j90253j76233j85081k18788
-4304g387877k72797l32041l80624m12188m29733m38187m35314m06719l29903j88704Q245
-4293a1005842K21294L97709N01214N28002N00353M51455M13638M08809M38684M84264N19706
-4282f140714N29341N12068M75040M27884L78806L29656K73602J98373R3339m1085j88784
-4271c152474l28836m54043n73294o90795p87184q27638p87528o68877m99778l22679j75413
-4260i268539p5063j4404L0842Q8376J70743K62848L32027L57755L49928L34342L24770L12620
-4248f793755K80311K20544J44444P6900M4967O4171J26166J95645K23403J72370M2424j24414
$$ plain form
-4327 577276 44567 -642290 -1418157 -2205971 -2930502 -3528673 -3961718 -4225937 -4354072 -4405989 -4452881 -4557774
-4315 -4557774 -4756832 -5049885 -5404939 -5773520 -6110395 -6391144 -6617522 -6807775 -6984008 -7169089 -7387877
-4304 -7387877 -7660674 -7992715 -8373339 -8785527 -9215260 -9653447 -10088761 -10495480 -10825383 -11014087 -11005842
-4293 -11005842 -10784548 -10386839 -9885625 -9357623 -8857270 -8405815 -7992177 -7583368 -7144684 -6660420 -6140714
-4282 -6140714 -5611373 -5099305 -4624265 -4196381 -3817575 -3487919 -3214317 -3015944 -2922605 -2963690 -3152474
-4271 -3152474 -3481310 -3935353 -4508647 -5199442 -5986626 -6814264 -7601792 -8270669 -8770447 -9093126 -9268539
-4260 -9268539 -9343602 -9358006 -9327164 -9238788 -9068045 -8805197 -8473170 -8115415 -7765487 -7431145 -7106375 -6793755
-4248 -6793755 -6513444 -6292900 -6148456 -6071556 -6026589 -5962418 -5836252 -5640607 -5417204 -5244834 -5202410 -5326824
-4236e326824k65288l32727l20170k59565j94992j54107j38334j34714j36132j51344j97023
-4225g611220k81485l97044n22970o26724o63423n90455l98949j33657J22347K90638L38743
-4214a0474199K92689K15100J70012J99542L16217N02730P16772R02540J007766J004132R02188
-4203d244511P47019N93547M76931L96846L24396K25124Q0894j01124k92525m58201n74863
-4192b826467o40298o69011o79956o81652o60188n82181m18433j73805J02488L42239M99248
-4181f388016N65866N54923M76579L35364J40738q2500k91485m34808m70808l81985j78711
-4170f154843J05763M22310P11273R12125R81857R11618P26784M72996K02598l3370j91828
-4159i32717k47679k05669j02369J1265R6730J42499J58355J61074J64143J72976J82914J81546
$$ plain form
-4236 -5326824 -5592112 -5924839 -6245009 -6504574 -6699566 -6853673 -6992007 -7126721 -7262853 -7414197 -7611220
-4225 -7611220 -7892705 -8289749 -8812719 -9439443 -10102866 -10693321 -11092270 -11225927 -11103580 -10812942 -10474199
-4214 -10474199 -10181510 -9966410 -9796398 -9596856 -9280639 -8777909 -8061137 -7158597 -6150831 -5146699 -4244511
-4203 -4244511 -3497492 -2903945 -2427014 -2030168 -1705772 -1480648 -1399754 -1500878 -1793403 -2251604 -2826467
-4192 -2826467 -3466765 -4135776 -4815732 -5497384 -6157572 -6739753 -7158186 -7331991 -7229503 -6887264 -6388016
-4181 -6388016 -5822150 -5267227 -4790648 -4455284 -4314546 -4397046 -4688531 -5123339 -5594147 -5976132 -6154843
-4170 -6154843 -6049080 -5626770 -4915497 -4003372 -3021515 -2109897 -1383113 -910117 -707519 -740889 -932717
-4159 -932717 -1180396 -1386065 -1488434 -1477169 -1380439 -1237940 -1079585 -918511 -754368 -581392 -398478 -216932
-4147b16932J56495J05879M4441k214j4058R620N2164R4400J27333J56113J97765K70864L78449
-4134A360319N00080O01498O48955O18256N04732L32318J45676j5028j33305k15571k81046
-4123D066884l51594m39561n39106o31109o97423p28781p21510o75723o02079n25388m72633
-4112b318023m55668m66884m88854n03042m90895m35613l29050j75915R195K06453L93993
-4101e054303N50416O54371O84837O32980N18615L87410K85771K35895K27531K25548J89149
-4090d61780R4647n2116k19883l69207m75530n43201n95492o47179o88057o93550o48461n58713
-4078e858522m43443l20423j99173q2700K7838J30091K20306K93751L44346L64549L48466
-4067e174914K98606K30842J71908J50415J85993K80503M13790N47950O43488O81268O73570
$$ plain form
-4147 -216932 -60437 45442 89883 87669 73611 83231 135395 229795 357128 513241 711006 981870 1360319
-4134 1360319 1860399 2461897 3110852 3729108 4233840 4566158 4711834 4696806 4563501 4347930 4066884
-4123 4066884 3715290 3275729 2736623 2105514 1408091 679310 -42200 -717923 -1320002 -1845390 -2318023
-4112 -2318023 -2773691 -3240575 -3729429 -4232471 -4723366 -5158979 -5488029 -5663944 -5654749 -5448296 -5054303
-4101 -5054303 -4503887 -3849516 -3164679 -2531699 -2013084 -1625674 -1339903 -1104008 -876477 -650929 -461780
-4090 -461780 -367133 -419249 -639132 -1008339 -1483869 -2027070 -2622562 -3269741 -3957798 -4651348 -5299809 -5858522
-4078 -5858522 -6301965 -6622388 -6821561 -6904261 -6876423 -6746332 -6526026 -6232275 -5887929 -5523380 -5174914
-4067 -5174914 -4876308 -4645466 -4473558 -4323143 -4137150 -3856647 -3442857 -2894907 -2251419 -1570151 -896581
-4056h96581O53141O46367O48023O17163N03335K86653j921k96593n32954o75590p23967p03377
-4044d76301o51522o07271o00981o40753p03963p47542p31341o37128m73966k70245n9463
-4033f600476J29094K70815L42758L28622K31337P9143q4689k21457l12620l62384l82550
-4022f582407l72372l19790k25205j15506k8101J7284L1107M3838Q6132J71336K86724L98074
-4010f608886M67797M77499M38074L77196L14973K51983J79821R7496J3338o2552j16815j28655
-3998d298731q1739J6634J35497K40367L10605L42109L40761L15650K76448K32675J89883
-3987a979841J45380R1917K8467l3282p5642r0813r1617j01640j30396j58222j43187m2412
-3975b581288J62001M43065P32632R51764J047489J013204Q84535P16477N56814M31297L41948
$$ plain form
-4056 -896581 -243440 402927 1050950 1668113 2171448 2458101 2456180 2159587 1626633 951043 227076 -476301
-4044 -476301 -1127823 -1735094 -2336075 -2976828 -3680791 -4428333 -5159674 -5796802 -6270768 -6541013 -6600476
-4033 -6600476 -6471382 -6200567 -5857809 -5529187 -5297850 -5218707 -5303396 -5524853 -5837473 -6199857 -6582407
-4022 -6582407 -6954779 -7274569 -7499774 -7615280 -7643381 -7626097 -7594990 -7551152 -7465020 -7293684 -7006960 -6608886
-4010 -6608886 -6141089 -5663590 -5225516 -4848320 -4533347 -4281364 -4101543 -4004047 -3990709 -4053261 -4170076 -4298731
-3998 -4298731 -4380470 -4363836 -4228339 -3987972 -3677367 -3335258 -2994497 -2678847 -2402399 -2169724 -1979841
-3987 -1979841 -1834461 -1742544 -1714077 -1747359 -1823001 -1913814 -2005431 -2107071 -2237467 -2395689 -2538876 -2581288
-3975 -2581288 -2419287 -1976222 -1243590 -291826 755663 1768867 2653402 3369879 3926693 4357990 4699938
-3964D699938K72847K01311J10244o573j48084l09527m80900o45405p82839q75260r10037
-3953A125715q77375p66348n70135l05646k8807J79984K57332J92240K7056j75408l69228
-3942a310620n38979o88807q25406r47109j040181j086674j083621j052200j019243r88730
-3932a0581570r36341q30949o58420m28994j70986Q0013K93274M53302N62084O31154O68713
-3921a0918720O73986O44232N86519N21633M75909M68889N06404N81087O76518P70102Q33903
-3910d179538Q38539P63267O05659L82053J20226j45939l77921n37338n96597n48715m09818
-3899d086122k13942k947J85891L31099M29723M87536N07931M91455M42007L67548K74356
-3888g85465J62866L2174j08631k35066l17907l40872l06005k28361j35279o4605m7944r1036
$$ plain form
-3964 4699938 4972785 5174096 5284340 5277767 5129683 4820156 4339256 3693851 2911012 2035752 1125715
-3953 1125715 248340 -518008 -1088143 -1393789 -1422596 -1242612 -985280 -793040 -765984 -941392 -1310620
-3942 -1310620 -1849599 -2538406 -3363812 -4310921 -5351102 -6437776 -7521397 -8573597 -9592840 -10581570
-3932 -10581570 -11517911 -12348860 -13007280 -13436274 -13607260 -13527247 -13233973 -12780671 -12218587 -11587433 -10918720
-3921 -10918720 -10244734 -9600502 -9013983 -8492350 -8016441 -7547552 -7041148 -6460061 -5783543 -5013441 -4179538
-3910 -4179538 -3340999 -2577732 -1972073 -1590020 -1469794 -1615733 -1993654 -2530992 -3127589 -3676304 -4086122
-3899 -4086122 -4300064 -4303011 -4117120 -3786021 -3356298 -2868762 -2360831 -1869376 -1427369 -1059821 -785465
-3888 -785465 -622599 -590425 -699056 -934122 -1252029 -1592901 -1898906 -2127267 -2262546 -2327151 -2375095 -2466131
-3876b466131j72681k60414l27835l67197l93963m36297n12087o11260o98168p31427o87036
-3865g664496n71049m10949k30929l4161J90062M43780P06514R40495J105743J171296J120655
-3854c233039R58189P13854M36087J70930n9508k58289m31374n66225o36698o28168n53952
-3843d088193m47623l43458k64158k17053j90452j53323o9082Q0356K77890M74466O11371
-3832d329259O49754N88703M59991L08555J74221Q0837L3611K4642M2040P4185J09306J37204
-3820a646210J51445J46889J17944O4708M0n4331q0098p1673l7134Q250N3505R9425J53261
-3807a093979K15557K74793L15155L28587L18094K90961K52254K02954J39346N3827n8280
-3796A239269j90679l26351m44946n27559n56540n18900m15408k68259j19157j4082K0057
$$ plain form
-3876 -2466131 -2638812 -2899226 -3227061 -3594258 -3988221 -4424518 -4936605 -5547865 -6246033 -6977460 -7664496
-3865 -7664496 -8235545 -8646494 -8877423 -8911584 -8721522 -8277742 -7571228 -6630733 -5524990 -4353694 -3233039
-3854 -3233039 -2274850 -1560996 -1124909 -953979 -1013487 -1271776 -1703150 -2269375 -2906073 -3534241 -4088193
-3843 -4088193 -4535816 -4879274 -5143432 -5360485 -5550937 -5704260 -5773342 -5692986 -5415096 -4940630 -4329259
-3832 -4329259 -3679505 -3090802 -2630811 -2322256 -2148035 -2067198 -2033587 -2008945 -1966905 -1892720 -1783414 -1646210
-3820 -1646210 -1494765 -1347876 -1229932 -1165224 -1165184 -1219515 -1299613 -1371286 -1408420 -1400170 -1346665 -1247240 -1093979
-3807 -1093979 -878422 -603629 -288474 40113 358207 649168 901422 1104376 1243722 1297549 1239269
-3796 1239269 1048590 722239 277293 -250266 -806806 -1325706 -1741114 -2009373 -2128530 -2142612 -2122555
-3785b122555o531m8451n2340Q405J20497K49964L70255M71257N49675O01899O26352O23919
-3773A392346N93156N30136M36023L21214J99368P6566n2941j97041l48593m78963n51948
-3762A919323n46498m70183l55186k41948j64012j40643j73780k48136l36395m10653m56060
-3751a624171m75038m77709m73262m73225m94634n47333o16201o62085o44652n49183l98872
-3740g436365k45054j40198j09136j36010j75935j81660j24322O83J77403L75741N60646P03518
-3728f730689P88099Q06538P55285O39062M75430K88550R6133r5387k80491m40333n43937
-3717d241740n69493n23733m35710l32367k23803j09703N808J08717J82762K20463K27286
-3706e691513K18692K13746K26154K57742L01577L49966L96765M32919M43295M12031L36058
$$ plain form
-3785 -2122555 -2129086 -2177537 -2229877 -2221472 -2100975 -1851011 -1480756 -1009499 -459824 142075 768427 1392346
-3773 1392346 1985502 2515638 2951661 3272875 3472243 3548809 3495868 3298827 2950234 2471271 1919323
-3762 1919323 1372825 902642 547456 305508 141496 853 -172927 -421063 -757458 -1168111 -1624171
-3751 -1624171 -2099209 -2576918 -3050180 -3523405 -4018039 -4565372 -5181573 -5843658 -6488310 -7037493 -7436365
-3740 -7436365 -7681419 -7821617 -7930753 -8066763 -8242698 -8424358 -8548680 -8547997 -8370594 -7994853 -7434207 -6730689
-3728 -6730689 -5942590 -5136052 -4380767 -3741705 -3266275 -2977725 -2881592 -2976979 -3257470 -3697803 -4241740
-3717 -4241740 -4811233 -5334966 -5770676 -6103043 -6326846 -6436549 -6430741 -6322024 -6139262 -5918799 -5691513
-3706 -5691513 -5472821 -5259075 -5032921 -4775179 -4473602 -4123636 -3726871 -3293952 -2850657 -2438626 -2102568
-3695b102568K35159J44757R3595Q5372R9542J05942P8904N482j09470k44035l68382m57240
-3683b432942m98398m97832m79842m76199n09581n82633o73917p43113p49852o75873n30724
-3672h850906l41948j44068L0793J66184K67622L49514M13283M42253M20383L53727K73146
-3661f620017K17323K10725K52359L20550L85479M18216L96005L08648J65633k764j57101
-3650d104944k68633l31255l57189l65607l72852l85447l95734l84128l31362k33834j08410
-3639g639395K0138J41820K73881M47617O80323R58054J239000J468292J595704J593324J465479
-3628B244237J241285R54904O32923K99390j4388k72252m47802n34975n41225m73360l36365
-3617B752372j46957N6411K22333L10960L15036K56432J62785N1574o3299j60762k18991k33164
$$ plain form
-3695 -2102568 -1867409 -1722652 -1629057 -1543685 -1444143 -1338201 -1259297 -1253815 -1363285 -1607320 -1975702 -2432942
-3683 -2432942 -2931340 -3429172 -3909014 -4385213 -4894794 -5477427 -6151344 -6894457 -7644309 -8320182 -8850906
-3672 -8850906 -9192854 -9336922 -9306129 -9139945 -8872323 -8522809 -8109526 -7667273 -7246890 -6893163 -6620017
-3661 -6620017 -6402694 -6191969 -5939610 -5619060 -5233581 -4815365 -4419360 -4110712 -3945079 -3947843 -4104944
-3650 -4104944 -4373577 -4704832 -5062021 -5427628 -5800480 -6185927 -6581661 -6965789 -7297151 -7530985 -7639395
-3639 -7639395 -7619257 -7477437 -7203556 -6755939 -6075616 -5117562 -3878562 -2410270 -814566 778758 2244237
-3628 2244237 3485522 4440426 5073349 5372739 5358351 5086099 4638297 4103322 3562097 3088737 2752372
-3617 2752372 2605415 2661826 2884159 3195119 3510155 3766587 3929372 3980946 3917647 3756885 3537894 3304730
-3605C304730k23356k22516k55827l32082m52257o14908q02837r72326j072723j082734j025662
-3594c752498r49953q95573q75235q79919q92148q90511q50169p50501n86720l76974j60525
-3583a1860726J2676R9915Q9551J4176o6351j01314p1944J3095J33968K69344L98611N03460
-3571a0565539N71447O02555O13058O23487O37235O36330O01728N35199M61947M16211M23412
-3560d442930M89158N96835P11079P84744P70141O32414L62739j1412m24345p87362j018776
-3549b337715j070436r34053o35002k29270K00973N65590P94497Q56998P63266N53570K83939
-3538a187643J0211k26111m04237n19810n76417n80323n38509m58806l50539k22168p7951
-3527e132303Q0411K48831M18109N74527P01910P84572Q08924P62491O36621M38286J99027
$$ plain form
-3605 3304730 3081374 2858858 2603031 2270949 1818692 1203784 400947 -571379 -1644102 -2726836 -3752498
-3594 -3752498 -4702451 -5598024 -6473259 -7353178 -8245326 -9135837 -9986006 -10736507 -11323227 -11700201 -11860726
-3583 -11860726 -11848050 -11748135 -11658584 -11644408 -11710759 -11812073 -11884017 -11870922 -11736954 -11467610 -11068999 -10565539
-3571 -10565539 -9994092 -9391537 -8778479 -8154992 -7517757 -6881427 -6279699 -5744500 -5282553 -4866342 -4442930
-3560 -4442930 -3953772 -3356937 -2645858 -1861114 -1090973 -458559 -95820 -107232 -531577 -1318939 -2337715
-3549 -2337715 -3408151 -4342204 -4977206 -5206476 -5005503 -4439913 -3645416 -2788418 -2025152 -1471582 -1187643
-3538 -1187643 -1177432 -1403543 -1807780 -2327590 -2904007 -3484330 -4022839 -4481645 -4832184 -5054352 -5132303
-3527 -5132303 -5051892 -4803061 -4384952 -3810425 -3108515 -2323943 -1515019 -752528 -115907 322379 521406
-3516E21406l4441k21293l40460l91927l91593l62717l23904k80218k27756j67500j11502
-3505b331905p2493m9434k7563M138L5637L7947j6002j32939k97316m78872o40495p46659
-3493d715956p72972p15014n91393m35420k78391j35487n485J17067K29623L20600L79890
-3482f602938M10569M30937M62504N11419N59690N75109N30120M14250K35053J3373k19656
-3471b679570m25123n67625o35850o52737o59952o89485p46803q14922q68676q87107q58647
-3460a0486497p81086o58590m97329l03384q7658J27373L10494M34313M86359M72300M15561
-3449a0568144L55927L39603L97779N27146O90707Q39401R37414R77157R77390R64875R54300
-3438b606445R43556R22315Q80686Q10366P00466N37276L14964N2351k04117m02808n15527
$$ plain form
-3516 521406 486965 265672 -74788 -466715 -858308 -1221025 -1544929 -1825147 -2052903 -2220403 -2331905
-3505 -2331905 -2404398 -2453832 -2481395 -2477257 -2441620 -2403673 -2419675 -2552614 -2849930 -3328802 -3969297 -4715956
-3493 -4715956 -5488928 -6203942 -6795335 -7230755 -7509146 -7644633 -7650118 -7533051 -7303428 -6982828 -6602938
-3482 -6602938 -6192369 -5761432 -5298928 -4787509 -4227819 -3652710 -3122590 -2708340 -2473287 -2459914 -2679570
-3471 -2679570 -3104693 -3672318 -4308168 -4960905 -5620857 -6310342 -7057145 -7872067 -8740743 -9627850 -10486497
-3460 -10486497 -11267583 -11926173 -12423502 -12726886 -12814544 -12687171 -12376677 -11942364 -11456005 -10983705 -10568144
-3449 -10568144 -10212217 -9872614 -9474835 -8947689 -8256982 -7417581 -6480167 -5503010 -4525620 -3560745 -2606445
-3438 -2606445 -1662889 -740574 140112 950478 1650944 2188220 2503184 2555535 2351418 1948610 1433083
-3427A433083n47608n25731m77730m17814l43768k43711j08491N3778K08827L03234K91405
-3416c74526J66124l0375k27813l65149m17843m00609l48464k93116k56391k56512l06599
-3405c111273m05847n37070o76658q08064r27715j036829j127624j178604j163298j063812
-3395a2036794q80345o32473l54168q6915J27843K60059L02892K75346K12798J49570J01390
-3384a2560797O0183Q300n7997j17735j37914r5642R983J58558L16081M46836N25556N43330
-3372a0901258N07145M37709L64217L13018K95263L01110L04074K75445K03241J00410o343
-3361g805969r2987j45070j58060j35373q2471m175Q9763J79744K43817K70071K54464J89127
-3349g197119O4931j07235k81092l88396l74834k29256J3259K91285N44149P33497Q51511
$$ plain form
-3427 1433083 885475 359744 -117986 -535800 -879568 -1123279 -1231770 -1177992 -969165 -665931 -374526
-3416 -374526 -208402 -238777 -466590 -831739 -1249582 -1650191 -1998655 -2291771 -2548162 -2804674 -3111273
-3405 -3111273 -3517120 -4054190 -4730848 -5538912 -6466627 -7503456 -8631080 -9809684 -10972982 -12036794
-3395 -12036794 -12917139 -13549612 -13903780 -13990695 -13862852 -13602793 -13299901 -13024555 -12811757 -12662187 -12560797
-3384 -12560797 -12500614 -12492314 -12550311 -12668046 -12805960 -12901602 -12891619 -12733061 -12416980 -11970144 -11444588 -10901258
-3372 -10901258 -10394113 -9956404 -9592187 -9279169 -8983906 -8682796 -8378722 -8103277 -7900036 -7799626 -7805969
-3361 -7805969 -7898956 -8044026 -8202086 -8337459 -8419930 -8424105 -8334342 -8154598 -7910781 -7640710 -7386246 -7197119
-3349 -7197119 -7132188 -7239423 -7520515 -7908911 -8283745 -8513001 -8499742 -8208457 -7664308 -6930811 -6079300
-3338f079300R11604R27988R01740Q26047P03354N55696M18507L23775K82493K76602K69697
-3327C18203K32694J65115R3172M5205K8885L3110M6577O8453J02994J48275J90736K11217
-3315A684636J98862J58719J03370L9798l1457j09577j93285k83223l75861m54268m90987
-3304B46727m64644l74811k41464r5387K6078Q2301M4474q4588k68052m55703o08347p06170
-3292b899586p43842p27922o78888o26600n94272n82091n67770n23990m37701l18101j89288
-3281h890051p3759J8898R0082J45199J89226K23040K42468K47598K52802K79287L35986M12221
-3269f527003M89913N58940O16154O50817O38669N60223M25668K74225J45984N6006o051n3931
-3257b170386q5444q4278l5620O4630K10589L86054N61274O99389P76729P97238P82807P51310
$$ plain form
-3338 -6079300 -5167696 -4239708 -3337968 -2511921 -1808567 -1252871 -834364 -510589 -228096 48506 318203
-3327 318203 550897 716012 809184 854389 883274 916384 962961 1031414 1134408 1282683 1473419 1684636
-3315 1684636 1883498 2042217 2145587 2185385 2153928 2044351 1851066 1567843 1191982 737714 246727
-3304 246727 -217917 -592728 -834192 -929579 -903501 -821200 -776726 -861314 -1129366 -1585069 -2193416 -2899586
-3292 -2899586 -3643428 -4371350 -5050238 -5676838 -6271110 -6853201 -7420971 -7944961 -8382662 -8700763 -8890051
-3281 -8890051 -8963810 -8944912 -8854830 -8709631 -8520405 -8297365 -8054897 -7807299 -7554497 -7275210 -6939224 -6527003
-3269 -6527003 -6037090 -5478150 -4861996 -4211179 -3572510 -3012287 -2586619 -2312394 -2166410 -2110404 -2116455 -2170386
-3257 -2170386 -2255830 -2340108 -2375728 -2311098 -2100509 -1714455 -1153181 -453792 322937 1120175 1902982 2654292
-3245B654292P05596O39303N47171M29451K93322J55782M1179l1092n7978n2825l8563m0028
-3233E245610p5149j47565k47672l60422m70681n62682o18458o21183n65287m65139l49474
-3222G61898k42478j51581p4837j3080L1090O2662R4487J35297J79093K09011K13079J95818
-3210A400459J73107J55519J37397J03186M4603k8378r1732j21201j06117n5271R526O6943
-3198A688041J04745J16500R4339L1081o9946j94149l26806m60053n87881o96821p63753p65090
-3186a829793o90855n50919l67886j65234L6652K17062L55957M40783M71371M64199M54028
-3175a164635M81332N66336O92182Q11481Q66905Q12887O32964L49628K0975k77913m81829
-3164C310313n59457n24595m28578l33321k79779k72939k90615l04081k94345k56519j95206
$$ plain form
-3245 2654292 3359888 3999191 4546362 4975813 5269135 5424917 5466096 5435004 5377026 5324201 5285638 5245610
-3233 5245610 5170461 5022896 4775224 4414802 3944121 3381439 2762981 2141798 1576511 1111372 761898
-3222 761898 519420 367839 293002 279922 311012 373674 468161 603458 782551 991562 1204641 1400459
-3210 1400459 1573566 1729085 1866482 1969668 2014271 1985893 1894161 1772960 1666843 1611572 1621098 1688041
-3198 1688041 1792786 1909286 2003625 2034706 1964760 1770611 1443805 983752 395871 -300950 -1064703 -1829793
-3186 -1829793 -2520648 -3071567 -3439453 -3604687 -3568035 -3350973 -2995016 -2554233 -2082862 -1618663 -1164635
-3175 -1164635 -683303 -116967 575215 1386696 2253601 3066488 3699452 4049080 4070055 3792142 3310313
-3164 3310313 2750856 2226261 1797683 1464362 1184583 911644 621029 316948 22603 -233916 -429122
-3153d29122j19201m1010K2021N4205N3225L1720N459j6785l3636m4993m6917l4585j1119
-3140f10738R515J0495j4712n5142q8282r1938n1553L3425J42299K38283K89909K88506K45893
-3127C45960J81076J11735N2392J1545j2380k9538n2409q9598j36378j67282j49819p5776
-3115a0472K4313J01877J24209R1732L2078j9675m1909l7283k5912k6155m2337p3078j26276
-3102b8888k16686l46706m95724o33736p44422q30698q97309r34228r21569q51093p41554
-3091g642613o30412n49407n10159n09065n34804n68993n89301n77111n20159m12210k60042
-3080a3304276r1480N4460J50963J95154K03431K04039K28837K98053M07038N31131O46888
-3069a0475762P48420Q42160R27706R89921J012024R88667R20321Q03769O39917M49777K74620
$$ plain form
-3153 -429122 -548323 -589333 -567312 -513107 -459882 -428162 -422703 -439488 -473124 -518117 -565034 -599619 -610738
-3140 -610738 -601223 -590728 -605440 -660582 -748864 -840802 -892355 -858930 -716631 -478348 -188439 100067 345960
-3127 345960 527036 638771 691163 702708 690328 660790 608381 518783 382405 215123 65304 -10472
-3115 -10472 13841 115718 239927 331659 363737 344062 302153 264870 238958 212803 170466 97388 -28888
-3102 -28888 -245574 -592280 -1088004 -1721740 -2466162 -3296860 -4194169 -5128397 -6049966 -6901059 -7642613
-3091 -7642613 -8273025 -8822432 -9332591 -9841656 -10376460 -10945453 -11534754 -12111865 -12632024 -13044234 -13304276
-3080 -13304276 -13395756 -13341296 -13190333 -12995179 -12791748 -12587709 -12358872 -12060819 -11653781 -11122650 -10475762
-3069 -10475762 -9727342 -8885182 -7957476 -6967555 -5955531 -4966864 -4046543 -3242774 -2602857 -2153080 -1878460
-3058a878460J55335J10151J29802J88950K60313L24613L73574M02879M00742L44855K13486
-3047A026240K819k61251n26773p37191q58233q89384q53616p79714o94963o26523n95856
-3036e794445o05257o32759o45078o18805n52905m64971l78290l08971k55992k01511j28547
-3025a0587531m2952K6010M8561J3786o9645j77447k71242l08894k65194j47149Q306J54092
-3013a1619299K59920L28057L83466M46166N12890N63170N78272N52713M92329M06973L07192
-3002f788151K03632J05448K0232m4223q1458r0845q0048o2783n3096n8412p4155q4708p5527
-2989g164094m9795k9456l3519n8485q6500j06963j19815j23136j10179p7796l0442K2868
-2977g967312P2241J11038J41423J76543K34583L26243M44551N62999O44197O58599O01572
$$ plain form
-3058 -1878460 -1723125 -1612974 -1483172 -1294222 -1033909 -709296 -335722 67157 467899 812754 1026240
-3047 1026240 1029059 767808 241035 -496156 -1354389 -2243773 -3097389 -3877103 -4572066 -5198589 -5794445
-3036 -5794445 -6399702 -7032461 -7677539 -8296344 -8849249 -9314220 -9692510 -10001481 -10257473 -10458984 -10587531
-3025 -10587531 -10630483 -10604473 -10555912 -10542126 -10611771 -10789218 -11060460 -11369354 -11634548 -11781697 -11773391 -11619299
-3013 -11619299 -11359379 -11031322 -10647856 -10201690 -9688800 -9125630 -8547358 -7994645 -7502316 -7095343 -6788151
-3002 -6788151 -6584519 -6479071 -6458839 -6503062 -6584520 -6675365 -6755413 -6818196 -6871292 -6929704 -7003859 -7088567 -7164094
-2989 -7164094 -7213889 -7243345 -7276864 -7335349 -7421849 -7528812 -7648627 -7771763 -7881942 -7959738 -7990180 -7967312
-2977 -7967312 -7895071 -7784033 -7642610 -7466067 -7231484 -6905241 -6460690 -5897691 -5253494 -4594895 -3993323
-2966c993323M95011L73558K66860J87174J28475P7721K5842l2399j03112j91926k96077m00349
-2954c462545m85888n44001n75528n76067n27899m10533k20918J4855K49926M38900N53559
-2943e546139N82004N24030L94419K26843O4830n8885j35894j75914j91235j90462j82593
-2932d688996j76026j69675j48116q6731L3353K07243M02347N75641O95552P50345P44452
-2921a860611O92820O13148N15711M00195K61648R6279r6491l11728n34957p40705q97557
-2910a862248r81487r90059r44647q77301q15890p78164p71478p93673q35943q82505r04475
-2899a1437870q59640p11095m53463j23347K13216M86002O42492O59699N50156L62296J65536
-2888a0506018K2643l2460j500Q3414J77616K52425L13036L85955M87869O08368P19602P94458
$$ plain form
-2966 -3993323 -3498312 -3124754 -2857894 -2670720 -2542245 -2464524 -2438682 -2471081 -2574193 -2766119 -3062196 -3462545
-2954 -3462545 -3948433 -4492434 -5067962 -5644029 -6171928 -6582461 -6803379 -6788524 -6538598 -6099698 -5546139
-2943 -5546139 -4964135 -4440105 -4045686 -3818843 -3754013 -3812898 -3948792 -4124706 -4315941 -4506403 -4688996
-2932 -4688996 -4865022 -5034697 -5182813 -5269544 -5236191 -5028948 -4626601 -4050960 -3355408 -2605063 -1860611
-2921 -1860611 -1167791 -554643 -38932 361263 622911 719190 622699 310971 -223986 -964691 -1862248
-2910 -1862248 -2843735 -3833794 -4778441 -5655742 -6471632 -7249796 -8021274 -8814947 -9650890 -10533395 -11437870
-2899 -11437870 -12297510 -13008605 -13462068 -13585415 -13372199 -12886197 -12243705 -11584006 -11033850 -10671554 -10506018
-2888 -10506018 -10483375 -10515835 -10517335 -10433921 -10256305 -10003880 -9690844 -9304889 -8817020 -8208652 -7489050 -6694592
-2876f694592Q15514P76738O83998N53547M08502K74074J71692J14136J04237J37043K05313
-2865b449798L02958M20042N36810O29351O82932O98629O87969O61616O22956N73444N22143
-2854C889052M86444M80129M97115N06002M67970L66735K22310P5006m4782j34319k12161
-2843F599501k98814m02753n18154o29868p20681p78562p98704p78568p12091n91656m17556
-2832d7906k05298J6310K14844L65263M56695M91663M80009M30596L45953K26822Q1947o9690
-2820B787208k06259l14321l98691m82285n90892p33559q96838j055906j189242j283644j330047
-2809e694476j321914j260556j157248j026545q78666p17621n45303l67596j94851l4570J13728
-2798a3085618K55367L93682N27910O56516P78114Q85071R59053R79217R34992Q30136O77798
$$ plain form
-2876 -6694592 -5879078 -5102340 -4418342 -3864795 -3456293 -3182219 -3010527 -2896391 -2792154 -2655111 -2449798
-2865 -2449798 -2146840 -1726798 -1189988 -560637 122295 820924 1508893 2170509 2793465 3366909 3889052
-2854 3889052 4375496 4855625 5352740 5858742 6326712 6693447 6915757 6990763 6945981 6811662 6599501
-2843 6599501 6300687 5897934 5379780 4749912 4029231 3250669 2451965 1673397 961306 369650 -47906
-2832 -47906 -253204 -236894 -22050 343213 799908 1291571 1771580 2202176 2548129 2774951 2856898 2787208
-2820 2787208 2580949 2266628 1867937 1385652 794760 61201 -835637 -1891543 -3080785 -4364429 -5694476
-2809 -5694476 -7016390 -8276946 -9434194 -10460739 -11339405 -12057026 -12602329 -12969925 -13164776 -13199346 -13085618
-2798 -13085618 -12830251 -12436569 -11908659 -11252143 -10474029 -9588958 -8629905 -7650688 -6715696 -5885560 -5207762
-2787e207762M94194K95133R4291r9313k82289m50652n90330o77900o95135o43769n49344
-2776h312876m52838l90173l68543l61249l29022k48108j21890K6916J74103L09819M41285
-2765i632576N81513P36944R02854J063163J191801J260255J247680J145922R60865P15055
-2755A73476M46419J96923k466j39726k20165k57321k61066k34880j86841j40241j28182j73650
-2743i27720k69260l73375m30323m01596k85329j14954N8446J90021K56178K52971J89851
-2732a855090Q9547j3559q5299j05262p1981k028P2877J14959R5017O105j30153k70313l67833
-2719b523013l93780l47127k49013j28805j4998O6823R7812P4979J6905m2535p0986n3029
-2707c566767P347R6564J98820K94336L55456L50036K57245Q8978j02216k40237k57829j27112
$$ plain form
-2787 -5207762 -4713568 -4418435 -4324144 -4423457 -4705746 -5156398 -5746728 -6424628 -7119763 -7763532 -8312876
-2776 -8312876 -8765714 -9155887 -9524430 -9885679 -10214701 -10462809 -10584699 -10557783 -10383680 -10073861 -9632576
-2765 -9632576 -9051063 -8314119 -7411265 -6348102 -5156301 -3896046 -2648366 -1502444 -541579 173476
-2755 173476 619895 816818 814352 674626 454461 197140 -63926 -298806 -485647 -625888 -754070 -927720
-2743 -927720 -1196980 -1570355 -2000678 -2402274 -2687603 -2802557 -2744111 -2554090 -2297912 -2044941 -1855090
-2732 -1855090 -1765543 -1779102 -1864401 -1969663 -2041644 -2043672 -1970795 -1855836 -1760819 -1754714 -1884867 -2155180 -2523013
-2719 -2523013 -2916793 -3263920 -3512933 -3641738 -3656736 -3589913 -3492101 -3417122 -3400217 -3442752 -3513738 -3566767
-2707 -3566767 -3559420 -3462856 -3264036 -2969700 -2614244 -2264208 -2006963 -1917985 -2020201 -2260438 -2518267 -2645379
-2695b645379J25272M26866O89359Q44728Q72796Q06241P04873O17519N63063N36745N21562
-2684D063645M92560M18653K70894L8294k61216n86184q88166j125179j267174j298097j217299
-2673a359269j038489p88457n07290k42900l5209R9701J67906J79646J37952M8017o6694j63608
-2661c568694j97668j41717J263J99738M04902N63198O27473N69801L94459J41590j22468
-2650a128123l26432m20210l91286k62190p6944J14784K72428L73626M14442M04369L61312
-2639f64224L08314K67492K46163K24376J61480K2346j97212m63962p21647r17157j022128
-2628b756159j035396r69293q37307o52961m35597k12921j4084J42461K54802L34189L96424
-2617e785842M52454N03734N46088N77930O04981O36150O72618P00416O95103O35894N18767
$$ plain form
-2695 -2645379 -2520107 -2093241 -1403882 -559154 313642 1119883 1824756 2442275 3005338 3542083 4063645
-2684 4063645 4556205 4974858 5245752 5284046 5022830 4436646 3548480 2423301 1156127 -141970 -1359269
-2673 -1359269 -2397758 -3186215 -3693505 -3936405 -3971614 -3871913 -3704007 -3524361 -3386409 -3338392 -3405086 -3568694
-2661 -3568694 -3766362 -3908079 -3906816 -3707078 -3302176 -2738978 -2111505 -1541704 -1147245 -1005655 -1128123
-2650 -1128123 -1454555 -1874765 -2266051 -2528241 -2605185 -2490401 -2217973 -1844347 -1429905 -1025536 -664224
-2639 -664224 -355910 -88418 157745 382121 543601 565947 368735 -95227 -816874 -1734031 -2756159
-2628 -2756159 -3791555 -4760848 -5598155 -6251116 -6686713 -6899634 -6913718 -6771257 -6516455 -6182266 -5785842
-2617 -5785842 -5333388 -4829654 -4283566 -3705636 -3100655 -2464505 -1791887 -1091471 -396368 239526 758293
-2606G58293L60585J92454M5186o8455j62897k65465l84956m95280n52954n31315m40157l18977
-2594a863938k14265j55778j41562j38336j02534j3930J04578K02438K41090K20860J71499
-2583a689878J20110O9207J307r7673k16963l21201l74306l66754l20602k70635k42414k44810
-2571c954612k72849l09113l24573k89165j91737n3062Q2894J75303K10012K05032J98903
-2560d522967K31012L22086M62934O18845P49786Q30675Q53773Q16493P16914N63005L77865
-2549B020421J89925J8848j28473k51136l47626m17551m64043m87891m80131m27177l26139
-2538a100973j93269n8804M5791J01991J15030J12336J27339J80893K71977L76850M54749
-2527D33910M64240L84633K25099J5513k08672m14090n70575o53973o54548n83377m65588
$$ plain form
-2606 758293 1118878 1311332 1356518 1288063 1125166 859701 474745 -20535 -573489 -1104804 -1544961 -1863938
-2594 -1863938 -2078203 -2233981 -2375543 -2513879 -2616413 -2630343 -2525765 -2323327 -2082237 -1861377 -1689878
-2583 -1689878 -1569768 -1500561 -1499254 -1596927 -1813890 -2135091 -2509397 -2876151 -3196753 -3467388 -3709802 -3954612
-2571 -3954612 -4227461 -4536574 -4861147 -5150312 -5342049 -5395111 -5312217 -5136914 -4926902 -4721870 -4522967
-2560 -4522967 -4291955 -3969869 -3506935 -2888090 -2138304 -1307629 -453856 362637 1079551 1642556 2020421
-2549 2020421 2210346 2229194 2100721 1849585 1501959 1084408 620365 132474 -347657 -774834 -1100973
-2538 -1100973 -1294242 -1353046 -1307255 -1205264 -1090234 -977898 -850559 -669666 -397689 -20839 433910
-2527 433910 898150 1282783 1507882 1523395 1314723 900633 330058 -323915 -978463 -1561840 -2027428
-2516b027428l23908j67986J298J78082L41635M60236N08014M80569L92014K57792Q7128j06949
-2504H0497k97115m45610n19607n06143m16790k80978j33917o179Q1690J18557J01577M0271
-2492b183747l7930r2280q8046j9022Q6324J84274K46967K75994K84897K72950K23023J24047
-2480g22549j0751j47288k47598k85772k57313j82515r7171k9949J5959N9956J24713K17298
-2468a562980L25017M25821M99888N32191N13233M46232L53380K67515K12759J92827J96466
-2457B402349K10079K23456K27094K12389J79817J44304J25548J30347J46126J52289J34987
-2446D288785R1250K4668n9048j52997k48416l36454m09766m58414m67129m25852l45770k58083
-2434A242774j92866j62388j65247j96018k43728k88999l16049l28542l44984l75242m06036
$$ plain form
-2516 -2027428 -2351336 -2519322 -2518024 -2339942 -1998307 -1538071 -1030057 -549488 -157474 100318 187446 80497
-2504 80497 -216618 -662228 -1181835 -1687978 -2104768 -2385746 -2519663 -2525842 -2444152 -2325595 -2224018 -2183747
-2492 -2183747 -2221677 -2313957 -2402003 -2421025 -2334701 -2150427 -1903460 -1627466 -1342569 -1069619 -846596 -722549
-2480 -722549 -733300 -880588 -1128186 -1413958 -1671271 -1853786 -1950957 -1980906 -1964947 -1904991 -1780278 -1562980
-2468 -1562980 -1237963 -812142 -312254 219937 733170 1179402 1532782 1800297 2013056 2205883 2402349
-2457 2402349 2612428 2835884 3062978 3275367 3455184 3599488 3725036 3855383 4001509 4153798 4288785
-2446 4288785 4380035 4404703 4345655 4192658 3944242 3607788 3198022 2739608 2272479 1846627 1500857 1242774
-2434 1242774 1049908 887520 722273 526255 282527 -6472 -322521 -651063 -996047 -1371289 -1777325
-2423a777325m12757l80504l08401k00396o2926Q8848K32555L51332M44747N25971O10146
-2412h88710P04588Q02550Q81125R08366Q59436P31594N44897L28480J06873j03373k88351
-2401D587475m32060n17724n33881m80836l73479k39069j12249k9554k0240r3496k30548l93153
-2389A131186n43550o59551p37915p87635q18739q33222q24107p83522p11082o15277n07852
-2378f691266m01185l13201k71153l00647m04123n47032o64107o85637n71468l33244k8855
-2367a1211918K65942M90555O20490O68738O68978O53391O43240O54613P02516P90629Q96388
-2356d156438R70834R60285Q34976O06420L26380O5552j21245k20540k55957k63238k72511
-2345a525482l04307l60221m09918m01772l01217j21685Q1506K45618L33319L44016L05403
$$ plain form
-2423 -1777325 -2190082 -2570586 -2878987 -3079383 -3142309 -3053461 -2820906 -2469574 -2024827 -1498856 -888710
-2412 -888710 -184122 618428 1499553 2407919 3267355 3998949 4543846 4872326 4979199 4875826 4587475
-2401 4587475 4155415 3637691 3103810 2622974 2249495 2010426 1898177 1868623 1848383 1754887 1524339 1131186
-2389 1131186 587636 -71915 -809830 -1597465 -2416204 -3249426 -4073533 -4857055 -5568137 -6183414 -6691266
-2378 -6691266 -7092451 -7405652 -7676805 -7977452 -8381575 -8928607 -9592714 -10278351 -10849819 -11183063 -11211918
-2367 -11211918 -10945976 -10455421 -9834931 -9166193 -8497215 -7843824 -7200584 -6545971 -5843455 -5052826 -4156438
-2356 -4156438 -3185604 -2225319 -1390343 -783923 -457543 -391991 -513236 -733776 -989733 -1252971 -1525482
-2345 -1525482 -1829789 -2190010 -2599928 -3001700 -3302917 -3424602 -3343096 -3097478 -2764159 -2420143 -2114740
-2334b114740K54032K16042J99734K01827K15650K33714K44538K28947J65379M6548j07452
-2323b15781k55889l60120m00033l73321k90104j75303p1093k4233o0585j66995k96628l94366
-2311c084451m25221l88111l10579k30452j73576j38531r6795j0881J37787L29099N09175
-2300c882536O17515O17299N09181L23284J01147j17847l03387m40280n30595n84781o07094
-2289d298094n89109n17836l89723k17197k5338J55351K95593L74922L89318L53495K95073
-2278d173545K45540K30716K58984L13750L61723L74004L42017K77399K01123J32920Q8215
-2267a347154P9132J09882J67819K24963K53182K36237J69789O0633o7576j73504k13922j69234
-2255f69753n8640P1956J79810K46618K78078K87776K78442K33518J30351l4078k29452m05493
$$ plain form
-2334 -2114740 -1860708 -1644666 -1444932 -1243105 -1027455 -793741 -549203 -320256 -154877 -108329 -215781
-2323 -215781 -471670 -831790 -1231823 -1605144 -1895248 -2070551 -2141644 -2165877 -2226462 -2393457 -2690085 -3084451
-2311 -3084451 -3509672 -3897783 -4208362 -4438814 -4612390 -4750921 -4847716 -4858597 -4720810 -4391711 -3882536
-2300 -3882536 -3265021 -2647722 -2138541 -1815257 -1714110 -1831957 -2135344 -2575624 -3106219 -3691000 -4298094
-2289 -4298094 -4887203 -5405039 -5794762 -6011959 -6037297 -5881946 -5586353 -5211431 -4822113 -4468618 -4173545
-2278 -4173545 -3928005 -3697289 -3438305 -3124555 -2762832 -2388828 -2046811 -1769412 -1568289 -1435369 -1347154
-2267 -1347154 -1268022 -1158140 -990321 -765358 -512176 -275939 -106150 -45517 -113093 -286597 -500519 -669753
-2255 -669753 -728393 -656437 -476627 -230009 48069 335845 614287 847805 978156 944078 714626 309133
-2243C09133n15932n32568m51726k97196j11287O7636K25039L72144N31162P14666R10166
-2232A221237J081755J190538J216433J165964J064587R40664Q11635O80981N44774L98244
-2222A0316812K38215O3456j22638l07315m66089n68889n96640n56551m77235l84755k85172
-2211F853199j71462m3144Q5923J97664K81338L33255L51050L34270K89839K30043J60387
-2200H902362P1115n7765k42616m81644p46075r86104j155563j239136j255244j228327j157792
-2189D23211j017674p90169m99640k13029p202O9002J4618j29014l03786m63207n85760o69652
-2177d172302p18388p30212p01550o39658n68018n16118n04051n35085n94791o51614o64068
-2166a0995855n98897m49593k41236j9541J67457K85534L23913K96859K37253J84874J74978
$$ plain form
-2243 309133 -206799 -739367 -1191093 -1488289 -1599576 -1531940 -1306901 -934757 -403595 311071 1221237
-2232 1221237 2302992 3493530 4709963 5875927 6940514 7881178 8692813 9373794 9918568 10316812
-2222 10316812 10555027 10618483 10495845 10188530 9722441 9153552 8556912 8000361 7523126 7138371 6853199
-2211 6853199 6681737 6638593 6724516 6922180 7203518 7536773 7887823 8222093 8511932 8741975 8902362
-2200 8902362 8973477 8915712 8673096 8191452 7445377 6459273 5303710 4064574 2809330 1581003 423211
-2189 423211 -594463 -1384632 -1884272 -2097301 -2104503 -2035501 -2020883 -2149897 -2453683 -2916890 -3502650 -4172302
-2177 -4172302 -4890690 -5620902 -6322452 -6962110 -7530128 -8046246 -8550297 -9085382 -9680173 -10331787 -10995855
-2166 -10995855 -11594752 -12044345 -12285581 -12305122 -12137665 -11852131 -11528218 -11231359 -10994106 -10809232 -10634254
-2155a0634254K29030L46357N03118O65646Q11983R40642J054852J141593J172598J126424
-2145b642011J005505Q30913O27942M23095K52725J63229J89267L23041N04352O47174O83567
-2134C008799N91895L95499J41251j23255l61321n46336o58079o83491o20873m84452l05169
-2123C54468j21272L8814J65671K61529L30808L83962M41274N18151O05842O72712O85818
-2112D337777O32609N26404L96343K74428J85763J39741J26779J27400J26133J16916J00318
-2101G090611Q0152N9489L5125m792p4443j78283l02373m16396m87049m95389m47172l69800
-2089D489680l01291k81571l44229n02258p36795j000833j232529j369291j366905j220652
-2079c866674r68615o69833l77628j28001N9023J75818K24729K14965J59402P5228j3318p6141
$$ plain form
-2155 -10634254 -10405224 -10058867 -9555749 -8890103 -8078120 -7137478 -6082626 -4941033 -3768435 -2642011
-2145 -2642011 -1636506 -805593 -177651 245444 498169 661398 850665 1173706 1678058 2325232 3008799
-2134 3008799 3600694 3996193 4137444 4014189 3652868 3106532 2448453 1764962 1144089 659637 354468
-2123 354468 233196 272010 437681 699210 1030018 1413980 1855254 2373405 2979247 3651959 4337777
-2112 4337777 4970386 5496790 5893133 6167561 6353324 6493065 6619844 6747244 6873377 6990293 7090611
-2101 7090611 7170763 7230252 7265377 7260585 7186142 7007859 6705486 6289090 5802041 5306652 4859480 4489680
-2089 4489680 4188389 3906818 3562589 3060331 2323536 1322703 90174 -1279117 -2646022 -3866674
-2079 -3866674 -4835289 -5505122 -5882750 -6010751 -5951728 -5775910 -5551181 -5336216 -5176814 -5101586 -5114904 -5191045
-2067e191045q3909j8755J14522K85355M48263N64369O17732O11862N53769M47789L04344
-2056a345704J47934J2287p4733j05356r4691o8674m4492j8289L1077J26247K72735M46258
-2044g15401N98409O83500O85219O16956M97320L31622J22768j05081l03718m26952m61172
-2033A523470m32418l85313l54544l51133l66496l82295l77285l30235k21553l9844K07644
-2022a510002M92985P78616J029075J213881J308759J303472J209921J059324Q90028P36549
-2012H512608O24340N68472N73279O29854P13599P88565Q19676P84868O82669N33396L69645
-2001A5600971K15441O7368j05125l35213o24423r26216j164648j275978j242111j092351
-1991I117715q78297o46284m25310k29490o4780O7200J69078K45299K95252L09475K72357
$$ plain form
-2067 -5191045 -5274954 -5293709 -5179187 -4893832 -4445569 -3881200 -3263468 -2651606 -2097837 -1650048 -1345704
-2056 -1345704 -1197770 -1185483 -1260216 -1365572 -1460263 -1528937 -1573429 -1591718 -1560641 -1434394 -1161659 -715401
-2044 -715401 -116992 566508 1251727 1868683 2366003 2697625 2820393 2715312 2411594 1984642 1523470
-2033 1523470 1091052 705739 351195 62 -366434 -748729 -1126014 -1456249 -1677802 -1717646 -1510002
-2022 -1510002 -1017017 -238401 790674 2004555 3313314 4616786 5826707 6886031 7776059 8512608
-2012 8512608 9136948 9705420 10278699 10908553 11622152 12410717 13230393 14015261 14697930 15231326 15600971
-2001 15600971 15816412 15883780 15778655 15443442 14819019 13892803 12728155 11452177 10210066 9117715
-1991 9117715 8239418 7593134 7167824 6938334 6873554 6940754 7109832 7355131 7650383 7959858 8232215
-1980H232215J67161j6967k74811n76387q70450j106594j262162j346883j380277j366952
-1970A97893j293449j143724r15822o28632l16654j4790K56549M93512O97866Q66020R88042
-1959h13189J055678J069088J036055R65907Q64602P35929N86589M26664K64328J03170n0724
-1948F244097j79797k58906k73990k37617j85178j56933j81655k67149l95699n28052o17678
-1937B961443o29674n56308m21597k69609j42885o5914m1167n3221p4648p4041l0227N1533
-1925F53685J37695J85703J67732Q0235n9448k20408l69926m87788n68174o05108n80744m74678
-1913b141224k87605n5551J65598L34026M41254N01134N28772N35536N37109N52775N92276
-1902A704100O47469O97920P21710P03267O38200N36694M21371L13568K15122J06708l0073
$$ plain form
-1980 8232215 8399376 8382409 8107598 7531211 6660761 5554167 4292005 2945122 1564845 197893
-1970 197893 -1095556 -2239280 -3155102 -3783734 -4100388 -4115178 -3858629 -3365117 -2667251 -1801231 -813189
-1959 -813189 242489 1311577 2347632 3313539 4178141 4914070 5500659 5927323 6191651 6294821 6244097
-1948 6244097 6064300 5805394 5531404 5293787 5108609 4951676 4770021 4502872 4107173 3579121 2961443
-1937 2961443 2331769 1775461 1353864 1084255 941370 875456 834289 781068 706420 632379 602152 653685
-1925 653685 791380 977083 1144815 1225050 1165602 945194 575268 87480 -480694 -1085802 -1666546 -2141224
-1913 -2141224 -2428829 -2484380 -2318782 -1984756 -1543502 -1042368 -513596 21940 559049 1111824 1704100
-1902 1704100 2351569 3049489 3771199 4474466 5112666 5649360 6070731 6384299 6599421 6706129 6676056
-1891F676056j87753l31851m26814m68186m94185n64067p16447r38069j167913j331874j380059
-1880a331162j301378j116863q63301n75709k80686m872K19245L65351M26535M10396L26431
-1869c726013J85499Q264j70929l08295l63364l17412j86639j6166J42556K54312L09128L16049
-1857c873010K89310K40511J84602J48898J64164K39603L51899M63057N45765N94825O23531
-1846b6845O49196O73201O72940O17923M96188L26463J47220o166j19570k04457k86033l81382
-1834B558678m84167n69297o09028n85111m93943l48085j72803M688J68745L20874M70094
-1823B60645O14886P34103P97298P84376O99379N69415M29327L04598K06959J41988J14201
-1812E657175J24277J65910K28956L03278L77169M32394M44505L92353K71133R7814r7621
$$ plain form
-1891 6676056 6488303 6156452 5729638 5261452 4767267 4203200 3486753 2548684 1380771 48897 -1331162
-1880 -1331162 -2632540 -3749403 -4612704 -5188413 -5469099 -5473971 -5254726 -4889375 -4462840 -4052444 -3726013
-1869 -3726013 -3540514 -3532250 -3703179 -4011474 -4374838 -4692250 -4878889 -4895055 -4752499 -4498187 -4189059 -3873010
-1857 -3873010 -3583700 -3343189 -3158587 -3009689 -2845525 -2605922 -2254023 -1790966 -1245201 -650376 -26845
-1846 -26845 622351 1295552 1968492 2586415 3082603 3409066 3556286 3550120 3430550 3226093 2940060 2558678
-1834 2558678 2074511 1505214 896186 311075 -182868 -530953 -703756 -699068 -530323 -209449 260645
-1823 260645 875531 1609634 2406932 3191308 3890687 4460102 4889429 5194027 5400986 5542974 5657175
-1812 5657175 5781452 5947362 6176318 6479596 6856765 7289159 7733664 8126017 8397150 8494964 8397343
-1801H397343k88176m59844o08732p30925q15784q48937q20724p30794n87743m08422k16365
-1790A880897l4865J21833K48893L41727L90665L87496L33891K42037J29366J1220j05090
-1779C948070k19548l32233m39612n39397o33089p19687p88083q19437p99804p28011o09036
-1768b679867m45835k44524k5340J77384L29540M11526M21492L71977K86000J91790J15104
-1757a090753P0309N7801P3690J22678K14407L44207M81953N83260O11222N50123M07901K15738
-1745B642536K4272j14861j76511j73773j42617j15748j07954j17871j37143j58020j76090
-1734A246220j86630j80650j48250q7480r582O7613J33629J89258K35582K68865K92736L24469
-1722B145780L76194M31521M48469L87649K36637J3379k41122m72968o32171o89392o41954
$$ plain form
-1801 8397343 8109167 7649323 7040591 6309666 5493882 4644945 3824221 3093427 2505684 2097262 1880897
-1790 1880897 1846032 1967865 2216758 2558485 2949150 3336646 3670537 3912574 4041940 4053160 3948070
-1779 3948070 3728522 3396289 2956677 2417280 1784191 1064504 276421 -543016 -1342820 -2070831 -2679867
-1768 -2679867 -3125702 -3370226 -3395566 -3218182 -2888642 -2477116 -2055624 -1683647 -1397647 -1205857 -1090753
-1757 -1090753 -1020444 -962643 -888953 -766275 -551868 -207661 274292 857552 1468774 2018897 2426798 2642536
-1745 2642536 2666808 2551947 2375436 2201663 2059046 1943298 1835344 1717473 1580330 1422310 1246220
-1734 1246220 1059590 878940 730690 643210 633628 701241 834870 1024128 1259710 1528575 1821311 2145780
-1722 2145780 2521974 2953495 3401964 3789613 4026250 4039629 3798507 3325539 2693368 2003976 1362022
-1711A362022n09880l25946j23072P3922K47946L86750M84466N45066N79015N91061N72728
-1700C884078N11644M06828K72542J32505J3064o3913q9329p3269m6352n0976j19334k49467
-1688D528021m00367n13973n46905m89563l62684j99125k9807J17973K19848K59759K35331
-1677B818508J57231M4396q1671k02796l08479l95300m60271m92217m72824l94370k77403
-1666f5196j65814j00005r0704j13561j29400j12737o3747m6N4752P9571O7391L3918P469
-1653e98109K907O414j0397o2314j39158k17832k77507l01793k74326j82995l4250J38788
-1641a950572K86750L69457L78566L39754K93380K69748K76588L02676L28144L34175L12384
-1630A541050K72442K39627K38903K79223L52233M38441N12187N51727N51286N17617M56507
$$ plain form
-1711 1362022 852142 526196 403124 477046 724992 1111742 1596208 2141274 2720289 3311350 3884078
-1700 3884078 4395722 4802550 5075092 5207597 5220661 5156748 5067419 4994150 4947798 4896822 4777488 4528021
-1688 4528021 4127654 3613681 3066776 2577213 2214529 2015404 1985597 2103570 2323418 2583177 2818508
-1677 2818508 2975739 3020135 2938464 2735668 2427189 2031889 1571618 1079401 606577 212207 -65196
-1666 -65196 -231010 -331015 -421719 -535280 -664680 -777417 -841164 -841210 -786458 -706887 -639496 -605578 -598109
-1653 -598109 -595202 -588788 -599185 -661499 -800657 -1018489 -1295996 -1597789 -1872115 -2055110 -2089360 -1950572
-1641 -1950572 -1663822 -1294365 -915799 -576045 -282665 -12917 263671 566347 894491 1228666 1541050
-1630 1541050 1813492 2053119 2292022 2571245 2923478 3361919 3874106 4425833 4977119 5494736 5951243
-1619E951243L69380K63822J63783J04994J12440J75988K50277K82625K41144J23593m6300
-1608G992989k25919l69775m53179m83401m84615m72871m49264m13276l71445l29124k78777
-1597C661343k02210q8873M7384J71319K45859K50833J89777Q5721k9067j27708k00494k53256
-1585C750628k93841l22046l32618l24048l01100k68752k23918j53557m6986Q4421K01625
-1574A769808K57194K26070J21919j5804j49938k61066l45999m13366m79802n60997o60555
-1563e12536p65662q54388r07567r12117q56786p33533n46650l16824p3450J54224L38842
-1552e986447M57275M98819M69626L86218K67264J34996K0916l7711j0841J13075L22257N81004
-1540b783549Q34600J021996J093548J026603Q31107N43723K16637r3497l37113m83833n29209
$$ plain form
-1619 5951243 6320623 6584445 6748228 6853222 6965662 7141650 7391927 7674552 7915696 8039289 7992989
-1608 7992989 7767070 7397295 6944116 6460715 5976100 5503229 5053965 4640689 4269244 3940120 3661343
-1597 3661343 3459133 3370260 3417644 3588963 3834822 4085655 4275432 4361153 4332086 4204378 4003884 3750628
-1585 3750628 3456787 3134741 2802123 2478075 2176975 1908223 1684305 1530748 1483762 1568183 1769808
-1574 1769808 2027002 2253072 2374991 2359187 2209249 1948183 1602184 1188818 709016 148019 -512536
-1563 -512536 -1278198 -2132586 -3040153 -3952270 -4809056 -5542589 -6089239 -6406063 -6479513 -6325289 -5986447
-1552 -5986447 -5529172 -5030353 -4560727 -4174509 -3907245 -3772249 -3751333 -3789044 -3799885 -3686810 -3364553 -2783549
-1540 -2783549 -1948949 -926953 166595 1193198 2024305 2568028 2784665 2691168 2354055 1870222 1341013
-1529A341013m92202m04064k91328j63111j6303J45253K97086L96877M02988L02032J25853
-1518A644094o1509j99200k57040k37416j60018m9067P1009J78572K58487L02057L05441K72356
-1506B067766K14557J42329N3392o2992k07984l59216m74561n11367m47412k89085n8565K26725
-1494B93587N53363Q87322J161091J297190J248346J019603O61450K47735j44080m44353o01411
-1483F179843n95512m47784k13003M2193K62743M17649M97897N06464M51733L47539K15383
-1472G665145Q5095q407l5915J1157J13470K30970L20434L52588L18257K22312P7416r4849
-1460I257673k62409l86665m30881l73381k21078j0589K07545L88297N02326N39608N12284
-1449I722730M51625L93267L59078L50916L59494L76010L94486M07255M05312L86580L62181
$$ plain form
-1529 1341013 848811 444747 153419 -9692 -25995 119258 416344 813221 1216209 1518241 1644094
-1518 1644094 1582585 1383385 1126345 888929 728911 679844 750853 929425 1187912 1489969 1795410 2067766
-1506 2067766 2282323 2424652 2478044 2415052 2207068 1847852 1373291 861924 414512 125427 66862 293587
-1494 293587 846950 1734272 2895363 4192553 5440899 6460502 7121952 7369687 7225607 6781254 6179843
-1483 6179843 5584331 5136547 4923544 4965737 5228480 5646129 6144026 6650490 7102223 7449762 7665145
-1472 7665145 7750240 7741833 7705918 7717075 7830545 8061515 8381949 8734537 9052794 9275106 9352522 9257673
-1460 9257673 8995264 8608599 8177718 7804337 7583259 7572670 7780215 8168512 8670838 9210446 9722730
-1449 9722730 10174355 10567622 10926700 11277616 11637110 12013120 12407606 12814861 13220173 13606753 13968934
-1438A3968934L49144L55244L71038L78209L66233L39231L06418K69791K25118J74754J35577
-1427A7239691J31643J79326K79171M17621N72672P19952Q43006R41437J025243J099246J155008
-1416B4604016J178932J169023J146563J153752J238294J432890J744075K155289K636512
-1407C8459346L152316L667544M153165M594022M993662N372455N762222O203425O743426
-1398H3101583P427125Q276568R282795J0424026J1691913J3101497J4694285J6542091J8745717
-1389A93287600K1417878K4664107K8571543L3209641L8632619M4865771N1846171N9311867
-1381D95807197O6666902P2888463P6581288P6273507P0918891O0339092M5306794K7261901
-1373I92044035P955965j0790717k7324527m0501679m9962035n6080227n9596932o1191033
$$ plain form
-1438 13968934 14318078 14673322 15044360 15422569 15788802 16128033 16434451 16704242 16929360 17104114 17239691
-1427 17239691 17371334 17550660 17829831 18247452 18820124 19540076 20383082 21324519 22349762 23449008 24604016
-1416 24604016 25782948 26951971 28098534 29252286 30490580 31923470 33667545 35822834 38459346
-1407 38459346 41611662 45279206 49432371 54026393 59020055 64392510 70154732 76358157 83101583
-1398 83101583 90528708 98805276 108088071 118512097 130204010 143305507 157999792 174541883 193287600
-1389 193287600 214705478 239369585 267941128 301150769 339783388 384649159 436495330 495807197
-1381 495807197 562474099 635362562 711943850 788217357 859136248 919475340 964782134 992044035
-1373 992044035 1000000000 989209283 961884756 921383077 871421042 815340815 755743883 694552850
-1365F94552850o1256259n9942019n7331889n3598461m9046215m4056990l9004512l4187412
-1357B96129093k9796700k5922180k2582061j9756414j7407609j5485064j3922414j2636258
-1349A38620393j1534968j0535792r581563q645907p725993o833629n994714n247338m625160
-1340F7895329m133406l742692l409985l103829k810618k529105k266619k035678j847507
-1331D2015890j707722j615669j561772j524781j478169j405663j311107j208979j104934
-1322B9097094r89048q50555o98581n67132m95560m98700n56290o32454p02249p60893q18418
-1311B1527214q92430r99661j138487j273864j349105j322986j196877j008983q10701o47697
-1301A0886423n49348n23799n59542o32358p14895p83938q21093q09828p37102n99195m05597
$$ plain form
-1365 694552850 633296591 573354572 516022683 462424222 413378007 369321017 330316505 296129093
-1357 296129093 266332393 240410213 217828152 198071738 180664129 165179065 151256651 138620393
-1349 138620393 127085425 116549633 106968070 98322163 90596170 83762541 77767827 72520489 67895329
-1340 67895329 63761923 60019231 56609246 53505417 50694799 48165694 45899075 43863397 42015890
-1331 42015890 40308168 38692499 37130727 35605946 34127777 32722114 31411007 30202028 29097094
-1322 29097094 28108046 27257491 26558910 25991778 25496218 24997518 24441228 23808774 23106525 22345632 21527214
-1311 21527214 20634784 19635123 18496636 17222772 15873667 14550681 13353804 12344821 11534120 10886423
-1301 10886423 10337075 9813276 9253734 8621376 7906481 7122543 6301450 5491622 4754520 4155325 3749728
-1290C749728j80962L4454J90104K40826J68476l239k14399l94118m88091m73170l57923j74967
-1278B096719L0642K15667L51084M25303M38666L97083L09105J83696K8454j46888l21368
-1267D008163m60205n27825n08126m11833k65755j01259M7926J49189J81939J46963O7063
-1256B326240k0852q0964r7405q2897o5420o4545q1840j08537j33544j41997j15907m5994
-1244A286338N6917J65199K48166K86174K79513K45625K05231J69341J38505J10319Q5948
-1233C277276P2304Q1996J26681K03592K93822L78739M50096M99122N05849M49973L33402
-1222F672852J88913O2803j4530m5136n6292p8661j28174k04428l02000m17202n43377o63452
-1210D471316p51195p83474p56826o91154o12829n33178m44554l34781k04317p2876K9951
$$ plain form
-1290 3749728 3568766 3603220 3793324 4034150 4202626 4199387 3984988 3590870 3102779 2629609 2271686 2096719
-1278 2096719 2127361 2343028 2694112 3119415 3558081 3955164 4264269 4447965 4476419 4329531 4008163
-1267 4008163 3547958 3020133 2512007 2100174 1834419 1733160 1781086 1930275 2112214 2259177 2326240
-1256 2326240 2305388 2224424 2127019 2044122 1978702 1914157 1832317 1723780 1590236 1448239 1332332 1286338
-1244 1286338 1343255 1508454 1756620 2042794 2322307 2567932 2773163 2942504 3081009 3191328 3277276
-1233 3277276 3349580 3431576 3558257 3761849 4055671 4434410 4884506 5383628 5889477 6339450 6672852
-1222 6672852 6861765 6924568 6910038 6864902 6808610 6729949 6601775 6397347 6095347 5678145 5134768 4471316
-1210 4471316 3720121 2936647 2179821 1488667 875838 342660 -101894 -436675 -640992 -713868 -683917
-1199f83917Q6498J08399J32946K00220L27034M92036O40392P08482O56110M85207K34065
-1188C387472m5607l14429n57680p73213r47466j047428j037284r02055o60363l61581o8700
-1177c328334J67599L28585M26265M87078N35056N80210O14519O19397N79502M89410L51886
-1166A851173J82901K2216p3341n9046O8330K63092M51292N68653N92820N48917M86810M47292
-1154E351109M41735M58576M84427N15660N54156O01067O55817P14761P67391P97182P89828
-1143A2131709P40684O54545N41172M12571K83567J73100R8553O1141L9892Q148m5709j17173
-1131A4982200j97853k80473l54729m06291m24521m12403l88314l75605l90230m37552n14126
-1120A0800103o06148o91933p54735p94713q25936q59837q91084q97718q53511p44058n76775
$$ plain form
-1199 -683917 -597419 -489020 -356074 -155854 171180 663216 1303608 2012090 2668200 3153407 3387472
-1188 3387472 3341865 3027436 2469756 1696543 749077 -298351 -1335635 -2237690 -2898053 -3259634 -3328334
-1177 -3328334 -3160735 -2832150 -2405885 -1918807 -1383751 -803541 -189022 430375 1009877 1499287 1851173
-1166 1851173 2034074 2056290 1982949 1923903 1992233 2255325 2706617 3275270 3868090 4417007 4903817 5351109
-1154 5351109 5792844 6251420 6735847 7251507 7805663 8406730 9062547 9777308 10544699 11341881 12131709
-1143 12131709 12872393 13526938 14068110 14480681 14764248 14937348 15035901 15097042 15136934 15145082 15099373 14982200
-1131 14982200 14784347 14503874 14149145 13742854 13318333 12905930 12517616 12142011 11751781 11314229 10800103
-1120 10800103 10193955 9502022 8747287 7952574 7126638 6266801 5375717 4477999 3624488 2880430 2303655
-1109B303655l77802j78927p325J16518J80919J89077J59707J18052Q6688P9212R4026J17498
-1097B881298J40812J70872K20745K93342L76941M54442N15821N62615N99340O16366N82151
-1086G414745M62916K56914M271k41051m44388n96082o96358p44626p39938o84146n83960
-1075C408297m52898l12363j89068j07987q6283j31039k36918l81018n21431o08986o12681
-1064b32375n40804m36576l50051l07877l00887k95803k62979j99053j23368n1470K2477J12356
-1052b966410K17138L18716L97769M44983M61548M56026M41973M35772M50570M83531N06446
-1041A648062M75628L59887J64466o9670k89465m56201n55593n88507n54507m45773k56710
-1030e68383L221L08994O31285R46099J235417J484361J678949J802927J836764J763026J575790
$$ plain form
-1109 2303655 1925853 1746926 1739601 1856119 2037038 2226115 2385822 2503874 2590562 2669774 2763800 2881298
-1097 2881298 3022110 3192982 3413727 3707069 4084010 4538452 5054273 5616888 6216228 6832594 7414745
-1086 7414745 7877661 8134575 8138846 7897795 7453407 6857325 6160967 5416341 4676403 3992257 3408297
-1075 3408297 2955399 2643036 2453968 2345981 2259698 2128659 1891741 1510723 989292 380306 -232375
-1064 -232375 -773179 -1209755 -1559806 -1867683 -2168570 -2464373 -2727352 -2926405 -3049773 -3101243 -3078766 -2966410
-1052 -2966410 -2749272 -2430556 -2032787 -1587804 -1126256 -670230 -228257 207515 658085 1141616 1648062
-1041 1648062 2123690 2483577 2648043 2578373 2288908 1832707 1277114 688607 134100 -311673 -568383
-1030 -568383 -565162 -256168 375117 1321216 2556633 4040994 5719943 7522870 9359634 11122660 12698450
-1019A2698450J288829R35144N56583J92563j26225l82273n73736p09688p98905q39691q21461
-1008A1419590p41913o25020n17878m64498m78171n33547n81785n78159n05617l79867k36177
-997E776958j09880k1451L1693P3091J29900K09924K93855L50014L56627L12408K30027J21497
-985G754663r046j56511l02180m14339m62409m32998l38847k15968j08796n0697m7902p7001
-973E137969j04083j13101j14965j29084j60622j94204k03540j68934r3509m520O3956R1808
-961D007171Q1449N2850L1827L4516N4677O5351L6781m2308j56969k77202l76276m41341m74906
-948B595620m92108n12004n42744n72718n74777n18763l86986j85377N9455L12834N40600
-937b76968P10339P94749P81200O80078N22659L49573J98507R6567N6948P7641J43649K32760
$$ plain form
-1019 12698450 13987279 14922423 15479006 15671569 15545344 15163071 14589335 13879647 13080742 12241051 11419590
-1008 11419590 10677677 10052657 9534779 9070281 8592110 8058563 7476778 6898619 6393002 6013135 5776958
-997 5776958 5667078 5645627 5677320 5750411 5880311 6090235 6384090 6734104 7090731 7403139 7633166 7754663
-985 7754663 7745617 7589106 7286926 6872587 6410178 5977180 5638333 5422365 5313569 5262872 5214970 5137969
-973 5137969 5033886 4920785 4805820 4676736 4516114 4321910 4118370 3949436 3855927 3851407 3915363 4007171
-961 4007171 4088620 4141470 4173297 4207813 4262490 4327841 4364622 4322314 4165345 3888143 3511867 3070526 2595620
-948 2595620 2103512 1591508 1048764 476046 -98731 -617494 -1004480 -1189857 -1130402 -817568 -276968
-937 -276968 433371 1228120 2009320 2689398 3212057 3561630 3760137 3856704 3913652 3991293 4134942 4367702
-925D367702L21797L91797M30574M28053L67827K29821P841k77670n86935q77341j112359
-914C691107j262607j310665j261175j142577r93673q45768p14752o04221n07823m07198k77346
-903e636698j05338R3030K78702M15731M94848N33425N57008N80265N98334N90915N35850
-892a063928M25426K79255J44139P2595R2257J88659L13634M13514M55590M34035L60211K53591
-880B368978J37297L2277m8371r9292j18352j04406n9343J1348J01374K02502K98387L66834
-868C089233L93808L80969L37943K73284J93465J04373J3119o7083j13467j02159k7687Q3809
-856D559607J84926K36155K28500J82450J29278R1500P3842O2966L3606l6328j47803k74415
-844E324284l76968m26636m17673l65120k94725k30493j83959j50983j18528p6583k7942J0258
$$ plain form
-925 4367702 4689499 5081296 5511870 5939923 6307750 6537571 6545412 6267742 5680807 4803466 3691107
-914 3691107 2428500 1117835 -143340 -1285917 -2279590 -3125358 -3840110 -4444331 -4952154 -5359352 -5636698
-903 -5636698 -5742036 -5649006 -5370304 -4954573 -4459725 -3926300 -3369292 -2789027 -2190693 -1599778 -1063928
-892 -1063928 -638502 -359247 -215108 -142513 -50256 138403 452037 865551 1321141 1755176 2115387 2368978
-880 2368978 2506275 2538552 2490181 2390889 2272537 2168131 2108788 2120136 2221510 2424012 2722399 3089233
-868 3089233 3483041 3864010 4201953 4475237 4668702 4773075 4786194 4719111 4605644 4503485 4475798 4559607
-856 4559607 4744533 4980688 5209188 5391638 5520916 5612416 5686258 5749224 5782830 5746502 5598699 5324284
-844 5324284 4947316 4520680 4103007 3737887 3443162 3212669 3028710 2877727 2759199 2682616 2654674 2664932
-832B664932J4895k8881j17667k31143l41527m21999m52979m29758l68459l02839k68678k82346
-820e66449l31330l84926m11400l85578k89295j17303J09898L40280N07760N68756N29166
-809d30421M35895L41717K75176K34603K02402J64751J21936Q3842N9137M8409M5506M3283
-797A626236L7154K2653r726p5282j86075l36537m97803o29647p00944p00288o30275m98800
-785b579334l21647j33638J0716O0672L604j20534k39130k85158k29448r2351P1396K07315
-773c647537K88148L12665K89617K30329J48999N9640k7591j03816j56260j71338j47878j06104
-761c031126p6431p5837r8608j31631j71267k20673k75975l21895l40319l19118k54784j52681
-749e470345k7005J01456K10752K87681L38828L88247M55960N39840O21869O84702P15417
$$ plain form
-832 2664932 2679827 2650946 2533279 2302136 1960609 1538610 1085631 655873 287414 -15425 -284103 -566449
-820 -566449 -897779 -1282705 -1694105 -2079683 -2368978 -2486281 -2376383 -2036103 -1528343 -959587 -430421
-809 -430421 5474 347191 622367 856970 1059372 1224123 1346059 1429901 1489038 1537447 1582953 1626236
-797 1626236 1663390 1686043 1676317 1601035 1414960 1078423 580620 -49027 -749971 -1450259 -2080534 -2579334
-785 -2579334 -2900981 -3034619 -3023903 -2963231 -2959627 -3080161 -3319291 -3604449 -3833897 -3926248 -3854852 -3647537
-773 -3647537 -3359389 -3046724 -2757107 -2526778 -2377779 -2318139 -2345730 -2449546 -2605806 -2777144 -2925022 -3031126
-761 -3031126 -3107557 -3183394 -3282002 -3413633 -3584900 -3805573 -4081548 -4403443 -4743762 -5062880 -5317664 -5470345
-749 -5470345 -5497350 -5395894 -5185142 -4897461 -4558633 -4170386 -3714426 -3174586 -2552717 -1868015 -1152598
-738a152598P02073O39622N41469M40039L71504L57931M02404M97421O30697P80539R10746
-727E121847R75918R33811P60283M65385J00744k54592n23159o52446o21588m36545j25782
-716E743876K61051O56499R87911J198063J262071J188290J004010P38292M17888P6087k44167
-705A3289871n02571o75995p64763p94634q09771q47840r10350r58580r44186q46085o81556
-694D553540m89837l10035j69719q3262n1890o3187r4160j17030j05384m1715P3429K17897
-682C318647L56639M55988M90526M43136L09494J06407j29075l54038n34606o48722o82726
-671C131670o35206n22658l71413k02453k8934J35460K73396L69552M16112M12086L60103
-660C337715K68535J56990N4206j2544k6732J4208R7757J97332K79679L18015L02518K43151
$$ plain form
-738 -1152598 -450525 189097 730566 1170605 1542109 1900040 2302444 2799865 3430562 4211101 5121847
-727 5121847 6097765 7031576 7791859 8257244 8357988 8103396 7580237 6927791 6306203 5869658 5743876
-716 5743876 6004927 6661426 7649337 8847400 10109471 11297761 12301771 13040063 13457951 13534038 13289871
-705 13289871 12787300 12111305 11346542 10551908 9742137 8894297 7983947 7025367 6081181 5235096 4553540
-694 4553540 4063703 3753668 3583949 3500687 3448797 3385610 3291450 3174420 3069036 3027321 3100750 3318647
-682 3318647 3675286 4131274 4621800 5064936 5374430 5480837 5351762 4997724 4463118 3814396 3131670
-671 3131670 2496464 1973806 1602393 1399940 1371006 1506466 1779862 2149414 2565526 2977612 3337715
-660 3337715 3606250 3763240 3817446 3804902 3778170 3792378 3890135 4087467 4367146 4685161 4987679 5230830
-648E230830J66563J06244Q7653J15458J67176J98160J64126N1214j12849k80234m19881n34531
-636D939929o42005p42558q06803p94400o83898m90520k62536n9832P4615J35239J49334J47040
-624I63605J33689R2601J3588q3480j53482j53002o3966J01499L12373N35574P49768R47053
-612C395820J121518J258611J339490J353267J300170J184119J008434P84316N41142L21640
-602A3608527J61767P2374L8794L3194K3991j9389j16777k66159m45382o26420p85842r04415
-590A0774263r62905r41284q25697o22816l68142j13738R9118K59578L81898M82530N60927
-579H723732N99027N78459N00661L90025K75554J69876O3231o7484k41938m60160o99796r29188
-567H901999j116732j226001j215881j060538p73661m13314o2229K06810L61160M15052M09936
$$ plain form
-648 5230830 5397393 5503637 5591290 5706748 5873924 6072084 6236210 6287424 6174575 5894341 5474460 4939929
-636 4939929 4297924 3555366 2748563 1954163 1270265 779745 517209 457377 531992 667231 816565 963605
-624 963605 1097294 1189895 1203483 1120003 966521 813519 749553 851052 1163425 1698999 2448767 3395820
-612 3395820 4517338 5775949 7115439 8468706 9768876 10952995 11961429 12745745 13286887 13608527
-602 13608527 13770294 13842668 13881462 13914656 13938647 13919258 13802481 13536322 13090940 12464520 11678678 10774263
-590 10774263 9811358 8870074 8044377 7421561 7053419 6939681 7038799 7298377 7680275 8162805 8723732
-579 8723732 9322759 9901218 10401879 10791904 11067458 11237334 11300565 11233081 10991143 10530983 9831187 8901999
-567 8901999 7785267 6559266 5343385 4282847 3509186 3095872 3033643 3240453 3601613 4016665 4426601
-556D426601L84780L55459L12295K34801J13603l5879j79362k84207l36985l46054l34237
-545D310815l28630l47149l85752m17410m06507l29548j88126p560J74206L20407M07403M28789
-533C230938L91778L12299K10738J06794J4112o2965j26832j78853k16374k36550k38918k24544
-521B981623j95500j56004j14142q0952o4436o2024n9033l7683J1080Q5957J82757K98117
-509B789760M25193N49273O50239P09011P09895O40076M96222K96203P9799j07069k30402
-498G008200k74851k42506j49981k2246J15360K41538L42497M17728M80708N50199O36974
-487I103620P34240Q19714Q69956Q74694Q40060P82880P24627O84596O68347O56956O09279
-476A7368969M79818K39879j08920n29495r53613j300535j506533j549305j450170j253243
$$ plain form
-556 4426601 4811381 5166840 5479135 5713936 5827539 5791660 5612298 5328091 4991106 4645052 4310815
-545 4310815 3982185 3635036 3249284 2831874 2425367 2095819 1907693 1900133 2074339 2394746 2802149 3230938
-533 3230938 3622716 3935015 4145753 4252547 4266659 4203694 4076862 3898009 3681635 3445085 3206167 2981623
-521 2981623 2786123 2630119 2515977 2435025 2370589 2308565 2249532 2211849 2222929 2308886 2491643 2789760
-509 2789760 3214953 3764226 4414465 5123476 5833371 6473447 6969669 7265872 7345671 7238602 7008200
-498 7008200 6733349 6490843 6340862 6318616 6433976 6675514 7018011 7435739 7916447 8466646 9103620
-487 9103620 9837860 10657574 11527530 12402224 13242284 14025164 14749791 15434387 16102734 16759690 17368969
-476 17368969 17848787 18088666 17979746 17450251 16496638 15196103 13689570 12140265 10690095 9436852
-466I436852j002991p37273m93558l11952k23944k32880l05979l88886m32926m17143l54139
-455D535181k79353k30385k22350k32218k10100j15385N5173K72486N01660P20660R17752
-444E713121J077058J170374J165830J049854Q44504O01928L80535K23988J52046J58380K15128
-433A2752746K89355L64989M49782N57764O86496Q10443Q93253R08287Q55703P66223O89176
-422B0024217O70182P29594Q55753J018910J192175J360927J518956J659626J769241J829650
-412C2629231J834139J803419J782263J814821J921605K099235K336476K626698K969422L367824
-402E5185133L826374M341072M877982N359220N679708N745754N505828M961177M159568L172941
-392A02814757K068944Q97167l03020j487551k599839l577320m365996m929916n251868n333309
$$ plain form
-466 9436852 8433861 7696588 7203030 6891078 6667134 6434254 6128275 5739389 5306463 4889320 4535181
-455 4535181 4255828 4025443 3803093 3570875 3360775 3245390 3300563 3573049 4074709 4795369 5713121
-444 5713121 6790179 7960553 9126383 10176237 11020741 11622669 12003204 12227192 12379238 12537618 12752746
-433 12752746 13042101 13407090 13856872 14414636 15101132 15911575 16804828 17713115 18568818 19335041 20024217
-422 20024217 20694399 21423993 22279746 23298656 24490831 25851758 27370714 29030340 30799581 32629231
-412 32629231 34463370 36266789 38049052 39863873 41785478 43884713 46221189 48847887 51817309 55185133
-402 55185133 59011507 63352579 68230561 73589781 79269489 85015243 90521071 95482248 99641816 102814757
-392 102814757 104883701 105780868 105477848 103990297 101390458 97813138 93447142 88517226 83265358 77932049
-382G7932049n194347m871630m414225l877622l315688k772348k278892j860763j545126j354304
-372D6447104j285962j299629j325907j294542j164597r40747o67727m07492k11768r9945
-362C7748788m9963j0124P3902K33316M65805P41301J019319J267312J463508J581607J575887
-351D6110658J391668J000468M26737k62724r87832j668363k224189k588783k735150k687458
-341C5775032k503332k242900j949516j648991j358622j095439q80055p35680o79599p11425
-331B1969473q10133r46245j099251j260994j421150j554320j625325j606831j493108j301031
-321H851085j060145q00407n45464l13164j18896K3142J02777J21563R8244O1750L5276K7683
-309F483444L6283N2899P0326Q9910J22621J77952K52361L29865L90683M19965M17407M03507
$$ plain form
-382 77932049 72737702 67866072 63451847 59574225 56258537 53486189 51207297 49346534 47801408 46447104
-372 46447104 45161142 43861513 42535606 41241064 40076467 39135720 38467993 38060501 37848733 37748788
-362 37748788 37698825 37688701 37762603 37995919 38461724 39203025 40222344 41489656 42953164 44534771 46110658
-351 46110658 47502326 48502794 48929531 48666807 47678975 46010612 43786423 41197640 38462490 35775032
-341 35775032 33271700 31028800 29079284 27430293 26071671 24976232 24096177 23360497 22680898 21969473
-331 21969473 21159340 20213095 19113844 17852850 16431700 14877380 13252055 11645224 10152116 8851085
-321 8851085 7790940 6990533 6445069 6131905 6013009 6036151 6138928 6260491 6358735 6420485 6455761 6483444
-309 6483444 6519727 6572626 6642952 6732862 6855483 7033435 7285796 7615661 8006344 8426309 8843716 9247223
-297I247223M09719M57695N47120O58544P64872Q46284R02255R49646J006099J071613J124004
-286A7985074J132251J078739R77640Q76656Q35870Q95762J057678J287416J535460J757542
-276B9420088J924401K021917K049142K016611J945251J864179J801715J772632J772861J786474
-266D8375271J798866J804664J800350J768544J677539J504287J255088R58827O44693L30668
-256F1918797K8357k51023m98868p13455q99902j064362j203910j300320j326534j263671
-246E3425109j116104r13572o95843m89402k94385r5993J07892K92236M22474M86807N13194
-235E1642413N57498O73357Q89170J205535J602928K048103K503834K946547L380357L833696
-225G1283438M341577M928598N603913O368181P223101Q174291R224293J0362853J1568092
$$ plain form
-297 9247223 9656942 10114637 10661757 11320301 12085173 12931457 13833712 14783358 15789457 16861070 17985074
-286 17985074 19117325 20196064 21173704 22050360 22886230 23781992 24839670 26127086 27662546 29420088
-276 29420088 31344489 33366406 35415548 37432159 39377410 41241589 43043304 44815936 46588797 48375271
-266 48375271 50174137 51978801 53779151 55547695 57225234 58729521 59984609 60943436 61588129 61918797
-256 61918797 61947154 61696131 61197263 60483808 59583906 58519544 57315634 56015314 54688780 53425109
-246 53425109 52309005 51395433 50699590 50210188 49915803 49819810 49927702 50219938 50642412 51129219 51642413
-235 51642413 52199911 52873268 53762438 54967973 56570901 58619004 61122838 64069385 67449742 71283438
-225 71283438 75625015 80553613 86157526 92525707 99748808 107923099 117147392 127510245 139078337
-216A39078337J2821810J4123762J5488014J6918723J8380850J9779504K0948029K1644360
-208B79183389K1571770K0437437J8040222J4352137R556011M024161j753195p264605j2073946
-199C46073381j5894716j8617621k0285892k1034394k1030376k0436902j9402361j8066053
-191A91305066j6563647j5022067j3544645j2196118j0996326r929566q966720q090511p307532
-182H8687934o637084o088314n643315n260933m899910m542855m198662l882131l591600l306367
-172D0636763l005127k684755k361117k053947j774003j523715j303595j114508r57165q33647
-162B3025184p48739p07543p09320p42719p86572q18299q26907q19725q15142q26627q50889
-151A4372702q68276q53337p85509o55301m70715k60426o5681P4418J32805J00192p325j44180
$$ plain form
-216 139078337 151900147 166023909 181511923 198430646 216811496 236591000 257539029 279183389
-208 279183389 300755159 321192596 339232818 353584955 363140966 367165127 365411932 358147327 346073381
-199 346073381 330178665 311561044 291275152 270240758 249210382 228773480 209371119 191305066
-191 191305066 174741419 159719352 146174707 133978589 122982263 113052697 104085977 95995466 88687934
-182 88687934 82050850 75962536 70319221 65058288 60158378 55615523 51416861 47534730 43943130 40636763
-172 40636763 37631636 34946881 32585764 30531817 28757814 27234099 25930504 24815996 23858831 23025184
-162 23025184 22276445 21568902 20859582 20116863 19330291 18511992 17685085 16865360 16050218 15223591 14372702
-151 14372702 13504426 12651089 11865580 11210279 10739564 10479138 10413457 10487875 10620680 10720872 10713547 10569367
-139A0569367k46163k55627j47654N7594L02796N15835O35466O31472N13434L24282J21060
-128A3021862m6545j48795j77528j43879p4929m644M2349O4097P7696J00623J35199J69894
-116A3015400J90669J88046J56898R5565Q959q7750j71619k23108k40849k47273k76597l51763
-104A2056578m67498n92901o91008p39393p36290o94187o33797n80666n58580n79296o36680
-93E146282p08712p66283p85870p60017o97414o11756n12593m08104l13251k49412k32656
-82h99786k62832l24056l93974m53018m87189m85152m38433l48415k29991j03504J7653J34425
-70d274272K61517M16159N98960P84743R36281J029257J066960J072615J065701J044311R88521
-59D990753Q78273P10688N04491K88359Q6799q2863k09045k92211l51288m13575m89532n55220
$$ plain form
-139 10569367 10323204 10067577 9919923 9977517 10280313 10796148 11431614 12063086 12576520 12900802 13021862
-128 13021862 12975317 12826522 12648994 12505115 12430186 12425542 12467891 12531988 12609684 12710307 12845506 13015400
-116 13015400 13206069 13394115 13551013 13646578 13655537 13567787 13396168 13173060 12932211 12684938 12408341 12056578
-104 12056578 11589080 10996179 10305171 9565778 8829488 8135301 7501504 6920838 6362258 5782962 5146282
-93 5146282 4437570 3671287 2885417 2125400 1427986 816230 303637 -104467 -417718 -667130 -899786
-82 -899786 -1162618 -1486674 -1880648 -2333666 -2820855 -3306007 -3744440 -4092855 -4322846 -4426350 -4408697 -4274272
-70 -4274272 -4012755 -3596596 -2997636 -2212893 -1276612 -247355 819605 1892220 2957921 4002232 4990753
-59 4990753 5869026 6579714 7084205 7372564 7459363 7376500 7167455 6875244 6523956 6110381 5620849 5065629
-47E065629n64075m80690l06404p7780J52513L35395M39592M58687M07835L13643K06395J16834
-35F067574P3460R7470J92696L35251M75456N57491N44640M31804K39298k033k62026n14224
-23H236857p34019q97850r87561r95926r27967p98572o34262m76191l72189l57172m37834
-12F17314n92129p80492r62399j110342j211510j257475j234504j125614r24536o50367l48483
-1i580537p3520J32874K52951K91089K67684K10013J39671O6998j472n2252o4464k3052O5695
11h368322J72728K61865L09859L17151L02624K87162K77574K61501K17853J36625L0619p1650
23e864411j42992j69874j53565j03812l3540L9994R3628J06515P4916K0630j7128n460N9379
36f095720J50655K32043K79676K89669K73263K48465K29971K20478K12241J99092J84120J74322
$$ plain form
-47 5065629 4501554 4020864 3714460 3636680 3789193 4124588 4564180 5022867 5430702 5744345 5950740 6067574
-35 6067574 6141034 6238504 6431200 6766451 7241907 7799398 8344038 8775842 9015140 9013107 8751081 8236857
-23 8236857 7502838 6604988 5617427 4621501 3693534 2894962 2260700 1784509 1412320 1055148 617314
-12 617314 25185 -755307 -1717706 -2828048 -4039558 -5297033 -6531537 -7657151 -8581687 -9232054 -9580537
-1 -9580537 -9654057 -9521183 -9268232 -8977143 -8709459 -8499446 -8359775 -8292777 -8294249 -8346501 -8410965 -8434017 -8368322
11 -8368322 -8195594 -7933729 -7623870 -7306719 -7004095 -6716933 -6439359 -6177858 -5960005 -5823380 -5792761 -5864411
23 -5864411 -6007403 -6177277 -6330842 -6434654 -6468194 -6428200 -6334572 -6228057 -6153141 -6132511 -6149639 -6155099 -6095720
36 -6095720 -5945065 -5713022 -5433346 -5143677 -4870414 -4621949 -4391978 -4171500 -3959259 -3760167 -3576047 -3401725
48c401725J72511J77902J90814K13040K45437K86336L32427L84643M54970N62725P17156Q99389
60A235625J060459J140476J098475R32335O75191L76781Q7660j48977l05620l79435l93867
71E379103l87515l95807m37379n09629n90639o48874o61014o25910n62135m94763m45308m27729
83h07599m44526m81128n03532m67355l37787j07675J97589N26265Q13082R98828J050676R70188
95A407026P86562N43397K82134K8331k05118m01778n38162n97550n79973m98670l73333k29210
107c76344j00421k6025l0369j00380j86010k31100k09070j31661k8717P4109J60717K22982
119i62289K64618L03200L61530M53991N76712P05125Q01396Q33123P90131O84030N35204L63358
131E710129J86568K4876r7031j54026j33301m7313O6734J62976K04960J77730R1341k8900
$$ plain form
48 -3401725 -3229214 -3051312 -2860498 -2647458 -2402021 -2115685 -1783258 -1398615 -943645 -380920 336236 1235625
60 1235625 2296084 3436560 4535035 5467370 6142561 6519342 6607002 6458025 6152405 5772970 5379103
71 5379103 4991588 4595781 4158402 3648773 3058134 2409260 1748246 1122336 560201 65438 -379870 -807599
83 -807599 -1252125 -1733253 -2236785 -2704140 -3041927 -3149602 -2952013 -2425748 -1612666 -613838 436838 1407026
95 1407026 2193588 2736985 3019119 3047450 2842332 2440554 1902392 1304842 724869 226199 -147134 -376344
107 -376344 -476765 -502790 -533159 -633539 -819549 -1050649 -1259719 -1391380 -1420097 -1345988 -1185271 -962289
119 -962289 -697671 -394471 -32941 421050 997762 1702887 2504283 3337406 4127537 4811567 5346771 5710129
131 5710129 5896697 5921573 5824542 5670516 5537215 5489902 5556636 5719612 5924572 6102302 6193643 6164743
143F164743j60009k90167m13132n19533n97145o37522o37547n95138n07941l75664k02597
154A228348j926J99911L67432M72839N11633M98664M49254L69514K62406J39452K5081n1420
166D471188p1083l2789N3516J73955L05687M11802M56185M27860L48452K57436J92387J74959
178G169555K03756K57660L10613L46143L57704L41805K98654K36520J65415Q6218q842j22612
190I642589k40869l34980l76341l49978k61480j37837j9420N5056O3378Q230q4879j82435
202G781034k61049l11518l31017l20683k90294k55798k28733k13445k14090k35203k71053
213D848151k98925k89315k27159j25099j3840Q2618J62113K36352L11749L81050M31431M52120
225E951246M30741L52284K14864M7345r9269j85345k06817j87495j51149j03524l7922M7255
$$ plain form
143 6164743 6004734 5714567 5301435 4781902 4184757 3547235 2909688 2314550 1806609 1430945 1228348
154 1228348 1226422 1426333 1793765 2266604 2778237 3276901 3726155 4095669 4358075 4497527 4522608 4471188
166 4471188 4400105 4367316 4420832 4594787 4900474 5312276 5768461 6196321 6544773 6802209 6994596 7169555
178 7169555 7373311 7630971 7941584 8287727 8645431 8987236 9285890 9522410 9687825 9774043 9765201 9642589
190 9642589 9401720 9066740 8690399 8340421 8078941 7941104 7921684 7976740 8040118 8048348 7963469 7781034
202 7781034 7519985 7208467 6877450 6556767 6266473 6010675 5781942 5568497 5354407 5119204 4848151
213 4848151 4549226 4259911 4032752 3907653 3893813 3976431 4138544 4374896 4686645 5067695 5499126 5951246
225 5951246 6381987 6734271 6949135 6996480 6897211 6711866 6505049 6317554 6166405 6062881 6024959 6072214
237F072214J40689K25647K91543L38382L73132M02349M26117M37588M28477L96764L51915
248I884817L12558K96949L14311L64005M38656N24153O00509O48914O60242O36598N85689
259A5267401N13780M25907L32995K52718J99013J72295J58681J34865P8891j5840j35425k54464
271A7130817l48411l99852m00120l49786k58668j43505k1795R6726K15726L45942M88759O25481
283A6981314P23584P55591P16679O30541N40153M85193M77042M90409M79683M10370K80812
294B2971371J17657m5324j81238k69593k93523k45327j37036k019J19229J96712K14880J68372
306B2614161O5520o3672j74923k34138k38171k12279j87060j73932j57978j13336l0729O6706
318B1160169J37998J56192J27126Q2205N6105O6285J05128J47337J66882J53007J15913Q0602
$$ plain form
237 6072214 6212903 6438550 6730093 7068475 7441607 7843956 8270073 8707661 9136138 9532902 9884817
248 9884817 10197375 10494324 10808635 11172640 11611296 12135449 12735958 13384872 14045114 14681712 15267401
259 15267401 15781181 16207088 16540083 16792801 16991814 17164109 17322790 17457655 17536546 17520706 17385281 17130817
271 17130817 16782406 16382554 15982434 15632648 15373980 15230475 15208680 15305406 15521132 15867074 16355833 16981314
283 16981314 17704898 18460489 19177168 19807709 20347862 20833055 21310097 21800506 22280189 22690559 22971371
294 22971371 23089028 23043704 22862466 22592873 22299350 22054023 21916987 21914968 22034197 22230909 22445789 22614161
306 22614161 22679681 22616009 22441086 22206948 21968777 21756498 21569438 21395506 21237528 21124192 21093463 21160169
318 21160169 21298167 21454359 21581485 21663690 21719795 21786080 21891208 22038545 22205427 22358434 22474347 22554949
330B2554949P4848J18985K20091L69829N46738P23588Q75598R83883J036868J036964J010149
341B9552490J001403J047187J144519J245921J287295J227919J070802Q51842O16829M08482
351C9454689K63093K05682K41597L52170N00308O42982P45550P90976P77355P07315N86742
362D5268459M35358K85288J59079N5291l8795j27088k03993k68075l27332l87671m37890m47732
374D3964899l86557k50291o9921J08269K51516L53694M27779M91107N58653O44588P59957
385D6853693R04356J064664J224943J375146J507411J606621J650635J625059J538079J416110
395F0766717J280228J127939R40587P07811M44559J87811k0697j52334k01150j85465j45697
406F4750309j31545j74088k63456l57485m17213m36766m42648m65645n09879n46417n36783
$$ plain form
330 22554949 22629797 22748782 22968873 23338702 23885440 24609028 25484626 26468509 27505377 28542341 29552490
341 29552490 30553893 31601080 32745599 33991520 35278815 36506734 37577536 38429378 39046207 39454689
351 39454689 39717782 39923464 40165061 40517231 41017539 41660521 42406071 43197047 43974402 44681717 45268459
362 45268459 45703817 45989105 46148184 46203475 46164680 46037592 45833599 45565524 45238192 44850521 44412631 43964899
374 43964899 43578342 43328051 43258130 43366399 43617915 43971609 44399388 44890495 45449148 46093736 46853693
385 46853693 47758049 48822713 50047656 51422802 52930213 54536834 56187469 57812528 59350607 60766717
395 60766717 62046945 63174884 64115471 64823282 65267841 65455652 65434955 65282621 65081471 64896006 64750309
406 64750309 64618764 64444676 64181220 63823735 63406522 62969756 62527108 62061463 61551584 61005167 60468384
417F0468384m63090l38914j96226o3293N1382J59600K79170M18403N70767P14519Q11162Q13084
429F3224948O86760M36580J04791k53200n93520q86917j107283j230523j250838j189954j080738
440E6860106r42080p72411n70070l59228j90981j14036j45773k70163m53943o57416q33003
451E1551002r28717r08224p77051n88961m20726l33121l48514m53877o14057p85317r27500
462D4464937j010495j014756r31113p63543n32556k72999k4606J78558L14974L79172L81717
473D1169290L44286K90540K38052J95136J61859J33104J00961N7616L81o5506j33429k04460
485D2287830k87509l88154m96762n93564o68551p31197p95276q58631r04327r21446r21133
496C4721280r29682r65323j020288j063772j060350r88975q53308o79928n07001l69376k85302
$$ plain form
417 60468384 60005294 59666380 59470154 59406861 59458243 59617843 59897013 60315416 60886183 61600702 62411864 63224948
429 63224948 63911708 64348288 64453079 64199879 63606359 62719442 61612159 60381636 59130798 57940844 56860106
440 56860106 55918026 55145615 54575545 54216317 54025336 53911300 53765527 53495364 53041421 52384005 51551002
451 51551002 50622285 49714061 48937010 48348049 47927323 47594202 47245688 46791811 46177754 45392437 44464937
462 44464937 43454442 42439686 41508573 40745030 40212474 39939475 39914869 40093427 40408401 40787573 41169290
473 41169290 41513576 41804116 42042168 42237304 42399163 42532267 42633228 42690844 42691225 42625719 42492290 42287830
485 42287830 42000321 41612167 41115405 40521841 39853290 39122093 38326817 37468186 36563859 35642413 34721280
496 34721280 33791598 32826275 31805987 30742215 29681865 28692890 27839582 27159654 26652653 26283277 25997975
507B5997975k49167k37474k27256k11400j96952j90842j90319j86789j75909j60812j46051
518B3825004j34576j31424j42394j62486j70729j44480p8774J2169J09577K00132K72895L13743
530B3768657L08450K52613J55187K7881j24713k96089m60868n75079n97372n10100l25552
541B1623015q2073J64222L54704M48467M37487L50634K42590J65626J38490J39640J29804
552B4112606Q1024j0523j32583k71491m14299n40879o25435o50936o20177n51828m66519l76591
564A9532369k88274k12236j68650j78094k46272l56738m78689n84178o62210p18936p63828
575A4874264p93390p86248p15244n67461l55499j14652J07615K64956L25553K81044J48499
586A2669437l4286k21749l77064m80279n24830n12801m57639l86412l29289k99338k81845
$$ plain form
507 25997975 25748808 25511334 25284078 25072678 24875726 24684884 24494565 24307776 24131867 23971055 23825004
518 23825004 23690428 23559004 23416610 23254124 23083395 22938915 22860141 22872310 22981887 23182019 23454914 23768657
530 23768657 24077107 24329720 24484907 24512788 24388075 24091986 23631118 23056039 22458667 21948567 21623015
541 21623015 21540942 21705164 22059868 22508335 22945822 23296456 23539046 23704672 23843162 23982802 24112606
552 24112606 24193630 24183107 24050524 23779033 23364734 22823855 22198420 21547484 20927307 20375479 19908960 19532369
564 19532369 19244095 19031859 18863209 18685115 18438843 18082105 17603416 17019238 16357028 15638092 14874264
575 14874264 14080874 13294626 12579382 12011921 11656422 11541770 11649385 11914341 12239894 12520938 12669437
586 12669437 12635151 12413402 12036338 11556059 11031229 10518428 10060789 9674377 9345088 9045750 8763905
597H763905k45261j64053l4524J27156K99426M68160O26480P64595Q63384Q99624Q56653P32395
609A3957940N41945L15565R4028p8740j68061j64844r3765N26Q2215J41725J87182K24931
621A5040647K51096K55864K30592J76172J10717O5957O8659J19056J83292K05508J33094n7447
633A6783207l44660o68672r57485j154786j235486j206789j097010r34834p32368m89941k21317
644G739859K8663J99640K52201J90854N7050r6139k29369l27577l93505m33107m45506m20871
656F122193l45526k11199k4658J87598L86023N37099O34435P03489P81687Q90913J023792
667A0685846J147912J219368J198816J065363Q29212N38630K67814Q3928J9497O9805K05677
678A7331868L84747N60551O95561P73549P99057P87689P58611P32462P25174P33912P27339
$$ plain form
597 8763905 8518644 8354591 8320067 8447223 8746649 9214809 9841289 10605884 11469268 12368892 13225545 13957940
609 13957940 14499885 14815450 14909478 14830738 14662677 14497833 14404068 14404594 14486809 14628534 14815716 15040647
621 15040647 15291743 15547607 15778199 15954371 16065088 16131045 16199704 16318760 16502052 16707560 16840654 16783207
633 16783207 16438547 15769875 14812390 13657604 12422118 11215329 10118319 9183485 8451117 7961176 7739859
644 7739859 7768522 7968162 8220363 8411217 8468267 8372128 8142759 7815182 7421677 6988570 6543064 6122193
656 6122193 5776667 5565468 5540810 5728408 6114431 6651530 7285965 7989454 8771141 9662054 10685846
667 10685846 11833758 13053126 14251942 15317305 16146517 16685147 16952961 17036889 17056386 17126191 17331868
678 17331868 17716615 18277166 18972727 19746276 20545333 21333022 22091633 22824095 23549269 24283181 25010520
689B5010520O56575M84640K09501j37689n12207q71026j176763j397883j511774j508896j398468
700A7846530j212173r96371p94539o32277n13014m22578l42973k67269j99372j38259p0991
711A2256714J2572J01196J65806J81172J38989M1745j05726k94486n07100p17955q97944j025550
723I349433j100825j144972j181445j218369j247178j249377j200985j080656q87601o52928
733a614903m25582k41403j03787R312J20012K28665L14062L52695L36305K74525J87372R9033
745d63694L6446K4878P4140J66556K62798L23471L27179K69804J51267l0419k69071n36861
757C36494p84196r55303j010583r42946p76134n47066k90699m0074J69108L07199L69092L78796
769c786312L72316L78779M15630M91726O08213P54836R06413J026625J082842J060350R62468
$$ plain form
689 25010520 25667095 26151735 26361236 26223547 25711340 24840314 23663551 22265668 20753894 19244998 17846530
700 17846530 16634357 15637986 14843447 14211170 13698156 13275578 12932605 12665336 12465964 12327705 12256714
711 12256714 12269286 12370482 12536288 12717460 12856449 12898194 12792468 12497982 11990882 11272927 10374983 9349433
723 9349433 8248608 7103636 5922191 4703822 3456644 2207267 1006282 -74374 -961975 -1614903
733 -1614903 -2040485 -2281888 -2385675 -2376363 -2256351 -2027686 -1713624 -1360929 -1024624 -750099 -562727 -463694
745 -463694 -427248 -402370 -328230 -161674 101124 424595 751774 1021578 1172845 1142426 873355 336494
757 336494 -447702 -1403005 -2413588 -3356534 -4132668 -4679734 -4970433 -5010507 -4841399 -4534200 -4165108 -3786312
769 -3786312 -3413996 -3035217 -2619587 -2127861 -1519648 -764812 141601 1168226 2251068 3311418 4273886
780D273886Q04674O15799M36622L00969K12092J39751M1879j06863k96936m86601o23630o71567
792D640075o23959n03075l50082k12718j30605j23298j87891l03891m38413n51091o05882
803F09170n87169n05513l86900k57541j38000m4486J3982M3122O2958R5600J50033K16495
815g28249K76194L19951L56085L97516M41609M63149M26482L08653J20751q7713k49583l12970
827A731875k62543j20230O7770K50077L88395M66339M84895M52531L84051L09245K71097L01791
839D725293L98367N22173O18732O41131N67030M02388J70087j06080m06967p09998r79927
850E842229j170789j239893j165703r60006o68769l56991q0789J36025L04569M55448O16636
861A711967P95440R72773J110946J171175J133482J006899Q18227N90236L33321N5311k28336
$$ plain form
780 4273886 5078560 5694359 6130981 6431950 6644042 6783793 6825672 6718809 6421873 5935272 5311642 4640075
792 4640075 4016116 3513041 3162959 2950241 2819636 2696338 2508447 2204556 1766143 1215052 609170
803 609170 22001 -483512 -870412 -1127953 -1265953 -1310439 -1296457 -1253335 -1190377 -1094777 -944744 -728249
815 -728249 -452055 -132104 223981 621497 1063106 1526255 1952737 2261390 2382141 2294428 2044845 1731875
827 1731875 1469332 1349102 1416872 1666949 2055344 2521683 3006578 3459109 3843160 4152405 4423502 4725293
839 4725293 5123660 5645833 6264565 6905696 7472726 7875114 8045201 7939121 7532154 6822156 5842229
850 5842229 4671440 3431547 2265844 1305838 637069 280078 199289 335314 639883 1095331 1711967
861 1711967 2507407 3480180 4591126 5762301 6895783 7902682 8720909 9311145 9644466 9699777 9471441
872I471441m93974p15963q75400r67763j003101r96243r56835q90128q04368p12320o24281
883D31065n41839m58206l61308k39070r0166O7145J99994K77253K84656K29943J37488L8718
895b4327l5655o2717l4290M0783J38705K25843K69296K49259J63237K1901j53889l33695m84567
908b0116n86225o43132o79855p18483p54486p53293o72614m91261k23005Q9255L89911O29459
920d433845P77232Q23573P76923O62678N19898L90644L04704K69415K74558L09561L72709
931A048050M60908N55139O21732O29943N70719M61060L32170K12510J16876M2153k8179j09028
943D914053j97405k72193l12253l14262k93779k72843k68565k89001l30369l73302l85399
954A604682l36683k22134p4488M5354P6009j3703k03803m24333n87202o33360n58641m00787
$$ plain form
872 9471441 8977467 8261504 7386104 6418341 5415240 4418997 3462162 2572034 1767666 1055346 431065
883 431065 -110774 -568980 -930288 -1169358 -1259524 -1192379 -992385 -715132 -430476 -200533 -63045 -24327
895 -24327 -59982 -122699 -156989 -116206 22499 248342 517638 766897 930134 952035 798146 464451 -20116
908 -20116 -606341 -1249473 -1929328 -2647811 -3402297 -4155590 -4828204 -5319465 -5542470 -5453215 -5063304 -4433845
920 -4433845 -3656613 -2833040 -2056117 -1393439 -873541 -482897 -178193 91222 365780 675341 1048050
931 1048050 1508958 2064097 2685829 3315772 3886491 4347551 4679721 4892231 5009107 5051260 5023081 4914053
943 4914053 4716648 4444455 4132202 3817940 3524161 3251318 2982753 2693752 2363383 1990081 1604682
954 1604682 1267999 1045865 971377 1016731 1092740 1079037 875234 450901 -136301 -769661 -1328302 -1729089
966a729089k09526k7577J14685J99099K16918J69603P6016k6489r7190j12125p1968N410J00897
979a391336K07632L30558M72465O20324P43924Q07269P86682O85640N37287L90662K85376
990D476483K29903J99482J54960O7549o8059k37778m21075o01766p69754r12744j008322j029880
1002G8999r65639q35729o91490n91061n65982o06125o72512p22507p27105o77041n82814m68558
1014h027564l59103k66120j81371q1132N9090K48460M73991P05203R03725J036262J089544
1025d399015J072765J000164Q75631O99341M84513K63574P8459l6023o4419j2635R6719K31688
1037B90762L60095M53978M87565M41744L18277J46325k8901j66172k43917k65336k52094k30577
1049A311749k19568k25573k44329k63025k60967k12937j01077O8808K63194M36503N54677
$$ plain form
966 -1729089 -1938615 -1966192 -1851507 -1652408 -1435490 -1265887 -1189871 -1216360 -1313550 -1425675 -1497643 -1492233 -1391336
979 -1391336 -1183704 -853146 -380681 239643 983567 1790836 2577518 3263158 3800445 4191107 4476483
990 4476483 4706386 4905868 5060828 5128377 5060318 4822540 4401465 3799699 3029945 2117201 1108879 78999
1002 78999 -886640 -1722369 -2413859 -3004920 -3570902 -4177027 -4849539 -5572046 -6299151 -6976192 -7559006 -8027564
1014 -8027564 -8386667 -8652787 -8834158 -8915290 -8856200 -8607740 -8133749 -7428546 -6524821 -5488559 -4399015
1025 -4399015 -3326250 -2326086 -1450455 -751114 -266601 -3027 75432 39409 -25010 -37645 59074 290762
1037 290762 650857 1104835 1592400 2034144 2352421 2498746 2469845 2303673 2059756 1794420 1542326 1311749
1049 1311749 1092181 866608 622279 359254 98287 -114650 -215727 -146919 116275 552778 1107455
1060A107455O10211O20398O07629N75506N04738L74490J86755l0755k42894m28247n86441
1071C298845p28094q58138r67302j035669j045051r91768q91263p72977o66389n83442n11266
1082e752514m22919k96670j31392M8385K01878K95709L26613L22645L21756L48524M02391
1093d335594M58354M81163M48438L65648K59522J58152P7760K2403j1405k9706l5968k9860
1105b171093j0886K1125P1117J47159K46767L49443M29593M75758M95973N10538N42317O05031
1117A712842O89336P57258P57663O56985M59990K04357n9640k85856m42774n20960n33207
1128C395994n01210m35658l29007j71539K3843K12544L34773L45347K35429L3463k10348m42297
1140B491334o15337o93912o62653n37849l69257k22021j45818j54702k30197l35079m22494
$$ plain form
1060 1107455 1717666 2338064 2945693 3521199 4025937 4400427 4587182 4556427 4313533 3885286 3298845
1071 3298845 2570751 1712613 745311 -290358 -1335409 -2327177 -3218440 -3991417 -4657806 -5241248 -5752514
1082 -5752514 -6175433 -6472103 -6603495 -6555110 -6353232 -6057523 -5730910 -5408265 -5086509 -4737985 -4335594
1093 -4335594 -3877240 -3396077 -2947639 -2581991 -2322469 -2164317 -2086557 -2064154 -2075559 -2105265 -2141233 -2171093
1105 -2171093 -2181979 -2160854 -2089737 -1942578 -1695811 -1346368 -916775 -441017 54956 565494 1107811 1712842
1117 1712842 2402178 3159436 3917099 4574084 5034074 5238431 5178791 4892935 4450161 3929201 3395994
1128 3395994 2894784 2459126 2130119 1958580 1982423 2194967 2529740 2875087 3110516 3143979 2933631 2491334
1140 2491334 1875997 1182085 519432 -18417 -387674 -609695 -755513 -910215 -1140412 -1475491 -1897985
1151a897985m43521l59577j54542J59422N40919R23148J226313J379556J348388J153824Q66475
1162D742420N75213L48713K10087J35214P4747j3893j44823l01310m49031n54590n99532n82966
1174C440249n17361m26862l44497k98497k94827l14684l31579l33231l27699l27258l28470
1185d04716l12612k63156j79381p5123L1471J23769J86792K10733J97260J56520R6923K3268
1197b08252n3269j07405j05576k4636J28768L14478M78834N83260O18452N97020N38144M57911
1209C217729L65008K57733J25690m0476k37966m49408o50341q17368r30728r77464r61336
1220a098927r10395q65255q50063q53983q42234p82578o60979m83438k75627q1294M9024P9945
1232g575804Q563j37591l16882m88757o20851o90456o83937n96574m35654k25317l806J90863
$$ plain form
1151 -1897985 -2341506 -2701083 -2855625 -2696203 -2155284 -1232136 -5823 1373733 2722121 3875945 4742420
1162 4742420 5317633 5666346 5876433 6011647 6086394 6072501 5927678 5626368 5177337 4622747 4023215 3440249
1174 3440249 2922888 2496026 2151529 1853032 1558205 1243521 911942 578711 251012 -76246 -404716
1185 -404716 -717328 -980484 -1159865 -1234988 -1203517 -1079748 -892956 -682223 -484963 -328443 -231520 -208252
1197 -208252 -261521 -368926 -474502 -499138 -370370 -55892 422942 1006202 1624654 2221674 2759818 3217729
1209 3217729 3582737 3840470 3966160 3925684 3687718 3238310 2587969 1770601 839873 -137591 -1098927
1220 -1098927 -2009322 -2874577 -3724640 -4578623 -5420857 -6203435 -6864414 -7347852 -7623479 -7704773 -7655749 -7575804
1232 -7575804 -7567241 -7704832 -8021714 -8510471 -9131322 -9821778 -10505715 -11102289 -11537943 -11763260 -11767066 -11576203
1244a1576203L38278M43788N28660O07093O73213P12004P18707P06721P01849P29475P98958
1255d617457Q96729R96766J076569J122849J128148J087822J002691Q82101P41484N97001
1265D914703M61042L38039K22472J01442l8372k00552l71025n20762o19566o49460o10710
1276C027251n21523m09921k98777j97495j08910l8672O345K6152L0055K8729K4816J4168l144
1289A579074j7291j4756J4775P7292J72976K91733M13380N15974N83450O05031N72577M84847
1301E279062L54634K08636P9494k789j8424L3579J32528K46816L48013M13260M22176L62286
1313G859271K40949Q9971m6849j38636j85148k12631k53978l31472m51090o05090p74542r30131
1325D260624j039339j083813j071145j026055r68293q95214p82257o04046l61611r1768J49384
$$ plain form
1244 -11576203 -11237925 -10794137 -10265477 -9658384 -8985171 -8273167 -7554460 -6847739 -6145890 -5416415 -4617457
1255 -4617457 -3720728 -2723962 -1647393 -524544 603604 1691426 2694117 3576218 4317702 4914703
1265 4914703 5375745 5713784 5936256 6037698 5999326 5798774 5427749 4906987 4287421 3637961 3027251
1276 3027251 2505728 2095807 1797030 1599535 1490625 1451953 1458298 1484450 1514505 1543234 1568050 1582218 1579074
1289 1579074 1561783 1547027 1561802 1639094 1812070 2103803 2517183 3033157 3616607 4221638 4794215 5279062
1301 5279062 5633696 5842332 5921826 5919037 5900613 5934192 6066720 6313536 6661549 7074809 7496985 7859271
1313 7859271 8100220 8190191 8143342 8004706 7819558 7606927 7352949 7021477 6570387 5965297 5190755 4260624
1325 4260624 3221285 2137472 1066327 40272 -928021 -1823235 -2605492 -3209538 -3571149 -3662917 -3513533
1336c513533L11847L68345L17565J79877j0718k15564l97362n21813n59678m96156l43611
1347d880801j42561N5569K08761K93487L06861K66851K03719J43890J00206P5382P1458R4910
1359c202268J51715K37575L36500M30310N04619N45799N40869M84868L86604K66594J49112
1370H32297N1833k1022p9488j40754k14398k92087l54816l87482l83163l42060k78015k24067
1382a833222k22091l00926m60649o70233q75575j015260j040622r30433o93626l64948L95
1393h407190L34485N68900O51641N69428L65508J29375m8465j25671j19882q1093n8146q1934
1405f303044j60699k79892m09844n20022n91939o23682o23298n95940n37129m37472k91425
1416a1374386j01918J18864L49965N65801P45042Q80314R81758J069502J157312J236655J273449
$$ plain form
1336 -3513533 -3201686 -2833341 -2515776 -2335899 -2346617 -2562181 -2959543 -3481356 -4041034 -4537190 -4880801
1347 -4880801 -5023362 -4967793 -4759032 -4465545 -4158684 -3891833 -3688114 -3544224 -3444018 -3368636 -3297178 -3202268
1359 -3202268 -3050553 -2812978 -2476478 -2046168 -1541549 -995750 -454881 29987 416591 683185 832297
1370 832297 884130 863108 783620 642866 428468 136381 -218435 -605917 -989080 -1331140 -1609155 -1833222
1382 -1833222 -2055313 -2356239 -2816888 -3487121 -4362696 -5377956 -6418578 -7349011 -8042637 -8407585 -8407190
1393 -8407190 -8072705 -7503805 -6852164 -6282736 -5917228 -5787853 -5836318 -5961989 -6081871 -6162964 -6221110 -6303044
1405 -6303044 -6463743 -6743635 -7153479 -7673501 -8265440 -8889122 -9512420 -10108360 -10645489 -11082961 -11374386
1416 -11374386 -11476304 -11357440 -11007475 -10441674 -9696632 -8816318 -7834560 -6765058 -5607746 -4371091 -3097642
1427c097642J226723J078934Q51760N94351L59239J84574Q5771N1439M5169J9449n9218j89113
1439A151436l34850m53937n28637n75557o25543o93575p64531q04086p82376o89174n31112
1450e631942l20860p3255J90419M38601O32786P40745P53374O90821N92385N00768M47496
1461a038662M42639M75088N22585N60880N69368N39348M79462M08266L38360K68958J91964
1472C758256J00844o992j31720k69887m09312n27674o00484o11679n58870m55795l30711k14511
1484b58535j26065p1702n6696q8887j67646k74444l78419m52523m89424n05540n27279n66214
1496c963374o05671o13300n64290m53333k96093j28639K699O3040M6216k6189j19190j98691
1508f856815k40199k32590j77732q6122K7101J46968K67563L96215N40974O93131Q26721R14935
$$ plain form
1427 -3097642 -1870919 -791985 59775 654126 1013365 1197939 1283710 1335149 1380318 1399767 1340549 1151436
1439 1151436 816586 362649 -165988 -741545 -1367088 -2060663 -2825194 -3629280 -4411656 -5100830 -5631942
1450 -5631942 -5952802 -6026057 -5835638 -5397037 -4764251 -4023506 -3270132 -2579311 -1986926 -1486158 -1038662
1461 -1038662 -596023 -120935 401650 962530 1531898 2071246 2550708 2958974 3297334 3566292 3758256
1472 3758256 3859100 3852108 3720388 3450501 3041189 2513515 1913031 1301352 742482 286687 -44024 -258535
1484 -258535 -384600 -456302 -512998 -601885 -769531 -1043975 -1422394 -1874917 -2364341 -2869881 -3397160 -3963374
1496 -3963374 -4569045 -5182345 -5746635 -6199968 -6496061 -6624700 -6622001 -6558961 -6512745 -6538934 -6658124 -6856815
1508 -6856815 -7097014 -7329604 -7507336 -7593458 -7566357 -7419389 -7151826 -6755611 -6214637 -5521506 -4694785 -3779850
1520c779850R45266R19882Q43082P11884N22628K87041L9697j71423l05768l50012l23904
1531f61477k68161k22340k04656k02666j83028j17482m688J27122K35326K85183K67557K03851
1543g45459J37181J12974J56791K61685L94863N18211O06903O55485O72446O70455O57832
1554D099367O34180N93851N35594M65351L84896K80039J29892o3920k59979l97476m36115
1565E965680l74663k37540n4793J45004L32917M80718N67632N86291N41814M46289L14408
1576H713757J60629l475j69161l27881m69729n84532o68534p34836q12795r25468j061709
1587C116266j174328j212994j163079j053095r25508q01480o73975n32839l88660k66243j80027
1598e255962j23134p6956k4741M3934J36990K63770M29536O21879Q06663R44257J010700J002460
$$ plain form
1520 -3779850 -2834584 -1914702 -1071620 -359736 162892 449933 489630 318207 12439 -337573 -661477
1531 -661477 -929638 -1151978 -1356634 -1559300 -1742328 -1859810 -1864498 -1737376 -1502050 -1216867 -949310 -745459
1543 -745459 -608278 -495304 -338513 -76828 318035 836246 1443149 2098634 2771080 3441535 4099367
1554 4099367 4733547 5327398 5862992 6328343 6713239 6993278 7123170 7059250 6799271 6401795 5965680
1565 5965680 5591017 5353477 5298684 5443688 5776605 6257323 6824955 7411246 7953060 8399349 8713757
1576 8713757 8874386 8870911 8701750 8373869 7904140 7319608 6651074 5916238 5103443 4177975 3116266
1587 3116266 1941938 728944 -434135 -1487230 -2412738 -3214218 -3888193 -4421032 -4809692 -5075935 -5255962
1598 -5255962 -5379096 -5456052 -5480793 -5436859 -5299869 -5036099 -4606563 -3984684 -3178021 -2233764 -1223064 -220604
1610b20604R30601Q19937P08696O34315O10534O15831O05029N36964L95225J86096p3816l58882
1622E389926o28427q31787r28187r07672p98532o52850n15709m03821l12994k39521j86827
1633a016401j54717j29369q5178M412J54817L60120N89011P95164R41110J017359J040709
1644C517037J037000J021611R86674R05944P60318N61249L49212J72782O9067N3441J15178
1655I549513K18585L12329L46987K93269J51442n3293k85634n12901p06858q40543q91943
1666G580953q54135p41919n86131m17769k55155j05304K5405J25251J81757J93455J74967
1677E321375J45567J10501N3261n2204k16265m14524n91639o89607o85438o08505n19001m62998
1689A390523m43272m26745l74181k65761j07608P9580K75028M61490O20153P28931P71597
$$ plain form
1610 -220604 709997 1529934 2238630 2872945 3483479 4099310 4704339 5241303 5636528 5822624 5748808 5389926
1622 5389926 4761499 3929712 3001525 2093853 1295321 642471 126762 -277059 -590053 -829574 -1016401
1633 -1016401 -1171118 -1300487 -1385665 -1381253 -1226436 -866316 -277305 517859 1458969 2476328 3517037
1644 3517037 4554037 5575648 6562322 7468266 8228584 8789833 9139045 9311827 9380894 9434335 9549513
1655 9549513 9768098 10080427 10427414 10720683 10872125 10818832 10533198 10020297 9313439 8472896 7580953
1666 7580953 6726818 5984899 5398768 4980999 4725844 4620540 4645945 4771196 4952953 5146408 5321375
1677 5321375 5466942 5577443 5630704 5578500 5362235 4947711 4356072 3666465 2981027 2372522 1853521 1390523
1689 1390523 947251 520506 146325 -119436 -227044 -147464 127564 589054 1209207 1938138 2709735
1700B709735P49843O85605O10784N51520N17708N01860M85937M50939L85060K86795J62937
1711H098723K4039j21043k67527m11450n42235o41347o92736o98660o85163o84203p02378
1722B676020p08903o58838n28390l34554j32047Q945L6079n9648k43036m55785o43777p77799
1734a821733q58367r01027r12955q81023p78315n81686k92743M9057L78404O37044Q00244
1745e163100Q81263R18281R49912R91790J033901J059245J060532J039081R93390R12221P80165
1756E456681N94017L75714J65875J607j01700j53560j79880k08750k55367l11727l50206l39344
1768D693360k59808j12221Q1417K79556M29018M79879M00094J87558j21033m55973p42470
1779D859377r33447j020932j020981r53630q38544p01928n74550m74222l91682l00647j84359
$$ plain form
1700 2709735 3459578 4145183 4755967 5307487 5825195 6327055 6812992 7263931 7648991 7935786 8098723
1711 8098723 8122762 8001719 7734192 7322742 6780507 6139160 5446424 4747764 4062601 3378398 2676020
1722 2676020 1967117 1308279 779889 445335 313288 322233 358312 298664 55628 -400157 -1043934 -1821733
1734 -1821733 -2680100 -3581127 -4494082 -5375105 -6153420 -6735106 -7027849 -6978792 -6600388 -5963344 -5163100
1745 -5163100 -4281837 -3363556 -2413644 -1421854 -387953 671292 1731824 2770905 3764295 4676516 5456681
1756 5456681 6050698 6426412 6592287 6593894 6492194 6338634 6158754 5950004 5694637 5382910 5032704 4693360
1768 4693360 4433552 4321331 4402748 4682304 5111322 5591201 5991295 6178853 6057820 5601847 4859377
1779 4859377 3925930 2904998 1884017 930387 91843 -610085 -1184635 -1658857 -2050539 -2351186 -2535545
1790b535545n1049P3554J62692J97445J69445Q5770k9475j47152k47338l18777l51435l41204
1802c333069l02112k65764k62509l01453l67876m36137m84517n02172m86284m37151l61164
1813g540208k75650k02310j52999j25184j08951r2134o0801j415R4971K27073L78555N22751
1825g336302O37468P13477P47878P34922O69663N57645M13876K52664Q5810o8658j82956k29539
1837c004052j94685q4807P6824K59452M36979N94897P26841Q24586Q73728Q60211P83733O67488
1849B821195N51183M67067M19231L85256L37769K63877J65235M6185r0457k35619l68473m64875
1861D297574n12104n14469m85525m36885l73675k99046k22022j59291j27136j29961j54334
1872H83126j70706j43374m8676J08176K92912M58570N61290N67157M59278K48968k0615k85886
$$ plain form
1790 -2535545 -2586594 -2513040 -2350348 -2152903 -1983458 -1897688 -1927163 -2074315 -2321653 -2640430 -2991865 -3333069
1802 -3333069 -3635181 -3900945 -4163454 -4464907 -4832783 -5268920 -5753437 -6255609 -6741893 -7179044 -7540208
1813 -7540208 -7815858 -8018168 -8171167 -8296351 -8405302 -8497436 -8558237 -8559652 -8464681 -8237608 -7859053 -7336302
1825 -7336302 -6698834 -5985357 -5237479 -4502557 -3832894 -3275249 -2861373 -2608709 -2522899 -2591557 -2774513 -3004052
1837 -3004052 -3198737 -3283544 -3206720 -2947268 -2510289 -1915392 -1188551 -363965 509763 1369974 2153707 2821195
1849 2821195 3372378 3839445 4258676 4643932 4981701 5245578 5410813 5456998 5366541 5130922 4762449 4297574
1861 4297574 3785470 3271001 2785476 2348591 1974916 1675870 1453848 1294557 1167421 1037460 883126
1872 883126 712420 569046 520370 628546 921458 1380028 1941318 2508475 2967753 3216721 3196106 2910220
1884B910220m82300n63054n14793l61335j49335P1537K61086L96473M75722N10197N10439
1895C064857M78894M13289L13349J85176M1080j03981k36588l46637m25116m62422m51724
1906B470177l94751l02827j92334q0369J9100J01075J74989K60103L68525M92525O10042O97364
1918D223619P34814P12511O40534N48225M62899L88401L07840K03209O8716q9494k60317m31804
1930G509153n86682o97937p38479p00741o05976m93414m01576l56670l68684m28730n07686
1941A622578n62005n48274m42638k56950l9746J46284K57200K82882K35529J31199j4936j82184
1953F28939l39756m50593m79630m05045k29116K0226L00051N66486P85466R36217J006630
1964B339875R88995Q84859P11604M97183K66038K9332k12948m59524o98001r08120j072219
$$ plain form
1884 2910220 2427920 1864866 1350073 988738 839403 910940 1172026 1568499 2044221 2554418 3064857
1895 3064857 3543751 3957040 4270389 4455565 4496645 4392664 4156076 3809439 3384323 2921901 2470177
1906 2470177 2075426 1772599 1580265 1499896 1518996 1620071 1795060 2055163 2423688 2916213 3526255 4223619
1918 4223619 4958433 5670944 6311478 6859703 7322602 7711003 8018843 8222052 8290768 8201274 7940957 7509153
1930 7509153 6922471 6224534 5486055 4785314 4179338 3685924 3284348 2927678 2558994 2130264 1622578
1941 1622578 1060573 512299 69661 -187289 -227035 -80751 176449 459331 694860 826059 811123 628939
1953 628939 289183 -161410 -641040 -1046085 -1275201 -1254975 -954924 -388438 397028 1333245 2339875
1964 2339875 3328870 4213729 4925333 5422516 5688554 5717886 5504938 5045414 4347413 3439293 2367074
1975B367074j179890j224352j199981j108572r67019q05917o58162n43685m58453l76938k70946
1986f426841j33793R796J17715J58879J33667O8169j0673r1968j74920k54997l23751l78217
1998g306934m20471m47042m46670m10562l37781k29615q7466Q1076K59856M32347N90827P33292
2010g589143Q51083R23526R29101Q62096P37040N80721M24380K98836K25699K04615K08424
2021a343622J97909J48818O8978o234l4968K705Q6175J65798J99228J76641J13081K5739p3491
2034b73243j66653k21880k05767j07613M5395J93279K68687K32960J01247o4826j93078k35783
2046f27275j83244o1466P8431J81100K14087J84100J29767R5484J07812J69300K62543L53744
2058I04383M04080L95486L47012K97341K69680K57858K43782K19049J87417J55389J25737
$$ plain form
1975 2367074 1187184 -37168 -1237149 -2345721 -3312740 -4118657 -4776819 -5320504 -5778957 -6155895 -6426841
1986 -6426841 -6560634 -6550838 -6433123 -6274244 -6140577 -6072408 -6083081 -6175049 -6349969 -6604966 -6928717 -7306934
1998 -7306934 -7727405 -8174447 -8621117 -9031679 -9369460 -9599075 -9686541 -9605465 -9345609 -8913262 -8322435 -7589143
2010 -7589143 -6738060 -5814534 -4885433 -4023337 -3286297 -2705576 -2281196 -1982360 -1756661 -1552046 -1343622
2021 -1343622 -1145713 -996895 -927917 -934151 -969119 -966414 -880239 -714441 -515213 -338572 -225491 -199752 -273243
2034 -273243 -439896 -661776 -867543 -975156 -929761 -736482 -467795 -234835 -133588 -198414 -391492 -627275
2046 -627275 -810519 -871985 -793554 -612454 -398367 -214267 -84500 10984 118796 288096 550639 904383
2058 904383 1308463 1703949 2050961 2348302 2617982 2875840 3119622 3338671 3526088 3681477 3807214
2069C807214R6031N8377K416p5588j64517k42549k92031l10038l07152l01782l14137l55946
2081A600298m17903m69001m76327m32681l65732l20816l34942m22167n70891p49309r16734
2092c876205j035111j076086j027929r02059p29283n43107l62629j89509j9709J42870K85019
2103i333738L92440M55948M74736M58465M23617L83168L38814K84519K18834J53471J10294
2114e639432J12024J72777K89236M34923N63945O27335N98629M93076L61168K59927K23588
2125a502804K49049L01531L37324L27752K69229J79107Q4631P265n2901j18188k12017l32745
2137d62767m50282n29019n54836n43694n26542n23770n33139n40226n33329n03985m42243
2148f143832l40539k00771l5413J35166K85569L90852M35363M19476L60734K89823K38091
$$ plain form
2069 3807214 3903245 3961622 3964038 3888450 3723933 3481384 3189353 2879315 2572163 2270381 1956244 1600298
2081 1600298 1182395 713394 237067 -195614 -561346 -882162 -1217104 -1639271 -2210162 -2959471 -3876205
2092 -3876205 -4911316 -5987402 -7015331 -7917390 -8646673 -9189780 -9552409 -9741918 -9761627 -9618757 -9333738
2103 -9333738 -8941298 -8485350 -8010614 -7552149 -7128532 -6745364 -6406550 -6122031 -5903197 -5749726 -5639432
2114 -5639432 -5527408 -5354631 -5065395 -4630472 -4066527 -3439192 -2840563 -2347487 -1986319 -1726392 -1502804
2125 -1502804 -1253755 -952224 -614900 -287148 -17919 161188 245819 253084 200183 81995 -130022 -462767
2137 -462767 -913049 -1442068 -1996904 -2540598 -3067140 -3590910 -4124049 -4664275 -5197604 -5701589 -6143832
2148 -6143832 -6484371 -6685142 -6720555 -6585389 -6299820 -5908968 -5473605 -5054129 -4693395 -4403572 -4165481
2159d165481K20744K30728K50420K68047K83576L03171L30102L60312L87792M14748M50371
2170f65470M94112N23164N03301M15199K74302J29118L5823K5168Q4905J66513K10371J78176
2182B374682P3423o6664k00535l06041l79170m17896m15390l68908k90041k05013j45203j30785
2194d77541j57346j99078k27221k25072j89381j22841k6666R9489K51581M17986N83644P36275
2206D63829Q66242R60368J000336R74064Q87534P62493O22868M85341L61115K61896K02860
2217G848946K01053K67160L92011N39867O60097P10596O74680N63205M05792K35208P2047
2228A2570662q0075k27071l72300n09460o23969p00190p29627p15240o69871o12598n65761
2239F764500n48060n64179o00042o31716o41222o23990n82914n19767m35979l39625k43900
$$ plain form
2159 -4165481 -3944737 -3714009 -3463589 -3195542 -2911966 -2608795 -2278693 -1918381 -1530589 -1115841 -665470
2170 -665470 -171358 351806 855107 1270306 1544608 1673726 1709549 1734717 1819622 1986135 2196506 2374682
2182 2374682 2448105 2381441 2180906 1874865 1495695 1077799 662409 293501 3460 -201553 -346756 -477541
2194 -477541 -634887 -833965 -1061186 -1286258 -1475639 -1598480 -1625146 -1525657 -1274076 -856090 -272446 463829
2206 463829 1330071 2290439 3290775 4264839 5152373 5914866 6537734 7023075 7384190 7646086 7848946
2217 7848946 8049999 8317159 8709170 9249037 9909134 10619730 11294410 11857615 12263407 12498615 12570662
2228 12570662 12490587 12263516 11891216 11381756 10757787 10057597 9327970 8612730 7942859 7330261 6764500
2239 6764500 6216440 5652261 5052219 4420503 3779281 3155291 2572377 2052610 1616631 1277006 1033106
2250A033106j55390o7600L0109J36430K34718L10939L71971M37984N14684N77709N85818N11071
2262D521549L61918J81462K2113q3507j33418j45596j39974j27637j08548p3353r354Q8999
2274D354654K10767L29654M18901M67713M80447M60805M04379L10386J92598P1467m2637j54371
2286G504763k72529l95137n03354n69683n75601n27647m60805m20161m25326m45352m12631
2297B496537k72102k6992K56768M88268O00659N78837M54662K79992R7198p2877k19361l24602
2309D336987l65329l30090k32354j07566K492O6705P1406J5614r7194k61248m60763o62196
2321A976464q22636r12305r28617q87473q00561o61344m55453j84771J19198M03774O18529
2332b535195P39699P81840P84457P78181P60243P02099N76754L79913J35368j13650l24670
$$ plain form
2250 1033106 877716 810116 840225 976655 1211373 1522312 1894283 2332267 2846951 3424660 4010478 4521549
2262 4521549 4883467 5064929 5087042 5003535 4870117 4724521 4584547 4456910 4348362 4275009 4265655 4354654
2274 4354654 4565421 4895075 5313976 5781689 6262136 6722941 7127320 7437706 7630304 7701771 7659134 7504763
2286 7504763 7232234 6837097 6333743 5764060 5188459 4660812 4200007 3779846 3354520 2909168 2496537
2297 2496537 2224435 2197443 2454211 2942479 3543138 4121975 4576637 4856629 4953827 4880950 4661589 4336987
2309 4336987 3971658 3641568 3409214 3301648 3304140 3370845 3442251 3457865 3360671 3099423 2638660 1976464
2321 1976464 1153828 241523 -687094 -1574567 -2375128 -3036472 -3491925 -3676696 -3557498 -3153724 -2535195
2332 -2535195 -1795496 -1013656 -229199 548982 1309225 2011324 2588078 2967991 3103359 2989709 2665039
2343B665039m75484n65034n97370n70936m88097l72902k71669k26463k42176k79153k77523
2354a701768j91803j3987K25282M75845O93621Q54294R50091R80897R52973Q85827Q15634
2365D926906P80753P94146Q29846Q41150P92927O77608N09458L14683J25900k7530j34296
2376A0431551k08208k78443l69201m85691o15023p36247q29110q79731q87853q70993q55193
2387C415858q56002q68968q79751q78670q61635q20993p41210o05646m07678j59192J06714
2398c557173L41214M95701N46358N12374M45509L89361L43929K70898J34270o2372k73176
2409d13107m37932n16267n07781m50140l98088l94210m46599n28478n97443o14654n53772
2420e858471m08749k01445K4387K23782L67005M40486M41174L75588K61673J26416k418j07399
$$ plain form
2343 2665039 2189555 1624521 1027151 456215 -31882 -404784 -676453 -902916 -1145092 -1424245 -1701768
2354 -1701768 -1893571 -1907558 -1682276 -1206431 -512810 341484 1291575 2272472 3225445 4111272 4926906
2365 4926906 5707659 6501805 7331651 8172801 8965728 9643336 10152794 10467477 10593377 10565847 10431551
2376 10431551 10223343 9944900 9575699 9090008 8474985 7738738 6909628 6029897 5142044 4271051 3415858
2387 3415858 2559856 1690888 811137 -67533 -929168 -1750161 -2491371 -3097017 -3504695 -3663887 -3557173
2398 -3557173 -3215959 -2720258 -2173900 -1661526 -1216017 -826656 -482727 -211829 -77559 -139931 -413107
2409 -413107 -851039 -1367306 -1875087 -2325227 -2723315 -3117525 -3564124 -4092602 -4690045 -5304699 -5858471
2420 -5858471 -6267220 -6468665 -6444278 -6220496 -5853491 -5413005 -4971831 -4596243 -4334570 -4208154 -4210572 -4317971
2432d317971j87711k52599l04465l27186k93017j83221k486K25254M70255P02661Q89548R96543
2444b584395R98799Q93462P03331M69083K34741L6190j01397j61930j41047n1005Q0640K18958
2456E95430L31705L98006M13649L87108L26824K32796J02932n2976k07748l26749l85981l84077
2468A430919l40603k85043k44394k32687k46117k68948k87803l03402l27714l67511m10329
2479a883632m26777l88290k89234j53153j4864J02596J93332K58023K91718K78783K01102
2490a830396N6542j28805l08708m39442m96806m75620l81360k28762m3818J41275K97336M04094
2502c434470M54390M55600M20612L55096K56691J26092k4896j74566k93820l49807l18669
2513b527747k00806k1440J82585L76148N31385O25964O39846N58519L84622J50157q3452k46382
$$ plain form
2432 -4317971 -4505682 -4758281 -5062746 -5389932 -5682949 -5866170 -5868656 -5643402 -5173147 -4470486 -3580938 -2584395
2444 -2584395 -1585596 -692134 11197 480280 715021 751211 649814 487884 346837 295832 376472 595430
2456 595430 927135 1325141 1738790 2125898 2452722 2685518 2788450 2735474 2527726 2200977 1814996 1430919
2468 1430919 1090316 805273 560879 328192 82075 -186873 -474676 -778078 -1105792 -1473303 -1883632
2479 -1883632 -2310409 -2698699 -2987933 -3141086 -3155950 -3053354 -2860022 -2601999 -2310281 -2031498 -1830396
2490 -1830396 -1773854 -1902659 -2211367 -2650809 -3147615 -3623235 -4004595 -4233357 -4277175 -4135900 -3838564 -3434470
2502 -3434470 -2980080 -2524480 -2103868 -1748772 -1492081 -1365989 -1390885 -1565451 -1859271 -2209078 -2527747
2513 -2527747 -2728553 -2749993 -2567408 -2191260 -1659875 -1033911 -394065 164454 549076 699233 615781 369399
2525C69399k96774k46442j51854p9760p5840j48287k64831l64728l85463k92361r6533J48820
2537a884654L76188N40728O36630O80613O84661O46789N63535M45161L13509J86045P0589
2548C259794k4151q4954j03805q3411l1467M5434J40772K44284L39818M06607M26077L93313
2560D928311L25651K56557K14239K02309K00591J82148J29363M0647p4029k04565l47797n02356
2572E351069o57760p89260q64026q58128p74885o48322n27894m55104m44388m78278n20615
2583a667591n36443n03234m12257k68241q9132R8036K65282L90464M59270M67690M27016L61087
2595a008053K92615K33704J88600J57761J36510J16577R4640P7860P8681J03860J46136J86496
2607H05387K06631K00274J76024J53017J50609J74217K08698K28533K18264J85776J58924
$$ plain form
2525 369399 72625 -173817 -325671 -405431 -481271 -629558 -894389 -1259117 -1644580 -1936941 -2033474 -1884654
2537 -1884654 -1508466 -967738 -331108 349505 1034166 1680955 2244490 2689651 3003160 3189205 3259794
2548 3259794 3235643 3150689 3046884 2963473 2932006 2977440 3118212 3362496 3702314 4108921 4534998 4928311
2560 4928311 5253962 5510519 5724758 5927067 6127658 6309806 6439169 6479816 6405787 6201222 5853425 5351069
2572 5351069 4693309 3904049 3040023 2181895 1407010 758688 230794 -224310 -668698 -1146976 -1667591
2583 -1667591 -2204034 -2707268 -3119525 -3387766 -3476898 -3378862 -3113580 -2723116 -2263846 -1796156 -1369140 -1008053
2595 -1008053 -715438 -481734 -293134 -135373 1137 117714 212354 290214 368895 472755 618891 805387
2607 805387 1012018 1212292 1388316 1541333 1691942 1866159 2074857 2303390 2521654 2707430 2866354
2618B866354J70106K37326L47651M54241M99552M54338L36339J89443M6374q7462k18236l41142
2630D954884m41203n15676n86897o87508q30982r94756j130024j187238j135314r66898o97970
2641d219582l65639j8485K98679N51751P15727P77393P41619O30435M75711L13020J73185
2652G3814P0773K735l8421n6223n6667n4130o3836q8436j14117j21529r9345m6476L4259J37520
2666d20079K48934L43921M00898M19233M23329M45570N02077N82984O64208P27078P66556
2677E104709P83012P70687P17507O15721M72360L11785J67364O5747J6734J7355N8563J21846
2689I223390J74953J83364J30401K5648j04129k31523l43777m50036n70193p12528q64452
2700F461118j004966j118623j196056j227147j197404j092606r11661o78938m42548k54945
$$ plain form
2618 2866354 3036460 3273786 3621437 4075678 4575230 5029568 5365907 5555350 5601724 5514262 5296026 4954884
2630 4954884 4513681 3998005 3411108 2723600 1892618 897862 -232162 -1419400 -2554714 -3521612 -4219582
2641 -4219582 -4585221 -4603706 -4305027 -3753276 -3037549 -2260156 -1518537 -888102 -412391 -99371 73814
2652 73814 144587 147322 108901 52678 -3989 -58119 -121955 -210391 -324508 -446037 -545382 -591858 -557599 -420079
2666 -420079 -171145 172776 573674 992907 1416236 1861806 2363883 2946867 3611075 4338153 5104709
2677 5104709 5887721 6658408 7375915 7991636 8463996 8775781 8943145 9008892 9025626 9042981 9101544 9223390
2689 9223390 9398343 9581707 9712108 9737756 9633627 9402104 9058327 8608291 8038098 7325570 6461118
2700 6461118 5456152 4337529 3141473 1914326 716922 -375684 -1287345 -1966283 -2408831 -2663776
2710b663776j48255j19666j37679j62804j63237j17072j3179J43407L30045N15691O77378
2721a859147Q07021R01266R46953R20222Q05044O10207L71416J38694m0606j39194j62461
2732C299415j43282j20409j19381j47605k00626k72363l60400m59669n52619o07658n95693
2743b80290n12536l86736k64287j80576j40066j18554q6503l4736J9500N1379N2394L5034
2755a845977J6109P50j4482k6250j7944K9228J20810K45745L85958N27322O61120P76663Q56240
2768A715292Q81840Q46643P58126O31845M88451L56870K70597K51119K92498L60996M08501
2779G262778L93951L06869J77136N7611p657k817N9503J45933K12943K21856J54150J9044
2791I001300j49381l05758m13706m61280m59008m24345l69252l01078k30277j72714j45743
$$ plain form
2710 -2663776 -2812031 -2931697 -3069376 -3232180 -3395417 -3512489 -3525668 -3382261 -3052216 -2536525 -1859147
2721 -1859147 -1052126 -150860 796093 1716315 2521359 3131566 3502982 3641676 3601070 3461876 3299415
2732 3299415 3156133 3035724 2916343 2768738 2568112 2295749 1935349 1475680 923061 315403 -280290
2743 -280290 -792826 -1179562 -1443849 -1624425 -1764491 -1883045 -1969548 -2004284 -1984784 -1933405 -1881011 -1845977
2755 -1845977 -1829868 -1829118 -1843600 -1869850 -1887794 -1858566 -1737756 -1492011 -1106053 -578731 82389 859052 1715292
2768 1715292 2597132 3443775 4201901 4833746 5322197 5679067 5949664 6200783 6493281 6854277 7262778
2779 7262778 7656729 7963598 8140734 8198345 8190688 8187871 8247374 8393307 8606250 8828106 8982256 9001300
2791 9001300 8851919 8546161 8132455 7671175 7212167 6787822 6418570 6117492 5887215 5714501 5568758
2802E568758j62505k24582l14792m00084m48693m51227m28708m19016m48696n11322n69640
2813A189493n78799n12976l80515k20889q3844k026K4509K2908K9335P0313J52580K66087
2825b3824L91342N01457N66168N64438M95660L79166K43720J14216M457p8990j27949j32054
2837B897807q8579r669P9323J44906J54394R4144j4692j21411j70445j30480j3707J27712
2849B949303K32736K71288K59543K38183K37311K57383K74231K60999K10053J34012M6113
2860E371155n5255j80520l32174m95085o38855p27420p31092o40468m76749k85482j13503
2871F94552J2720R3114J47382K01497K71171L49609M10001M22185L69777K56549J01977o8908
2883C261626k35641l84915n00920n55089n14646l67866j43026R4652K67529L18042K29282
$$ plain form
2802 5568758 5406253 5181671 4866879 4466795 4018102 3566875 3138167 2719151 2270455 1759133 1189493
2813 1189493 610694 97718 -282797 -503686 -587530 -589556 -565047 -542139 -512804 -442491 -289911 -23824
2825 -23824 367518 868975 1435143 1999581 2495241 2874407 3118127 3232343 3236800 3157810 3029861 2897807
2837 2897807 2809228 2799559 2878882 3023788 3178182 3272326 3257634 3136223 2965778 2835298 2821591 2949303
2849 2949303 3182039 3453327 3712870 3951053 4188364 4445747 4719978 4980977 5191030 5325042 5371155
2860 5371155 5315900 5135380 4803206 4308121 3669266 2941846 2210754 1570286 1093537 808055 694552
2871 694552 707272 800386 947768 1149265 1420436 1770045 2180046 2602231 2972008 3228557 3330534 3261626
2883 3261626 3025985 2641070 2140150 1585061 1070415 702549 559523 654175 921704 1239746 1469028
2894A469028K5251k41599n05194o99301p68588o80210m38665r3515K75088N86680P86215Q55051
2906E70241Q08443O83114N21716L61783K29748J37055P8830L5585k3128j27955k88331m74440
2918B512661o26267o89969o51339n37003l86749k26971o6282R2222K38915L57676M34628M61292
2930I12814M30627L38112J90860J2222j65979l17365m28996m98257n24451n04746m37875l31586
2942a324620k06185q8268N177P9527J54691K41340L24788L69632L38978K18613L3066j63477
2954a6738l19336m14369m62318m89006n08419n14974m89146m06744k52046l4942K02133M00306
2966c305599N13650N29925M72044L82367K98823K39050K03231J86819J85939J93383J98989
2977I8621K00157K06958K33158K83445L51637M27677M98792N42729N28227M31600K52525J3177
$$ plain form
2894 1469028 1494279 1252680 747486 48185 -720403 -1400613 -1839278 -1932793 -1657705 -1071025 -284810 570241
2906 570241 1378684 2061798 2583514 2945297 3175045 3312100 3390930 3426515 3403387 3275432 2987101 2512661
2918 2512661 1886394 1196425 545086 8083 -378666 -605637 -671919 -579697 -340782 16894 451522 912814
2930 912814 1343441 1681553 1872413 1884635 1718656 1401291 972295 474038 -50413 -555159 -993034 -1324620
2942 -1324620 -1530805 -1619073 -1613896 -1534369 -1379678 -1138338 -813550 -443918 -104940 113673 146739 -16738
2954 -16738 -336074 -750443 -1212761 -1701767 -2210186 -2725160 -3214306 -3621050 -3873096 -3908038 -3705905 -3305599
2966 -3305599 -2791949 -2262024 -1789980 -1407613 -1108790 -869740 -666509 -479690 -293751 -100368 98621
2977 98621 298778 505736 738894 1022339 1373976 1801653 2300445 2843174 3371401 3803001 4055526 4068703
2989D068703k50865m97746o90475q14153q85440r41895j014302j103060j177933j195981j118993
3000e622140r26736o31450k81744N7480L37398N43632O90282Q01029Q91853R62265R97842
3011b180289R83921R23436Q45036P91025P90611Q38448Q95722R09544Q32896O39224L36387
3022F605961k5767l69635o27516p77197q43113q62936q52336p99067o88164n29394l57282
3033a26446k08994j06048n0601l1575l2321l4917k2367J5141P2775J31597J68677J68157J24879
3046F7957M0584p9391k22748l64670m69310n01182m41893l02035j16082Q0147K68072M42034
3058a598517N90773O88629P07496O38382N03358L48175K20696J51736J51377K16542L33475
3069B952122M72944N91994O50158O30115N44871M24094K91286J52030K439j53021k92261l82660
$$ plain form
2989 4068703 3817838 3320092 2629617 1815464 930024 -11871 -1026173 -2129233 -3307166 -4503147 -5622140
3000 -5622140 -6548876 -7180326 -7462070 -7404590 -7067192 -6523560 -5833278 -5032249 -4140396 -3178131 -2180289
3011 -2180289 -1196368 -272932 572104 1363129 2153740 2992188 3887910 4797454 5630350 6269574 6605961
3022 6605961 6580194 6210559 5583043 4805846 3962733 3099797 2247461 1448394 760230 230836 -126446
3033 -126446 -335440 -441488 -492089 -523664 -555985 -590902 -613269 -598128 -525353 -393756 -225079 -56922 67957
3046 67957 108541 29150 -193598 -558268 -1027578 -1528760 -1970653 -2272688 -2388770 -2308623 -2040551 -1598517
3058 -1598517 -1007744 -319115 388381 1026763 1530121 1878296 2098992 2250728 2402105 2618647 2952122
3069 2952122 3425066 4017060 4667218 5297333 5842204 6266298 6557584 6709614 6712053 6559032 6266771 5884111
3081E884111l98398l34076k03976l1061J61389L47546M91750N49453M83182K84329j6790l62951
3093F854508o93378r58571j124483j177785j131658j017598q64144o83817m81287k72696r2207
3104a643116K1897M7551r999j20116k39918l31649l74978l71423l39818l02109k65793k18382
3116d147853j41252k7408J14586K68105M15050N39113O31344O94402P36850P62979P69023
3127F14939P45185O79264N62535L96723J98531L35j55260k31397k18795j47928p5363m6790
3139B321979o6407j05277j38584j68650k10951k65982l11761l21871k85537k10506j11902
3150A24551j828J10479K08922K65077K49611J55764J3840j19857j94348j91931j31600m9286
3162D39394K4971P6549J02491J06133R6896Q9115R4590J17041J55800K11670K83824L60789
$$ plain form
3081 5884111 5485713 5151637 4947661 4916600 5077989 5425535 5917285 6466738 6949920 7234249 7217459 6854508
3093 6854508 6161130 5202559 4078076 2900291 1768633 751035 -113109 -796926 -1278213 -1550909 -1643116
3104 -1643116 -1621219 -1573668 -1583667 -1703783 -1943701 -2275350 -2650328 -3021751 -3361569 -3663678 -3929471 -4147853
3116 -4147853 -4289105 -4316513 -4201927 -3933822 -3518772 -2979659 -2348315 -1653913 -917063 -154084 614939
3127 614939 1360124 2039388 2601923 2998646 3197177 3197512 3042252 2810855 2592060 2444132 2368769 2321979
3139 2321979 2255572 2150295 2011711 1843061 1632110 1366128 1054367 732496 446959 236453 124551
3150 124551 122723 233202 442124 707201 956812 1112576 1126416 1006559 812211 620280 488680 439394
3162 439394 464365 540914 643405 749538 846434 935549 1030139 1147180 1302980 1514650 1798474 2159263
3174B159263M18634M30313L78099K60922R3602j00874l00115m84968o34515p22050p22089
3185G76222o22980m30045j62136J42983M23158O08073O51689N50731L35583N2541k44163m96024
3197A585632o48265o62885n35488l05772m4891J76898L17211L67802L45136K75021J81505
3208A051904Q5727P883l8538n5518n9430o7339q3689r7738r1310n2896P710N9080P0593L8763
3222G75202j2138n2399n9782j3568J04704K92961N15795P15583Q38040Q54406P68849O11964
3234E339617M29984K71309J68768J25374J15330J00555M9699n1960k01369l76930n39932o43715
3246D786730o54032n72282m39371l10226k23213j90336k04575k49494l06646l59386l93020
3257H84149l96709l68480l15459k50946j94628j68366j81561k22965k73199l24925l87527
$$ plain form
3174 2159263 2577897 3008210 3386309 3647231 3740833 3639959 3339844 2854876 2220361 1498311 776222
3185 776222 153242 -276803 -438939 -295956 127202 735275 1386964 1937695 2273278 2325819 2081656 1585632
3197 1585632 937367 274482 -261006 -566778 -611669 -434771 -117560 250242 595378 870399 1051904
3208 1051904 1137631 1145514 1106976 1051458 992028 924689 841000 743262 651952 599056 606766 665846 736439 775202
3222 775202 763064 710665 650883 637315 742019 1034980 1550775 2266358 3104398 3958804 4727653 5339617
3234 5339617 5769601 6040910 6209678 6335052 6450382 6550937 6600636 6548676 6347307 5970377 5430445 4786730
3246 4786730 4132698 3560416 3121045 2810819 2587606 2397270 2192695 1943201 1636555 1277169 884149
3257 884149 487440 118960 -196499 -447445 -642073 -810439 -992000 -1214965 -1488164 -1813089 -2200616
$$ [...]
##END=	
