##TITLE=	20180606 tagE WTA.2.fid
##JCAMPDX=	6.0	$$ NMR Plug-in 1.14 of MestReNova 12.0.4-22023
##DATATYPE=	NMRSPECTRUM
##DATACLASS=	NTUPLES
##NUMDIM=	1
##ORIGIN=	Bruker BioSpin GmbH
##OWNER=	nmrmse
##.OBSERVEFREQUENCY=	161.8703181109999889
##.OBSERVENUCLEUS=	^31P
##.SOLVENTNAME=	H2O+D2O
##.PULSESEQUENCE=	zgig
##LONGDATE=	2018/06/07 10:33:56.000
##.ACQUISITIONMODE=	SIMULTANEOUS (DQD)
##$ORIGINALFORMAT=	Bruker XWIN-NMR
##$PARAMETERFILE=	(acqus, ASCII, /Users/Rodrigo/Downloads/OneDrive-2019-10-24/20180606%20WTA%20+%202%20mM%20std/20180606%20tagE%20WTA/2/acqus, 0)
$$ ##TITLE= Parameter file, TopSpin 3.5 pl 7
$$ ##JCAMPDX= 5.0
$$ ##DATATYPE= Parameter Values
$$ ##NPOINTS= 19	$$ modification sequence number
$$ ##ORIGIN= Bruker BioSpin GmbH
$$ ##OWNER= nmrmse
$$ $$ 2018-06-07 10:33:56.857 -0500  nmrmse@am400
$$ $$ /opt/data/nmrmse/AUGSBURG/2/acqus
$$ $$ process /opt/topspin3.5pl7/prog/mod/go4
$$ ##$ACQT0= -4.99745346615264
$$ ##$AMP= (0..31)
$$ 100 100 100 100 100 100 100 100 100 100 100 100 100 100 100 100 100 100
$$ 100 100 100 100 100 100 100 100 100 100 100 100 100 100
$$ ##$AMPCOIL= (0..19)
$$ 0 0 0 0 0 0 0 0 0 0 0 0 0 0 0 0 0 0 0 0
$$ ##$ANAVPT= -1
$$ ##$AQSEQ= 0
$$ ##$AQ_mod= 3
$$ ##$AUNM= <au_zg>
$$ ##$AUTOPOS= <>
$$ ##$BF1= 161.870343035
$$ ##$BF2= 399.87
$$ ##$BF3= 161.870343035
$$ ##$BF4= 161.870343035
$$ ##$BF5= 161.870343035
$$ ##$BF6= 161.870343035
$$ ##$BF7= 161.870343035
$$ ##$BF8= 161.870343035
$$ ##$BWFAC= (0..63)
$$ 0 0 0 0 0 0 0 0 0 0 0 0 0 0 0 0 0 0 0 0 0 0 0 0 0 0 0 0 0 0 0 0 0 0 0 0
$$ 0 0 0 0 0 0 0 0 0 0 0 0 0 0 0 0 0 0 0 0 0 0 0 0 0 0 0 0
$$ ##$BYTORDA= 0
$$ ##$CAGPARS= (0..11)
$$ 0 0 0 0 0 0 0 0 0 0 0 0
$$ ##$CHEMSTR= <none>
$$ ##$CNST= (0..63)
$$ 1 1 1 1 1 1 1 1 1 1 1 1 1 1 1 1 1 1 1 1 1 1 1 1 1 1 1 1 1 1 1 1 1 1 1 1
$$ 1 1 1 1 1 1 1 1 1 1 1 1 1 1 1 1 1 1 1 1 1 1 1 1 1 1 1 1
$$ ##$CPDPRG= (0..8)
$$ <> <> <waltz16> <> <> <> <> <> <>
$$ ##$D= (0..63)
$$ 0 6.5 0 0 0 0 0 1.7 0 0 0 0.03 0 0 0 0 0.0002 0 0 0 0 0 0 0 0 0 0 0 0 0
$$ 0 0 0 0 0 0 0 0 0 0 0 0 0 0 0 0 0 0 0 0 0 0 0 0 0 0 0 0 0 0 0 0 0 0
$$ ##$DATE= 1528385636
$$ ##$DE= 6.5
$$ ##$DECBNUC= <off>
$$ ##$DECIM= 4053.33333333333
$$ ##$DECNUC= <off>
$$ ##$DECSTAT= 4
$$ ##$DIGMOD= 1
$$ ##$DIGTYP= 12
$$ ##$DQDMODE= 0
$$ ##$DR= 23
$$ ##$DS= 0
$$ ##$DSPFIRM= 0
$$ ##$DSPFVS= 20
$$ ##$DTYPA= 0
$$ ##$EXP= <P31CPD>
$$ ##$FCUCHAN= (0..9)
$$ 0 1 2 0 0 0 0 0 0 0
$$ ##$FL1= 0
$$ ##$FL2= 0
$$ ##$FL3= 0
$$ ##$FL4= 0
$$ ##$FN_INDIRECT= (0..7)
$$ 0 0 0 0 0 0 0 0
$$ ##$FOV= 0
$$ ##$FQ1LIST= <>
$$ ##$FQ2LIST= <>
$$ ##$FQ3LIST= <>
$$ ##$FQ4LIST= <>
$$ ##$FQ5LIST= <>
$$ ##$FQ6LIST= <>
$$ ##$FQ7LIST= <>
$$ ##$FQ8LIST= <>
$$ ##$FRQLO3= 14447.5139999986
$$ ##$FRQLO3N= 2
$$ ##$FS= (0..7)
$$ 83 83 83 83 83 83 83 83
$$ ##$FTLPGN= 0
$$ ##$FW= 4032000
$$ ##$FnILOOP= 0
$$ ##$FnMODE= 0
$$ ##$FnTYPE= 0
$$ ##$GPNAM= (0..31)
$$ <> <> <> <> <> <> <> <> <> <> <> <> <> <> <> <> <> <> <> <> <> <> <> <>
$$ <> <> <> <> <> <> <> <>
$$ ##$GPX= (0..31)
$$ 0 0 0 0 0 0 0 0 0 0 0 0 0 0 0 0 0 0 0 0 0 0 0 0 0 0 0 0 0 0 0 0
$$ [...]
$$ 130000 130000 130000 130000 130000 130000 130000 0 0 0 0 0 0 0 0 0 0 0
$$ 0 0 0 0 0 0 0 0 0 0 0 0 0
$$ ##$ShimPowMaxUC= (0..63)
$$ 130000 130000 130000 130000 130000 130000 130000 130000 130000 130000 130000
$$ 130000 130000 130000 130000 130000 130000 130000 130000 130000 130000 130000
$$ 130000 130000 130000 130000 130000 130000 130000 130000 130000 130000 130000
$$ 130000 130000 130000 130000 130000 130000 130000 0 0 0 0 0 0 0 0 0 0 0
$$ 0 0 0 0 0 0 0 0 0 0 0 0 0
$$ ##$ShimPowMaxUG= (0..63)
$$ 524287 524287 524287 524287 524287 524287 524287 524287 524287 524287 524287
$$ 524287 524287 524287 524287 524287 524287 524287 524287 524287 524287 524287
$$ 524287 524287 524287 524287 524287 524287 524287 524287 524287 524287 524287
$$ 524287 524287 524287 524287 524287 524287 0 0 0 0 0 0 0 0 0 0 0 0 0 0 0
$$ 0 0 0 0 0 0 0 0 0 0
$$ ##$ShimPowNum= 0
$$ ##$ShimPowRcbType= 3
$$ ##$ShimPowRes= (0..63)
$$ 1e-20 1e-20 1e-20 1e-20 1e-20 1e-20 1e-20 1e-20 1e-20 1e-20 1e-20 1e-20
$$ 1e-20 1e-20 1e-20 1e-20 1e-20 1e-20 1e-20 1e-20 1e-20 1e-20 1e-20 1e-20
$$ 1e-20 1e-20 1e-20 1e-20 1e-20 1e-20 1e-20 1e-20 1e-20 1e-20 1e-20 1e-20
$$ 1e-20 1e-20 1e-20 1e-20 0 0 0 0 0 0 0 0 0 0 0 0 0 0 0 0 0 0 0 0 0 0 0 0
$$ ##$ShimPowRng0= (0..63)
$$ 1 1 1 1 1 1 1 1 1 1 1 1 1 1 1 1 1 1 1 1 1 1 1 1 1 1 1 1 1 1 1 1 1 1 1 1
$$ 1 1 1 1 0 0 0 0 0 0 0 0 0 0 0 0 0 0 0 0 0 0 0 0 0 0 0 0
$$ ##$ShimPowRng1= (0..63)
$$ 1 1 1 1 1 1 1 1 1 1 1 1 1 1 1 1 1 1 1 1 1 1 1 1 1 1 1 1 1 1 1 1 1 1 1 1
$$ 1 1 1 1 0 0 0 0 0 0 0 0 0 0 0 0 0 0 0 0 0 0 0 0 0 0 0 0
$$ ##$ShimPowRng2= (0..63)
$$ 1 1 1 1 1 1 1 1 1 1 1 1 1 1 1 1 1 1 1 1 1 1 1 1 1 1 1 1 1 1 1 1 1 1 1 1
$$ 1 1 1 1 0 0 0 0 0 0 0 0 0 0 0 0 0 0 0 0 0 0 0 0 0 0 0 0
$$ ##$ShimPowRng3= (0..63)
$$ 1 1 1 1 1 1 1 1 1 1 1 1 1 1 1 1 1 1 1 1 1 1 1 1 1 1 1 1 1 1 1 1 1 1 1 1
$$ 1 1 1 1 0 0 0 0 0 0 0 0 0 0 0 0 0 0 0 0 0 0 0 0 0 0 0 0
$$ ##$ShimPowType1= 0
$$ ##$ShimPowType2= 0
$$ ##$ShimPowType3= 0
$$ ##$ShimPowType4= 0
$$ ##$ShimSysAngle= <>
$$ ##$ShimSysFunc= (0..63)
$$ 1 2 3 4 5 6 7 8 9 10 0 37 38 35 16 15 14 13 12 11 28 27 26 25 24 23 36
$$ 22 30 29 20 21 34 33 32 31 17 18 19 0 0 0 0 0 0 0 0 0 0 0 0 0 0 0 0 0 0
$$ 0 0 0 0 0 0 0
$$ ##$ShimSysMatId= <no>
$$ ##$ShimSysMatrix= 1
$$ ##$ShimSysOffset= <>
$$ ##$ShimSysType= 4
$$ ##$ShimUnit= 0
$$ ##$TFXNUM= 0
$$ ##$TOSITY= <no>
$$ ##$TRIPLO2= 0
$$ ##$VTU= 2
$$ ##$VTUETH= <149.236.99.20>
$$ ##$VTUTY= <no>
$$ ##$WBREFAM= (0..15)
$$ 132.6 111.2 100 100 100 100 100 100 100 100 100 100 100 100 100 100
$$ ##$WBREFLM= (0..15)
$$ 0 0 0 0 0 0 0 0 0 0 0 0 0 0 0 0
$$ ##$WBREFPH= (0..15)
$$ 78.43 -67.85 0 0 0 0 0 0 0 0 0 0 0 0 0 0
$$ ##$WBSGU= (0..15)
$$ 0 0 0 0 0 0 0 0 0 0 0 0 0 0 0 0
$$ ##$XFAC= 2
$$ ##END=
$$ 
##$DECIM=	4053.33333333333
##$DSPFVS=	20
##XUNITS=	HZ
##YUNITS=	ARBITRARY UNITS
##FIRSTX=	2442.1812631562502247
##LASTX=	-2491.7281028490956487
##XFACTOR=	-0.30116031044407898243
##YFACTOR=	1.662680078125000174e-05
##NPOINTS=	16384
##XYDATA=	(X++(Y..Y))
$$ [...]
-5695D67524q7689r1788r3212r3444r3428r2791r0155q4710p7405o9885o2980n6499n0184
-5682e76646m4088l7799l0052j9507o179Q044K0396K8831L2882L3092K9896K3759J6275J0161
-5668e10935P615Q822J2057J5270J7462J9060K1433K5804L2434M0406M7758N2177N1921M6575
-5654a12141L6795K3568P965q470k3725l5796m3632m7552m8843m8454m6123m0733l1695j9833
-5640d38669p206M004J2269J7162J8999J8448J6076J2522Q694N660M122M108M881M719J507
-5625c12704n700j5559k5277l2804l8116m2548m6719m9495m9043m4749l7886l0379k3274j6203
-5611g70456p916K491J4843K7692L8639M4939M4653L8148K8323J9142J3824J3657J8647K8620
-5597d44754M3033N9852P5133Q4646Q6057P9586O6698M8613K6063N37k5159m7958o5725p7370
$$ plain form
-5695 467524 379835 288047 194835 101391 7963 -84828 -174983 -259693 -337098 -406983 -469963 -526462 -576646
-5682 -576646 -620734 -658533 -688585 -708092 -714271 -706227 -685831 -657000 -624118 -591026 -561130 -537371 -521096 -510935
-5668 -510935 -503320 -494498 -482441 -467171 -449709 -430649 -409216 -383412 -350978 -310572 -262814 -210637 -158716 -112141
-5654 -112141 -75346 -51778 -43813 -52283 -76008 -111804 -155436 -202988 -251831 -300285 -346408 -387141 -418836 -438669
-5640 -438669 -445875 -441871 -429602 -412440 -393441 -374993 -358917 -346395 -337701 -332041 -327919 -323811 -318930 -314211 -312704
-5625 -312704 -318404 -333963 -359240 -392044 -430160 -472708 -519427 -568922 -617965 -662714 -700600 -730979 -754253 -770456
-5611 -770456 -778372 -775881 -761038 -733346 -694707 -649768 -605115 -566967 -538644 -519502 -505678 -492021 -473374 -444754
-5597 -444754 -401721 -341869 -266736 -182090 -96033 -16447 50251 98864 124927 125464 100305 52347 -13378 -90748
-5583i0748q2089p9685p1823o2062n3800m8208m4482m1774m0438m1273m4231m7435m7963m3456
-5569h39467l3337j8878k627J2465K3475K8506K7847K4405K2081K3127K6639K9385K7765K0069
-5555f28545P481o646j8696k6391k9020k6926k1204j3529n996n05K216L158M231O946J1197
-5540g42229J4935J5397J1076K827o816j5264k1016k3831k4448k3900k3016k1979k0479j7880
-5526h96623j3739q463l308M36K197K409K149K915O567J4566K6911M2288N8865P4616Q7165
-5511f01049R3977R3528Q6248P4076N9343M3849K9066J6302O676O62k025k678l239n914j2567
-5496a23745k3790l8322n3511o6268p4042p5114o8875n6219l9581k2032o140O107J2944J3013
-5482f15575O539l794j3627j9200j9208j4846q449j834M019Q820J2478J4983J6468J7031J6585
$$ plain form
-5583 -90748 -172837 -252522 -324345 -386407 -440207 -488415 -532897 -574671 -615109 -656382 -700613 -748048 -796011 -839467
-5569 -839467 -872804 -891682 -894309 -881844 -858369 -829863 -802016 -777611 -755530 -732403 -705764 -676379 -648614 -628545
-5555 -628545 -621064 -627710 -646406 -672797 -701817 -728743 -749947 -763476 -769472 -769977 -767761 -764603 -760372 -753426 -742229
-5540 -742229 -727294 -711897 -700821 -697994 -704810 -720074 -741090 -764921 -789369 -813269 -836285 -858264 -878743 -896623
-5526 -896623 -910362 -918825 -922133 -921697 -919500 -917091 -914942 -912027 -905460 -890894 -863983 -821695 -762830 -688214 -601049
-5511 -601049 -507072 -413544 -327296 -253220 -193877 -150028 -120962 -104660 -97984 -97322 -99347 -102025 -105264 -111178 -123745
-5496 -123745 -147535 -185857 -239368 -305636 -379678 -454792 -523667 -579886 -619467 -641499 -647639 -641532 -628588 -615575
-5482 -615575 -609036 -612830 -626457 -645657 -664865 -679711 -688160 -689994 -685975 -677155 -664677 -649694 -633226 -616195 -599610
-5467e99610J5197J3249J1613J1159J2192J3849J4240J1496N375k239q601j2075j2582j0415
-5453e37152n498K216J1906K1872L0307L5983L8436L8097L5969L2887K9206K4797J9651J3878
-5439b07445P651J050n534j1144j4462j4388j0366k192R520K2741L4415M2125M5178M4165
-5425e8686M0042L3641K5028J3303k647k2356m2547n8289o5752o4519n7522m8603l9843l0807
-5411c79557k0137p468O099J8863K9589L8126M4972N0511N4408N5614N2913M5575L3813J8894
-5397D2215K761j2605k5910l6904m5969n3237n8252o0457o0128n8300n5694n1592m4124l2152
-5383e50348j6801r93J2124K0807K4835K4637K0299J1843O65r926j6230j6573j2265o317j166
-5368e15409K474M952O635P443P514P792R538J3327J8674K4961L2222M0502M8510N3340N2099
$$ plain form
-5467 -599610 -584413 -571164 -559551 -548392 -536200 -522351 -508111 -496615 -491240 -493479 -502080 -514155 -526737 -537152
-5453 -537152 -542650 -540434 -528528 -506656 -476349 -440366 -401930 -363833 -327864 -294977 -265771 -240974 -221323 -207445
-5439 -207445 -199794 -198744 -204278 -215422 -229884 -244272 -254638 -256830 -247310 -224569 -190154 -148029 -102851 -58686
-5425 -58686 -18644 14997 40025 53328 50681 28325 -14222 -72511 -138263 -202782 -260304 -308907 -348750 -379557
-5411 -379557 -399694 -407162 -401063 -382200 -352611 -314485 -269513 -219002 -164594 -108980 -56067 -10492 23321 42215
-5397 42215 44976 32371 6461 -30443 -76412 -129649 -187901 -248358 -308486 -366786 -422480 -474072 -518196 -550348
-5383 -550348 -567149 -568142 -556018 -535211 -510376 -485739 -465440 -453597 -452932 -462858 -479088 -495661 -507926 -514243 -515409
-5368 -515409 -512935 -507983 -501348 -493905 -486391 -478599 -469061 -455734 -437060 -412099 -379877 -339375 -290865 -237525 -185426
-5353a85426M4004L0942J6224K958o673j1418j0991o607j096K244J207m759j4977k7817m1046
-5338b13231n2517o0813o5417o6599o5208o2516o0065n9220o0766o4476o8730p0774o8124
-5325a038456o0100m8077l4428k0860p551O471K1478L5706M6285N1493N2034N0123M7776M5826
-5311h52280M3835M0771L5933K9847K4781K4098L0325M3708O1872Q0496R4549R9746R3737
-5298a48582P6403M9885J8303j2992l8723n4994o0283n6174m6674l6049k6773j9359j3238
-5285c69250p444o06Q882K1667L6033M7667N1610M5339L0598J2683k339j0926j3954j5351
-5271a65391j8877k5713l4515m2826m8457n0254m8039m2278l3606k2824j1360j031O657J1381
-5257e27133J3830J4822J4414J2082P756J980m824j2925k2731l3434m2888m8683m9362m4372
$$ plain form
-5353 -185426 -141422 -110480 -94256 -91298 -97971 -109389 -120380 -126987 -128083 -125839 -124632 -129391 -144368 -172185 -213231
-5338 -213231 -265748 -326561 -391978 -458577 -523785 -586301 -646366 -705586 -766352 -830828 -899558 -970332 -1038456
-5325 -1038456 -1098556 -1146633 -1181061 -1201921 -1209472 -1203001 -1181523 -1145817 -1099532 -1048039 -996005 -945882 -898106 -852280
-5311 -852280 -808445 -767674 -731741 -701894 -677113 -653015 -622690 -578982 -517110 -436614 -342065 -242319 -148582
-5298 -148582 -72179 -22294 -3991 -16983 -55706 -110700 -170983 -227157 -273831 -309880 -336653 -356012 -369250
-5285 -369250 -376694 -377300 -368418 -346751 -310718 -263051 -211441 -166102 -135504 -122821 -125160 -136086 -150040 -165391
-5271 -165391 -184268 -209981 -244496 -287322 -335779 -386033 -434072 -476350 -509956 -532780 -544140 -545171 -538514 -527133
-5257 -527133 -513303 -498481 -484067 -471985 -464229 -462249 -467073 -479998 -502729 -536163 -579051 -627734 -677096 -721468
-5243g21468l4030k0172o360L243N185j759j5636l1669m3930m7967m2316k8026p383J6594
-5229i75694M0167N9224P0071P0539O1085M5019K7368J2819L816Q2J7K520P686J5745K5549
-5214e33987L4099L7676L4308K5416J5056P374M476O260J1495J8910K7393L5772M2360M5108
-5200a88284M2887L6896L0351K5919K3610K0950J5219N336p979k3196l9060n4709o8777p8551
-5186b59388q0610p2936n7204l8655k3328j4597j1928j2274j2219r385k642P911K0620L2240
-5172e34395L9164L9313L2963K1966Q564m931j6167k2841k3451j8173r422r80M311O380P614
-5157d70085J0607J6315K3717L0414L3511L0788K1806Q351n969j6992k1866k0735j6733j4220
-5143c91091j6415k4038l5307m6614n3838n4153m7100l4239j7843j56J6662L0551L9752M3210
$$ plain form
-5243 -721468 -755498 -775670 -782030 -778787 -773602 -775361 -790997 -822666 -866596 -914563 -956879 -984905 -992288 -975694
-5229 -975694 -935527 -876303 -806232 -735693 -674608 -629589 -602221 -589402 -585586 -585504 -585487 -582967 -575281 -559536 -533987
-5214 -533987 -499888 -462212 -427904 -402488 -387432 -380058 -375582 -369322 -357827 -338917 -311524 -275752 -233392 -188284
-5200 -188284 -145397 -108501 -78150 -52231 -28621 -7671 7548 12884 4905 -18291 -57351 -112060 -180837 -259388
-5186 -259388 -339998 -412934 -470138 -508793 -532121 -546718 -558646 -570920 -583139 -592524 -595166 -587255 -566635 -534395
-5172 -534395 -495231 -455918 -422955 -400989 -392425 -397356 -413523 -436364 -459815 -477988 -487410 -488390 -484079 -477699 -470085
-5157 -470085 -459478 -443163 -419446 -389032 -355521 -324733 -302927 -294576 -300545 -317537 -339403 -360138 -376871 -391091
-5143 -391091 -407506 -431544 -466851 -513465 -567303 -621456 -668556 -702795 -720638 -720794 -704132 -673581 -633829 -590619
-5129e90619M0871L3959K4820J6073R426N285L241K824L628M567L786o57r801k3297l9672
-5114e15566n7073p3264q5449r0732q7241p4950n5249l0523m074K0133L8159M7549M8478M3966
-5100h75836L8162L4125L2814L3520L5078L6833L8637L9722L8380L3426K5971J8991J4875
-5087d55302J3548J2910J1008P719M531L221M947J0203J8680K9080L9343M7358N1465N0598
-5073a50691M4511L3869J9905L998j2372k7331l8720m4461m3297l5509k3010q396O063J8653
-5059b56788K7832L1988L0246K3788J6212J1714J2177J6009J9614K0064J6674J0864N022J151
-5045a3433k80l29l35n63J87L413R361J6205K0725K0359J5081P085j335r243j6689k3872l0951
-5028d614l7997m4550m9492n1892n2050n1445n1114n0299m6822l8808k6154j0493N413J8438
$$ plain form
-5129 -590619 -549748 -515789 -490969 -474896 -465470 -460185 -456944 -454120 -450492 -445925 -442139 -442796 -452597 -475894 -515566
-5114 -515566 -572639 -645903 -731352 -822084 -909325 -984275 -1039524 -1070047 -1074121 -1053988 -1015829 -968280 -919802 -875836
-5100 -875836 -837674 -803549 -770735 -737215 -702137 -665304 -626667 -586945 -548565 -515139 -489168 -470177 -455302
-5087 -455302 -441754 -428844 -417836 -410117 -405586 -402365 -397418 -387215 -368535 -339455 -300112 -252754 -201289 -150691
-5073 -150691 -106180 -72311 -52406 -48408 -60780 -88111 -126831 -171292 -214589 -250098 -273108 -281504 -275441 -256788
-5059 -256788 -228956 -196968 -166722 -142934 -126722 -115008 -102831 -86822 -67208 -47144 -30470 -19606 -14584 -13433
-5045 -13433 -13713 -14042 -14377 -14940 -14753 -11340 -1979 14226 34951 55310 70391 77476 76141 66898 50209 26337 -4614
-5028 -4614 -42611 -87161 -136653 -188545 -240595 -292040 -343154 -393453 -440275 -479083 -505237 -515730 -510317 -491879
-5014d91879K5922K6746K1823J3612N182p64k591n20L993R420J5129K1308K7826L3610L7381
-4999b53802L8508L7429L4725K9948K1764R345o023k0972l1361l4663l1357k4022j5409p344
-4985b53234j296J520N97l904j1245k0039k7933l1967k9817k1079p464Q376K3865L7120M7007
-4970b89493N2999N4749N2050M5386L6193K6064J6346P884R74m671r751j5126k1506k8990
-4956g6892l7017m4581n0609n4050n4270n1282m5511l7484k7877j7706q101R2O704J2245J7480
-4941d68859K2708K7377L0345L0396K6752J9328R078j934j1354j7455j9630j8478j5689j3182
-4927d00597j1846j1131r939p511l304K904J0836J9817K8808L6488M1184M1082L4662K1174
-4913b07373J546k0713m0167n1926n4288m9568m2531l7724l7130l9491m1798m1259l6537k7788
$$ plain form
-5014 -491879 -465957 -439211 -417388 -403776 -398594 -399358 -401949 -402469 -398476 -389056 -373927 -352619 -324793 -291183 -253802
-4999 -253802 -215294 -177865 -143140 -113192 -91428 -82083 -88106 -109078 -140439 -175102 -206459 -230481 -245890 -253234
-4985 -253234 -254530 -253010 -252413 -256317 -267562 -287601 -315534 -347501 -377318 -398397 -405861 -397485 -373620 -336500 -289493
-4970 -289493 -236494 -181745 -129695 -84309 -48116 -22052 -5706 2178 3152 -1519 -11270 -26396 -47902 -76892
-4956 -76892 -113909 -158490 -209099 -263149 -317419 -368701 -414212 -451696 -479573 -497279 -505380 -505288 -498584 -486339 -468859
-4941 -468859 -446151 -418774 -388429 -358033 -331281 -311953 -302875 -304809 -316163 -333618 -353248 -371726 -387415 -400597
-4927 -400597 -412443 -423574 -433513 -441024 -444328 -441424 -430588 -410771 -381963 -345475 -304291 -263209 -228547 -207373
-4913 -207373 -205827 -226540 -266707 -318633 -372921 -422489 -465020 -502744 -539874 -579365 -621163 -662422 -698959 -726747
-4899g26747j6179l299Q986J8718K4525K6138K4347K0328J4804P701j316j1676k1476k7733
-4885f62879k7445j9104l914J4335L1380M4866N5152O4039P2836Q1385Q8622R3373R4319Q9955
-4871A6920P9375O3369M4539K6569J3231P164Q622J4634K0474K2399J9834J4737R211L502
-4857C64580l801j3743k5390l6139m3654m7303m8044m7232m5490m2775l9126l5623l4255l6640
-4843a34635m2645n0330n6981o0395n9735n5376m8300l9417k9384j8520o834N683J8344K9100
-4829e49425L4855L2583K0667l47k7389n5307p8501r2860r7192r3263q4650p4852o5757n7421
-4815a188859m8888l9174k7668j4234P07J5904K9273L8338M1327L8229L0902K2142J4477R404
-4801a078120P406Q400J1698J5996J9888K2542K3670K3234K1327J8174J3726P746P17n549
$$ plain form
-4899 -726747 -742926 -746225 -737239 -718521 -693996 -667858 -643511 -623183 -608379 -600678 -601994 -613670 -635146 -662879
-4885 -662879 -690324 -709428 -713342 -699007 -667627 -622761 -567609 -503570 -430734 -349349 -260727 -167354 -73035 16920
-4871 16920 96295 159664 204203 230772 244003 251167 259789 274423 294897 317296 337130 351867 361078 364580
-4857 364580 360779 347036 321646 285507 241853 194550 146506 99274 53784 11009 -28117 -63740 -97995 -134635
-4843 -134635 -177280 -227610 -284591 -344986 -404721 -460097 -508397 -547814 -577198 -595718 -602552 -596869 -578525 -549425
-4829 -549425 -514570 -481987 -461320 -461667 -489056 -544363 -622864 -715724 -812916 -906179 -990829 -1065681 -1131438 -1188859
-4815 -1188859 -1237747 -1276921 -1304589 -1318823 -1318116 -1302212 -1272939 -1234601 -1193274 -1155045 -1124143 -1102001 -1087524 -1078120
-4801 -1078120 -1070714 -1062314 -1050616 -1034620 -1014732 -992190 -968520 -945286 -923959 -905785 -892059 -884313 -883596 -889145
-4787h89145q773p958m073J160O692J2199J6799J8504J5696Q925J447k586p34O096J4251J9686
-4771g91814K0276J6657J1483Q393J0252J7570K7703L5966L8618L5259K8727K2604J8845J7422
-4757d82039J7509J8828K2279K9066L9449N2068O4261P3206P7101P5845P0524O1888M9671
-4744A69656L3534J4506m909k2066l5301m3774m7331m6913m4606m2856m3137m5034m6635m6255
-4730b51121m3585l9476l4991l0978k8257k7591k8837l0140k8529k1707r619N625K1223L4806
-4716e13177M4707N0101N1303M9807M7199M3702L8069K8951J6344J889j2069k3712l2224l7543
-4702b46653l9619l7974l2378k3801j4596p485m378n539r668j5118k0924k6364l0202l0788
-4688e45487k7003j9094q521K919J4179K5207L5898M4710M8785M5750L5814K2062Q719j326
$$ plain form
-4787 -889145 -897918 -905876 -909949 -908789 -902097 -889898 -873099 -854595 -838899 -829974 -828527 -831113 -831847 -825751 -811500 -791814
-4771 -791814 -771538 -754881 -743398 -735005 -724753 -707183 -679480 -643514 -604896 -569637 -540910 -518306 -499461 -482039
-4757 -482039 -464530 -445702 -423423 -394357 -354908 -302840 -238579 -165373 -88272 -12427 58097 119985 169656
-4744 169656 203190 217696 212787 190721 155420 111646 64315 17402 -27204 -70060 -113197 -158231 -204866 -251121
-4730 -251121 -294706 -334182 -369173 -400151 -428408 -455999 -484836 -514976 -543505 -565212 -574831 -569206 -547983 -513177
-4716 -513177 -468470 -418369 -367066 -317259 -270060 -226358 -188289 -159338 -142994 -141105 -153174 -176886 -209110 -246653
-4702 -246653 -286272 -324246 -356624 -380425 -395021 -402506 -406884 -412423 -422091 -437209 -458133 -484497 -514699 -545487
-4688 -545487 -572490 -591584 -600105 -597186 -583007 -557800 -521902 -477192 -428407 -382657 -346843 -324781 -316062 -317388
-4674c17388p827j2488j7190k2795k8857l4178l7491l7981l5272k9107j9124m680J4758L8714
-4660e50906O4631Q7910J03415J07841J01024Q5584O5072M2389J9464j981j9868l2506l9777
-4647C2292m3405m5745m8181n0090m9260m3549l2590j8265l756Q186J6497K1833K5550K8880
-4633b01603L2301L4668L2988K4082O830j6846m3092o7894q8059j01271j06229j02952r3140
-4620f90217p9567o4902n0514l6352k1875o905P880K1271L2267M0690M7297N3036N8253O2199
-4606f27439O3574O1502N6142M8265L8307K6206J2187k456j4980k2080k1401j2800J680J8585
-4592c74708L4437M6578N3883N6415N4652M9166M0996L1977K3926J7436J1492M620l599j1839
-4578C5432j7719j9052j5515r698n866p167j3598k2269k9658l3574l3862l1628k7931k3204
$$ plain form
-4674 -317388 -325215 -337703 -354893 -377688 -406545 -440723 -478214 -516195 -551467 -580574 -599698 -604378 -589620 -550906
-4660 -550906 -486275 -398365 -294950 -187109 -86085 -501 64571 106960 126424 124443 104575 72069 32292
-4647 32292 -11113 -56858 -105039 -155129 -204389 -247938 -280528 -298793 -302549 -294363 -277866 -256033 -230483 -201603
-4633 -201603 -169302 -134634 -101646 -77564 -70734 -87580 -130672 -198566 -286625 -387896 -494125 -597077 -690217
-4620 -690217 -769784 -834686 -885200 -921552 -943427 -950332 -942452 -921181 -888914 -848224 -800927 -747891 -689638 -627439
-4606 -627439 -563865 -502363 -446221 -397956 -359649 -333443 -321256 -323712 -338692 -360772 -382173 -394973 -393293 -374708
-4592 -374708 -340271 -293693 -239810 -183395 -128743 -79577 -38581 -6604 17322 34758 46250 50870 47271 35432
-4578 35432 17713 -1339 -16854 -26552 -32418 -39585 -53183 -75452 -105110 -138684 -172546 -204174 -232105 -255309
-4564b55309j7997j3503j1110j1341j3557j6596j9578k2323k5446k9514l4182l7962l8839
-4551e47257l5214k6831j5113k662Q075J6261K2874K9495L7029M5253N3217N9544O2477O0086
-4537b32766N1186L6589J9245L310p565j1510r232l627J939N340O377N965M646J956k931j0148
-4521a41226j8653k6473l1433l1923k8038k1598j5061r863o076k551K479J0110J9862K9387
-4507b71057L5306L4747K6702J2743l712j8676k8851l2415k9631k2931j6025j2173j2453j4827
-4493c53253j5451j1963m981K523P396Q454O134J915l056p509r749q671m876j699k551q321
-4477d05658j6954k5463l2142l6298l7071l2754k2233n869J3660L1687M3029M4775L7558K5361
-4463d18372J3068M101k98k70L180Q268J2618J4307J2784R112M815P67l314q207j4582k3076
$$ plain form
-4564 -255309 -273306 -286809 -297919 -309260 -322817 -339413 -358991 -381314 -406760 -436274 -470456 -508418 -547257
-4551 -547257 -582471 -609302 -624415 -627077 -619002 -602741 -579867 -550372 -513343 -468090 -414873 -355329 -292852 -232766
-4537 -232766 -181580 -144991 -125746 -122436 -130001 -141511 -150743 -154370 -152431 -147091 -140714 -134749 -130103 -128147 -131078 -141226
-4521 -141226 -159879 -186352 -217785 -249708 -277746 -299344 -314405 -324268 -330344 -332895 -330416 -320306 -300444 -271057
-4507 -271057 -235751 -201004 -174302 -161559 -165271 -183947 -212798 -245213 -274844 -297775 -313800 -325973 -338426 -353253
-4493 -353253 -368704 -380667 -385648 -383125 -375729 -367275 -361141 -359226 -362282 -369791 -379540 -388211 -393087 -394786 -397337 -405658
-4477 -405658 -422612 -448075 -480217 -516515 -553586 -586340 -608573 -614442 -600782 -569095 -526066 -481291 -443733 -418372
-4463 -418372 -405304 -401203 -401501 -401771 -398591 -390323 -377705 -363398 -350614 -341502 -336687 -335920 -339234 -347441 -362023 -385099
-4447c85099l4276m8210o3187p5855q2637q1434p2122n6449l7177j7300Q38J5791K7001L4924
-4433h75192M1071M7627N6098O6448P6817Q4059Q4900P7683O3861M7681L4159K6603K5432
-4420a42753K8863L4097L8452L9838L7376L1327K2872J3614N218r09m095m111n70P222J9108
-4405A25549L2478M2682M5621M0044K7514J0590q419k7126m2605n2026n3995m9564m1602l2970
-4391A6171k4753j6495p842K30N780P048L503l735j2272j9254k2552k1591j7264j1346n297
-4376a29669K83N381R778J2550J2759J0672Q091P291R071J1763J2482R305K626n226j1221
-4361c4064j2715q340J415J4195K6469L4761L6748L1639K0431O284n993j2121j1040n564j91
-4346H1914J690r50p768j7913k9627l9907m5607m5256l9848l2077k4810j9984j8384j9636
$$ plain form
-4447 -385099 -419375 -467585 -530772 -606627 -689264 -770698 -842820 -899269 -936446 -953746 -952908 -937117 -910116 -875192
-4433 -875192 -834121 -786494 -730396 -663948 -587131 -503072 -418172 -340489 -276628 -228947 -194788 -168185 -142753
-4420 -142753 -113890 -79793 -41341 -1503 35873 67200 90072 103686 108904 107995 103900 99789 99219 106441 125549
-4405 125549 158027 200709 246330 286374 313888 324478 316059 288933 246328 194302 140307 90743 49141 16171
-4391 16171 -8582 -25077 -32919 -32689 -26909 -19861 -16358 -20093 -32365 -51619 -74171 -95762 -113026 -124372 -129669
-4376 -129669 -129386 -124005 -114227 -101677 -88918 -78246 -70155 -62864 -53793 -42030 -29548 -20243 -17617 -22843 -34064
-4361 -34064 -46779 -55119 -53704 -39509 -13040 21721 58469 90108 110539 116823 110830 98709 87669 82105 81914
-4346 81914 83604 82654 74886 56973 27346 -12561 -58168 -103424 -143272 -175349 -200159 -220143 -238527 -258163
-4332b58163k2491k5075k5660k3321j8060j0274k96J1568K4987L9259N2541O1806O4242N9151
-4318f9786M8768L7182K7837K1437J5873Q089l451j7354l0167l8738m2152m1548l8411l3869
-4304a56290k8944k4754k1874j9649j6297j0143j329P781J3888J5382J4019J3876J8187K6756
-4290a69391L6318M2920M4388M0956L4200K5579J5971O197k610r328j3491j5546j6136j5054
-4276D973j1034l224P577J9102K9383L8036M5791N2703N6925N5899M8563L6360K2428R802
-4262D13284M42m668n241j616N185J3844K2891L0446L4056L1620K2942J0270k852j4011k3213
-4247E33379l2012m1639n1871o1446o8836p2878p2814o8006n7510m0511j7273J0308L8772
-4234b337O4562Q5225R9440J05968J03158Q9945O7171L7930O404k3394m8514o6910p7595q1056
$$ plain form
-4332 -258163 -280654 -305729 -331389 -354710 -372770 -383044 -383340 -371772 -346785 -307526 -254985 -193179 -128937 -69786
-4318 -69786 -21018 16164 44001 65438 81311 89400 85949 68595 38428 -310 -42462 -84010 -122421 -156290
-4304 -156290 -185234 -209988 -231862 -251511 -267808 -277951 -279280 -271499 -257611 -242229 -228210 -214334 -196147 -169391
-4290 -169391 -133073 -90153 -45765 -4809 29391 54970 70941 77138 74528 65200 51709 36163 20027 4973
-4276 4973 -6061 -9285 -1708 17394 46777 84813 130604 183307 240232 296131 344694 381054 403482 413284
-4262 413284 413726 409058 403817 402201 407386 421230 444121 474567 508623 540243 563185 573455 570603 556592 533379
-4247 533379 501367 459728 407857 346411 277575 204697 131883 63877 6367 -34144 -51417 -41109 -2337
-4234 -2337 62225 147450 246890 352858 456016 545961 613132 651062 657466 634072 585558 518648 441053 359997
-4220C59997p9235p4495o8165n9958m9216l6540k4320j5626j2559j5644k3716l4236m4019
-4207a77732n0623n3096n1806m7577m1632l5644l1179k8900k8283k8026k6855k4107j9732
-4194f45192j4088p788j759K634L914J395m229j1231j7333j9873j6413o312P829K0597K6758
-4179f81091K4593J6365N717m902j4744k3996l2632l9652m3764m4902m4383m3310m1552l8006
-4165a006259l1758k2787j2000r5J3200K8620M5923O2999P6881Q5528Q8731Q7841Q4848Q1503
-4151d16825P8564P5672P1987O6586N8208M5208K6384K356k3563m5985n9404o0641n0104l1182
-4137b62739q845J1661K5648L0013K4207J0745n762k0548l0200l2993k8674j8278l476J3967
-4123b95274L2079M8385O0132O4948O1614N0816L5286J8526K868j1324k4307l5314m2327m3812
$$ plain form
-4220 359997 280762 206267 138102 78144 28928 -7612 -31932 -47558 -60117 -75761 -99477 -133713 -177732
-4207 -177732 -228355 -281451 -333257 -380834 -422466 -458110 -489289 -518189 -546472 -574498 -601353 -625460 -645192
-4194 -645192 -659280 -667068 -668827 -666193 -662279 -660884 -665113 -676344 -693677 -713550 -729963 -736275 -728446 -707849 -681091
-4179 -681091 -656498 -640133 -634416 -639318 -654062 -678058 -710690 -750342 -794106 -839008 -883391 -926701 -968253 -1006259
-4165 -1006259 -1038017 -1060804 -1072804 -1072899 -1059699 -1031079 -985156 -922157 -845276 -759748 -671017 -583176 -498328 -416825
-4151 -416825 -338261 -262589 -190602 -124016 -65808 -20600 5784 8140 -15423 -61408 -120812 -181453 -231557 -262739
-4137 -262739 -271584 -259923 -234275 -204262 -180055 -169310 -175072 -195620 -225820 -258813 -287487 -305765 -309241 -295274
-4123 -295274 -263195 -214810 -154678 -89730 -28116 22700 57986 76512 79380 68056 43749 8435 -33892 -77704
-4109g7704m0446l4818k9591k5765k2538j8521j2637m656M877J4929K4408L2936M0830M8324
-4095a00372N4768N8822N9151N5477M8702M0473L2587K6249K1610J7677J2766N373n144j8257
-4081C09882l2212m4059n0179m8012l7879k3303r754k462m278j4854l1223m9353o5638p7474
-4067a80798q3276q2310p4863o2620m8570l5809k5683j7469r696j693N909J1950J5794J7767
-4053e71367J8584J8928J9232J9534J9272J7438J3233P014M79m194n516l286J547P327J2445
-4038d29330J6213J9365K3329K8641L4144L7825L8532L6724L3746L0611K7356K3486J8570
-4025f0788J2829P041K035k131o307j1378j6927k0888k0821j5667o256N875J9878L5580N2229
-4010b5696O7492P7721P9634P2256N7566L9840K3830J2657O496K964j141p948j7658k8555
$$ plain form
-4109 -77704 -118150 -152968 -182559 -208324 -230862 -249383 -262020 -266676 -261799 -246870 -222462 -189526 -148696 -100372
-4095 -100372 -45604 13218 72369 127846 176548 217021 249608 275857 297467 315144 327910 333283 328139 309882
-4081 309882 277670 233611 183432 135420 97541 74238 64484 62022 57744 42890 11667 -37686 -103324 -180798
-4067 -180798 -264074 -346384 -421247 -483867 -532437 -568246 -593929 -611398 -621094 -622787 -616878 -604928 -589134 -571367
-4053 -571367 -552783 -533855 -514623 -495089 -475817 -458379 -445146 -438132 -437653 -441847 -447363 -450649 -449102 -441775 -429330
-4038 -429330 -413117 -393752 -370423 -341782 -307638 -269813 -231281 -194557 -160811 -130200 -102844 -79358 -60788
-4025 -60788 -47959 -40918 -38883 -41014 -47321 -58699 -75626 -96514 -117335 -133002 -139258 -133383 -113505 -77925 -25696
-4010 -25696 41796 119517 199151 271407 328973 368813 392643 405300 411796 414760 413619 405671 388013 359458
-3996C59458l7834m2753m1901l6108k7897j9983j3750r277o075m094l798n448q581j2445j6799
-3981G2715k1973k8164l4886m1235m6646n0704n3048n3222n0616m4721l5521k3748j0507K890
-3967d19386J5073K4980L2523L8564M3936M8341N0225M8100M1907L3017K2884J2059M07j1719
-3953a9089k2952l1691l6901l8437l6465l1560k4683j6937r135j788M190P531P490M719Q19
-3938b44889k833n858q575j1321j3853j5248j4582j1928q407n203k371O54L896O552P573O325
-3922c20068K935j790o860j1239j3723j2898p869J123J2481K3704L1961L4903L1541K2918
-3908b12881J1620N51q399j4600j8386k0067j9444j5990r774j957N859J2523J7587K0449J9498
-3893b33411J2341k676k5078n1576p6520r3290r6750q5457o2116l2313k467K1950L7300M2199
$$ plain form
-3996 359458 321624 278871 236970 200862 172965 152982 139232 129955 123880 119786 115988 110540 101959 89514 72715
-3981 72715 50742 22578 -12308 -53543 -100189 -150893 -203941 -257163 -307779 -352500 -388021 -411769 -422276 -419386
-3967 -419386 -404313 -379333 -346810 -308246 -264310 -215969 -165744 -117644 -75737 -42720 -19836 -7777 -7370 -19089
-3953 -19089 -42041 -73732 -110633 -149070 -185535 -217095 -241778 -258715 -267850 -269638 -265448 -257917 -250427 -245708 -244889
-3938 -244889 -247722 -253580 -262155 -273476 -287329 -302577 -317159 -329087 -337494 -342697 -345068 -344414 -340518 -333966 -326393 -320068
-3922 -320068 -317133 -318923 -325783 -337022 -350745 -363643 -371512 -370389 -357908 -334204 -302243 -267340 -235799 -212881
-3908 -212881 -201261 -200710 -209109 -223709 -242095 -262162 -281606 -297596 -307370 -309327 -303468 -290945 -273358 -252909 -233411
-3893 -233411 -221070 -223746 -248824 -300400 -376920 -470210 -566960 -652417 -714533 -746846 -749313 -727363 -690063 -647864
-3879f47864L7379K5297R936l730j1123r956j450J0148J9591K3156K0761J6001J3722J6975
-3865d81157K5375L5974M5249N0675N0984M5691L5177K1251P093m000j0528j3706j6059j8801
-3851b26782k0693j9733j5713j0676p078n620m999l473n58K756N097O294P756J1370J7773
-3836b64279K5738L3053L7754L8605L5245K7816J6696L071j0551k1114k6975k9079k9979l1574
-3822a95573l3576l3833l0128k1912j0882P3Q546J3261J3518Q781p16j3093k5140l3811l7790
-3807c92275l7595l4590l0199k5840k2672k0939k0080j9207j7468j4193r045k214N498J2534
-3793f28285J6901J6985J2585N332j817o353p407n709k415J888P375J4687K4328L5582M6050
-3778d70273N2828N4062M9576M0387K8232J5396M576j945l177M21P304J5316K2067K5671K5523
$$ plain form
-3879 -647864 -610485 -585188 -575252 -578982 -590105 -600061 -601511 -591363 -571772 -548616 -527855 -511854 -498132 -481157
-3865 -481157 -455782 -419808 -374559 -323884 -272900 -227209 -192032 -170781 -163688 -167688 -178216 -191922 -207981 -226782
-3851 -226782 -247475 -267208 -282921 -293597 -300675 -306295 -311294 -314767 -315325 -312569 -307472 -301178 -293422 -282052 -264279
-3836 -264279 -238541 -205488 -167734 -129129 -93884 -66068 -49372 -46301 -56852 -77966 -104941 -134020 -163999 -195573
-3822 -195573 -229149 -262982 -293110 -315022 -325904 -325831 -317285 -304024 -290506 -281725 -282441 -295534 -320674 -354485 -392275
-3807 -392275 -429870 -464460 -494659 -520499 -543171 -564110 -584190 -603397 -620865 -635058 -644103 -646317 -640819 -628285
-3793 -628285 -611384 -594399 -581814 -576482 -578299 -584652 -592059 -597768 -600183 -598295 -590920 -576233 -551905 -516323 -470273
-3778 -470273 -417445 -363383 -313807 -273420 -245188 -229792 -225216 -227161 -230338 -229917 -222613 -207297 -185230 -159559 -134036
-3763a34036K2370J7674J2948R191O279K913k122q607j4569j7990j8477j7044j4641j1055
-3749a67166n624J222P381J0284Q682L519k441o131n159J731J4027K9107M3417N4458O1516
-3734D8823O4732O3803N7590M5120K6996O192j2547k4696k8246k4457j6726q709l153j640
-3720A93082m657j1426j9982k7480l0666k6631j4645K651J9674L0573L2141K4842J1346n367
-3706A73455k3029m0059n5164o6944p3682p3940o7589n6694m4986l5922l0488k6556k0621
-3693d42219j0339M125K0479L5488M6227N0845M9187M3133L5951L0177K5751K0458J2300J871
-3679g6566p577j2356j0774m246L657R228J0254O368j275j0503j8701k3702k4582k1389j4545
-3664a96709m786O382J6956K5005K9075K8465K3705J6700J0004N437L421L453M875P209J0217
$$ plain form
-3763 -134036 -111666 -93992 -81044 -71853 -65574 -62661 -64783 -73390 -87959 -105949 -124426 -141470 -156111 -167166
-3749 -167166 -172790 -171568 -164187 -153903 -145221 -141702 -144143 -150274 -155433 -153702 -139675 -110568 -67151 -12693 48823
-3734 48823 113555 177358 234948 280068 307064 313256 300709 276013 247767 223310 206584 197875 194722 193082
-3720 193082 188425 176999 157017 129537 98871 72240 57595 60246 79920 110493 142634 167476 178822 173455
-3706 173455 150426 110367 55203 -11741 -85423 -159363 -226952 -283646 -328632 -364554 -395042 -421598 -442219
-3693 -442219 -452558 -448433 -427954 -392466 -346239 -295394 -246207 -203074 -167123 -136946 -111195 -90737 -78437 -76566
-3679 -76566 -84143 -96499 -107273 -111519 -107862 -98634 -88380 -82012 -83287 -93790 -112491 -136193 -160775 -182164 -196709
-3664 -196709 -201495 -195113 -178157 -153152 -124077 -95612 -71907 -55207 -45203 -39766 -36345 -32892 -28017 -20808 -10591
-3649a0591J3967J8374K2553K5230K5742K4796K3877K4096K5342K6449K6418K5279K3533K0951
-3635C16016J6179Q085k531j2794j9801k3156k5175k8769l4808m1369m5286m4576l9571l2017
-3621i573k3837j6649j1742r358p921n100J57O638J1842J3644J1368O096M81k506j155L975
-3605c3640J0205J3885J2226M584p173j9598k9451l4890l5579l2144k6121j9788j5636j5156
-3591b28276j8008k1908k3958k2157j6578q782p78N834R973J0416N823m082j7164k9645l8340
-3576c97630m2462m3554m3599m3090m0483l3958k3300r846M673J8817L0865L8696M0677L6823
-3562e07371K8780J8832R222J662l054n168n772o337q291j2143j6546j8416j4686m472J0367
-3547e33393K6629M1600N3695O1943O5735O5349O2245N8211N3873M8071L8955K5707R595o299
$$ plain form
-3649 -10591 3376 21750 44303 69533 95275 120071 143948 168044 193386 219835 246253 271532 295065 316016
-3635 316016 332195 340280 337749 324955 305154 281998 256823 228054 193246 151877 106591 62015 22444 -9573
-3621 -9573 -33410 -50059 -61801 -71159 -79080 -84180 -84023 -77385 -65543 -51899 -40531 -34435 -33954 -36460 -37615 -33640
-3605 -33640 -23435 -9550 2676 7260 87 -19511 -48962 -83852 -119431 -151575 -177696 -197484 -213120 -228276
-3591 -228276 -246284 -268192 -292150 -314307 -330885 -339667 -340445 -334611 -324638 -314222 -308399 -312481 -329645 -359290 -397630
-3576 -397630 -440092 -483646 -527245 -570335 -610818 -644776 -668076 -677922 -673249 -654432 -623567 -584871 -544194 -507371
-3562 -507371 -478591 -459759 -450537 -448875 -451929 -457097 -462869 -469206 -477497 -489640 -506186 -524602 -539288 -543760 -533393
-3547 -533393 -506764 -465164 -411469 -349526 -283791 -218442 -156197 -97986 -44113 3958 42913 68620 78215 71916
-3533G1916j8372k3932k2376j5435o416R76L978J951l118p456p463j880P269J5685J9071J4908
-3517B9306K797j6345m0277o5176q6183r9113j02322r7053q6475p4122o2749n3597m6220l8949
-3503h36478l0260k0178j0219j959M841J2426K3623L9437N7784P4011Q3038Q1642O9994N1254
-3489d01044L0512J2998K182j522k45K878N082M690J286m277j0100j3968j4141j0018k623
-3474c98310N580J1787J4208J2671Q059J663n400j2032j7386k0867k2111k0858j6872j0579
-3460d70447l290L118P570J0504J2947J4649J3968R242Q88q449j5361j7778j5498q963J414
-3445d65486J4851K9105M1609N0966N6772N8509N4932M4829K8100O826j4879l2052m0963m0628
-3431b07509l2637k0106o616M336J0253J0572P042K519o22k035l553p505j4292k1468k5503
$$ plain form
-3533 71916 53544 29612 7236 -8199 -14615 -13639 -9661 -7710 -10828 -18284 -25747 -27627 -20358 -4673 14398 29306
-3517 29306 32103 15758 -24519 -89695 -175878 -274991 -377313 -474366 -560841 -634963 -697712 -751309 -797529 -836478
-3503 -836478 -866738 -886916 -897135 -899094 -894253 -881827 -858204 -818767 -760983 -686972 -603934 -522292 -452298 -401044
-3489 -401044 -370532 -357534 -355352 -356874 -357119 -354241 -349159 -344469 -343183 -347460 -357560 -371528 -385669 -395687 -398310
-3474 -398310 -392730 -380943 -366735 -354064 -346005 -344342 -349742 -361774 -379160 -400027 -422138 -442996 -459868 -470447
-3460 -470447 -473737 -470619 -463049 -452545 -439598 -424949 -410981 -401739 -400851 -409300 -424661 -442439 -457937 -466900 -465486
-3445 -465486 -450635 -421530 -379921 -328955 -272183 -213674 -158742 -113913 -85813 -78987 -93866 -125918 -166881 -207509
-3431 -207509 -240146 -260252 -266868 -262532 -252279 -241707 -234665 -232146 -232768 -234803 -238356 -245861 -260153 -281621 -307124
-3416c07124k4294j7845p321N877K0425L5006M8136N8051O3056O2333N6740M8578M0249L2789
-3402A14656K5779J8141R170p72j0076j6790j9990k0380j9428j8117j6602j4496j1611q256
-3388A1228n103k600o50J182L051M430M460K523j193n695r707j2649j5204j8871k4664l1651
-3372a01113l7060l8496l5964l1455k6612k1361j4702o148L769J3601K1143K3973K0914J3704
-3358b15807O759M962J0726K2457L5705M5750M9722M7556M1554L5074L0893K9873L0598L0128
-3344B05950K5814J6953M972p766j9426k9283l7068m1960m2070l5039j9817J369K3054L8714
-3330H4397M4181L9421K7832J3597m77j3196k3707l1053l5143l7477m0466m5739n2916n9756
-3316a30502o2979n9568m8070k9872r531P160J5936J5983R762J094o993j2748j4856j2002
$$ plain form
-3416 -307124 -331418 -349263 -356584 -350707 -330282 -295276 -247140 -189089 -126033 -63700 -6960 41618 81867 114656
-3402 114656 140435 158576 167746 166974 156898 140108 120118 99738 80310 62193 45591 31095 19484 11228
-3388 11228 6125 3525 2875 4057 7108 11538 15998 18521 17328 11633 1926 -10723 -25927 -44798 -69462 -101113
-3372 -101113 -138173 -176669 -212633 -244088 -270700 -292061 -306763 -312911 -309142 -295541 -274398 -250425 -229511 -215807
-3358 -215807 -209048 -204086 -193360 -170903 -135198 -89448 -39726 7830 49384 84458 115351 145224 175822 205950
-3344 205950 231764 248717 253689 245923 226497 197214 160146 118186 76116 41077 21260 22629 45683 84397
-3330 84397 128578 167999 195831 209428 208951 195755 172048 140995 105852 68375 27909 -17830 -70746 -130502
-3316 -130502 -193481 -253049 -301119 -330991 -340522 -333362 -317426 -301443 -291681 -290587 -297580 -310328 -325184 -337186
-3302c37186l778P871J8867K5179K5300K0804J4824R800O043K197l158j0135j7655k4516l0220
-3287b95763l5092l9866m4971n0089n4228n5980n4052m8141l9504l0145k1074j1403J005J7328
-3273g61975L6001N3136O5009P0153O9389O4634N7720N0135M3565M0183M2069M9504N9860
-3260f0617O8578P1576O7204N6404M1766K6314J2356Q45q352j5990k2929k9895l7063m3801
-3246A26396m8720n0085m6279l6570k1939n481Q576J6845J8508J5583J1114P165M133J396
-3232F42j737n716j0668j6015k0238k1289j7626r471J212J1825K0425K6126K8897K9044K6599
-3217D2010K1207J2803K570o743j1531q817J926J7823L3785M5176M9497M6344L6862K3591
-3203C06503R988j054q576j4036k0372l0446m5292o3198q0357r2779r8215r6643q9212p7040
$$ plain form
-3302 -337186 -340964 -333093 -314226 -289047 -263747 -242943 -228119 -218319 -212276 -210079 -213237 -223372 -241027 -265543 -295763
-3287 -295763 -330855 -370721 -415692 -465781 -520009 -575989 -630041 -678182 -717686 -747831 -768905 -780308 -779303 -761975
-3273 -761975 -725974 -672838 -607829 -537676 -468287 -403653 -345933 -295798 -252233 -212050 -169981 -120477 -60617
-3260 -60617 7961 79537 146741 203145 244911 271225 283581 284426 276074 260084 237155 207260 170197 126396
-3246 126396 77676 27591 -18688 -55258 -77197 -82678 -74102 -57257 -38749 -23166 -12052 -4887 -754 642
-3232 642 -1095 -6811 -17479 -33494 -53732 -75021 -92647 -102118 -100906 -89081 -68656 -42530 -13633 15411 42010
-3217 42010 63217 76020 78590 71847 60316 51499 53425 71248 105033 150209 199706 246050 282912 306503
-3203 306503 316491 315437 306861 292825 272453 242007 196715 133517 53160 -39619 -137834 -234477 -323689 -400729
-3189d00729o0936m2004k2224m362Q951J6534J9274J8972J6762J2856P572K661J003M884J4112
-3174d06674K5742L6083M2565M4109M0270L0891J6631m44j7283l0556l7491l6479k7778j3654
-3160c34068K294J6343K5588K8788K7101K3351K0273J9076J9406J9916J8938J5516J0287N597
-3146h1594M076O829J2360J7596J9887J8575J4696R298K487n919j5082k2999k7964l0064l0945
-3131a08763l1950l2718l1988k9772k8032k8929l2498l6272l7171l3479k5596j5127l611P830
-3117d68076J8024K5553K9522L0171K8611K5984K2928J9620J6527J4669J4935J7289K0342
-3104a83901K1875K0051J4632P659K648K536Q079J7714K8437L6761L9497L4872K3517Q203
-3090H2580p586k1481l2816m1874m8869n3355n4457n1384m4074l3506k1738j1257l992p25
$$ plain form
-3189 -400729 -461665 -503669 -525893 -530255 -521304 -504770 -485496 -466524 -449762 -436906 -429334 -426673 -425670 -420786 -406674
-3174 -406674 -380932 -344849 -302284 -258175 -217905 -187014 -170383 -170827 -188110 -218666 -256157 -292636 -320414 -334068
-3160 -334068 -331774 -315431 -289843 -261055 -233954 -210603 -190330 -171254 -151848 -131932 -112994 -97478 -87191 -81594
-3146 -81594 -77518 -70689 -58329 -40733 -20846 -2271 12425 21723 24210 18291 3209 -19790 -47754 -77818 -108763
-3131 -108763 -140713 -173431 -205419 -235191 -263223 -292152 -324650 -360922 -398093 -431572 -457168 -472295 -475906 -468076
-3117 -468076 -450052 -424499 -394977 -364806 -336195 -310211 -287283 -267663 -251136 -236467 -221532 -204243 -183901
-3104 -183901 -162026 -141975 -127343 -119684 -117036 -114500 -106421 -88707 -60270 -23509 15988 50860 74377 82580
-3090 82580 74994 53513 20697 -21177 -70046 -123401 -177858 -229242 -273316 -306822 -328560 -339817 -343809 -344534
-3076c44534j306m832r382j2268j1148n690J579O211M054o541k3672m2450n6692o1102n3919
-3061f21692l7862j8547j477R886J4326J2534O676m21o372j0078j1946j3411j6011k0684k7466
-3046g42545l5679m3885n0107n2272m8926m0201k7936j4758k457Q941K0191L1254M0598M6005
-3032i11777M6050M1171L3847K7818K6151K9451L5660M1729M5875M8203M9592N0170M8894
-3019c87166M4596L7290K8378J9661J1895M208n179j7331l1135m3047m8710m5298l3313j6413
-3005d81564O8J1198J4150Q626l882k0742l8775n4574o5362o9796o8620o3897n7477m9923
-2991i40570m1079l1673k3721j9218j8270j8515j6817j0991n90J3257K7957L9848M5645M4050
-2977i50687L6516K6247J6348Q270J863l752r023j3421j5680j4583r590j029R994K2171L4511
$$ plain form
-3076 -344534 -345840 -350672 -360054 -372322 -383470 -389160 -387581 -381370 -377316 -383857 -407529 -449979 -506671 -567773 -621692
-3061 -621692 -659554 -678101 -679578 -669692 -655366 -642832 -636156 -636577 -642949 -653027 -664973 -678384 -694395 -715079 -742545
-3046 -742545 -778224 -822109 -872216 -924488 -973414 -1013615 -1041551 -1056309 -1058766 -1049825 -1029634 -998380 -957782 -911777
-3032 -911777 -865727 -824556 -790709 -762891 -736740 -707289 -671629 -629900 -584025 -535822 -486230 -436060 -387166
-3019 -387166 -342570 -305280 -276902 -257241 -245346 -241138 -246317 -263648 -294783 -337830 -386540 -431838 -465151 -481564
-3005 -481564 -481496 -470298 -456148 -447522 -451404 -472146 -510921 -565495 -630857 -700653 -769273 -833170 -890647 -940570
-2991 -940570 -981649 -1013322 -1037043 -1056261 -1074531 -1093046 -1109863 -1120854 -1121444 -1108187 -1080230 -1040382 -994737 -950687
-2977 -950687 -914171 -887924 -871576 -863306 -861443 -865195 -874218 -887639 -903319 -917902 -927492 -928521 -918527 -896356 -861845
-2962h61845M6536N7699O7001P3033P4213O9205N7205L8909J7174l603j9227k7303k7787k1990
-2948d60780j1755L87J1233J7428J7517J2945P605N660R063J7025K7105L7068M6118N4638
-2934b08743O3138P1261P6777P6303O7145M9717K7650N593j3378k8677m1072n0749n6515n6881
-2920a8431n1509m2051l1879k4713k2664k5144k9509l2891l3516l1282k7471k3870k1614k0356
-2906d36900j8491j4279p295J053Q646J3840J5924J4874J1025N502R39J007Q268K1825L7111
-2891c36951M8441N1923M6685L4236J7369o10j6769k8993l6328l8983l8419l6642l5007l3567
-2877d03615l1464k8044k3333j7934j2568p789l647J79L426M350L70j0137k6476m5580o2984
-2862f65246p4771p9476p8466p4244o8339o0505m9789l6374k2081r208J179R615J7582K6204
$$ plain form
-2962 -861845 -815309 -757610 -690609 -617576 -543363 -474158 -416953 -378044 -360870 -364473 -383700 -411003 -438790 -460780
-2948 -460780 -472535 -472148 -460915 -443487 -425970 -413025 -405420 -399760 -390697 -373672 -346567 -309499 -263381 -208743
-2934 -208743 -145605 -74344 2433 78736 145881 195598 223248 228841 215463 186786 145714 94965 38450 -18431
-2920 -18431 -69940 -111991 -143870 -168583 -191247 -216391 -245900 -278791 -312307 -343589 -371060 -394930 -416544 -436900
-2906 -436900 -455391 -469670 -476965 -475912 -467266 -453426 -437502 -422628 -411603 -406101 -405162 -404155 -395887 -374062 -336951
-2891 -336951 -288510 -236587 -189902 -155666 -138297 -138907 -155676 -184669 -220997 -259980 -298399 -335041 -370048 -403615
-2877 -403615 -435079 -463123 -486456 -504390 -516958 -524747 -528394 -528215 -524789 -520439 -520069 -530206 -556682 -602262 -665246
-2862 -665246 -740017 -819493 -897959 -972203 -1040542 -1101047 -1150836 -1187210 -1209291 -1218499 -1217320 -1207705 -1190123 -1163919
-2848a163919L5747M5883N5753O3986O9067P0204O8100O4507O1109N8767N7664N7757N8552
-2835c96823N8881N7368N3194M5958L5383K1756O686p333j8367k5910l0444l2182l0381k3567
-2821b85781j1140N171K1315L3001L7870L5851K8272J7495O881O4r35L021Q791J3215J4904
-2806g2005J4208J2215R830P405N031K956J398r7k769p514j3827j9656k2523k1133j6157r500
-2790a32138k706L594R290J4753K1287L0317M1620N2533N9538O0859N7317N0840M2479L2213
-2776C41796K0140P379m549j4478k1721k5647k5387k0316j0549K946J8460L3849M6361N3084
-2762D01368N1702M1485K4432M831j2735k5542l3409l8056m1894m6860n3258n9673o3921o4408
-2748H4062o0662n2935m1610k7375j1424M384J7934K7454L2337L3477L2769L2028L1933L1977
$$ plain form
-2848 -1163919 -1128172 -1082289 -1026536 -962550 -893483 -823279 -755179 -690672 -629563 -570796 -513132 -455375 -396823
-2835 -396823 -337942 -280574 -227380 -181422 -146039 -124283 -117597 -124930 -143297 -169207 -199651 -231833 -262214 -285781
-2821 -285781 -296921 -291750 -270435 -237434 -199564 -163713 -135441 -117946 -111065 -111001 -111936 -108915 -100124 -86909 -72005
-2806 -72005 -57797 -45582 -35752 -28347 -23316 -20360 -18962 -19059 -21828 -29342 -43169 -62825 -85348 -106481 -122638 -132138
-2790 -132138 -134844 -131250 -121960 -107207 -85920 -55603 -13983 38550 98088 158947 216264 267104 309583 341796
-2776 341796 361936 369315 364766 350288 328567 302920 277533 257217 246668 249614 268074 301923 348284 401368
-2762 401368 453070 494555 518987 523818 511083 485541 452132 414076 372182 325322 272064 212391 148470 84062
-2748 84062 23400 -29535 -71145 -98520 -109944 -105560 -87626 -60172 -27835 5642 38411 70439 102372 134349
-2734A34349L1375L0196K9220K9010K8930K7823K5416K2688K0847K0412K1421K4238K9527
-2721D75452L7197M5687N2764N6821N7113N3056M4174L1198J6650L635o226j3935k1962l2210
-2707G99414m4518n6762o5720o8697o4933n6083m5344l5918k9855k7352k7204k8109k9328
-2694B19591l0452l0567k8555k4100j7963j1144l800M510J3849K3053L0015L2895L1309K6646
-2680B35287K1037J5807J0767M738l153j2428k1345k7566k8878k3613j1160P267K8118M6303
-2666B41181N7186N8500N0870L7134K1302P250l112j0659j7977k6692l5822m2270m2839l6167
-2652B57885k3643q738M343J2227J3325Q241m23q972j4075j3893q832j461M463N634Q69q072
-2636B18878j7450k3620k4996k2654j9403j8071j9753k3554k7454k9761k9782k7860k4877
$$ plain form
-2734 134349 165724 195920 225140 254150 283080 310903 336319 359007 379854 400266 421687 445925 475452
-2721 475452 512649 558336 611100 667921 725034 778090 822264 853462 870112 873747 867521 853586 831624 799414
-2707 799414 754896 698134 632414 563717 498784 442701 397357 361439 331584 304232 277028 248919 219591
-2694 219591 189139 158572 130017 105917 87954 76810 73010 77520 91369 114422 144437 177332 208641 235287
-2680 235287 256324 272131 282898 287636 284483 272055 250710 223144 194266 170653 159493 166760 194878 241181
-2666 241181 298367 356867 407737 444871 466173 473423 470311 459652 441675 414983 379161 336891 294052 257885
-2652 257885 234242 225504 229847 242074 255399 263640 263217 254245 240170 226277 217445 215984 220447 226081 226950 218878
-2636 218878 201428 177808 152812 130158 110755 92684 72931 49377 21923 -7838 -37620 -65480 -90357
-2623i0357k1580j8048j3935r479n623l119j648j22K405O276J1304J7011K2728K7385K9630
-2608d7172K8475K4155J7694R808N33r464j7962k1857j9019r593L854J7438K7648L2958L4428
-2593G1924L4713L6249L9659M3500M5364M3476L7216K7358J6407Q064N022O744R502Q567N08
-2578D34273j5064l5030n3820o5787o7904o0854m7872l2290j6262j028J2199K2108K7728K8833
-2564A29230K6149K1230J6038J2109J0316J1080J4375J9276K3967K6032K3535J6062M868p774
-2550C46493j9293k7398l0755k9885k6819k3750k1873k1209k1468k2447k4018k6151k9149
-2537B2278l3667m0178m8402n7380o6110p3570p8386p8956p4169o3942m9176l1343j2151O931
-2523f78221K4911M1191N5170O6112P3234P5672P2637O4369N3219M3335L8841M1642N0418
$$ plain form
-2623 -90357 -111937 -129985 -143920 -153399 -159022 -162141 -163789 -163911 -161506 -155230 -143926 -126915 -104187 -76802 -47172
-2608 -47172 -18697 5458 23152 32960 33493 24029 6067 -15790 -34809 -44402 -40548 -23110 4538 37496 71924
-2593 71924 106637 142886 182545 226045 271409 314885 352101 379459 395866 403930 408952 415696 425198 433765 434273
-2578 434273 419209 384179 330359 264572 196668 135814 87942 55652 39390 38362 50561 72669 100397 129230
-2564 129230 155379 176609 192647 204756 215072 226152 240527 259803 283770 309802 333337 349399 354267 346493
-2550 346493 327200 299802 269047 239162 212343 188593 166720 145511 124043 101596 77578 51427 22278
-2537 22278 -11389 -51567 -99969 -157349 -223459 -297029 -375415 -454371 -528540 -592482 -641658 -673001 -685152 -678221
-2523 -678221 -653310 -612119 -556949 -490837 -417603 -341931 -269294 -204925 -151706 -108371 -69530 -27888 22530
-2510B2530O1301O9914P3474P1974O8111O5460O6040O9232P3085P5647P5375P0751O0344M3391
-2496I66629K0735m636k8458m6807n7490o0451n7550n1830m6266m2142l8329l2471k3133j1487
-2482D86314j257L402M57q833k1073l2709m1526m7342n1156n3631n4401n2850m9252m4635
-2468C1508l9846l4824k8253j8583n422R403K2600L1707L6767M0067M4256N0699N8566O5302
-2454B63947O8171O5723N8508M8090L5722K1795O332r912k5079l7070m4158m5565m1504l2871
-2440C32129k1329q692L032J1615J4846J1755L229q340k0380l0132l4868l2984k4923j2620
-2426A82338J564J6064K9854M1623M9962N3655N2719M8255M1784L4010K4220J1086n988k5532
-2412E55614m3888n6686o0871n6108m4623l0355j7646j0070r501j5941k7592m1401n4136o3382
$$ plain form
-2510 22530 83831 153745 227219 299193 367304 432764 498804 568036 641121 716768 792143 862894 923238 966629
-2496 966629 987364 982728 954270 907463 849973 789522 731972 680142 633876 591734 553405 520934 497801 486314
-2482 486314 485057 488459 488916 480083 459010 426301 384775 337433 286277 232646 178245 125395 76143 31508
-2468 31508 -8338 -43162 -71415 -89998 -95420 -86017 -63417 -31710 5057 45124 89380 140079 198645 263947
-2454 263947 332118 397841 456349 504439 540161 561956 568288 558376 533297 496227 452069 406504 365000 332129
-2440 332129 310800 302108 305140 316755 331601 343356 346585 338245 317865 287733 252865 219881 194958 182338
-2426 182338 183902 199966 229820 271443 321405 375060 427779 476034 517818 551828 576048 587134 581146 555614
-2412 555614 511726 455040 394169 338061 293438 263083 245437 235367 225866 209925 182333 140932 86796 23414
-2398B3414o8020o7840o3255n5195m4656l2128j7682j967J3025K4673L1641L4864L6784L9563
-2384a46779M3891M9042N3707N6550N6334N2284M4384L3419K0839Q423k147r888j5000j8252
-2370B26807j9962k0074j8582j5677j1442n793J204R378J8363K7161L3801L5886L1858K1990
-2356C14918Q524n376j7056k5086k8701k7247k0528r711K276J1445J4474J0319Q65r712j6760
-2341B02644j7123j0457R09J3697K5106L3467L7686L6915L0962K0878R011j582q134r149m529
-2326C60301M598J6501K9871M4240N9109P2694Q2117Q4821Q0041O9070N4423L8684K3805J1347
-2312A031622K453k397l958m063m723p344j2311j8893k5861l2448l8705m4476m8180m6955
-2298G43761l8992k5390r956L428J3052J9284K2811K3492K0624J4172N231m222j2443j8226
$$ plain form
-2398 23414 -44606 -112446 -175701 -230896 -275552 -307680 -325362 -327329 -314304 -289631 -257990 -223126 -186342 -146779
-2384 -146779 -102888 -53846 -139 56411 112745 165029 209413 242832 263671 272094 269947 260059 245059 226807
-2370 226807 206845 186771 168189 152512 141070 135277 136481 145859 164222 191383 225184 261070 292928 314918
-2356 314918 323442 318066 301010 275924 247223 219976 199448 189737 192013 203458 217932 228251 229116 219404 202644
-2341 202644 185521 175064 175973 189670 214776 248243 285929 322844 353806 374684 383695 382113 373979 364830 360301
-2326 360301 364899 381400 411271 455511 514620 587314 669431 754252 834293 903363 957786 996470 1020275 1031622
-2312 1031622 1034075 1031678 1027720 1023657 1018934 1011590 999279 980386 954525 922077 883372 838896 790716 743761
-2298 743761 704769 679379 669423 672851 685903 705187 727998 751490 772114 786286 791517 787295 774852 756626
-2284G56626k0448j8229j1767k544P375J6133K2246K4728K3257J8303J1314M521N57J605Q129
-2269H41806J8022K7142L1370K8855K1067J1706M469J571L678J0309J9587K8297L3391L3955
-2255A115225L1784L0125L1871L8632N1069O9403R3081J19931J45840J66274J78512J82736
-2243B254483J81179J76713J72102J69548J70221J73796J79331J86843J97552K12386K30631
-2232D304785K49361K62962K63305K41675J93000J20178L4686m7524j12926j55325j76182
-2221E177995j81452j77810j69873j59168j45326j28041j08014q6229o2986l8083j2199J2287
-2209C921101L2772M8728O2238P5739Q9642J02002J10755J16269J21708J30787J45007J62782
-2197E119530J81254J98119K12366K23878K33191K41241K48904K56749K65585K76907K92594
$$ plain form
-2284 756626 736178 717949 706182 703638 711013 727146 749392 774120 797377 815680 826994 831515 832072 833677 841806
-2269 841806 859828 886970 918340 947195 968262 979968 984437 986008 989686 999995 1019582 1047879 1081270 1115225
-2255 1115225 1147009 1177134 1209005 1247637 1298706 1368109 1461190 1581121 1726961 1893235 2071747 2254483
-2243 2254483 2435662 2612375 2784477 2954025 3124246 3298042 3477373 3664216 3861768 4074154 4304785
-2232 4304785 4554146 4817108 5080413 5322088 5515088 5635266 5669952 5622428 5509502 5354177 5177995
-2221 5177995 4996543 4818733 4648860 4489692 4344366 4216325 4108311 4022082 3959096 3921013 3908814 3921101
-2209 3921101 3953873 4002601 4064839 4140578 4230220 4332222 4442977 4559246 4680954 4811741 4956748 5119530
-2197 5119530 5300784 5498903 5711269 5935147 6168338 6409579 6658483 6915232 7180817 7457724 7750318
-2186G750318L13832L40337L70299M01313M31849M62197M94090N29330N69099O13946O63711
-2175A2940321P17066P71582Q25306Q78577R34581R97690J071277J156749J253967J362689
-2165B2909805J483684J618898J771178J942810K134563K344851K569542K801936L032650
-2156D2609917L249615L438163L580832L656511L639842L502044L214811K757712K127097
-2147G1776544J343311M52202m80732j382061k184150k837011l314667l614310l750240l746022
-2137E2262864l629170l428329l171715k885474k591615k305712k035567j782323j543261
-2128B8889698j314713j093297q76210o61219m46786k31582j3905K08554M38007O75366R18685
-2117B6492598J159990J380376J545345J605554J508820J224514P70373K22048l09460p23734
$$ plain form
-2186 7750318 8064150 8404487 8774786 9176099 9607948 10070145 10564235 11093565 11662664 12276610 12940321
-2175 12940321 13657387 14428969 15254275 16132852 17067433 18065123 19136400 20293149 21547116 22909805
-2165 22909805 24393489 26012387 27783565 29726375 31860938 34205789 36775331 39577267 42609917
-2156 42609917 45859532 49297695 52878527 56535038 60174880 63676924 66891735 69649447 71776544
-2147 71776544 73119855 73572057 73091325 71709264 69525114 66688103 63373436 59759126 56008886 52262864
-2137 52262864 48633694 45205365 42033650 39148176 36556561 34250849 32215282 30432959 28889698
-2128 28889698 27574985 26481688 25605478 24944259 24497473 24265891 24251986 24460540 24898547 25573913 26492598
-2117 26492598 27652588 29032964 30578309 32183863 33692683 34917197 35687570 35909618 35600158 34876424
-2107C4876424r70506j058567j036950r68685r10361q98219r38894j009027j068444j081523
-2097B4935248j034042r36776q17127p06500o28950n93416n91426o01912o01580n75416n21352
-2086A7326751m47511l65044k81829k00240j18955l6715M5246J22929J90800K43462K77165
-2075A6756059K90728K85576K64815K31728J88675J37137P9300J9317l7790q8909j34421j75369
-2063A7816846k08562k25205k15256j73506j02172r737R0886J83810K52462K83617K72418
-2052A7965601K25879J62318J05380P5059Q1288J23276J93037K79582L72122M61914N43460
-2041B0588916O14397O74194P22352P57762P79517P88560P88886P87297P91639Q08359Q41218
-2030B8943097Q89963R47836R97543J008760R41551P58956M48007L7424m04143p94729j074370
$$ plain form
-2107 34876424 33905918 32847351 31810401 30841716 29931355 29033136 28094242 27085215 26016771 24935248
-2097 24935248 23901206 22964430 22147303 21440803 20811853 20218437 19627011 19025099 18423519 17848103 17326751
-2086 17326751 16879240 16514196 16232367 16032127 15913172 15876457 15921703 16044632 16235432 16478894 16756059
-2075 16756059 17046787 17332363 17597178 17828906 18017581 18154718 18234018 18253335 18215545 18126636 17992215 17816846
-2063 17816846 17608284 17383079 17167823 16994317 16892145 16882408 16973294 17157104 17409566 17693183 17965601
-2052 17965601 18191480 18353798 18459178 18534237 18615525 18738801 18931838 19211420 19583542 20045456 20588916
-2041 20588916 21203313 21877507 22599859 23357621 24137138 24925698 25714584 26501881 27293520 28101879 28943097
-2030 28943097 29833060 30780896 31778439 32787199 33728750 34487706 34935713 34973137 34568994 33774265 32699895
-2019C2699895j223890j258467j209173j107750r79852q43752p11727n91764m87593l97435
-2009B3888492l13903k26760j27310j1742J18172K56957L98355N37309O69816P91363Q94089
-1998B6874838R63886R80552R24069P87863N91533L81299K12665J24572J22017J77572K47733
-1987C2388599K92860K90364K38432J51149M9527m6418j21705j67062j78941j58847j12399
-1976C2625559m9105J7528P1164R5663P9530J9592p7786j98640l25828m42680n35597n96296
-1964C0683104o23040o19947n94426n54253n06004m55341m08414l72796l57230l69955m15423
-1953B5406275m90615n84018o78801p59158q15378q44953q50070q33712p97369p41182o66461
-1942A7344558n78387m86206m00180l27275k68574k19321j71436j17938n6507J0648Q0412
$$ plain form
-2019 32699895 31476005 30217538 29008365 27900615 26920763 26077011 25365284 24773520 24285927 23888492
-2009 23888492 23574589 23347829 23220519 23208777 23326949 23583906 23982261 24519570 25189386 25980749 26874838
-1998 26874838 27838724 28819276 29743345 30531208 31122741 31504040 31716705 31841277 31963294 32140866 32388599
-1987 32388599 32681459 32971823 33210255 33361404 33410931 33364513 33242808 33075746 32896805 32737958 32625559
-1976 32625559 32576454 32593982 32665146 32760809 32840339 32859931 32782145 32583505 32257677 31814997 31279400 30683104
-1964 30683104 30060064 29440117 28845691 28291438 27785434 27330093 26921679 26548883 26191653 25821698 25406275
-1953 25406275 24915660 24331642 23652841 22893683 22078305 21233352 20383282 19549570 18752201 18011019 17344558
-1942 17344558 16766171 16279965 15879785 15552510 15283936 15064615 14893179 14775241 14718734 14729382 14809794
-1931A4809794J52652K31118L21052M25871N44853O73326Q04938R33957J056279J166904J254734
-1920B2375478J297447J260688J106160Q10114L86029j04628n68275r18009j110876j158160
-1910B3375968j107430j014851r24297q58091q17063p87597p52947p03027o38061n65860m96315
-1899A4710429m36933l91769l63128l53038l62514l89098m25616m62057m89167n01626m99320
-1888A0036163m86433m68834m51217m35259m19304l99782l74129l43118l10318k79698k53537
-1877E814534k32035k13945j97842j83746j73496j69034j69864j72599j72950j68596j60203
-1866C800224j50240j41065j33647j27717j22041j15174j06119r4648q1208o7142n5021m7766
-1854B558436m6772n1141n8764o7396p4989p9564p9796p5821o9074o1477n4399m8576m4194
$$ plain form
-1931 14809794 14962446 15193564 15514616 15940487 16485340 17158666 17963604 18897561 19953840 21120744 22375478
-1920 22375478 23672925 24933613 26039773 26849887 27235916 27131288 26563013 25645004 24534128 23375968
-1910 23375968 22268538 21253687 20329390 19471299 18654236 17866639 17113692 16410665 15772604 15206744 14710429
-1899 14710429 14273496 13881727 13518599 13165561 12803047 12413949 11988333 11526276 11037109 10535483 10036163
-1888 10036163 9549730 9080896 8629679 8194420 7775116 7375334 7001205 6658087 6347769 6068071 5814534
-1877 5814534 5582499 5368554 5170712 4986966 4813470 4644436 4474572 4301973 4129023 3960427 3800224
-1866 3800224 3649984 3508919 3375272 3247555 3125514 3010340 2904221 2809573 2728365 2661223 2606202 2558436
-1854 2558436 2511664 2460523 2401759 2334363 2259374 2179810 2100014 2024193 1955119 1893642 1839243 1790667 1746473
-1841A746473m0953l8388l6138l4266l2925l1701k9398k4543j6289m805R119K4721M1293N7817
-1827A590017P2956Q5523R5245J03233J11677J22930J38460J58681J83559K12969K46038K80720
-1815C402008L14947L48576L84014M24425M70666N19044N60438N79884N58149M77672L33231
-1804H373054J40708o4006k38025l49010l85938l57924k84362j84519p2150M4579J61380K76871
-1792G060658L92770N13420O43322P83593R29618J069595J182763J237089J190392J001004
-1782A6004224O49794J64074l77087q68839j224900j409874j440203j361568j224304j068841
-1772G842476r20811p91729o82826n90464n10778m41464l81339l28950k82172k39518k01229
-1761B471196j68968j44012j25838j12486j01769r2205q2912p2867o0884m6582l1384j8106
$$ plain form
-1841 1746473 1705520 1667132 1630994 1596728 1563803 1532102 1502704 1478161 1461872 1457067 1466186 1490907 1532200 1590017
-1827 1590017 1662973 1748496 1843741 1946974 2058651 2181581 2320041 2478722 2662281 2875250 3121288 3402008
-1815 3402008 3716955 4065531 4449545 4873970 5344636 5863680 6424118 7004002 7562151 8039823 8373054
-1804 8373054 8513762 8449756 8211731 7862721 7476783 7118859 6834497 6649978 6577828 6622407 6783787 7060658
-1792 7060658 7453428 7966848 8610170 9393763 10323381 11392976 12575739 13812828 15003220 16004224
-1782 16004224 16654018 16818092 16441005 15572166 14347266 12937392 11497189 10135621 8911317 7842476
-1772 7842476 6921665 6129936 5447110 4856646 4345868 3904404 3523065 3194115 2911943 2672425 2471196
-1761 2471196 2302228 2158216 2032378 1919892 1818123 1725918 1643006 1570139 1509255 1462673 1431289 1413183
-1749A413183r367o502r743j8469l1038m4740n6521o3758o4761n9197m8302l4470k0182p203
-1735I38930L775J2797K0112K5872L0358L4262L8226M1814M3434M1535L6038K8445K0922J5071
-1721A331591J1099P569K047p531k1614l8785n6525p2207q3881r0491r1699q7742p9332o7461
-1707F55038n3293l8263k4030j1824k283L997N877K562m398j0648j1450n148N590J5802K1279
-1692E48808K0352J4078N556j969o788r209j0667j2406j4666j6650j7484j7604j8648k1914
-1678D40789k6898l1501l3717l2726k9038k4156k0072j8758k0992k5788l0741l3592l3507
-1665G9303l1288k8581k6908k7284k9530l2038l2636l0367k6210k2333k0274k0485k2828k7048
-1651b98507l2466l7516l9953l7822l0640k0260j0094k909P87K507L967N604O364M431j397
$$ plain form
-1749 1413183 1403816 1397314 1387571 1369102 1338064 1293324 1236803 1173045 1108284 1049087 1000785 966315 946133 938930
-1735 938930 942705 955502 975614 1001486 1031844 1066106 1104332 1146146 1189580 1231115 1267153 1295598 1316520 1331591
-1721 1331591 1342690 1350259 1352306 1344775 1323161 1284376 1227851 1155644 1071763 981272 889573 801831 722499 655038
-1707 655038 601745 563482 539452 527628 525345 529342 535219 537781 533383 522735 511285 506137 511727 527529 548808
-1692 548808 569160 583238 588794 586825 580037 570828 560161 547755 533089 516439 498955 481351 462703 440789
-1678 440789 413891 382390 348673 315947 286909 262753 242681 223923 202931 177143 146402 112810 79303
-1665 79303 48015 19434 -7474 -34758 -64288 -96326 -128962 -159329 -185539 -207872 -228146 -248631 -271459 -298507
-1651 -298507 -330973 -368489 -408442 -446264 -476904 -497164 -507258 -510167 -509380 -506873 -502906 -497302 -490938 -486507 -487904
-1636d87904j0660k1135l0027l5211l5972l2770k6488j7717o708N775J7494K5294K7143K3541
-1622f05345J6658Q633P49o488j2820j7925k1622k4190k6450k9101l2183l5015l6575l5941
-1608h57615l2266k4982j4433k143J0026K0799K9644L6435M1246M4714M7910N1891N6838O1923
-1594e30013O5797O7383O5810O0198N0072L6070K0315N685n222j0971j1641q603l901N96L818
-1579a94607N742P090Q516J0362J2971J6953K2744L0216L8735M7253N4469N9218O1030O0145
-1565B40837N6954N1617M4270L5610K6938J9519J3694Q713L517k264p923j2442j5590j8072
-1551D45378k0593k3107k5068k5957k5571k4102k2176k0684k0437k1904k4986k9171l3817
-1538A27805l8063m0623l9900l4752k5542j4471m897N52J285j320n347r441j2776j4643j4277
$$ plain form
-1636 -487904 -498564 -519699 -549726 -584937 -620909 -653679 -680167 -697884 -704592 -698817 -681323 -656029 -628886 -605345
-1622 -605345 -588687 -580054 -579305 -585793 -598613 -616538 -638160 -662350 -688800 -717901 -750084 -785099 -821674 -857615
-1608 -857615 -889881 -914863 -929296 -931439 -921413 -900614 -870970 -834535 -793289 -748575 -700665 -648774 -591936 -530013
-1594 -530013 -464216 -396833 -331023 -270825 -220753 -184683 -164368 -158683 -163905 -174876 -186517 -195120 -199021 -198425 -194607
-1579 -194607 -188865 -181775 -173259 -162897 -149926 -132973 -110229 -80013 -41278 5975 60444 119662 180692 240837
-1565 240837 297791 349408 393678 429288 456226 475745 489439 498152 501669 499405 491482 479040 463450 445378
-1551 445378 424785 401678 376610 350653 325082 300980 278804 258120 237683 215779 190793 161622 127805
-1538 127805 89742 49119 9219 -25533 -51075 -65546 -70443 -69891 -68606 -69926 -75273 -84714 -97490 -112133 -126410
-1523a26410j1052n151J677O439O837L395m37n95M635J3487K2460K8951L2241L2609K9837
-1508C8923K2953J1630k209j4620k2323k5193k5917k7698l2281l9509m7769n5103o0232o2797
-1494c42145o2753n9523n1714l8200j9337K887K5797M6546O1961O9000O6443N5642L9027J8509
-1480a87860m456k7405m6536n8277o1092n5774m4367k9217j2953J605J1940J7239J9551K3132
-1466d54470L1703M5729O1685P3833P7169O9636N2523K9526N690j3612k4353k5331j8230o482
-1452i4984O236J7146K4646K8619L0539L3021L8253M6470N5820O3203O5653O1396N0568L5220
-1438D61806J8623L996o769j3726j8250k1695k4444k6410k7707k8396k7790k4489j7572p543
-1424B39634L305J1863J5540J3094M929p331k1646l6217m9479n9922o5979o6173n9686m7139
$$ plain form
-1523 -126410 -137462 -142613 -140936 -134497 -127660 -124265 -124702 -125297 -120662 -107175 -84715 -55764 -23523 9086 38923
-1508 38923 61876 73506 71297 56677 34354 9161 -16756 -44454 -76735 -116244 -164013 -219116 -279348 -342145
-1494 -342145 -404898 -464421 -516135 -554335 -573672 -570785 -544988 -498442 -436481 -367481 -301038 -245396 -206369 -187860
-1480 -187860 -192316 -219721 -266257 -324534 -385626 -441400 -485767 -514984 -527937 -526332 -514392 -497153 -477602 -454470
-1466 -454470 -422767 -377038 -315353 -241520 -164351 -94715 -42192 -12666 -6976 -20588 -44941 -70272 -88502 -94984
-1452 -94984 -88748 -71602 -46956 -18337 12202 45223 83476 129946 185766 248969 314622 376018 426586 461806
-1438 461806 480429 484425 477656 463930 445680 423985 399541 373131 345424 317028 289238 264749 247177 239634
-1424 239634 242939 254802 270342 283436 288365 281034 259388 223171 173692 113770 47791 -18382 -78068 -125207
-1410a25207l0411j2120N432K0636L2762M1365M5737M5002L9000K9178J8342R199L389P22
-1396A23026r9o59k022m150o272p362p070o111n568n944o671o359l471K469J0463J8728K6039
-1379A18967L2343L8702M6171N4467O1375O3760N9255M7426K9898R336j1568l0646m6146n6815
-1365D16525o2457o4644o6042o8490p1596p3280p1469o5578n6761m6595l5547k2614o254J4032
-1351b80770L6652N8316P5613Q6402Q9686Q4938P2192N3147L1642J2457o85o013l761M096
-1337C13912J4391K4048L1116L4873L5161L1930K5379J6304O241l084j0583j6641k2802l0336
-1323D49909l9036m6970n1573n1153m6128l8893l2379k8017k4923k0722j3195j465J3741L0451
-1309I9647M5909N7081O1525N8331M8327L3667J7400K836p717j4170j8427k2930k8944l5867
$$ plain form
-1410 -125207 -155618 -167738 -162306 -141670 -108908 -67543 -21806 23196 62196 91374 109716 118915 122304 123026
-1396 123026 122927 122268 120246 116096 109824 102462 95392 89281 83713 77769 71098 64739 61268 63737 74200 92928 118967
-1379 118967 151310 190012 236183 290650 352025 415785 475040 522466 552364 561700 550132 519486 473340 416525
-1365 416525 354068 289424 223382 154892 83296 10016 -61453 -127031 -183792 -230387 -265934 -288548 -294802 -280770
-1351 -280770 -244118 -185802 -110189 -23787 65899 150837 223029 276176 307818 320275 319590 313577 309816 313912
-1337 313912 328303 352351 383467 418340 453501 485431 510810 527114 533355 530271 519688 503047 480245 449909
-1323 449909 410873 363903 312330 261177 215049 176156 143777 115760 90837 70115 56920 55455 69196 99647
-1309 99647 145556 202637 264162 322493 370820 404487 421887 424723 417006 402836 384409 361479 332535 296668
-1295B96668m1973m5766m7022m6797m6222m5375m3169l8417l1033k2207j3673p339n242q745
-1281a46312j7347k8306l8088m4275m6201m4825m1887l8861l6330l4232l2559l1431l0378
-1268f11032k8188k3849j7722j1247n432L48P837J8495L2713M9746O7472Q2368R0787R0709
-1254b56995Q2826O9990N5721M2578L1450K1982J3530N597k273j0405j8387k4790k7998k7659
-1240d4833k5196k2401j9429j4531n910O549K0915L3778M1467M1586L4392K3322J3474R138
-1226I2321J1339J7346K2552K3290J8975J1937N514J761M23k89j875m585p901j1223j3980
-1211A65605j5529j5835j5807j6375j7278j7092j4415q683n25Q431J6371K2298K6173K8213
-1197A45552K8584K7487K5322K2441J8870J4602R900N425J857l71j274q23J476O110J2254
$$ plain form
-1295 296668 254695 208929 161907 115110 68888 23513 -19656 -58073 -89106 -111313 -124986 -132325 -137567 -146312
-1281 -146312 -163659 -191965 -230053 -274328 -320529 -365354 -407241 -446102 -482432 -516664 -549223 -580654 -611032
-1268 -611032 -639220 -663069 -680791 -692038 -697470 -697122 -689285 -670790 -638077 -588331 -520859 -438491 -347704 -256995
-1254 -256995 -174169 -104179 -48458 -5880 25570 47552 61082 66679 64406 54001 35614 10824 -17174 -44833
-1240 -44833 -70029 -92430 -111859 -126390 -132300 -125751 -104836 -71058 -29591 11995 46387 69709 83183 92321
-1226 92321 103660 121006 143558 166848 185823 197760 203274 205035 205458 205169 203294 198709 190808 179585 165605
-1211 165605 150076 134241 118434 102059 84781 67689 53274 44591 44066 52497 68868 91166 117339 145552
-1197 145552 174136 201623 226945 249386 268256 282858 292758 298183 300040 299669 298395 297572 299048 305158 317412
-1182C17412J7265J8177J3751N481l307r164j0032n918J079P781J1033Q459q25j5377l1356
-1167C24459m4108n0066m7517l6569j8933K314K3074L9245M7809M7426L8708K3755N650j2331
-1153C42916k7558l8633m5018m6400m2342l3349k1573j0238j951K426L746L481K603J521L10
-1138H9941j057k539m023n518p381j0161j3977j7868j9968j8590j3710p201j224L391P404
-1123b2481J1977J7759K4476L0787L4807L4945L0536K1794R618m778k0097l5304m9364o0690
-1109B3985o7088o6205n6344l7291j1063J8013M4372O2875P0380O6368N2965L4407J6092K922
-1095A54388k460k72P266J7318K7224L4560L6827L1527J7394m253k9332n2150o7519p2397
-1081I8121o6814n3677l7356k1684q419K457J1422J8662K4196K8052L0367L1224L0499K7660
$$ plain form
-1182 317412 334677 352854 366605 372086 368779 359615 349583 343665 344744 352525 363558 372017 371192 355815 324459
-1167 324459 280351 230285 182768 146199 127266 129580 152654 191899 239708 287134 325842 349597 355247 342916
-1153 342916 315358 276725 231707 185307 142965 109616 88043 77805 75854 78280 82026 85507 88110 89631 89941
-1138 89941 88884 86345 82322 76804 69423 59262 45285 27417 7449 -11141 -24851 -32052 -33276 -29885 -22481
-1123 -22481 -10504 7255 31731 62518 97325 132270 162806 184600 194218 189440 169343 134039 84675 23985
-1109 23985 -43103 -109308 -165652 -202943 -214006 -195993 -151621 -88746 -18366 48002 100967 135374 151466 154388
-1095 154388 151928 151656 158922 176240 203464 238024 274851 306378 323772 319519 290187 238037 170518 98121
-1081 98121 31307 -22370 -59726 -81410 -89829 -87372 -75950 -57288 -33092 -5040 25327 56551 87050 114710
-1067A14710K2072J3362J627j2245k6117l7168m3572m5043m1532l2124j6112N193K8156M8458
-1053b0335O3086P0956P2283O7907N9168M7734L5227K2914J1801K707l753p184p638n551j522
-1038D07800L968J0525J7598K4028K7993K7875K3270J5194N142n782j6817k6849l4294l8149
-1024D41502l8720l7501l6179l5175l3316k8426j9030o377N432J1748J0239K207q386j7149
-1010B10869k1445k1573j9871j8918k0087k3452k8274l3673l8850m3036m5522m6077m4881
-997a94790m2056l7305l0064k0552j0722l642j464l973r094j4293j7520j7458j3818p658j022
-982d25431L983O115N288K302j800o087j0040j3373j5372j4513r211N24J2452K3425L1824
-967d09914L8841M7315N8867P2365Q4796R3560R8164R9889J00115R9160R6334R1000Q3231
$$ plain form
-1067 114710 136782 150144 151771 139526 113409 76241 32669 -12374 -53906 -86030 -102142 -96949 -68793 -20335
-1053 -20335 42751 113707 185990 253897 313065 360799 396026 418940 430741 433448 429695 422511 414873 409322 407800
-1038 407800 411768 422293 439891 463919 491912 519787 543057 558251 563393 557611 540794 513945 479651 441502
-1024 441502 402782 365281 329102 293927 260611 232185 213155 206778 212210 223958 234197 236404 228018 210869
-1010 210869 189424 167851 147980 129062 108975 85523 57249 23576 -15274 -58310 -103832 -149909 -194790
-997 -194790 -236846 -274151 -304215 -324767 -335489 -339131 -340595 -344568 -353662 -367955 -385475 -402933 -416751 -424409 -425431
-982 -425431 -421448 -415333 -410045 -407743 -409543 -415630 -425670 -439043 -454415 -468928 -478139 -477615 -465163 -441738 -409914
-967 -409914 -371073 -323758 -264891 -192526 -107730 -14170 83994 183883 283998 383158 479492 570492 653723
-954F53723P3428O1474M6878K9575J0402r045k7311m3471n7045o7621p4622p7145p4261o5524
-940C79435n2027l6622k2794j2893p309n063m944n882o813p032o786o766p054o747m787r49
-924A84967L662O691N701j10r121j8367k5371k9055k9170k5441j7932p843K493J0852J5917
-909F7873J7694J7270J6248J6379J8750K3226K8236L1562L1682K8701K4753K3299K7204L6217
-895D09094M6777N4176N5536N0959M2718L3098K2678J0363m694k2256m0720n7531o9806p5101
-881D55291p2783o4411n3035m1457l1624k5077k3151k6164l2853m0505m6003m7052m3294l6518
-867a28636k9290k3133j7589j0991j584J1383K7209M3680N7615O5903O6536N9636M7618L3933
-853B02290K1041R616m74q999j5216j8510j8828j6939j4214j1811r506n441K235J3187K4470
$$ plain form
-954 653723 727151 788625 835503 865078 875480 866435 839124 795653 738608 670987 596365 519220 444959 379435
-940 379435 327408 290786 267992 255099 247790 242727 237783 231901 225088 218056 211270 204504 197450 190703 185916 184967
-924 184967 188629 195320 201021 200911 191790 173423 148052 118997 89827 64386 46454 38611 41104 51956 67873
-909 67873 85567 102837 119085 135464 154214 177440 205676 237238 268920 297621 322374 345673 372877 409094
-895 409094 455871 510047 565583 616542 659260 692358 715036 725399 720705 698449 657729 600198 530392 455291
-881 455291 382508 318097 265062 223605 191981 166904 143753 117589 84736 44231 -1772 -48824 -92118 -128636
-867 -128636 -157926 -181059 -198648 -209639 -211223 -199840 -172631 -128951 -71336 -5433 61103 120739 168357 202290
-853 202290 223331 232947 232473 223474 208258 189748 170920 153981 139767 127956 118450 113009 115244 128431 152901
-838A52901L2513L5387L3403K8014K0607J2438N329J546K451P950J6967K8110L9551M8906
-824D66073N3706N2314M4428L1086J4117m242k1650l5793m4797m7472m3749l5018k4223j5029
-810C89751r647p281m654J397J1595K3861L4853M2296M6200M7610M6986M4317M0433L7353
-796G45070L6880L9293M3361M7287M9907N1502N3799N8592O5517P1016P0032N9357L9475J3751
-782A444839j3278l6959n3452o1145o1333n7210n2171m8745m7875m8794m9353m7268m1704
-769H25552l4222k7870k4544k3577k2517j9091j2437l372O393J5189K2193K7098K9884L0865
-755G89544L0426K8677K5152J9635J3340Q486O555P250R503J2967J8286K5744L4109M0523
-741A070197M1947L7303K8310J8791J2370J0275J1020J1591R249K908o290j5850k3607k8523
$$ plain form
-838 152901 185414 220801 254204 282218 302825 315263 320592 322138 324589 332539 349506 377616 417167 466073
-824 466073 519779 572093 616521 647607 661724 657482 635832 600039 555242 507770 464021 429003 404780 389751
-810 389751 380104 372823 368169 369566 381161 405022 439875 482171 528371 575981 622967 667284 707717 745070
-796 745070 781950 821243 864604 911891 961798 1013300 1067099 1125691 1191208 1262224 1332256 1391613 1431088 1444839
-782 1444839 1431561 1394602 1341150 1280005 1218672 1161462 1109291 1060546 1012671 963877 914524 867256 825552
-769 825552 791330 763460 738916 715339 692822 673731 661294 657922 664315 679504 701697 728795 758679 789544
-755 789544 819970 848647 873799 893434 906774 915260 921815 929065 938568 951535 969821 995565 1029674 1070197
-741 1070197 1112144 1149447 1177757 1196548 1208918 1219193 1230213 1241804 1251053 1253961 1247671 1231821 1208214 1179691
-727A179691l0380k9534k7098k4547k2633k0840j8359j5412j3253j3178j5774k0722k6975
-714I00986l3391l9455m5027m9756n3034n4335n3073m8312l9251k6466j2304K10Q925J3335
-700D69052J4413J3724J2707J2437J3656J6599K1019K6338L1821L6454L8952L8284L4259K7791
-686H07506K0704J5055J2061J1161J0375Q083M408R65l70J706P609J6537K6356L4045L6823
-671A013024L3303K4027J1018l200j6620k8004l6432m0921m0918l6947l0409k2690j4302n104
-657H05825M814J4405K2138K7249L0230L2307L4465L7233M0652M4400M7680M9254M7822M2855
-643A281329L4766K4355J2091j375j4301k4147k8755k7611k1788j3122l420O371J5802K4176
-629A264371L0449L3975L5203L5077L4052L2091K9556K7826K8694L3038M0200M8306N5334
$$ plain form
-727 1179691 1149311 1119777 1092679 1068132 1045499 1024659 1006300 990888 977635 964457 948683 927961 900986
-714 900986 867595 828140 783113 733357 680323 625988 572915 524603 485352 458886 446582 446792 455717 469052
-700 469052 483465 497189 509896 522333 535989 552588 573607 599945 631766 668220 707172 745456 779715 807506
-686 807506 828210 843265 855326 866487 876862 884945 889353 890318 889948 891654 899263 915800 942156 976201 1013024
-671 1013024 1046327 1070354 1081372 1078172 1061552 1033548 997116 956195 915277 878330 847921 825231 810929 805825
-657 805825 810639 825044 847182 874431 904661 936968 971433 1008666 1049318 1093718 1141398 1190652 1238474 1281329
-643 1281329 1316095 1340450 1352541 1351166 1336865 1312718 1283963 1256352 1234564 1221442 1218022 1224393 1240195 1264371
-629 1264371 1294820 1328795 1363998 1399075 1433127 1465218 1494774 1522600 1551294 1584332 1624532 1672838 1728172
-616A728172O0332O3818O6763O8936O8398O2917N1548L5113J5559n214k5440m2882n5065o0381
-602B032574n8863n1531l9555k4239p244R648K4506L5213L9831L7800L0990K2886J6767J4586
-588B083369J7325K5339L7942N3204O8513Q1168Q8421Q7562P6620N5796K8471Q87j9437k6518
-574B658662j8450J979K8605N4338P3250Q1841P9285O6997M8320K7875J0358m07k225M662
-560C115090J7329L1247M2512M9617N3914N8319O5167P4508Q4092R1124R3965R2736Q8514
-547C958134Q2487P5300O6687N5927M3020K9473J7870J0471Q257J1074J8183K8487M0714N3650
-533D499734O6317P7660Q6847R3829R9410J04839J10654J15934J18638J17241J12541J07874
-521E711518J06976J11478J20484J32214J45481J59548J73722J87349J99933K11363K22444
$$ plain form
-616 1728172 1788504 1852322 1919085 1988021 2056419 2119336 2170884 2205997 2221556 2216342 2190902 2148020 2092955 2032574
-602 2032574 1973711 1922180 1882625 1858386 1851142 1860790 1885296 1920509 1960340 1998140 2029130 2052016 2068783 2083369
-588 2083369 2100694 2126033 2163975 2217179 2285692 2366860 2455281 2542843 2619463 2675259 2703730 2704617 2685180 2658662
-574 2658662 2640212 2642191 2670796 2725134 2798384 2880225 2959510 3026507 3074827 3102702 3113060 3112653 3110428 3115090
-560 3115090 3132419 3163666 3206178 3255795 3309709 3368028 3433195 3507703 3591795 3682919 3776884 3869620 3958134
-547 3958134 4040621 4115921 4182608 4238535 4281555 4311028 4328898 4339369 4347626 4358700 4376883 4405370 4446084 4499734
-533 4499734 4566051 4643711 4730558 4824387 4923797 5028636 5139290 5255224 5373862 5491103 5603644 5711518
-521 5711518 5818494 5929972 6050456 6182670 6328151 6487699 6661421 6848770 7048703 7260066 7482510
-510G482510K35069K50998K69588K86394K93984K84676K54412K05437J46603R0227M7467K5265
-498I872630K5679M6521Q2437J26644J73164K17693K56989K88417L10885L26141L38756L54101
-486A2420057L76359M07927M49733N01884N64261O35757P12454P85286Q39112Q54027Q09727
-475A9356584O93593N10497K87629O7831j07311k13765k50006k30449j74742r9870j7217O6768
-463A9889542J48464K24895K93412L52766M03983M50317M95943N44362N96951O52366P07977
-452B4760978P61998Q15130Q70100R29530R94470J064356J138147J215072J293768J370663
-442C5214212J439077J490546J518196J521008J507374J495193J505888J555796J650921J788068
-432E0686279J959415K156849K374941K612011K870313L155336L474769L836909M248108M711147
$$ plain form
-510 7482510 7717579 7968577 8238165 8524559 8818543 9103219 9357631 9563068 9709671 9799898 9847365 9872630
-498 9872630 9898309 9944830 10027267 10153911 10327075 10544768 10801757 11090174 11401059 11727200 12065956 12420057
-486 12420057 12796416 13204343 13654076 14155960 14720221 15355978 16068432 16853718 17692830 18546857 19356584
-475 19356584 20050177 20560674 20848303 20916134 20808823 20595058 20345052 20114603 19939861 19839991 19822774 19889542
-463 19889542 20038006 20262901 20556313 20909079 21313062 21763379 22259322 22803684 23400635 24053001 24760978
-452 24760978 25522976 26338106 27208206 28137736 29132206 30196562 31334709 32549781 33843549 35214212
-442 35214212 36653289 38143835 39662031 41183039 42690413 44185606 45691494 47247290 48898211 50686279
-432 50686279 52645694 54802543 57177484 59789495 62659808 65815144 69289913 73126822 77374930 82086077
-422H2086077N224102N779097O359340O933305P448772P830948P995088P880887P500406O969244
-412A52007266O486521O264462O448270P080046Q116470R474009J1068643J2838953J4757580
-403B34542220J6835039J9115968K1669293K4575874K7918939L1776692L6212185M1256691
-395D53902901M6878851N2934703N9088819O4709743O8774388O9857447O6321999N6804232
-387I39273083M0913038J9813878l764277k6309180m4737636n7341650o3987489o5653074
-379G38206693o3758249n9675338n4512012m9069285m3856504l9125139l4936799l1257335
-371C62016032k8041869k5267823k2912550k0913970j9158830j7514462j5879551j4218972
-363A98108005j2568305j1016943r681957q675958q068058p846219p903544q067030q162055
$$ plain form
-422 82086077 87310179 93089276 99448616 106381921 113830693 121661641 129656729 137537616 145038022 152007266
-412 152007266 158493787 164758249 171206519 178286565 186403035 195877044 206945687 219784640 234542220
-403 234542220 251377259 270493227 292162520 316738394 344657333 376434025 412646210 453902901
-395 453902901 500781752 553716455 612805274 677515017 746289405 816146852 882468851 939273083
-387 939273083 980186121 999999999 996235722 969926542 925188906 867847256 803859767 738206693
-379 738206693 674448444 614773106 560261094 511191809 467335305 428210166 393273367 362016032
-371 362016032 333974163 308706340 285793790 264879820 245720990 228206528 212326977 198108005
-363 198108005 185539700 174522757 164840800 156164842 148096784 140250565 132347021 124279991 116117936
-354A16117936q075128p778946p312736o744548o139601n545943m992917m495424m058315
-345F0974378l679759l353516l070993k823010k601053k398398k210977k037113j876320j727954
-335C5195285j590865j464230j348661j245826j157087j081852j017179r58916r03999q51817
-325B3574853q03280p59107p18860o81282o44924o08634n71746n34183m96199m58456m21883
-314A6876299l87390l55864l28097l03968k81308k56448k26584j92042j56097j22312r2160
-303A4174029o4951l9364j5018P901K9655N1292P3789R7408J22247J49451J81173K19535K65387
-290A5252534L18448L78458M46582N25921O20610P33510Q63883J006641J153282J293194J413654
-279B4006717J499245J532730J498377J386974J199858R50973O65613L75481J10127j11188
$$ plain form
-354 116117936 108042808 100263862 92951126 86206578 80066977 74521034 69528117 65032693 60974378
-345 60974378 57294619 53941103 50870110 48047100 45446047 43047649 40836672 38799559 36923239 35195285
-335 35195285 33604420 32140190 30791529 29545703 28388616 27306764 26289585 25330669 24426670 23574853
-325 23574853 22771573 22012466 21293606 20612324 19967400 19358766 18787020 18252837 17756638 17298182 16876299
-314 16876299 16488909 16133045 15804948 15500980 15219672 14963224 14736640 14544598 14388501 14266189 14174029
-303 14174029 14109078 14069714 14054696 14062597 14092252 14143544 14217333 14314741 14436988 14586439 14767612 14987147 15252534
-290 15252534 15570982 15949440 16396022 16921943 17542553 18276063 19139946 20146587 21299869 22593063 24006717
-279 24006717 25505962 27038692 28537069 29924043 31123901 32074874 32740487 33115968 33226095 33114907
-269C3114907k81689m03167m79998n15753n13025m74468m03570l04372j81583m1494J07189
-258B9622977K53025L82108M78387N24398N03932M07157K36435R426k43508m88423o99092
-247C0986822q64569r88143j080026j148803j197015j221914j219894j191070j141263j080704
-237A9853421j020223r67139r22569q81728q37382p83956p20256o49526n77445n09273m47443
-226A1536481l90903l36765k82763k28560j74838j21223o5506n188O0303J28569J94923K53939
-214A0568469L01553L36979L63365L87350M18040M65411N38387O42755P79939R47007J137266
-203A6886521J339996J538224J704706J798180J764190J546657J112996M83862k54391r72228
-193B6948713j546891j908206k052640k024903j887135j695192j488728j291541j115593r65233
$$ plain form
-269 33114907 32833218 32430051 31950053 31434300 30921275 30446807 30043237 29738865 29557282 29515788 29622977
-258 29622977 29876002 30258110 30736497 31260895 31764827 32171984 32408419 32417845 32174337 31685914 30986822
-247 30986822 30122253 29134110 28054084 26905281 25708266 24486352 23266458 22075388 20934125 19853421
-237 19853421 18833198 17866059 16943490 16061762 15224380 14440424 13720168 13070642 12493197 11983924 11536481
-226 11536481 11145578 10808813 10526050 10297490 10122652 10001429 9935923 9930735 9991038 10119607 10314530 10568469
-214 10568469 10870022 11207001 11570366 11957716 12375756 12841167 13379554 14022309 14802248 15749255 16886521
-203 16886521 18226517 19764741 21469447 23267627 25031817 26578474 27691470 28175332 27920941 26948713
-193 26948713 25401822 23493616 21440976 19416073 17528938 15833746 14345018 13053477 11937884 10972651
-183A0972651q40706p40410o61587o00125n50458n06161m61653m14096l64281l15562k71548
-172E246064k34565k05374j83577j68098j57627j51141j47706j45624j41849j33145j18625
-161C458733j00857q4285p2574o6849o5421o4769o1264n2738l9136k1759k279J7746L6990
-148B881538N4205O8472P9446Q7783R5000J02749J11799J21400J29723J34867J35580J31208
-136D133770J21445J06471Q7430O6165M4274K2625J548j8905l9104n9553q0766j03001j26036
-123D156363j48444j67412j79897j83971j79368j67095j48945j27604j06398q8531p5820o7939
-111B514939o3025n9530n7489n8122o2457p0548q1455r3805j05932j15904j21950j23209j19951
-98A381562j13037j03157r0457p4854n6515l6281j5691L461J9862L2784M1596M5713M5027
$$ plain form
-183 10972651 10131945 9391535 8729948 8129823 7579365 7073204 6611551 6197455 5833174 5517612 5246064
-172 5246064 5011499 4806125 4622548 4454450 4296823 4145682 3997976 3852352 3710503 3577358 3458733
-161 3458733 3357876 3273591 3201017 3134168 3068747 3003978 2942714 2889976 2850840 2829081 2826802 2844548 2881538
-148 2881538 2935743 3004215 3083661 3171444 3266444 3369193 3480992 3602392 3732115 3866982 4002562 4133770
-136 4133770 4255215 4361686 4449116 4515281 4559555 4582180 4583728 4564823 4525719 4466166 4385400 4282399 4156363
-123 4156363 4007919 3840507 3660610 3476639 3297271 3130176 2981231 2853627 2747229 2658698 2582878 2514939
-111 2514939 2451914 2392384 2334895 2276773 2214316 2143768 2062313 1968508 1862576 1746672 1624722 1501513 1381562
-98 1381562 1268525 1165368 1074911 1000057 943542 907261 891570 895031 914893 947677 989273 1034986 1080013
-85A080013M0092L1750K0950Q839l511j5656k7714l9996n2548o4737p4907q0525p9078o9315
-71F73657n1996k9564n156J8071L6966M8677N1549M6077L4891K1401Q476k056q928j1363r871
-56H20831o522l765k692k367j155J292L222K205k009o304o440n15R863K1400L1391L8326M1252
-39I38013L9300L1830J8968K274j4937k8378l5052l4947l0626k5223k1038j9362k0454k3502
-25G76866k7129l0300l2477l3081l1027k5270j5641l329R294J9258K4048K2500J5000L014
-11F71726j1141k4733l5507m2739m7358n0951n4045n5145n1558m1280k4673m633J4547K9147
2B71657L7661M0572L9190L4573K6941J6095K512j1699k3044k8160k5292j4787J254J9840L7740
17D25053N1723N8696N6676M6145L0346J3586q16j1092j6345j6219j1215l026N797J2765J6594
$$ plain form
-85 1080013 1120105 1151855 1172805 1181644 1178133 1162477 1134763 1094767 1042219 977482 902575 822050 742972 673657
-71 673657 621661 592097 586941 605012 641978 690655 742204 788281 823172 844573 853049 850993 842065 830702 820831
-56 820831 814309 810544 807852 805485 804330 805622 808844 811049 809040 802736 796296 795781 805644 827044 858435 896761 938013
-39 938013 977313 1009143 1028111 1030385 1015448 987070 952018 917071 886445 861222 840184 820822 800368 776866
-25 776866 749737 719437 686960 653879 622852 597582 581941 578612 587906 607164 631212 653712 668712 671726
-11 671726 660585 635852 600345 557606 510248 459297 405252 350107 298549 257269 232596 227963 242510 271657
2 271657 309318 349890 389080 423653 450594 466689 469201 457502 434458 406298 381006 366219 367473 387313 425053
17 425053 476776 535472 592148 638293 668639 682225 681409 670317 653972 637753 626538 623512 629309 642074 658668
32F58668J7531J6831J6259J7433K0896K5891L1122L6002M0921M6240N1241N4073N2822M6524
46A132454L5831K2350P653p358k1631l2549l6385l0803j7067K05J5105K2714K0569R102q835
61A111355k9099m7615o1379o8832o9661o4654n5711m5345l5314k5928j6448o130M768J4529
75F04536K0507K0758J5164N493n731j6430k5316l1429l3455l0098k1056p636P421K0650K8835
90E52213K9982K4480J4949M834l195p655p603k020J0149K9018N2860P8195J00442J14920J18300
105A109869J09697R1059O6751M2232K2581J0738O799Q620J3581K0310K9013M0138N2787O4426
119A688601P2286P4838P2255O5743N6634M5776L3165J8178R36j6369k9870l5711l2089k0268
133A994105l917J2782K6817L7095M4039M8497N0856N1156M9571M6761M3829M2439M4112M9095
$$ plain form
32 658668 676199 693030 709289 726722 747618 773509 804631 840633 881554 927794 979035 1033108 1085930 1132454
46 1132454 1168285 1190635 1198288 1190930 1169299 1136750 1100365 1069562 1052495 1052700 1067805 1090519 1111088 1120190 1111355
61 1111355 1082256 1034641 973262 904430 834769 770115 714404 669059 633745 607817 591369 585239 590007 604536
75 604536 625043 645801 660965 666458 660727 644297 618981 587552 554097 523999 502943 495307 502728 523378 552213
90 552213 582195 606675 621624 626458 623263 615608 608005 605985 616134 645152 698012 776207 876649 991569 1109869
105 1109869 1219566 1310625 1377376 1419608 1442189 1452927 1459726 1468346 1481927 1502237 1531250 1571388 1624175 1688601
119 1688601 1760887 1835725 1907980 1973723 2030357 2076133 2109298 2127476 2128412 2112043 2082173 2046462 2014373 1994105
133 1994105 1990188 2002970 2029787 2066882 2110921 2159418 2210274 2261430 2311001 2357762 2401591 2444030 2488142 2537237
147B537237N5856O2071O6442O9424P2278P5526P7902P6665O9079N4457L5232J5875K65j0424
161C257885j7437k2342k4827k2476j2289P334L5824P0872J09408J48400J85023K16752K41445
174D173572K57412K63719K60958K51393K38252K24664K13641K08907K14486K32450K61157
185F800611K96010L32187L66875L99144M28520M54264M76365M96154N15380N34059N49200
196A1648769N55859N49758N29932M99584M64694M31106M01972L76610L51271L21278K83623
207A6414456K39200J93320J53864J27677J17564J21607J34605J50055J61168J61776J48578
218A8123870J24213R7918Q1688Q4120J05981J40011J73523J92371J86025J52773J01924N0342
230A9614759J4646L916J7538M8208Q7252J28290J67939K05199K40701K76095L13622L55667
$$ plain form
147 2537237 2593093 2655164 2721606 2791030 2863308 2938834 3016736 3093401 3162480 3216937 3252169 3268044 3268309 3257885
161 3257885 3240448 3218106 3193279 3170803 3158514 3165848 3201672 3272544 3381952 3530352 3715375 3932127 4173572
174 4173572 4430984 4694703 4955661 5207054 5445306 5669970 5883611 6092518 6307004 6539454 6800611
185 6800611 7096621 7428808 7795683 8194827 8623347 9077611 9553976 10050130 10565510 11099569 11648769
196 11648769 12204628 12754386 13284318 13783902 14248596 14679702 15081674 15458284 15809555 16130833 16414456
207 16414456 16653656 16846976 17000840 17128517 17246081 17367688 17502293 17652348 17813516 17975292 18123870
218 18123870 18248083 18346001 18427689 18511809 18617790 18757801 18931324 19123695 19309720 19462493 19564417 19614759
230 19614759 19629405 19633321 19650859 19699067 19786319 19914609 20082548 20287747 20528448 20804543 21118165 21473832
242B1473832M04299M60150N21376N83953O43424O97589P47048P93160Q34784Q66640Q80696
253B8906951Q70060Q33081P75540P09208O46804N96930N62223N41273N31368N29915N34794
264C6038147N44103N55872N67611N76300N78925N74010N62795N48975N37623N33678N40245
275D2158284N57395N82152O10256O37931O62563O82429O95971P00792O93732O73193O42190
286D9296888O09239N85209N78775N93333O26819O73300P24986P74312Q14963Q42176Q52674
297E6972674Q45230Q20591P79734P21322O41165N35741M08214K72116J48113N4718q30k4514
309F2174274l0373l2539l9880n4601p3565r0171r6927q8585o4733k9738J0029M9473Q5825
322F1718489J18445J48532J79044K14101K57395L10109L68947M26359M73405N03500N14512
$$ plain form
242 21473832 21878131 22338281 22859657 23443610 24087034 24784623 25531671 26324831 27159615 28026255 28906951
253 28906951 29777011 30610092 31385632 32094840 32741644 33338574 33900797 34442070 34973438 35503353 36038147
264 36038147 36582250 37138122 37705733 38282033 38860958 39434968 39997763 40546738 41084361 41618039 42158284
275 42158284 42715679 43297831 43908087 44546018 45208581 45891010 46586981 47287773 47981505 48654698 49296888
286 49296888 49906127 50491336 51070111 51663444 52290263 52963563 53688549 54462861 55277824 56120000 56972674
297 56972674 57817904 58638495 59418229 60139551 60780716 61316457 61724671 61996787 62144900 62199618 62198788 62174274
309 62174274 62143901 62111362 62071482 62016881 61943316 61853145 61756218 61667633 61602900 61573162 61583191 61632664 61718489
322 61718489 61836934 61985466 62164510 62378611 62636006 62946115 63315062 63741421 64214826 64718326 65232838
333F5232838N07955M87061M55000M14282L66626L12753K53460J91173J30463P6310L1350m970
345F8454301l4588n8381p4806q0884p4049n3603k0983K0616O6480J10384J45014J63575J62569
358F8725645J43701J13254P9475M9733K8787J8318J7598K4610L7113N3037P0620Q8762J07543
371F9558196J28672J55513J92509K43336L09001L86618M69889N49789O15828O57817O67316
382G3934484O38647N69905M64669L32957J89961N1701o8756j62826k26633k60942k71095k66404
394G4925668k58386k58424k75948l17032l83682m72862n75985o80531p73449q44511q88428
405F9196430r05227q99610q78312q47543q11479p72576p32460o92733o55519o24091o02114
416F0774766n91986n93660o04691o21515o41051o61359o81075o98247p10104p13566p06632
$$ plain form
333 65232838 65740793 66227854 66682854 67097136 67463762 67776515 68029975 68221148 68351611 68427921 68459271 68454301
345 68454301 68419713 68361332 68286526 68205642 68131593 68077990 68057007 68077623 68144103 68254487 68399501 68563076 68725645
358 68725645 68869346 68982600 69062075 69111808 69140595 69158913 69176511 69201121 69238234 69291271 69361891 69450653 69558196
371 69558196 69686868 69842381 70034890 70278226 70587227 70973845 71443734 71993523 72609351 73267168 73934484
382 73934484 74573131 75143036 75607705 75940662 76130623 76182324 76113568 75950742 75724109 75463167 75192072 74925668
394 74925668 74667282 74408858 74132910 73815878 73432196 72959334 72383349 71702818 70929369 70084858 69196430
405 69196430 68291203 67391593 66513281 65665738 64854259 64081683 63349223 62656490 62000971 61376880 60774766
416 60774766 60182780 59589120 58984429 58362914 57721863 57060504 56379429 55681182 54971078 54257512 53550880
427E3550880o88989o61781o26625n85187n39625m92732m46905m02822l59655l16424k73481
438D8156654k32547j96000j65873j42886j26271j14748j07117j01713r5909q6541p1726n2299
450D6663024l1228j1391O494K4040M3721O7192R4279J22942J50026J71037J80021J70858J40507
463D7791522R1280K9778l6422j01805j64126k23285k78804l27965l66153l88865l93563l81031
475D5250561l55827l25332k96979k75867k63383k57660k54943k51386k44768k35165k24651
486D2264600k15973k10797k08793k08506k09006k10478k13415k17760k23304k30275k39463
497C9876830k51691k66944k83727k99016l09279l11787l05507k91365k72057k51471k33524
508C6800462k20859k13888k11406k11759k13782k17236k22856k31303k41937k52568k60355
$$ plain form
427 53550880 52861891 52200110 51573485 50988298 50448673 49955941 49509036 49106214 48746559 48430135 48156654
438 48156654 47924107 47728107 47562234 47419348 47293077 47178329 47071212 46969499 46873590 46787049 46715323 46663024
450 46663024 46631796 46620405 46626899 46650939 46694660 46761852 46856131 46979073 47129099 47300136 47480157 47651015 47791522
463 47791522 47882802 47912580 47876158 47774353 47610227 47386942 47108138 46780173 46414020 46025155 45631592 45250561
475 45250561 44894734 44569402 44272423 43996556 43733173 43475513 43220570 42969184 42724416 42489251 42264600
486 42264600 42048627 41837830 41629037 41420531 41211525 41001047 40787632 40569872 40346568 40116293 39876830
497 39876830 39625139 39358195 39074468 38775452 38466173 38154386 37848879 37557514 37285457 37033986 36800462
508 36800462 36579603 36365715 36154309 35942550 35728768 35511532 35288676 35057373 34815436 34562868 34302513
519C4302513k62766k58335k47220k31460k14197j98749j88041j84316j88533j99917k16380
530C1912599k35356k54675k72927k89417l04252l17604l28500l34490l33287l24832l11714
541B8605545k97448k84724k74433k66156k59037k52172k44833k36470k26899k16605k06658
552B5840110j98414j93393j93082j98299k08452k21351k34138k44601k51805k56009k58293
563B3382273k59609k59842k57706k51799k41534k27444k10873j93481j76511j60240j44167
574B0999067j28010j12144r7245q3957p2974o5496o2981o5990p2726p9384q2212p9957p4586
587A9921405o9791o8698p2245p9321q8364r7994j06544j11733j11589j05898r6605q7068q0818
600A8744737q0698q8477j04411j26312j49323j67726j78207j81845j83319j87799j97766k12140
$$ plain form
519 34302513 34039747 33781412 33534192 33302732 33088535 32889786 32701745 32517429 32328896 32128979 31912599
530 31912599 31677243 31422568 31149641 30860224 30555972 30238368 29909868 29575378 29242091 28917259 28605545
541 28605545 28308097 28023373 27748940 27482784 27223747 26971575 26726742 26490272 26263373 26046768 25840110
552 25840110 25641696 25448303 25255221 25056922 24848470 24627119 24392981 24148380 23896575 23640566 23382273
563 23382273 23122664 22862822 22605116 22353317 22111783 21884339 21673466 21479985 21303474 21143234 20999067
574 20999067 20871057 20758913 20661668 20577711 20504737 20439241 20376260 20310270 20237544 20158160 20075948 19995991 19921405
587 19921405 19851614 19782916 19710671 19631350 19542986 19444992 19338448 19226715 19115126 19009228 18912623 18825555 18744737
600 18744737 18664039 18575562 18471151 18344839 18195516 18027790 17849583 17667738 17484419 17296620 17098854 16886714
612A6886714k27722k41512k51606k56801k55776k47655k32929k14267j95442j79399j67040
623A4416565j57116j46997j33950j16340r4880p2797n4706m4259m2432m7532n6805o8084p9958
636A3300709r1053r9168j02006r8473q9234p5977o0641m5074l0987j9725j2498r471r337r599
650A2547466q028l960J379N935Q516R836J2072J7368K6842M0259N6132P2191Q5920R5747J01540
665A3069215J04604J06006J04818R8118Q3301O0955L5033J0049j1780l0289m4782n2983n3147
678A3479118m6245l5024k1342m748J6166M1501O8853R3753J10901J14912J00969O5653P811
691A3992278p0952j66232k70806l74978m67846n39608n83878n99112n88758n59781n20367
702I249960m77704m37108m01913l73724l52153l34931l18543k99536k75908k48142k19107
$$ plain form
612 16886714 16658992 16417480 16165874 15909073 15653297 15405642 15172713 14958446 14763004 14583605 14416565
623 14416565 14259449 14112452 13978502 13862162 13767282 13694485 13639779 13595520 13553088 13505556 13448751 13380667 13300709
636 13300709 13209656 13110488 13008482 12910009 12820775 12744798 12684157 12639083 12608096 12588371 12575873 12566402 12557065 12547466
650 12547466 12539438 12535478 12536857 12542792 12551308 12561144 12573216 12590584 12617426 12657685 12713817 12786008 12871928 12967675 13069215
665 13069215 13173819 13279825 13384643 13482761 13566062 13627017 13662050 13672099 13660319 13630030 13585248 13532265 13479118
678 13479118 13432873 13397849 13376507 13371759 13387925 13429426 13498279 13592032 13702933 13817845 13918814 13984467 13992278
691 13992278 13921326 13755094 13484288 13109310 12641464 12101856 11517978 10918866 10330108 9770327 9249960
702 9249960 8772256 8335148 7933235 7559511 7207358 6872427 6553884 6254348 5978440 5730298 5511191
713E511191j93209j74506j64653j61656j60564j56325j46885j34080j21616j12352j07138
724C878207j05419j06140j07870j08835j07360j02706r5370q6479p7011o7545n8347m9594
736B805531m1691l5421l1559l0559l2336l6015l9988m2503m2351l9485l5258l2146l2767l8289
750B295163m7269n5996o0568n8995n1887m1912l2380k5876k3183k3500k5312k7595l0011l2390
764A758289l4571l7104m1585m9473o0806p3745q5524r3836r7557r6707r1584q2461o9774n4202
778G89360l6267j6145N830K8371M8638O3123O9551O7718N8781M4101K5131M080j6021l2262
792A103989m2977m7915m7731m3777l7960l2367k8376k5886k3705k1195j9465k0698k6238l4862
806F50837m3055m6925m4424l6065k4340j2512l383J574K613J168j150l723p331j3304k1994
$$ plain form
713 5511191 5317982 5143476 4978823 4817167 4656603 4500278 4353393 4219313 4097697 3985345 3878207
724 3878207 3772788 3666648 3558778 3449943 3342583 3239877 3144507 3058028 2981017 2913472 2855125 2805531
736 2805531 2763840 2728419 2696860 2666301 2633965 2597950 2557962 2515459 2473108 2433623 2398365 2366219 2333452 2295163
750 2295163 2247894 2191898 2131330 2072335 2020448 1978536 1946156 1920280 1897097 1873597 1848285 1820690 1790679 1758289
764 1758289 1723718 1686614 1645029 1595556 1534750 1461005 1375481 1281645 1184088 1087381 995797 913336 843562 789360
778 789360 753093 736948 742778 771149 819787 882910 952461 1020179 1078960 1123061 1148192 1152272 1136251 1103989
792 1103989 1061012 1013097 965366 921589 883629 851262 822886 797000 773295 752100 732635 711937 685699 650837
806 650837 607782 560857 516433 480368 456028 443516 440133 441707 444320 445488 444338 440615 433284 419980 397986
821C97986l2143m1896n0188n7134o2782o5930o4504n7514m6529l5165k7206k4259k4835k5351
835b17450k2776j6839j0251o766q867j6193k5676l2969l4402k8444j5873R97J9310L6631N1336
850c28232O2449O9520P2741P2794P0264O5295N7907M8348L7434K6371J6197P477P14l402m921
865B70956n226o031p742r370j0232j1352j4925k2609l4103m6989n7886o3775o2699n3897l8302
880a74182j8744N58J5665K4463K6842K4065J7925J0268K540m373r916j3337j3461r636k680
895a24003N322J2090J5906J6023J2457O004k018j0243j7571k3295k7169k9736l2275l6008
909b34516m1246m7450n3833n9713o4292o6146o3563n5378m1894k4984p213R301K3425L4757
923f92745M3140M8511N1330N2564N3237N3809N4059N3394N1187M7145M1171L3134K3353J3374
$$ plain form
821 397986 365843 323947 273759 216625 153843 87913 23409 -34105 -80634 -115799 -143005 -167264 -192099 -217450
835 -217450 -240226 -257065 -267316 -274082 -282949 -299142 -324818 -357787 -392189 -420633 -436506 -435509 -416199 -379568 -328232
850 -328232 -265783 -196263 -123522 -50728 19536 84831 142738 191086 228520 254891 271088 278565 279279 275877 270956
865 270956 265730 259699 251957 242587 232355 221003 206078 183469 149366 102377 44491 -19284 -81983 -135880 -174182
880 -174182 -192926 -192368 -176703 -152240 -125398 -101333 -83408 -73140 -70600 -74973 -84889 -98226 -111687 -121323 -124003
895 -124003 -118681 -106591 -90685 -74662 -62205 -56201 -58219 -68462 -86033 -109328 -136497 -166233 -198508 -234516
909 -234516 -275762 -323212 -377045 -436758 -501050 -567196 -630759 -686137 -728031 -753015 -760228 -750927 -727502 -692745
923 -692745 -649605 -601094 -549764 -497200 -443963 -390154 -336095 -282701 -231514 -184369 -143198 -110064 -86711 -73337
937g3337N554J830K746P541J4772K2876L0451L6266L8998L7112K9835J8704P744J081j22J510
953A83561J749k133j0129k0422l0519l8095m1709m0912l5780k6518j3840L66J3173K1430K2958
968a6820J7123M672j2389l0608m5494n3406n3275m6443l4835j9969l282J3215K7014L5772
982b18725L8495L6296L1671K6680K1757J6201R390J610o034j2213j6279j8679k0631k3209
996a33670k7008l1981l7176m0734m1044l8406l5426l5361l9627m6250n0729m8915l9703k5545
1010f71575j0699J321R119J3086J4492J4625J4603J5430J8153K3544L1284M0151M8790N6045
1024c81631O1137O3974O5234O5800O5653O3389N6812M4492K7217Q014r163k1334k7886l0743
1038E0965l3152l7839m5363n3860o0462o3054o1448n7238n2911n0578n1192n4240n8066o0717
$$ plain form
937 -73337 -67783 -65953 -63207 -55666 -40894 -18018 12433 48699 87697 124809 154644 173348 181092 182173 182051 183561
953 183561 185310 183177 173048 152626 122107 84012 42303 1391 -34389 -60907 -74747 -74381 -61208 -39778 -16820
968 -16820 303 4975 -7414 -38022 -83516 -136922 -190197 -236640 -271475 -291444 -294726 -281511 -254497 -218725
982 -218725 -180230 -143934 -112263 -85583 -63826 -47625 -38235 -36625 -42659 -54872 -71151 -89830 -110461 -133670
996 -133670 -160678 -192659 -229835 -270569 -311613 -350019 -385445 -420806 -460433 -506683 -557412 -606327 -646030 -671575
1010 -671575 -682274 -680953 -671834 -658748 -644256 -629631 -615028 -599598 -581445 -557901 -526617 -486466 -437676 -381631
1024 -381631 -320494 -256520 -191286 -125486 -59833 3556 60368 104860 132077 140091 130928 109594 81708 50965
1038 50965 17813 -20026 -65389 -119249 -179711 -242765 -304213 -361451 -414362 -464940 -516132 -570372 -628438 -689155
1052f89155o0821n8006n2638m5164l5465k2936p575R321K5265L7596M4741M6987M5735M1660
1066g20455L3958K2053P951l569p123M19J8481M2972O8155Q8866J02007J06576J02949R2260
1080d4500P6124N6744L6800J8925M824n345j2813j9187k5430l1660l7511m2781m7479n1542
1094a24831n4839n7208n8664n9630o0726o2061o2387n9891n4075m6696m0461l6689l4136l0417
1108h42711k4346j7273j1727q576n581N85J1278K4694L7542M7315N3336N6305N7494N8387
1122e63278O0424O4387O9912P5828Q0591Q2420P9523P0783N6475L8314J8675l7j5894k7326
1136I0797l3217l3348k8649k0967j2361m458J537N028N999N214L992L466M088N273N693M234
1152B321M86n208j2277k0257k8612l6201m1468m3012m0554l5169k8692k2732j8257j5695j5074
$$ plain form
1052 -689155 -749976 -807982 -860620 -905784 -941249 -964185 -971760 -962439 -937174 -899578 -854837 -807850 -762115 -720455
1066 -720455 -686497 -664444 -656493 -660062 -667185 -666766 -648285 -605313 -537158 -448292 -346285 -239709 -136760 -44500
1080 -44500 31624 88368 125168 144093 148917 143572 130759 111572 86142 54482 16971 -25810 -73289 -124831
1094 -124831 -179670 -236878 -295542 -355172 -415898 -477959 -540346 -600237 -654312 -701008 -741469 -778158 -812294 -842711
1108 -842711 -867057 -884330 -896057 -904633 -910214 -909629 -898351 -873657 -836115 -788800 -735464 -679159 -621665 -563278
1122 -563278 -502854 -438467 -368555 -292727 -212136 -129716 -50193 20590 77065 115379 134054 134017 118123 90797
1136 90797 57580 24232 -4417 -25384 -37745 -42203 -40666 -35638 -29639 -24425 -20433 -16967 -12879 -7606 -1913 2321
1152 2321 2807 -2401 -14678 -34935 -63547 -99748 -141216 -184228 -224782 -259951 -288643 -311375 -329632 -345327 -360401
1167c60401j6183j8496k1364k4257k6977k9270l0661l0580k8783k5413k0318j2228O73J8608
1181f25650L8703N5963O6296O8890O6144O1523N7652N5620N5396N6318N7574N8386N7724N4251
1195A84790M6873L5711K2359R137k059j0586j6978k2094k6244k9348l1694l4157l7595m2456
1209D5659m9081n7845o8545p9633q8757r3709r3034q6126p3392n6405l7418j8806k903Q187
1223g51808J3356J3373J0546P562O314P393J0039J2779J4358J4840J5458J7471K0667K3021
1237e64631K1789J5353M364q847k1732l2616m0334m3905m2958l8261l1080k1888j0006N330
1251h09422K3665M3145O1331P5933Q4951Q6984Q1712P0210N5189M0630L0537K7095K9595L5091
1265f3354M0134M2503M2019L9856L6973L2959K6558J6905M414r367k2423l2752l9012m1087
$$ plain form
1167 -360401 -376584 -395080 -416444 -440701 -467678 -496948 -527609 -558189 -586972 -612385 -632703 -644931 -644258 -625650
1181 -625650 -586947 -530984 -464688 -395798 -329654 -268131 -210479 -154859 -99463 -43145 14429 72815 130539 184790
1195 184790 231663 267374 289733 298870 296811 286225 269247 247153 220909 191561 159867 125710 88115 45659
1209 45659 -3422 -61267 -129812 -209445 -298202 -391911 -484945 -571071 -644463 -700868 -738286 -757092 -759995 -751808
1223 -751808 -738452 -725079 -714533 -706971 -700657 -693264 -683225 -670446 -656088 -641248 -625790 -608319 -587652 -564631
1237 -564631 -542842 -527489 -523125 -531972 -553704 -586320 -626654 -670559 -713517 -751778 -782858 -804746 -814752 -809422
1251 -809422 -785757 -742612 -681281 -605348 -520397 -433413 -351701 -281491 -226302 -185672 -155135 -128040 -98445 -63354
1265 -63354 -23220 19283 61302 101158 138131 171090 197648 214553 218967 209600 187177 154425 115413 74326
1279G4326m0087l7504l4266l0757k7328k4921k5047k9218l7866m9344n9647o3374n6201l7410
1293d78644j0241K0203M9043P2139Q6000Q8323P8926O0235L6770J3314o929k3027l5189m3501
1307i2578m7934m8949m7478m4530m0929l7303l4052l1276k8927k7010k5722k5133k4586k2592
1321e78999j7678r385J336J2540K2274K9303L3229L4557L4538L4562L5778L8762M3389M8286
1335b37508N0722M7693L7884K2967O977o205j4591j8016j7165j3159p661k119K934P705J2254
1350a27288J6132J8994K0990K2351K2836K1902J9189J4495P694j113j1149k0757k7934l1576
1364e5234l1791k9026k3420j5417o719J31L410L517K549K723N018Q880J3094J6675J9118K0197
1380f6295J9779J8056J5921J4694J5374J7923K1259K3851K4580K3138J9626J4277P648Q67
$$ plain form
1279 74326 34239 -3265 -37531 -68288 -95616 -120537 -145584 -174802 -212668 -262012 -321659 -385033 -441234 -478644
1293 -478644 -488885 -468682 -419639 -347500 -261500 -173177 -94251 -34016 2754 16068 9139 -13888 -49077 -92578
1307 -92578 -140512 -189461 -236939 -281469 -322398 -359701 -393753 -425029 -453956 -480966 -506688 -531821 -556407 -578999
1321 -578999 -596677 -606062 -604726 -592186 -569912 -540609 -507380 -472823 -438285 -403723 -367945 -329183 -285794 -237508
1335 -237508 -186786 -139093 -101209 -78242 -71265 -77470 -92061 -110077 -127242 -140401 -148062 -150181 -147247 -139542 -127288
1350 -127288 -111156 -92162 -71172 -48821 -25985 -4083 15106 29601 37295 36182 25033 4276 -23658 -55234
1364 -55234 -87025 -116051 -139471 -154888 -161607 -161476 -158066 -154549 -152000 -149277 -144259 -135379 -122285 -105610 -86492 -66295
1380 -66295 -46516 -28460 -12539 2155 17529 35452 56711 80562 105142 128280 147906 162183 169831 170698
1394A70698m740q212r416r450j0544j5411k5908m1779o0252p7502r0671r8539j00337r4640
1408d76703q0151n7233k8921m70K2520L6327M0488L7372L0141K1089J1546L034j990p92P769
1423d35974K1926L7374M9284N4029N0147L8821K3592Q368m782j6092k6021l3509l6429l3876
1437c03142k7484k0293j4543j0732q078n173p17N708J3147J9765K3942K5253K4765K4250K4934
1452b28398K6614K7759K6664K2750J6748R449M24j1557k6718m2843n5900o2208o0161n0105
1466d07482l3508j3049P167K2699L0879L1967K8339K2131J3940L783o973j5522j9382j7946
1480c52957j2550n452J096N886R757J5213K4528L7863N3211O7889P9973Q8973R5647J01046
1494B10123J04957J05290R8851Q3344N9010K8955k208l0694n4866p4153q7119r1148q4638
$$ plain form
1394 170698 165958 157746 148330 138880 128336 112925 87017 45238 -15014 -92516 -183187 -281726 -382063 -476703
1408 -476703 -556854 -614087 -643008 -643478 -620958 -584631 -544143 -506771 -476630 -455541 -443995 -440961 -442951 -443743 -435974
1423 -435974 -414048 -376674 -327390 -273361 -223214 -184393 -160801 -152433 -157215 -173307 -199328 -232837 -269266 -303142
1437 -303142 -330626 -350919 -365462 -376194 -384272 -389445 -390162 -384454 -371307 -351542 -327600 -302347 -277582 -253332 -228398
1452 -228398 -201784 -174025 -147361 -124611 -107863 -98414 -97990 -109547 -136265 -179108 -235008 -297216 -357377 -407482
1466 -407482 -440990 -454039 -446872 -424173 -393294 -361327 -332988 -310857 -296917 -293134 -300107 -315629 -335011 -352957
1480 -352957 -365507 -370959 -369863 -363977 -354220 -339007 -314479 -276616 -223405 -155516 -75543 13430 109077 210123
1494 210123 315080 420370 519221 602565 661575 690530 688322 657628 602762 528609 441490 350342 265704
1507B65704o9071m8513k7419r000M949J3502J6787J6601J5853J6508J8124J8371J4958O918
1521B54272n138j9148l2097m1073m4486m2636l7287l0667k4512j9324j4395q597j956L900
1535f3144O948O496L188k172r361j7792k5937l1630l2935k8858j9877q302J836O326K737q372
1551b20849k4017m0285n3550o0911o0616n2530l8665k2759q620J606P954J1831J4739J7622
1565e29050K0827K4042K6304K6700K5442K3906K3152K2638K0612J5554P466k159j1037j7289
1579c22892k0410k1537k2540k4418k6114k4812j7824m551J2514K8569L8248L7965K7811J1762
1593c28229m156j4425j6191r762J851J4277K3381K6680K4178J7863J0413M214Q55L86J645
1608b47020L210M465N531O738Q597J1562J5417J9008K1048K0621J7052R738j207j4422k7878
$$ plain form
1507 265704 196633 148120 120701 111701 116650 130152 146939 163540 179393 195901 214025 232396 247354 254272
1521 254272 249134 229986 197889 156816 112330 69694 32407 1740 -22772 -42096 -56491 -65088 -67044 -63144
1535 -63144 -56196 -49700 -46512 -48684 -58045 -75837 -101774 -133404 -166339 -195197 -215074 -223376 -221540 -215214 -212477 -220849
1551 -220849 -244866 -285151 -338701 -399612 -460228 -512758 -551423 -574182 -582802 -581196 -573242 -561411 -546672 -529050
1565 -529050 -508223 -484181 -457877 -431177 -405735 -381829 -358677 -336039 -315427 -299873 -292407 -294566 -305603 -322892
1579 -322892 -343302 -364839 -387379 -411797 -437911 -462723 -480547 -485098 -472584 -444015 -405767 -367802 -339991 -328229
1593 -328229 -332385 -346810 -363001 -372763 -370912 -356635 -333254 -306574 -282396 -264533 -254120 -249906 -249051 -248665 -247020
1608 -247020 -243810 -239345 -233814 -227076 -218479 -206917 -191500 -172492 -151444 -130823 -113771 -104033 -105240 -119662 -147540
1623a47540m0117n0433n8115o1883o0448n3633m2756k9593j5268j2J6020L1706M4701N2119
1637d15252N2312M6423L8057L0849K6029K2030J6552Q723o80j0400j9121k5921k9819k9784
1651b90002k4657j4808l163N978R640Q107M350J439J016K839N756Q572J0492J1410J2467J5469
1667b35095K2379L3514M6596N7851O3632O2861N7115M9336M1760L5111K9153K3376J7600J2190
1681C17379P823M724K055j506o691j3223k0784k9665m0170n1203o0462o6224o8313o7337o3842
1696a57439n8614n3308m9600m7893m7034m5418m1930l6246k8550j9341r601p19O285J2174
1710e77234J9242K9367M2247N5622O7008P4815P8247P6539O8831N5095L7057J7922R94j1956
1724C3796k1445k9262l6616m2981m6407m4865l7677k6073j2601P2R620J4298J3477Q231J007
$$ plain form
1623 -147540 -187657 -238090 -296205 -358088 -418536 -472169 -514925 -544518 -559786 -559798 -543778 -512072 -467371 -415252
1637 -415252 -362940 -316517 -278460 -247611 -221582 -199552 -183000 -174277 -174957 -185357 -204478 -230399 -260218 -290002
1651 -290002 -314659 -329467 -332630 -326652 -317012 -308905 -304555 -303116 -302100 -299261 -293505 -284933 -274441 -263031 -250564 -235095
1667 -235095 -212716 -179202 -132606 -74755 -11123 51738 108853 158189 199949 235060 264213 287589 305189 317379
1681 317379 325202 329926 331981 330475 323784 310561 289777 260112 219942 168739 108277 42053 -26260 -93597 -157439
1696 -157439 -216053 -269361 -318961 -366854 -413888 -459306 -501236 -537482 -566032 -585373 -594974 -595693 -589408 -577234
1710 -577234 -557992 -528625 -486378 -430756 -363748 -288933 -210686 -134147 -65316 -10221 26836 44758 45752 33796
1724 33796 12351 -16911 -53527 -96508 -142915 -187780 -225457 -251530 -264131 -264059 -254439 -240141 -226664 -218433 -217426
1739b17426n036o958l241N259J5405K3202K5507K1233J1340k174j7439l3088m8055o1309p1700
1754c64480p8117q0082p7973p2941o6443n9561n2183m3207l1873j8648m839Q354K0216L0450
1768h91327L8839M5458N0758N5428N9592O2698O4076O3196N9794N3641M4777L3698K1459R733
1782b28180N72m104l430J763Q947J5156J8218J7686J4803J1561R435Q609P683M673j704j1271
1798a29583k2605l3866m3556n0778n5242n6613n4366m8166l8208k5076r278Q271K5345L8512
1812d95209M4477M1572L0520J4106l843j9648l0421l4228l0290j9588n213Q498J8001K2018
1826d59248K1544J8593J5068J2343J0946J0137P918K146q175k2160l7190m9420n5251n3121
1840e85870m4241l1674j8552p191J086O005Q239Q882Q496O942L859m55m884q013q921p511
$$ plain form
1739 -217426 -222462 -229420 -232661 -227402 -211997 -188795 -163288 -142055 -130715 -132889 -150328 -183416 -231471 -292780 -364480
1754 -364480 -442597 -522679 -600652 -673593 -740036 -799597 -851780 -894987 -926860 -945508 -950347 -941993 -921777 -891327
1768 -891327 -852488 -807030 -756272 -700844 -641252 -578554 -514478 -451282 -391488 -337847 -293070 -259372 -237913 -228180
1782 -228180 -227608 -231712 -235142 -233379 -224432 -209276 -191058 -173372 -158569 -147008 -137573 -128964 -121281 -116608 -118312 -129583
1798 -129583 -152188 -186054 -229610 -280388 -335630 -392243 -446609 -494775 -532983 -558059 -567337 -559066 -533721 -495209
1812 -495209 -450732 -409160 -378640 -364534 -368377 -388025 -418446 -452674 -482964 -502552 -507765 -499267 -481266 -459248
1826 -459248 -437704 -419111 -404043 -391700 -380754 -370617 -362699 -360553 -368728 -390888 -428078 -477498 -532749 -585870
1840 -585870 -630111 -661785 -680337 -687528 -686442 -680437 -672198 -663316 -654820 -647878 -644019 -644474 -649358 -657371 -666292 -673803
1856f73803m268O8M931J0208J6454K4789L6287N0754O5840P7228Q0519P2971N4513K8129m65
1871a55845k4754l9642m3020l6152k2973q459L065R035R123N051l29m047l837J245J0035J9248
1887b82256K4920K4224J6657M138r361j9168k1891j7041p111L451R562P216m516k2687m1603
1902c35466n5485o0669n6070m2728k3449k508J5198K5908K8377K4249J6979J0101N545L228
1916d46790J733p53n578j3081k2450l2103m0826m8382n4983n9985o1536n7912m8793l5417
1930i26856j9689l585J0527K0395K4991K5577K4910K5263K6958K9155L1327L3914L7694M2767
1944f16652M7928N0816M9141M2182L1355J9064P326k417q726j0322o827Q92J1059K1697L1063
1959c32421L7697L9995L6551K7428J4536L52j3412k5550l4460l8175l5822k8530j9211j1319
$$ plain form
1856 -673803 -678071 -678003 -673072 -662864 -646410 -621621 -585334 -534580 -468740 -391512 -310993 -238022 -183509 -155380 -155845
1871 -155845 -180599 -220241 -263261 -299413 -322386 -330845 -327780 -318745 -309622 -304571 -304900 -308947 -312784 -311539 -301504 -282256
1887 -282256 -257336 -233112 -216455 -212317 -221678 -240846 -262737 -279778 -286889 -283438 -273876 -266660 -271176 -293863 -335466
1902 -335466 -390951 -451620 -507690 -550418 -573867 -576375 -561177 -535269 -506892 -482643 -465664 -455563 -450018 -446790
1916 -446790 -445057 -445810 -451388 -464469 -486919 -519022 -559848 -608230 -663213 -723198 -784734 -842646 -891439 -926856
1930 -926856 -946545 -950130 -939603 -919208 -894217 -868640 -843730 -818467 -791509 -762354 -731027 -697113 -659419 -616652
1944 -616652 -568724 -517908 -468767 -426585 -395230 -376166 -368840 -371257 -379983 -390305 -397132 -396240 -385181 -363484 -332421
1959 -332421 -294724 -254729 -218178 -190750 -176214 -175862 -189274 -214824 -249284 -287459 -323281 -351811 -371022 -382341
1973c82341p616r313j5630k4017l0963l3405l0622k4990k0395j9401k1636k4914k7459k9312
1987g02014l1673l4999l7966l8371l4972k7945j8093o378N710J6258K3845K8459L1515L4716
2001g91908L8278M0682L9933L4984K5920J3486j180j6383k9696l8383m0300l4724k2642o522
2015g88455J0458K5389L6039M0953L9776L4123K7615K3997K4674K7756K9828K8782K5342K1611
2029c92112J8793J6583J4131J0962O900J976l684r958j6711k3590k9659l3872l5690l5300
2043e11231l2935k8376k1302j2175k753M520Q105P903M994J101j607j218L305J1854K3376
2058e46439L6259M8481N7631O1185N7852M8689L6764K5246J5855Q977M542K267J335M92j287
2073a42151m265q571j4894k3872l5038m6855n7442o4865o7147o3031n2980l9089k3724q159
$$ plain form
1973 -382341 -389957 -399270 -414900 -438917 -469880 -503285 -533907 -558897 -579292 -598693 -620329 -645243 -672702 -702014
1987 -702014 -733687 -768686 -806652 -845023 -879995 -907940 -926033 -932411 -926701 -910443 -886598 -858139 -826624 -791908
2001 -791908 -753630 -712948 -673015 -638031 -612111 -598625 -599805 -616188 -645884 -684267 -724567 -759291 -781933 -788455
2015 -788455 -777997 -752608 -716569 -675616 -635840 -601717 -574102 -550105 -525431 -497675 -467847 -439065 -413723 -392112
2029 -392112 -373319 -356736 -342605 -331643 -324743 -322767 -326451 -336409 -353120 -376710 -406369 -440241 -475931 -511231
2043 -511231 -544166 -572542 -593844 -606019 -608772 -604252 -596147 -588244 -583250 -582149 -583756 -584974 -581669 -569815 -546439
2058 -546439 -510180 -461699 -404068 -342883 -285031 -236342 -199578 -174332 -158477 -149500 -144958 -142691 -141356 -140864 -142151
2073 -142151 -146416 -154987 -169881 -193753 -228791 -275646 -333088 -397953 -465100 -528131 -581111 -620200 -643924 -652083
2087f52083P405K2781L6947M8228N5541N9383O1210O1915O1272N8655N3967M7985M2179L8359
2101C744L7891M0450M3040M1242L2622J9177N808m012j0556j6664k4550l3934m2737m8936
2115D2585n1914n2093n0009m5784l9155k9727j7569l685J0118K1655K8905L0930K8679K4741
2129a02323K1736K1076K2717K5831K9589L3584L7502M0505M0988L7056K7362J2004o680k4411
2143B16536l6580m0581l7210k9821k2525j8372j8561k2373k7745l2148l3537l0954k4303j3640
2157a71814P42J7121L1439L8562L5106K1755K904j5600k9266l6144l6349l0976k1405r336
2171b03261L660J6277K7452L5488L8444L5085K6208J4566L418n057j0324j3505j6583k0734
2185f8866k4835k6053k2134j3623l557M437Q206P852N526L979M683O588O758K600o130j7114
$$ plain form
2087 -652083 -644678 -621897 -584950 -536722 -481181 -421798 -360588 -298673 -237401 -178746 -124779 -76794 -34615 3744
2101 3744 41635 82085 125125 166367 198989 218166 223974 219962 209406 192742 168192 134258 91521 42585
2115 42585 -9329 -61422 -111431 -157215 -196370 -226097 -243666 -247351 -237233 -215578 -186673 -155743 -127064 -102323
2129 -102323 -80587 -59511 -36794 -10963 18626 52210 89712 130217 171205 208261 235623 247627 240947 216536
2143 216536 179956 139375 102165 72344 49819 31447 12886 -9487 -37232 -69380 -102917 -133871 -158174 -171814
2157 -171814 -171072 -153951 -122512 -83950 -48844 -27089 -24185 -39785 -69051 -105195 -141544 -172520 -193925 -203261
2171 -203261 -199601 -183324 -155872 -120384 -81940 -46855 -20647 -6081 -2663 -7720 -18044 -31549 -48132 -68866
2185 -68866 -93701 -119754 -141888 -155511 -159068 -154631 -146425 -138573 -133047 -129068 -124385 -117797 -111039 -108439 -114569 -131683
2201a31683k6336k9928k6200j6686m941N855J4132J9643K2617K3271K1764J8277J3124O775
2215i0316K1n573p610m149M402J4585K1879K3310J8684R868m95j0237j8386k4971l0073l3087
2231a32148l3114k9832k4129j7939j3574j2463j4488j8475k2771k5568k5243k1507j6218j2337
2245d19806j1991j4942j8801k0526j8155j1791k825P810K0357L5229N1536O6740P7541Q1223
2259a78401P6716O4920M7985K8264Q113j0072k4260l3427l7506l6768l1481k2663j2591m542
2273a65713j470m192j0632j6340j6780j0098J682J4082K3130K7244K6981K3682J8741J3775
2287g5908J0626J0593J3567J8195K2830K6417K8395K8111K4760J8189R473N68o574j0415j0193
2302A08634o278k46N662R373R908P776N005M291P720J5834K7518M0540N1913N8392N7205M7098
$$ plain form
2201 -131683 -158019 -187947 -214147 -230833 -235774 -229919 -215787 -196144 -173527 -150256 -128492 -110215 -97091 -90316
2215 -90316 -90295 -95868 -103478 -107627 -103225 -88640 -66761 -43451 -24767 -14899 -15394 -25631 -44017 -68988 -99061 -132148
2231 -132148 -165262 -195094 -219223 -237162 -250736 -263199 -277687 -296162 -318933 -344501 -369744 -391251 -407469 -419806
2245 -419806 -431797 -446739 -465540 -486066 -504221 -516012 -518837 -511027 -490670 -455441 -403905 -337165 -259624 -178401
2259 -178401 -101685 -36765 11220 39484 47597 37525 13265 -20162 -57668 -94436 -125917 -148580 -161171 -165713
2273 -165713 -167183 -171375 -182007 -198347 -215127 -225225 -223543 -209461 -186331 -159087 -132106 -108424 -89683 -75908
2287 -75908 -65282 -54689 -41122 -22927 -97 26320 54715 82826 107586 125775 135248 135816 129242 118827 108634
2302 108634 102356 102110 107772 117145 127053 134829 139834 144125 151845 167679 195197 235737 287650 346042 403247 450345
2318D50345K9101O366j7212l8646n6613p0978q1756q8356r0004q6651p9390p0255o1351n3867
2332c09267m7722m2042l6049k9912k4958k2784k3960k7407l1226l3942l5090l4721l2378k6796
2346g58254j7068l655J1301K4946L4993M0716M3028M3053M0452L3311K0141J816j8382l6393
2360e39995m9255n6107n7899n6231n2222m6012l7062k4616q253J1625L3539N5117P3732Q6977
2374f66662R2714Q9258P6583N7346L5999J6549J099r506j4361j2517m537O650J6746K2388
2388b92251K2550J8101J0451R99q633j6705k1955k4214k4381k3919k4323k6917l2643m1236
2402d85076n0485n6776n6878m9567l6234j9784k668J4158L0322M4324N3393N5171M9521L8753
2416d71826K6313J5168O575N1n772j2217j9701k7476l4039l8191l9576l8322l4514k8527k1720
$$ plain form
2318 450345 479446 485812 468600 429954 373341 302363 220607 132251 42247 -44404 -123794 -194049 -255400 -309267
2332 -309267 -356989 -399031 -435080 -464992 -489950 -512734 -536694 -564101 -595327 -629269 -664359 -699080 -731458 -758254
2346 -758254 -775322 -778977 -767676 -742730 -707737 -667021 -623993 -580940 -540488 -507177 -487036 -485220 -503602 -539995
2360 -539995 -589250 -645357 -703256 -759487 -811709 -857721 -894783 -919399 -927652 -916027 -882488 -827371 -753639 -666662
2374 -666662 -573948 -484690 -408107 -350761 -314762 -298213 -297114 -306620 -320981 -333498 -338035 -331385 -314639 -292251
2388 -292251 -269701 -251600 -241149 -240150 -248783 -265488 -287443 -311657 -336038 -359957 -384280 -411197 -443840 -485076
2402 -485076 -535561 -592337 -649215 -698782 -735016 -754800 -757468 -743310 -712988 -668664 -615271 -560100 -510579 -471826
2416 -471826 -445513 -430345 -423770 -423719 -429491 -441708 -461409 -488885 -522924 -561115 -600691 -639013 -673527 -702054 -723774
2431g23774j6500j5415j9823k9102m0437m9961n4544n3369m7662l9184k9301j8586o671P543
2445a136786K4808M4278O3673Q0821R4902J06144J14475J18555J16655J08206R4257P6883
2457i3129N8223M0187K4287J1399J539o092j2350j7547k1621k4695k7170k9048k9362k6775
2471a52154k0982j3194n383R07M817N505J965o326j8364l1441m2124m8045m9240m7813m5982
2486d67854m4501m2566l8803l2241k2621j0562K608J5285K5740L2149L2926K7424J6651L224
2500e03141r579j8760k2086j8499q937L506J4642K1419K3441K2637K1422K1011K1266K1701
2514d09957K2088K2404K2554K2455K2177K1747K1070K0063J8805J7495J6547J6532J7636J9172
2528a29212J9845J8600J5137R475J313r527k2041l3678m1341m3437m1250l7709l4740l1911
$$ plain form
2431 -723774 -740274 -755689 -775512 -804614 -845051 -895012 -949556 -1002925 -1050587 -1089771 -1119072 -1137658 -1144329 -1136786
2445 -1136786 -1111978 -1067700 -1004027 -923206 -828304 -722160 -607685 -489130 -372475 -264269 -170012 -93129
2457 -93129 -34906 5281 29568 40967 42506 36414 24064 6517 -15104 -39799 -66969 -96017 -125379 -152154
2471 -152154 -173136 -186330 -191713 -190806 -185989 -180484 -178519 -184845 -203209 -234650 -276774 -324819 -374059 -421872 -467854
2486 -467854 -512355 -554921 -593724 -625965 -648586 -659148 -656540 -641255 -615515 -583366 -550440 -523016 -506365 -503141
2500 -503141 -512720 -531480 -553566 -572065 -581002 -577496 -562854 -541435 -517994 -495357 -473935 -452924 -431658 -409957
2514 -409957 -387869 -365465 -342911 -320456 -298279 -276532 -255462 -235399 -216594 -199099 -182552 -166020 -148384 -129212
2528 -129212 -109367 -90767 -75630 -66155 -64842 -74369 -96410 -130088 -171429 -214866 -256116 -293825 -328565 -360476
2542c60476k8025k3396k0225k0592k4403k9059l0989k7966j9840q022N685J9528L2222M3325
2556d92233N2953O1050O6908O9238O7179O1222N3255M5422L8972L3915K9422K4037J6018L988
2570A31346j2101l0758m9861o7419q1759r1512r5610r3815q6848p6450o5083n5132m8100m3740
2584g66842m0192l5332k8253j9565j0388j153Q642J9483L0769M0587M6651M7679M3861L6302
2598f27751K6359J5688O480O73j080P02N229J1685J8659K4093K6484K6252K5921K8688L6391
2613c75527M8041O0297O9594P4092P4195P1547O7535O2241N4387M2182K4556K348k1578m2941
2627B10969n7338o1587n4991m0008k1745o229K022J669n301j5306k5313l3824m0309m4217
2641a91508m4942m2613l8087l2305k5576j7656q316K201J3105K3103L0654L4560L4260K9890
$$ plain form
2542 -360476 -388501 -411897 -432122 -452714 -477117 -506176 -537165 -565131 -584971 -592993 -587308 -567780 -535558 -492233
2556 -492233 -439280 -378230 -311322 -242084 -174905 -113683 -60428 -15006 23966 57881 87303 111340 127358 131346
2570 131346 119245 88487 38626 -28793 -110552 -202064 -297674 -391489 -478337 -554787 -619870 -675002 -723102 -766842
2584 -766842 -807034 -842366 -870619 -890184 -900572 -901725 -893083 -873600 -842831 -802244 -755593 -707914 -664053 -627751
2598 -627751 -601392 -585704 -579224 -578551 -579631 -578929 -573700 -562015 -543356 -519263 -492779 -466527 -440606 -411918 -375527
2613 -375527 -327486 -267189 -197595 -123503 -49308 22239 89774 152015 206402 248584 273140 275488 253910 210969
2627 210969 153631 92044 37053 -2955 -24700 -30929 -28907 -27238 -32539 -47845 -73158 -106982 -147291 -191508
2641 -191508 -236450 -279063 -317150 -349455 -375031 -392687 -401003 -398802 -385697 -362594 -331940 -297380 -263120 -233230
2655b33230K1727J0271k910j5061k3543k7595k8685k9061k9832l0097k8059k2451j2955k96
2669d51777J3442K5127L1823L2479K7860J9372Q127m607j6669k5410k9089k7906k3797j9195
2683d40220j5790j4010j3319j3206j3406j3961j4969j6426j8091j9414j9737j8327j5156j0917
2697f56949o394k164J611M342M926K412l005r867j5942j8974j7569j2250n813j643j444m236
2713g42959p521q910p110k622K409N649O390N746N088M744M407M120M649O762J0198J3032
2729f95928J2373O492l100j2055j5807j2230k717Q859J8379K3343K3308J9164J2444M920j882
2744f14437p190j0831j2498j1081n321M958J8008L0750M0067M3868M1625L4289K3552J0997
2758d13244j923j3278k0807k3462k2785k2106k3702k6581k6733k0018n531J2948K8636L5387
$$ plain form
2655 -233230 -211503 -201232 -204142 -219203 -242746 -270341 -299026 -328087 -357919 -388016 -416075 -438526 -451481 -451777
2669 -451777 -438335 -413208 -381385 -348906 -321046 -301674 -293547 -298154 -314823 -340233 -369322 -397228 -421025 -440220
2683 -440220 -456010 -470020 -483339 -496545 -509951 -523912 -538881 -555307 -573398 -592812 -612549 -630876 -646032 -656949
2697 -656949 -663343 -665507 -663896 -659554 -654628 -652216 -655221 -665088 -681030 -700004 -717573 -729823 -735636 -737279 -738723 -742959
2713 -742959 -750480 -759390 -766500 -769122 -766713 -761064 -754674 -748928 -743840 -739096 -734689 -730569 -725920 -719158 -708960 -695928
2729 -695928 -683555 -677063 -680163 -692218 -708025 -720255 -722972 -714113 -695734 -672391 -649083 -629919 -617475 -612555 -614437
2744 -614437 -621627 -632458 -644956 -656037 -661358 -656400 -638392 -607642 -567575 -523707 -482082 -447793 -424241 -413244
2758 -413244 -415167 -428445 -449252 -472714 -495499 -517605 -541307 -567888 -594621 -614639 -620170 -607222 -578586 -543199
2772e43199L0767J6585k963k3854m3492o0073p1609p6156p3129o4010n1889l9979l0157k2223
2786a055381j4686o498J935R214J4153J6605J7221J6693J5312J3440J1766J0914J0665J0046
2800i28601Q318N884M381N833J1309K0045K9885L9080M7103N3892N8393N8709N3534M3462
2814d88773L0783J8436R060M069L131M445N755N675M625M274N665Q093J0228J2172J5421K0722
2830c26219K6706L1024L2662L2958L4461L8939M6108N3611N8226N7520N1119M0834K9419J8671
2844B26039Q431k420j4127k5246l3808l9177m2786m6992n2966n9472o3502o2210n4470m1469
2858c04175k6000j1296K13P649J1440J2194R825L823n666j7284k9007l8976m6386n1558n5365
2873e40569n8129n9132n7129n1135m1079k7926j3319J538J6747L3184N1155O9168Q4073R2516
$$ plain form
2772 -543199 -512432 -495847 -498810 -522664 -566156 -626229 -697838 -773994 -847123 -911133 -963022 -1003001 -1033158 -1055381
2786 -1055381 -1070067 -1076565 -1074630 -1065416 -1051263 -1034658 -1017437 -1000744 -985432 -971992 -960226 -949312 -938647 -928601
2800 -928601 -920283 -914399 -910018 -904185 -892876 -872831 -842946 -803866 -756763 -702871 -644478 -585769 -532235 -488773
2814 -488773 -457990 -439554 -430494 -426425 -423294 -418849 -413094 -407419 -402794 -398520 -392855 -384762 -374534 -362362 -346941 -326219
2830 -326219 -299513 -268489 -235827 -202869 -168408 -129469 -83361 -29750 28476 85996 137115 177949 207368 226039
2844 226039 234470 232050 217923 192677 158869 119692 76906 29914 -23052 -82524 -146026 -208236 -262706 -304175
2858 -304175 -330175 -341471 -341258 -333609 -322169 -309975 -300150 -296327 -301993 -319277 -348284 -387260 -433646 -485204 -540569
2873 -540569 -598698 -657830 -714959 -766094 -807173 -835099 -848418 -846880 -830133 -796949 -745794 -676626 -592553 -500037
2887e00037R2680Q5143P2555N8213M4400L1445J8564N536o314j4621j7666j5802j1581q074
2901a65559p149q986j2856j8077k4442l1983m0136m7297n1124m9805m3257l3198k2375j3412
2915e69656p854n361l588M18P803J6905K4489K7936K6578K1603J5211R429N539M070N126Q571
2931d12781J4044K0801K7935L4646M0643M5844M9753N0860M7194L7630K2857M884j4251l3679
2945f3620n2939p0942q5580r4742r7320r3532q4732p3240o1916n3201m7866m4602m0927l4547
2959i99706k4315j0712L838J5756K1823K0705J3415K970o929j3084j3716q922p82P682J4313
2974i77664J8985K2909K7039L1296L4703L5666L2385K3615R861o189k0482k9783l3515l3656
2988h64830l2693l1479k8811k2926j3157l91J3361K5593L4010L7477L6734L4431L4060L8557
$$ plain form
2887 -500037 -407357 -322214 -249659 -191446 -147046 -115601 -97037 -91501 -97815 -112436 -130102 -145904 -157485 -165559
2901 -165559 -172708 -181694 -194550 -212627 -237069 -269052 -309188 -356485 -407609 -457414 -500671 -533869 -556244 -569656
2915 -569656 -577510 -582871 -586459 -586041 -578238 -561333 -536844 -508908 -482330 -460727 -445516 -436087 -430548 -426478 -421352 -412781
2931 -412781 -398737 -377936 -350001 -315355 -274712 -228868 -179115 -128255 -81061 -43431 -20574 -15690 -29941 -63620
2945 -63620 -116559 -187501 -273081 -367823 -465143 -558675 -643407 -716647 -778563 -831764 -879630 -924232 -965159 -999706
2959 -999706 -1024021 -1034733 -1030895 -1015139 -993316 -972611 -959196 -956226 -963155 -976239 -989955 -998877 -999659 -991977 -977664
2974 -977664 -958679 -935770 -908731 -877435 -842732 -807066 -774681 -751066 -741205 -747394 -767876 -797659 -831174 -864830
2988 -864830 -897523 -929002 -957813 -980739 -993896 -994287 -980926 -955333 -921323 -883846 -847112 -812681 -778621 -740064
3002g40064M9427O5997Q5265J02551J13022J13536J03705Q5804O3842M2667K6645J8286J7391
3015A48074K0907K3665K0028O636j5190l9541n9182o9359o9448o2442n3176m6111m3525m4714
3029b83378m6488m4733l6455k1449k516J5751K9084L5243L4567K9136K1537J3813O711J02
3043b49075o191j1588j4740j4128r108j137O000P681J057j2711k8359l9190m0934l3985k2432
3058d68840j0975k495K835O641J1045J7553K6404L6567M6555N5270O2421O7945P1264P1296
3072f514O7031N8447M7089L5665K6696K1142J8055J5708J2883R296N005k12o766j5112k5450
3087B62963l6907m7089n2789n1584m3425l0587j6104k303R687J9249K5868K9616L1493L2760
3101A30848L3792L3303K8911J9263N937o628j3939j4718j1856j0216j3147k0322k8547l4097
$$ plain form
3002 -740064 -690637 -624640 -539375 -436824 -323802 -210266 -106561 -20757 43085 85752 112397 130683 148074
3015 148074 168981 192646 212674 219310 204120 164579 105397 36038 -33410 -95852 -149028 -195139 -238664 -283378
3029 -283378 -329866 -374599 -411054 -432503 -435019 -419268 -390184 -354941 -320374 -291238 -269701 -255888 -249177 -249075
3043 -249075 -255266 -266854 -281594 -295722 -304830 -305967 -299967 -292286 -291229 -303940 -332299 -371489 -412423 -446408 -468840
3058 -468840 -479815 -482310 -479475 -472834 -461789 -444236 -417832 -381265 -334710 -279440 -217019 -149074 -77810 -6514
3072 -6514 60517 118964 166053 201718 228414 249556 267611 283319 296202 305498 310503 310291 303525 288413 262963
3087 262963 226056 178967 126178 74594 31169 582 -15522 -17825 -8138 11111 36979 66595 98088 130848
3101 130848 164640 197943 226854 246117 252054 245426 231487 216769 204913 194697 181550 161228 132681 98584
3115I8584l4844l1070k4752j8367j3577j0765r897j1173j4688j9699k4626k8367l1338l4960
3129b09539m0120m6046n0717n2240m9946m4710l8278l2020k6327k0980j6102j2394j0423j0454
3143f60296j3030j9025k8766m0681n1173n6236n3567m3686k8896j1904N171K0891L4254M4391
3157i02553N0560N2332M9956M4260L6359K7621J9873J5184J4965J9032K5572L2054L6669L9148
3171d38968M0045L9388L6300L0076K1074J1213L116j273k062j426j444k077j248L199J1760
3186b52327K3046L4205M2435M6314M6515M5209M4731M5831M7179M6604M2932L6364K8021J8741
3200B95800Q652k502j4834k7767m0195n0648n7618o0131n8753n5414n2319n1239n3011n7374
3214b77353o2895o7621o9714o7782o1095m9638l4081j5888K330J6990K4745K4150J6234L780
$$ plain form
3115 98584 63740 32670 7918 -10449 -24026 -34791 -44688 -55861 -70549 -90248 -114874 -143241 -174579 -209539
3129 -209539 -249659 -295705 -346422 -398662 -448608 -493318 -531596 -563616 -589943 -610923 -627025 -639419 -649842 -660296
3143 -660296 -673326 -692351 -721117 -761798 -812971 -869207 -922774 -966460 -995356 -1007260 -1002089 -981198 -946944 -902553
3157 -902553 -851993 -799661 -749705 -705445 -669086 -641465 -621592 -606408 -591443 -572411 -546839 -514785 -478116 -438968
3171 -438968 -398923 -359535 -323235 -293159 -272085 -260872 -257756 -259029 -261091 -262517 -263961 -266038 -267286 -264087 -252327
3186 -252327 -229281 -195076 -152641 -106327 -59812 -14603 30128 75959 123138 169742 212674 249038 277059 295800
3200 295800 304452 301950 287116 259349 219154 168506 110888 50757 -7996 -63410 -115729 -166968 -219979 -277353
3214 -277353 -340248 -407869 -477583 -545365 -606460 -656098 -690179 -706067 -703737 -686747 -662002 -637852 -621618 -617838
3228f17838j0122k2928l2800l8693m0175l7227l0028j9398p183M508J4416K2452K9078L4665
3242g51273L9105M1637M1691L9931L8611M0322M5960N4001O1686O6915O8921O7341O1598N1574
3256c1980L8543K4817J2100O17j0201k0209k8093l1843k9992k2838j3009m526q24l252j0973
3271a31663k1669l2424m0271m2644l7849k5798q173J2252L2299M8797N9111O1892N7492M7607
3285b1041L4493K0377P450k091o467n025J391J0667K0405K8782L4816L7818L6835L1192K1804
3300B51406J1461L412n18p03J152L353M885N343M398J861j903n978r655j3017j6966k2701
3316B15830l1061m1802n3136o2613o8879p2337p4253p5476p5872p4098o8002n6342m0259k2905
3330f01205p563L538R205R201M767j677p791j2674j6967k1509k5973k9069k9811k8412k5797
$$ plain form
3228 -617838 -627960 -650888 -683688 -722381 -762556 -799783 -829811 -849209 -856392 -851884 -837468 -815016 -785938 -751273
3242 -751273 -712168 -670531 -628840 -588909 -550298 -509976 -464016 -410015 -348329 -281414 -212493 -145152 -83554 -31980
3256 -31980 6563 31380 43480 44097 33896 13687 -14406 -46249 -76241 -99079 -112088 -116614 -117438 -120690 -131663
3271 -131663 -153332 -185756 -226027 -268671 -306520 -332318 -340491 -328239 -295940 -247143 -188032 -126140 -68648 -21041
3285 -21041 13452 33829 41279 39188 32721 27696 29087 39754 60159 88941 123757 161575 198410 229602 251406
3300 251406 262867 266279 265761 265058 266210 269563 274448 279791 284189 286050 284147 278169 268514 255497 238531 215830
3316 215830 184769 142967 89831 27218 -41661 -113998 -188251 -263727 -339599 -413697 -481699 -538041 -578300 -601205
3330 -601205 -608768 -605230 -596025 -586824 -582057 -583734 -591525 -604199 -621166 -642675 -668648 -697717 -727528 -755940 -781737
3345g81737k3106k1296k0464j9498j7001j2550o940j373L336P090J0436J4040J7943K1454
3359h29666K3818K5106K6416K9377L5109M3601N3787O4186P3559Q0990Q5638Q6819Q4022P6592
3373d0646O3884M6101K4693J985j9484l6940m7587m9622m2820k8835j1052O178J9316K7395
3387h7434L2516L8046M6484N8250P1888Q4703R3192R3934Q4795O6124M0827J3059j3624l7279
3401E85481n7323p3618q5812r3140r4389q8571p5843n7884l7467j7500k16J3130K2115K6549
3415c4488K5969J9429N951j4464l9707o5390q5956r6801r6002q5063o8261n0581l5632k4927
3429f45923j8464j5330j4170j3773j3641j4083j5650j8457k1783k4212k4375k1771j7217j2413
3443h91262r201r016j2198j7721k3309k6240k4516j7782p599K856J0419J3916J4925J6740
$$ plain form
3345 -781737 -804843 -826139 -846603 -866101 -883102 -895652 -902592 -903965 -900629 -893539 -883103 -869063 -851120 -829666
3359 -829666 -805848 -780742 -754326 -724949 -689840 -646239 -592452 -528266 -454707 -373717 -288079 -201260 -117238 -40646
3373 -40646 23238 69339 94032 96017 76533 39593 -7994 -57616 -100436 -129271 -140323 -134145 -114829 -87434
3387 -87434 -54918 -16872 29612 87862 159750 244453 337645 431579 516374 582498 623325 636384 622760 585481
3401 585481 528158 454540 368728 275588 181199 92628 16785 -41099 -78566 -96066 -96282 -83152 -61037 -34488
3415 -34488 -8519 10910 16861 2397 -37310 -102700 -188656 -285457 -381459 -466522 -534783 -585364 -620996 -645923
3429 -645923 -664387 -679717 -693887 -707660 -721301 -735384 -751034 -769491 -791274 -815486 -839861 -861632 -878849 -891262
3443 -891262 -900463 -909479 -921677 -939398 -962707 -988947 -1013463 -1031245 -1038844 -1035988 -1025569 -1011653 -996728 -979988
3457i79988K2370L3068M7753O3357P5896Q2423Q2306P6715O6969N3603L7143J9553M520m076
3471c18388m410K222J2265K1990K9423L4860L9376M3184M5163M3620L7278K6063J1308m524
3485A9430j8129k6001k5674j7144l409J0626K0512K4101K1909J6002Q438K39q662j8648k9109
3500b5519l8136m3442m3670l8825k9605j7051k675J1466K2994K9740L0348K4655J3660r51
3514a07011j7686l5406n2636o6875p5345p6582p1110o0441m6122k9632j3206QP285Q365O140
3529f30254N205R179J9006L2932M7994O1727P3104Q1995Q8047R0236Q7638Q0217O9027N5913
3543A71966M2492K9026J4596j459j8276l3901m6624n5851o1926o5385o6527o5416o2394n8286
3557b77965n3842m9141m3688l6836k8426j9116j0351l592O37L306O288J1126J7825K4849K9946
$$ plain form
3457 -979988 -957618 -924550 -876797 -813440 -737544 -655121 -572815 -496100 -429131 -375528 -338385 -318832 -314312 -318388
3471 -318388 -322798 -320576 -308311 -286321 -256898 -222038 -182662 -139478 -94315 -50695 -13417 12646 23954 19430
3485 19430 1301 -24700 -50374 -67518 -70927 -60301 -39789 -15688 6221 22223 30661 30900 22238 3590 -25519
3500 -25519 -63655 -107097 -150767 -189592 -219197 -236248 -238923 -227457 -204463 -174723 -144375 -119720 -106060 -107011
3514 -107011 -124697 -160103 -212739 -279614 -354959 -431541 -502651 -563092 -609214 -638846 -652052 -652044 -644759 -636394 -630254
3529 -630254 -625049 -615870 -596864 -563932 -515938 -454211 -381107 -299112 -211065 -120829 -33191 47026 116053 171966
3543 171966 214458 243484 258080 256621 238345 204444 157820 101969 40043 -25342 -91869 -157285 -219679 -277965
3557 -277965 -331807 -380948 -424636 -461472 -489898 -509014 -519365 -522957 -522320 -519014 -512726 -501600 -483775 -458926 -428980
3572d28980L1355K8467K2384J5585J0624Q744R286J0679J1729J2240J2680J3131J2615R698
3586b19763L927l232r228j2046j1198p732l352L63K567L399L495K983J191k720q458j4382
3602b74186j8334j8629j4886q419j700K755L323m7n881j1706j5047j4267r069l82J0004K0058
3618c56413K8245L4098L7870L9871M0466M0496M1151M2942M4776M4423L9887L0644J8041M795
3632A31292o451j4571k0220k4817k9469l4619m0207m5716n0200n2212n0352m3849l2865j8531
3646c32787l035J0789K0491K5523K7596K9095L0971L2219L1329K7767K2424J6547J0831N639
3660d4601J602j91R44M334P320O239j128j3702k7417l7368m0171l5375k5287j3572l441L446
3676b18368O972P353M261l369j6025l2257m8562o0585o5081o0651m7638k7916n011J6127L0640
$$ plain form
3572 -428980 -397625 -369158 -346774 -331189 -320565 -311821 -302535 -291856 -280127 -267887 -255207 -242076 -229461 -219763
3586 -219763 -215836 -219068 -228296 -240342 -251540 -259272 -262624 -262261 -259694 -256295 -252800 -249817 -248626 -251346 -259804 -274186
3602 -274186 -292520 -311149 -326035 -334454 -336154 -333399 -330076 -330123 -336004 -347710 -362757 -377024 -386093 -386475 -376471 -356413
3618 -356413 -328168 -294070 -256200 -216329 -175863 -135367 -94216 -51274 -6498 37925 77812 108456 126497 131292
3632 131292 124841 110270 90050 65233 35764 1145 -39062 -84778 -134978 -187190 -237542 -281391 -314256 -332787
3646 -332787 -335822 -325033 -304542 -279019 -251423 -222328 -191357 -159138 -127809 -100042 -77618 -61071 -50240 -44601
3660 -44601 -42999 -43190 -42246 -37912 -30592 -24353 -25481 -39183 -66600 -103968 -144139 -179514 -204801 -218373 -221814 -218368
3676 -218368 -211396 -204043 -199782 -203151 -219176 -251433 -299995 -360580 -425661 -486312 -533950 -561866 -566877 -550750 -520110
3691e20110L5913L2329K2637J0489p16q669j2633j3542j3047j2757j3486j5346j8030k0793
3705e47761k2081j9331j0688L130J7230K5116K1844O820j6388m2103o4167p7588p9723p1212
3719h76902n5823l8982k5473j7826j6322k0134k7232l4923m0253m1034l6130k5736j1204N136
3733a262838K0379L1777L7567L7228L1644K2491J1908J944n580r289q649m009L576J2559K1102
3748a058190K7491L0820L1163K9424K6954K5361K5979K9197L4576M1419M9208N7291O4255
3761e85052O7923O6637O0470N0887L9371K6656J3247j74j2609k2618k8668k9974k7272k2596
3775d03772j7994j4419j1426p994l940n25N41j210m049n282l290Q86M084K596o034k1708m1306
3792e34842n9634p1314p2894o4304m8587l0227j3095P09J1070J9600K8530L9037N0222N9641
$$ plain form
3691 -520110 -484197 -451868 -429231 -418742 -419458 -428127 -440760 -454302 -467349 -480106 -493592 -508938 -526968 -547761
3705 -547761 -569842 -589173 -599861 -596731 -579501 -554385 -532541 -525721 -542109 -584212 -648379 -725967 -805690 -876902
3719 -876902 -932725 -971707 -997180 -1015006 -1031328 -1051462 -1078694 -1113617 -1153870 -1194904 -1231034 -1256770 -1267974 -1262838
3733 -1262838 -1242459 -1210682 -1173115 -1135887 -1104243 -1081752 -1069844 -1067900 -1073480 -1082769 -1091418 -1095427 -1091851 -1079292 -1058190
3748 -1058190 -1030699 -999879 -968716 -939292 -912338 -886977 -860998 -831801 -797225 -755806 -706598 -649307 -585052
3761 -585052 -517129 -450492 -390022 -339135 -299764 -273108 -259861 -260035 -272644 -295262 -323930 -353904 -381176 -403772
3775 -403772 -421766 -436185 -447611 -455605 -459545 -460070 -459529 -460739 -464788 -470070 -473360 -472474 -468390 -465794 -471828 -493536 -534842
3792 -534842 -594476 -665790 -738684 -802988 -851575 -881802 -894897 -894188 -883118 -863518 -834988 -795951 -745729 -686088
3806f86088O4908O5100O0782N3180M3070L0623J5974k43j7095l3601m8998o2427p2448p7020
3820f64283p4264o3398m5088k1267N077L0372N0994O3796O7152O1993N2089M2455L6749L5644
3834d21979L7308L9524M1304M3144M5925M9717N3079N3838N0369M2454L1300J8693N848o847
3848H3677j9270l0997m1535n0295n6374n8562n6304n0228m1481l0831j8835o394N078J4239
3862c58112K0174K2397K0504J4082L561q674j8744k3287k1054j2942j447R855J7230J8685
3876c17772J5506J1431J0177J3241J9725K7257L3218L5767L4491L0698K6552K3463K1168J8120
3890C042J2443L232q487k0247k9843l6870m2867m9637n7413o4404o8041o6588o0185n0777
3904e36642m1065l3185k7957k4690k1815j7590j0916j705R334K0813L0514L5529L3100K2117
$$ plain form
3806 -686088 -621180 -556080 -495298 -442118 -399048 -368425 -352451 -352694 -369789 -403390 -452388 -514815 -587263 -664283
3820 -664283 -738547 -801945 -847033 -868300 -863223 -832851 -781857 -718061 -650909 -588916 -536827 -494372 -457623 -421979
3834 -421979 -384671 -345147 -303843 -260699 -214774 -165057 -111978 -58140 -7771 34683 65983 84676 90524 83677
3848 83677 64407 33410 -8125 -58420 -114794 -173356 -229660 -279888 -321369 -352200 -371035 -377429 -372351 -358112
3862 -358112 -337938 -315541 -295037 -280955 -277394 -286068 -304812 -328099 -349153 -362095 -363542 -353687 -336457 -317772
3876 -317772 -302266 -290835 -280658 -267417 -247692 -220435 -187217 -151450 -116959 -86261 -59709 -36246 -15078 3042
3890 3042 15485 18717 10230 -10017 -39860 -76730 -119597 -169234 -226647 -291051 -359092 -425680 -485865 -536642
3904 -536642 -577707 -610892 -638849 -663539 -685354 -702944 -713860 -715565 -706231 -685418 -654904 -619375 -586275 -564158
3918e64158M249j6143l3600m3828m5450m0062l0646j9707q718J734J1372J9704K5627K8194
3932g11432K7568K5363K3921K5008K9002L4723M0347M4065M4680M1763L5340K5783J4225K944
3946b96700n520r781j0455r422q388p815o854m262L69O087J1141J3582J1696N002n234j6275
3962c32829k5188k9533k7609j8588k834J7641L9388N8347P0984P4966O9667N6076L6817J6007
3976C312j389j1228j2000n095O596K0204L3533M4822N2350N4737N1403M3060L1357J8239N195
3991C35096p113j8491k8138l3975l3638k6677j5935o449k689o470j6702l0335m3439n1987
4005A3058n2719m4375k8394q702R844K3151K8911K7011J9108P692m756j6429k6674l6139m5998
4020a35411n6900o8391p9278q8426r5118r8911r9310r5410q5967p0213m8843k4309k12J9679
$$ plain form
3918 -564158 -559909 -576052 -609652 -653480 -698930 -738992 -769638 -789345 -798063 -796329 -784957 -765253 -739626 -711432
3932 -711432 -683864 -658501 -634580 -609572 -580570 -545847 -505500 -461435 -416755 -374992 -339652 -313869 -299644 -296700
3946 -296700 -302220 -312001 -322456 -331878 -340266 -348081 -354935 -359197 -358828 -352741 -341600 -328018 -316322 -311320 -316554 -332829
3962 -332829 -358017 -387550 -415159 -433747 -436581 -418940 -379552 -321205 -250221 -175255 -105588 -49512 -12695 3312
3976 3312 1923 -9305 -21305 -26400 -19804 400 33933 78755 131105 185842 237245 280305 311662 329901 335096
3991 335096 327983 309492 281354 247379 213741 187064 171129 164680 161991 155521 138819 108484 65045 13058
4005 13058 -39661 -84036 -112430 -121132 -111288 -88137 -59226 -32215 -13107 -5415 -10171 -26600 -53274 -89413 -135411
4020 -135411 -192311 -260702 -339980 -428406 -523524 -622435 -721745 -817155 -903122 -973335 -1022178 -1046487 -1046699 -1027020
4034a027020L2271L5775L0243J8070L558q607j5601j7506j6163j2823o901L008J7136L3451
4048i31109M8343N8352O2151O0899N6984N2381M8234M5458M4850M6595M9846N3205N5285N4839
4062a93687N1089M4322L6103K8290K1933J6730J1411M209o620k1674l9407n6360o8976p4786
4076b47423p2839o3879n0386l5884k3210j3367n220L257J3025K2790K9766L1696K8284K1187
4090c62203J3142O995M714O154Q857R377N759j332r581j7000k2598k5782k5762k1742j3519
4105d44521j733J2380K6865L8881M5582M5926M1555L5487K9798K4845J9884J4279Q273L329
4119i9170J609M874J3200K4459L5092M1710M2613L8108K9758J9548R303J1q710j8184k9147
4134A05074m0535m9430n2517m8264l8347k6986j8385j4077j2499j1359j0410j1541j6483k4729
$$ plain form
4034 -1027020 -994749 -958974 -928731 -910661 -907103 -915710 -931311 -948817 -964980 -977803 -984704 -981696 -964560 -931109
4048 -931109 -882766 -824414 -762263 -701364 -644380 -591999 -543765 -498307 -453457 -406862 -357016 -303811 -248526 -193687
4062 -193687 -142598 -98276 -62173 -33883 -11950 4780 16191 20400 13780 -7894 -47301 -103661 -172637 -247423
4076 -247423 -320262 -384141 -434527 -470411 -493621 -506988 -512208 -508951 -495926 -473136 -443370 -411674 -383390 -362203
4090 -362203 -349061 -342066 -337352 -331198 -322341 -312964 -307205 -308537 -318118 -335118 -357716 -383498 -409260 -431002 -444521
4105 -444521 -446254 -433874 -407009 -368128 -322546 -276620 -235065 -199578 -169780 -144935 -125051 -110772 -102499 -99170
4119 -99170 -97561 -92687 -79487 -55028 -19936 21774 64387 102495 132253 151801 161104 161115 152405 134221 105074
4134 105074 64539 15109 -37408 -85672 -124019 -151005 -169390 -183467 -195966 -207325 -217735 -229276 -245759 -270488
4148b70488l3663m0394m3422m2742l8701l1296k0434o590Q818K3863L6504M4921M7760M4588
4162c21276L6342K5427J5560J0767J3804K4525L9475N3212O0423N7732M4966K5358M358j2646
4176G8027k2493k4409j8865o857R787K8142M4678N6097O0098N6422M7163L5703K4953J6791
4190C85237J2247J1445J2987J4087J2068N888l861j6205l0565m6077o0637p1213p5403p2380
4204G7618o3079m9611l4693k1211j1254n436k792j870j963l249n946r509j2240j2056p816
4219a65107L6R216J6738K0090J8143J1137j22j4520l0332m5154n6284o1516o0135n3186m2580
4234d53576l0184j7487n896L415J0124J4782J7941J9439J8673J5861J2329R880R512J0584
4248c64603J1299J0335Q106O823Q833J4630K2386K9492L4860L9313M4177M9796N5238N9293
$$ plain form
4148 -270488 -304151 -344545 -387967 -430709 -469410 -500706 -521140 -527730 -518912 -495049 -458545 -413624 -365864 -321276
4162 -321276 -284934 -259507 -243947 -233180 -219376 -194851 -155376 -102164 -41741 15991 60957 86315 90673 78027
4176 78027 55534 31125 12260 5403 15190 43332 88010 144107 204205 260627 307790 343493 368446 385237
4190 385237 397484 408929 421916 436003 448071 453959 450098 433893 403328 357251 296614 225401 149998 77618
4204 77618 14539 -35072 -69765 -90976 -102230 -107666 -110458 -112328 -114291 -117540 -123486 -132995 -145235 -157291 -165107
4219 -165107 -165071 -155855 -139117 -119027 -100884 -89747 -89869 -104389 -134721 -179875 -236159 -297675 -357810 -410996 -453576
4234 -453576 -483760 -501247 -507143 -503728 -493604 -478822 -460881 -441442 -422769 -406908 -394579 -384699 -375187 -364603
4248 -364603 -353304 -342969 -334863 -328040 -319207 -304577 -282191 -252699 -217839 -178526 -134349 -84553 -29315 29978
4262B9978O1410O1946O1153N8165N1015L8046J9492k226k3241l9708m9518n3267n3495n2585
4276A07165n1233m8576m3434l5660k6923k0293j8556k2261k8987l4346l4165k6760j3805P35
4290b97099J2735J9993K2798K3127K2909K2556K0971J6828R840R05q362j6056k0198j8970
4304a88023j1800k04J2628K3416L0037L1670K8477K1317J1800K180n272q888q557n965l702
4319g0886l686o261j0218j3571j4828j3998j2860j3718j7594k3015k7011k7307k3480j6677
4333b95110r021k962j28m23k602n521q678j1693j3987j4865j3800j0490m745K957J0934J6599
4349c63535J7936J5082J0184N709K997K071K654M985R488J5779K1712K4393K2105J5002M565
4364a88873p437j9752l1884m3660n3955o0611o1918n8055n0835m2263l3219k3314j1913P05
$$ plain form
4262 29978 91388 153334 214487 272652 323667 361713 381205 378979 355738 316030 266512 213245 159750 107165
4276 107165 55932 7356 -36078 -71738 -98661 -118954 -137510 -159771 -188758 -223104 -257269 -284029 -297834 -297099
4290 -297099 -284364 -264371 -241573 -218446 -195537 -172981 -152010 -135182 -125342 -124437 -132799 -148855 -169053 -188023
4304 -188023 -199823 -200027 -187399 -163983 -133946 -102276 -73799 -52482 -40682 -38502 -43774 -52662 -61219 -67184 -70886
4319 -70886 -74572 -80833 -91051 -104622 -119450 -133448 -146308 -160026 -177620 -200635 -227646 -254953 -278433 -295110
4333 -295110 -304131 -307093 -307221 -307644 -310246 -315767 -324445 -336138 -350125 -364990 -378790 -389280 -394025 -391068 -380134 -363535
4349 -363535 -345599 -330517 -320333 -314624 -311627 -309556 -306902 -301917 -292429 -276650 -254938 -230545 -208440 -193438 -188873
4364 -188873 -196310 -216062 -247946 -291606 -345561 -406172 -468090 -526145 -576980 -619243 -652462 -675776 -687689 -686984
4378f86984J2966K2617K7739K7254K1462J2170J793p317j3009j3029n889P756K4739M0838
4392e26894N2724N8820N9088N4752M8103M1715L7592L6361L7237L8714L9413L8749L6837L4074
4406H7285L0566K6221K1065J5362R546M239J20k053j624J623P074J3338J8657K1503K1019
4421B73941J7219J0625J912p977j7808k6407l2738l5950l5648l2211k6839k1131j6511j3881
4435C6596j3381j4436j6140j7924j9945k2747k6449l0186l2448l2059k8835k3354j6455q738
4449b66501l84Q816J9041L0298M2449N5001O6294P3280P2386O1602M1920J7312p189k7863
4463A86462m3374n4101o0536o2310n8256m7886l2555j5650j070Q421J2335J2171J0302Q687
4477a37360P826O654L669j991j0142k0002l0289l8968m3688m3179l8284l1518k5594k2707
$$ plain form
4378 -686984 -674018 -651401 -623662 -596408 -574946 -562776 -560983 -568300 -581309 -594338 -600227 -592471 -567732 -526894
4392 -526894 -474170 -415350 -356262 -301510 -253407 -211692 -174100 -137739 -100502 -61788 -22375 16374 53211 87285
4406 87285 117851 144072 165137 180499 190045 194284 194404 192351 190727 192350 199424 212762 231419 252922 273941
4421 273941 291160 301785 303697 295720 277912 251505 218767 182817 147169 114958 88119 66988 50477 36596
4435 36596 23215 8779 -7361 -25285 -45230 -67977 -94426 -124612 -157060 -189119 -217954 -241308 -257763 -266501
4449 -266501 -266885 -258069 -239028 -208730 -166281 -111280 -44986 28294 100680 162282 204202 221514 214325 186462
4463 186462 143088 88987 28451 -33859 -92115 -140001 -172556 -188206 -189276 -180855 -168520 -156349 -146047 -137360
4477 -137360 -129534 -122880 -119211 -121202 -131344 -151346 -181635 -220603 -264291 -307470 -345754 -377272 -402866 -425573
4491d25573k3841k8426l4418l9017l9849l5546k5749j1288N475K1094L2530L8852M1372M2563
4505d81821M4624M8311N2468N4377N1221M2009K8512J4302K411o230j2341j6666j9675k2055
4519b20553k4570k7457l0158l1570l0222k4711j4791k409Q457J3930J3091Q870N952P353J2889
4534c35899K0362K7715L3908L8425M0526L9433L5162K8742K1662J4906Q581K261m372j1380
4548c9968j8459k4805k9542l2516l4546l6566l8982m1609m4297m7328n0829n4004n5559n5140
4562f04150n3989n3807n4892n5785n4115m7914l6602k1349m806R983K0963K7958L2925L8526
4576h57054M6186N5223O3946P0899P5196P6130P3187O6483N6849M5608L4286K4422J7052J2105
4590a39482Q519M742q15q710j7647k4501k6029k0714r580M476J8150K9367L7702M3697M8144
$$ plain form
4491 -425573 -449414 -477840 -512258 -551275 -591124 -626670 -652419 -663707 -658232 -637138 -604608 -565756 -524384 -481821
4505 -481821 -437197 -388886 -336418 -282041 -230820 -188811 -160299 -145997 -143586 -149816 -162157 -178823 -198498 -220553
4519 -220553 -245123 -272580 -302738 -334308 -364530 -389241 -404032 -406441 -397984 -384054 -370963 -362093 -356141 -348788 -335899
4534 -335899 -315537 -287822 -253914 -215489 -174963 -135530 -100368 -71626 -49964 -35058 -26477 -24216 -28588 -39968
4548 -39968 -58427 -83232 -112774 -145290 -179836 -216402 -255384 -296993 -341290 -388618 -439447 -493451 -549010 -604150
4562 -604150 -658139 -711946 -766838 -822623 -876738 -924652 -961254 -982603 -987409 -977426 -956463 -928505 -895580 -857054
4576 -857054 -810868 -755645 -691699 -620800 -545604 -469474 -396287 -329804 -272955 -227347 -193061 -168639 -151587 -139482
4590 -139482 -130963 -126221 -127036 -135746 -153393 -177894 -203923 -224637 -234217 -229741 -211591 -182224 -144522 -100825 -52681
4605e2681N1574N3846N4197N2193M8372M4170M1388M1485M4670M9342N2631N1367M3253K7545
4619F03352O058j6894l6389m9868n8743o7071p7954r0851j01511j04732r7549q0801n8042
4632b30995l3301r512J1095K5987L2503K9332J7676R49j6540l0778l8602l8463l0967j8505
4646c30121m147R210J8976K2757J8600N887j3526l5180n3703o5252o8844o5614n7193m4911
4660f63061k9939j3542K713J6656K5579K7406K2372J3342L921l518q096r195n644L721J8944
4675e98341L8028N7653P4607Q7005R4195R6094R2729Q3706O8534M7877K4761L892j0634j7461
4689A42645j8421j6922j5851j6203j7303j7935j7538j6775j6974j9221k3730k9828l6212m1515
4703a61783m4885m6239m5784m3545l9331l3162k5444j6738p465J932J0501J6813J9645J8799
$$ plain form
4605 -52681 -1107 52739 106936 159129 207501 251671 293059 334544 379214 428556 481187 532554 575807 603352
4619 603352 609410 592516 556127 506259 447516 380445 302491 211640 110129 5397 -92152 -172953 -230995
4632 -230995 -264296 -273808 -262713 -236726 -204223 -174891 -157215 -156266 -172806 -203584 -242186 -280649 -311616 -330121
4646 -330121 -334268 -325058 -306082 -283325 -264725 -258838 -272364 -307544 -361247 -426499 -495343 -560957 -618150 -663061
4660 -663061 -693000 -706542 -703829 -687173 -661594 -634188 -611816 -598474 -594553 -598071 -606167 -615362 -621006 -617285 -598341
4675 -598341 -560313 -502660 -428053 -341048 -246853 -150759 -58030 25676 94210 142087 166848 170740 160106 142645
4689 142645 124224 107302 91451 75248 57945 40010 22472 5697 -11277 -30498 -54228 -84056 -120268 -161783
4703 -161783 -206668 -252907 -298691 -342236 -381567 -414729 -440173 -456911 -464376 -462444 -451943 -435130 -415485 -396686
4717c96686J5305J0555N510M39m838j0512j6671k3051k9411l5461m0470m3410m2787l7908
4731f49396k8935j7134m450O867J4723J8246J8469J7959J8862K1368K3649K3629K0652J5500
4745d99991R458K803m961j3827k2028k7152k8018k5602k2181j9932j9869k1553k3314k3067
4759g39234j9457j2672m133M946J4550K5341L7822N1491O4832P5591Q1860Q3438Q1968P9720
4773a73937P7557P4091O6644N3485L5117J3886p459k6480m1084m9422n0402m4599l4384k2921
4787a29908j2667m826J37J773J25l448o611p554n678j527L246O218N467P48o750j5906k6326
4804b03487l7133m5687m8520m4136l4318k2517j1843m497k048n111j2616k2005l0624l6806
4818e61348l9772l9145l5139k9102k2965j7596j2136m877N195J8019L2631M7457O0749P0892
$$ plain form
4717 -396686 -381381 -370826 -365316 -364877 -369715 -380227 -396898 -419949 -449360 -484821 -525291 -568701 -611488 -649396
4731 -649396 -678331 -695465 -699915 -693048 -678325 -660079 -641610 -623651 -604789 -583421 -559772 -536143 -515491 -499991
4745 -499991 -490533 -487730 -492691 -506518 -528546 -555698 -583716 -609318 -631499 -651431 -671300 -692853 -716167 -739234
4759 -739234 -758691 -771363 -775496 -770550 -756000 -730659 -692837 -641346 -576514 -500923 -419063 -335625 -253657 -173937
4773 -173937 -96380 -22289 44355 97840 132957 146843 139384 112904 71820 22398 -28004 -72603 -106987 -129908
4787 -129908 -142575 -147401 -147264 -145491 -145366 -148814 -155425 -162979 -168657 -170184 -166938 -160720 -155253 -154505 -161255 -177161 -203487
4804 -203487 -240620 -286307 -334827 -378963 -413281 -435798 -447641 -452138 -454186 -459297 -471913 -493918 -524542 -561348
4818 -561348 -601120 -640265 -675404 -704506 -727471 -745067 -757203 -762080 -756885 -738866 -706235 -658778 -598029 -527137
4832e27137P6709P7801P4656O8243N9014M6536L0293J1194p891k2958l0807l0303k2596j0579
4846b07825K145J1996J6122J3335N225m057r803r418l299O138J6277K5676L4394M3136N1707
4861h251N8491O1474N9773N4376M7495M1164L6045L1195K5053J6543N829n910j7497k8408
4875C77372l8308m6006m9468m6985l8383k5491j1560n0O302O231L14q967j8073k3810k4618
4890E8500k0986j5000r467o899q474j3800k1411k9582l6409l9625l7314k9578j9470j1656
4904b41171r678j4075k2539l1489l7683l9010l4465k3810p993J0086K5701L4011L2445K2292
4918c37378P830o223j6942k3456k5792k3842j7546p796K963J1500J5376J3904Q243P81n878
4933d04256r732r476m476M939J7475L0927M2275M8016M5474L4445J7690m95j6185k6834l1369
$$ plain form
4832 -527137 -450428 -372627 -297971 -229728 -170714 -124178 -93885 -82691 -90582 -113540 -144347 -174650 -197246 -207825
4846 -207825 -205680 -193684 -177562 -164227 -159002 -163059 -172862 -182280 -185579 -179441 -163164 -137488 -103094 -59958 -8251
4861 -8251 50240 111714 171487 225863 273358 314522 350567 381762 406815 423358 429187 423277 405780 377372
4875 377372 339064 293058 243590 196605 158222 132731 121171 121121 127423 133654 133968 125001 106928 83118 58500
4890 58500 37514 22514 13047 6148 -2326 -16126 -37537 -67119 -103528 -143153 -180467 -210045 -229515 -241171
4904 -241171 -250849 -264924 -287463 -318952 -356635 -395645 -430110 -453920 -461913 -451827 -426126 -392115 -359670 -337378
4918 -337378 -329548 -335771 -352713 -376169 -401961 -425803 -443349 -451145 -448182 -436682 -421306 -407402 -399159 -398378 -404256
4933 -404256 -413988 -423464 -427940 -423001 -405526 -374599 -332324 -284308 -238834 -204389 -186699 -187194 -203379 -230213 -261582
4948b61582l0305k5624k0049j5658j3201j2264j2062j2020j2043j2349j3193j4398j5284j4997
$$ plain form
4948 -261582 -291887 -317511 -337560 -353218 -366419 -378683 -390745 -402765 -414808 -427157 -440350 -454748 -470032 -485029
$$ [...]
##END=	
