##TITLE=	20180606 SB491 WTA.3.fid
##JCAMPDX=	6.0	$$ NMR Plug-in 1.14 of MestReNova 12.0.4-22023
##DATATYPE=	NMRSPECTRUM
##DATACLASS=	NTUPLES
##NUMDIM=	1
##ORIGIN=	Bruker BioSpin GmbH
##OWNER=	nmrmse
##.OBSERVEFREQUENCY=	161.8703181109999889
##.OBSERVENUCLEUS=	^31P
##.SOLVENTNAME=	H2O+D2O
##.PULSESEQUENCE=	zgig
##LONGDATE=	2018/06/07 11:45:27.000
##.ACQUISITIONMODE=	SIMULTANEOUS (DQD)
##$ORIGINALFORMAT=	Bruker XWIN-NMR
##$PARAMETERFILE=	(acqus, ASCII, /Users/Rodrigo/Downloads/OneDrive-2019-10-24/20180606%20WTA%20+%202%20mM%20std/20180606%20SB491%20WTA/3/acqus, 0)
$$ ##TITLE= Parameter file, TopSpin 3.5 pl 7
$$ ##JCAMPDX= 5.0
$$ ##DATATYPE= Parameter Values
$$ ##NPOINTS= 16	$$ modification sequence number
$$ ##ORIGIN= Bruker BioSpin GmbH
$$ ##OWNER= nmrmse
$$ $$ 2018-06-07 11:45:27.852 -0500  nmrmse@am400
$$ $$ /opt/data/nmrmse/AUGSBURG/3/acqus
$$ $$ process /opt/topspin3.5pl7/prog/mod/go4
$$ ##$ACQT0= -4.99745346615264
$$ ##$AMP= (0..31)
$$ 100 100 100 100 100 100 100 100 100 100 100 100 100 100 100 100 100 100
$$ 100 100 100 100 100 100 100 100 100 100 100 100 100 100
$$ ##$AMPCOIL= (0..19)
$$ 0 0 0 0 0 0 0 0 0 0 0 0 0 0 0 0 0 0 0 0
$$ ##$ANAVPT= -1
$$ ##$AQSEQ= 0
$$ ##$AQ_mod= 3
$$ ##$AUNM= <au_zg>
$$ ##$AUTOPOS= <>
$$ ##$BF1= 161.870343035
$$ ##$BF2= 399.87
$$ ##$BF3= 161.870343035
$$ ##$BF4= 161.870343035
$$ ##$BF5= 161.870343035
$$ ##$BF6= 161.870343035
$$ ##$BF7= 161.870343035
$$ ##$BF8= 161.870343035
$$ ##$BWFAC= (0..63)
$$ 0 0 0 0 0 0 0 0 0 0 0 0 0 0 0 0 0 0 0 0 0 0 0 0 0 0 0 0 0 0 0 0 0 0 0 0
$$ 0 0 0 0 0 0 0 0 0 0 0 0 0 0 0 0 0 0 0 0 0 0 0 0 0 0 0 0
$$ ##$BYTORDA= 0
$$ ##$CAGPARS= (0..11)
$$ 0 0 0 0 0 0 0 0 0 0 0 0
$$ ##$CHEMSTR= <none>
$$ ##$CNST= (0..63)
$$ 1 1 1 1 1 1 1 1 1 1 1 1 1 1 1 1 1 1 1 1 1 1 1 1 1 1 1 1 1 1 1 1 1 1 1 1
$$ 1 1 1 1 1 1 1 1 1 1 1 1 1 1 1 1 1 1 1 1 1 1 1 1 1 1 1 1
$$ ##$CPDPRG= (0..8)
$$ <> <> <waltz16> <> <> <> <> <> <>
$$ ##$D= (0..63)
$$ 0 6.5 0 0 0 0 0 1.7 0 0 0 0.03 0 0 0 0 0.0002 0 0 0 0 0 0 0 0 0 0 0 0 0
$$ 0 0 0 0 0 0 0 0 0 0 0 0 0 0 0 0 0 0 0 0 0 0 0 0 0 0 0 0 0 0 0 0 0 0
$$ ##$DATE= 1528389927
$$ ##$DE= 6.5
$$ ##$DECBNUC= <off>
$$ ##$DECIM= 4053.33333333333
$$ ##$DECNUC= <off>
$$ ##$DECSTAT= 4
$$ ##$DIGMOD= 1
$$ ##$DIGTYP= 12
$$ ##$DQDMODE= 0
$$ ##$DR= 23
$$ ##$DS= 0
$$ ##$DSPFIRM= 0
$$ ##$DSPFVS= 20
$$ ##$DTYPA= 0
$$ ##$EXP= <P31CPD>
$$ ##$FCUCHAN= (0..9)
$$ 0 1 2 0 0 0 0 0 0 0
$$ ##$FL1= 0
$$ ##$FL2= 0
$$ ##$FL3= 0
$$ ##$FL4= 0
$$ ##$FN_INDIRECT= (0..7)
$$ 0 0 0 0 0 0 0 0
$$ ##$FOV= 0
$$ ##$FQ1LIST= <>
$$ ##$FQ2LIST= <>
$$ ##$FQ3LIST= <>
$$ ##$FQ4LIST= <>
$$ ##$FQ5LIST= <>
$$ ##$FQ6LIST= <>
$$ ##$FQ7LIST= <>
$$ ##$FQ8LIST= <>
$$ ##$FRQLO3= 14447.5139999986
$$ ##$FRQLO3N= 2
$$ ##$FS= (0..7)
$$ 83 83 83 83 83 83 83 83
$$ ##$FTLPGN= 0
$$ ##$FW= 4032000
$$ ##$FnILOOP= 0
$$ ##$FnMODE= 0
$$ ##$FnTYPE= 0
$$ ##$GPNAM= (0..31)
$$ <> <> <> <> <> <> <> <> <> <> <> <> <> <> <> <> <> <> <> <> <> <> <> <>
$$ <> <> <> <> <> <> <> <>
$$ ##$GPX= (0..31)
$$ [...]
$$ 130000 130000 130000 130000 130000 130000 130000 0 0 0 0 0 0 0 0 0 0 0
$$ 0 0 0 0 0 0 0 0 0 0 0 0 0
$$ ##$ShimPowMaxUC= (0..63)
$$ 130000 130000 130000 130000 130000 130000 130000 130000 130000 130000 130000
$$ 130000 130000 130000 130000 130000 130000 130000 130000 130000 130000 130000
$$ 130000 130000 130000 130000 130000 130000 130000 130000 130000 130000 130000
$$ 130000 130000 130000 130000 130000 130000 130000 0 0 0 0 0 0 0 0 0 0 0
$$ 0 0 0 0 0 0 0 0 0 0 0 0 0
$$ ##$ShimPowMaxUG= (0..63)
$$ 524287 524287 524287 524287 524287 524287 524287 524287 524287 524287 524287
$$ 524287 524287 524287 524287 524287 524287 524287 524287 524287 524287 524287
$$ 524287 524287 524287 524287 524287 524287 524287 524287 524287 524287 524287
$$ 524287 524287 524287 524287 524287 524287 0 0 0 0 0 0 0 0 0 0 0 0 0 0 0
$$ 0 0 0 0 0 0 0 0 0 0
$$ ##$ShimPowNum= 0
$$ ##$ShimPowRcbType= 3
$$ ##$ShimPowRes= (0..63)
$$ 1e-20 1e-20 1e-20 1e-20 1e-20 1e-20 1e-20 1e-20 1e-20 1e-20 1e-20 1e-20
$$ 1e-20 1e-20 1e-20 1e-20 1e-20 1e-20 1e-20 1e-20 1e-20 1e-20 1e-20 1e-20
$$ 1e-20 1e-20 1e-20 1e-20 1e-20 1e-20 1e-20 1e-20 1e-20 1e-20 1e-20 1e-20
$$ 1e-20 1e-20 1e-20 1e-20 0 0 0 0 0 0 0 0 0 0 0 0 0 0 0 0 0 0 0 0 0 0 0 0
$$ ##$ShimPowRng0= (0..63)
$$ 1 1 1 1 1 1 1 1 1 1 1 1 1 1 1 1 1 1 1 1 1 1 1 1 1 1 1 1 1 1 1 1 1 1 1 1
$$ 1 1 1 1 0 0 0 0 0 0 0 0 0 0 0 0 0 0 0 0 0 0 0 0 0 0 0 0
$$ ##$ShimPowRng1= (0..63)
$$ 1 1 1 1 1 1 1 1 1 1 1 1 1 1 1 1 1 1 1 1 1 1 1 1 1 1 1 1 1 1 1 1 1 1 1 1
$$ 1 1 1 1 0 0 0 0 0 0 0 0 0 0 0 0 0 0 0 0 0 0 0 0 0 0 0 0
$$ ##$ShimPowRng2= (0..63)
$$ 1 1 1 1 1 1 1 1 1 1 1 1 1 1 1 1 1 1 1 1 1 1 1 1 1 1 1 1 1 1 1 1 1 1 1 1
$$ 1 1 1 1 0 0 0 0 0 0 0 0 0 0 0 0 0 0 0 0 0 0 0 0 0 0 0 0
$$ ##$ShimPowRng3= (0..63)
$$ 1 1 1 1 1 1 1 1 1 1 1 1 1 1 1 1 1 1 1 1 1 1 1 1 1 1 1 1 1 1 1 1 1 1 1 1
$$ 1 1 1 1 0 0 0 0 0 0 0 0 0 0 0 0 0 0 0 0 0 0 0 0 0 0 0 0
$$ ##$ShimPowType1= 0
$$ ##$ShimPowType2= 0
$$ ##$ShimPowType3= 0
$$ ##$ShimPowType4= 0
$$ ##$ShimSysAngle= <>
$$ ##$ShimSysFunc= (0..63)
$$ 1 2 3 4 5 6 7 8 9 10 0 37 38 35 16 15 14 13 12 11 28 27 26 25 24 23 36
$$ 22 30 29 20 21 34 33 32 31 17 18 19 0 0 0 0 0 0 0 0 0 0 0 0 0 0 0 0 0 0
$$ 0 0 0 0 0 0 0
$$ ##$ShimSysMatId= <no>
$$ ##$ShimSysMatrix= 1
$$ ##$ShimSysOffset= <>
$$ ##$ShimSysType= 4
$$ ##$ShimUnit= 0
$$ ##$TFXNUM= 0
$$ ##$TOSITY= <no>
$$ ##$TRIPLO2= 0
$$ ##$VTU= 2
$$ ##$VTUETH= <149.236.99.20>
$$ ##$VTUTY= <no>
$$ ##$WBREFAM= (0..15)
$$ 132.6 111.2 100 100 100 100 100 100 100 100 100 100 100 100 100 100
$$ ##$WBREFLM= (0..15)
$$ 0 0 0 0 0 0 0 0 0 0 0 0 0 0 0 0
$$ ##$WBREFPH= (0..15)
$$ 78.43 -67.85 0 0 0 0 0 0 0 0 0 0 0 0 0 0
$$ ##$WBSGU= (0..15)
$$ 0 0 0 0 0 0 0 0 0 0 0 0 0 0 0 0
$$ ##$XFAC= 2
$$ ##END=
$$ 
##$DECIM=	4053.33333333333
##$DSPFVS=	20
##XUNITS=	HZ
##YUNITS=	ARBITRARY UNITS
##FIRSTX=	2442.1812631562502247
##LASTX=	-2491.7281028490956487
##XFACTOR=	-0.30116031044407898243
##YFACTOR=	1.3817475585937501682e-06
##NPOINTS=	16384
##XYDATA=	(X++(Y..Y))
$$ [...]
-6026I796708N57260O56641O82119O48406N67719M45087K85838J07258n9862j87792k72166
-6015A3227216l34577m04335m95128n94488o73722p11149p07914o84561o66391o69748o91292
-6004F593911p04331o71063n68600m09687k38052r9735j5731K2964L9451N0465N5450M0233
-5992D095275q717r1730j97994l17864m46591n74823o83538p55431p88916p96049p89430p73644
-5980b129452p44512o91500o04712m85601l52592k36551j69165j68713k26857l07223l61930
-5969f478808l56175k84160j65903l0030J02279K20083L19170M01910M76296N47057O05663
-5958d642618O32286O09787N38606M38507L35641K47252J75274J11401M9108p275m5339n7471
-5946a614841m9945l7390k9601k7054k6938k6546k2048j2376n243j3382m3768r1075j39039
$$ plain form
-6026 9796708 10353968 11010609 11692728 12341134 12908853 13353940 13639778 13747036 13687174 13499382 13227216
-6015 13227216 12892639 12488304 11993176 11398688 10724966 10013817 9305903 8621342 7954951 7285203 6593911
-6004 6593911 5889580 5218517 4649917 4240230 4002178 3902443 3886712 3909676 3949127 3999592 4055042 4095275
-5992 4095275 4086558 3994828 3796834 3478970 3032379 2457556 1774018 1018587 229671 -566378 -1355808 -2129452
-5980 -2129452 -2873964 -3565464 -4170176 -4655777 -5008369 -5244920 -5414085 -5582798 -5809655 -6116878 -6478808
-5969 -6478808 -6834983 -7119143 -7285046 -7315076 -7212797 -6992714 -6673544 -6271634 -5795338 -5248281 -4642618
-5958 -4642618 -4010332 -3400545 -2861939 -2423432 -2087791 -1840539 -1665265 -1553864 -1504756 -1512031 -1557370 -1614841
-5946 -1614841 -1664786 -1702176 -1731777 -1758831 -1785769 -1812315 -1834363 -1846739 -1851982 -1865364 -1909132 -2000207 -2139246
-5933b139246j67322j61720j21886o0606M631O3000J17825J82184K64043L53510M25109M55270
-5921g85208M40035L96084L45782L02556K68698K43366K30397K38102K69463L12520L43880
-5910B605675L42678L00087K18537J08827j0072j14831j87083k17676k01366j35314k8288
-5899B681174R3660J98476K69132L12833L47714L78969L87300L39489K13900K1928j91708
-5888E052867l73082m90633n47559n64146n49008m87137l55330j49941R8910L38169N17183
-5877B490293O07732O06210N24957L88390K30850Q1360n5872j97473l50755m90327n68238
-5866C267127n50409m48794l21295k33627k12837k34613k52775k38074j91916j31010o5223
-5855C86554Q224R1303J70380K20542K25371J90782J39699R5277O8652N5936M0337j555q8136
$$ plain form
-5933 -2139246 -2306568 -2468288 -2590174 -2650780 -2646149 -2583149 -2465324 -2283140 -2019097 -1665587 -1240478 -785208
-5921 -785208 -345173 50911 396693 699249 967947 1211313 1441710 1679812 1949275 2261795 2605675
-5910 2605675 2948353 3248440 3466977 3575804 3565732 3450901 3263818 3046142 2844776 2709462 2681174
-5899 2681174 2774834 2973310 3242442 3555275 3902989 4281958 4669258 5008747 5222647 5244575 5052867
-5888 5052867 4679785 4189152 3641593 3077447 2528439 2041302 1685972 1536031 1634941 1973110 2490293
-5877 2490293 3098025 3704235 4229192 4617582 4848432 4929792 4873920 4676447 4325692 3835365 3267127
-5866 3267127 2716718 2267924 1946629 1713002 1500165 1265552 1012777 774703 582787 451777 386554
-5855 386554 394778 486081 656461 877003 1102374 1293156 1432855 1528132 1596784 1652720 1693057 1691502 1603366
-5842A603366k22867l92988n75137p43688q77225r57932r68197q93857p33478n04844k43684
-5831e510531O298K07609L39024L96460L88364L32081K50208J62526P8769k301q8214j83073
-5819c622780k77492l50091l83111l76128l41840k87577k01477n9204J50311M01496O35916
-5808d711977P93671Q49959Q31399P99231Q09569Q80389R87272J081621J110159J028442Q13990
-5797E273725M79112P1904l40720o96789r53931j088648j087307r45485o81471l45991j0569
-5786c26170K55123L98307L93985K57280M4776j65651l03871l28803k38221o7589J23811K75318
-5774C18295L45240L20733K16983O9744p6901j86665k45661k65271k69687k79074k99612l21640
-5762f73516l26462k98267k31658j32995k1031P6311J36060J57035J62338J87772K69389M30725
$$ plain form
-5842 1603366 1380499 987511 412374 -331314 -1208539 -2166471 -3134668 -4028525 -4762003 -5266847 -5510531
-5831 -5510531 -5504233 -5296624 -4957600 -4561140 -4172776 -3840695 -3590487 -3427961 -3349192 -3351493 -3439707 -3622780
-5819 -3622780 -3900272 -4250363 -4633474 -5009602 -5351442 -5639019 -5840496 -5899700 -5749389 -5347893 -4711977
-5808 -4711977 -3918306 -3068347 -2236948 -1437717 -628148 252241 1239513 2321134 3431293 4459735 5273725
-5797 5273725 5752837 5824741 5484021 4787232 3833301 2744653 1657346 711861 30390 -315601 -326170
-5786 -326170 -71047 327260 721245 978525 1023301 857650 553779 224976 -13245 -80834 42977 318295
-5774 318295 663535 984268 1201251 1270995 1194094 1007429 761768 496497 226810 -52264 -351876 -673516
-5762 -673516 -999978 -1298245 -1529903 -1662898 -1683929 -1607618 -1471558 -1314523 -1152185 -964413 -695024 -264299
-5750b64299O65692R29740J151799J262338J223029J043350P75802M92348K53669Q8612m887
-5739G617193m7558p0653j11006j99916l47479n35897p30798r00263j022413j077946j044711
-5728A528553r09292o84716m09637j26606J35286L57922N24047O16219O24824N53799M20576
-5717B630975K52383P9977o8209j68941k05796j70411n8902J33363M04288P23740J023398
-5706D575865J217659J245995J103782Q40176N30606K45230K6874j17657k10354k81059l45252
-5695H831865l96289m14933l86258l11818k10221j08696l3718k623j5826n7409j09669j65251
-5683F619154k19943k58606k56475j95225p7320P2897K20806L38637M16597M60372M81048
-5672G601942M85794M69472M09367K73521M6705k44154n34189p59732q97281r64503r89776
$$ plain form
-5750 -264299 401393 1331133 2482932 3745270 4968299 6011649 6787451 7279799 7533468 7622080 7617193
-5739 7617193 7569635 7498982 7387976 7188060 6840581 6304684 5573886 4673623 3651210 2573264 1528553
-5728 1528553 619261 -65455 -475092 -601698 -466412 -108490 415557 1031776 1656600 2210399 2630975
-5717 2630975 2883358 2963335 2895126 2726185 2520389 2349978 2291076 2424439 2828727 3552467 4575865
-5706 4575865 5793524 7039519 8143301 8983477 9514083 9759313 9786187 9668530 9458176 9177117 8831865
-5695 8831865 8435576 8020643 7634385 7322567 7112346 7003650 6969932 6967309 6951483 6894074 6784405 6619154
-5683 6619154 6399211 6140605 5884130 5688905 5611585 5684482 5905288 6243925 6660522 7120894 7601942
-5672 7601942 8087736 8557208 8966575 9240096 9286801 9042647 8508458 7748726 6851445 5886942 4897166
-5661D897166r85806r47342q65700p41002n79725l85456j61779P1294K71970L97770M33004
-5650A404394L94941L16727K27299J44279P6491K3754k5776r1808j89959l18853m55982n66857
-5638I38650o22902o14830n51668m52041l36890k22193j10796Q375J49960L20371N12345P03479
-5626b78140Q59380R48437R60878R13099Q34706P52968O82785O21744N53105M56069L15999
-5615G621030J30328q8662l15527n21536o88700q14036q98874r37646r18911q33727o82909
-5604A050830m81977k60403n2420J14593K26617K84905L01926K89133K45293J58656K0713
-5593A897866j62634l70309n70664p26048q01497p79912o73969n20517l61177k26242j29563
-5582c424666p1801m8157n2508p2334q3596n9558J2980J25837K54514L68599M41714M57214
$$ plain form
-5661 4897166 3911360 2964018 2098318 1357316 777591 392135 230356 301650 573620 971390 1404394
-5650 1404394 1799335 2116062 2343361 2487640 2564131 2587885 2562109 2470301 2280342 1961489 1505507 938650
-5638 938650 315748 -299082 -850750 -1302791 -1639681 -1861874 -1972670 -1964295 -1814335 -1493964 -981619 -278140
-5626 -278140 581240 1529677 2490555 3403654 4238360 4991328 5674113 6295857 6848962 7305031 7621030
-5615 7621030 7751358 7662696 7347169 6825633 6136933 5322897 4424023 3486377 2567466 1733739 1050830
-5604 1050830 568853 308450 256030 370623 597240 882145 1184071 1473204 1718497 1877153 1897866
-5593 1897866 1735232 1364923 794259 68211 -733286 -1513198 -2187167 -2707684 -3068861 -3295103 -3424666
-5582 -3424666 -3496467 -3544624 -3597132 -3669466 -3753062 -3812620 -3799640 -3673803 -3419289 -3050690 -2608976 -2151762
-5570b151762M11024L16552K05461J15383P0799P2429J03005J43124J82672K19284K49801
-5559f2228K66162K56901K12309J34236M1585l9638r0454j01458o7766J4531J49097L35165
-5547A048442N59567P94142J000026J135042J165533J084933R27572P57621O31377N62174
-5537I666429N19208M57405L46704J78145m4252l05904n77914q18048r79601j026458r52279
-5526F463435p93835o21805n08755m93056n57908o36489o48210n48268l52728j19780R1170
-5515A273771K47131L44276L98606M34348M68122M95656M95528M48798L53891K25745Q7046
-5504E272918m0464j42633k14092k55636k72657k74092k70653k74866l00688l58281m45847
-5493B423009n47184o40577p13075p65664q04225q28003q25109p71121o33862l93519o9530
$$ plain form
-5570 -2151762 -1740738 -1424186 -1218725 -1103342 -1032543 -960114 -857109 -713985 -531313 -312029 -62228
-5559 -62228 203934 460835 673144 807380 848965 809327 718873 617415 549649 564180 713277 1048442
-5547 1048442 1608009 2402151 3402177 4537219 5702752 6787685 7715257 8472878 9104255 9666429
-5537 9666429 10185637 10643042 10989746 11167891 11123639 10817735 10239821 9421773 8442172 7415714 6463435
-5526 6463435 5669600 5047795 4539040 4045984 3488076 2851587 2203377 1655109 1302381 1182601 1273771
-5515 1273771 1520902 1865178 2263784 2698132 3166254 3661910 4157438 4606236 4960127 5185872 5272918
-5504 5272918 5232454 5089821 4875729 4620093 4347436 4073344 3802691 3527825 3227137 2868856 2423009
-5493 2423009 1875825 1235248 522173 -243491 -1047716 -1875719 -2700828 -3471949 -4105811 -4499330 -4568860
-5482d568860K73293N52229P06243P17660O08475M23935K13310J5539j46028k63334l42577
-5471a810115l99137m46023m83193m97200m72373m01118k84064j26163N9361K44351L89947
-5460d225727M66387M69933M23669L65451L28150L24705L46579L77381M08214M39667M70691
-5449A95100M87932M70475M03798K88889J42203q622j31707k02785k16236j87356j45003j20758
-5437I75930j37079j97030k82039l61450m06651m01846l49417k69357j92577j48559j50783
-5426a920858j87812k28139k35212j84070p3527P1750K14606L28727M13507M85426N54065
-5415g61537O07481O18889N64156M35879K50222M7943j13322j80407j31618J2614K05942M02614
-5403A958856N72452P00256P78776Q02479P63343O49932M51627J67581j81547n48598q73140
$$ plain form
-5482 -4568860 -4295567 -3743338 -3037095 -2319435 -1710960 -1287025 -1073715 -1058176 -1204204 -1467538 -1810115
-5471 -1810115 -2209252 -2655275 -3138468 -3635668 -4108041 -4509159 -4793223 -4919386 -4860025 -4615674 -4225727
-5460 -4225727 -3759340 -3289407 -2865738 -2500287 -2172137 -1847432 -1500853 -1123472 -715258 -275591 195100
-5449 195100 683032 1153507 1557305 1846194 1988397 1979775 1848068 1645283 1429047 1241691 1096688 975930
-5437 975930 838851 641821 359782 -1668 -408319 -810165 -1159582 -1428939 -1621516 -1770075 -1920858
-5426 -1920858 -2108670 -2336809 -2572021 -2756091 -2829618 -2757868 -2543262 -2214535 -1801028 -1315602 -761537
-5415 -761537 -154056 464833 1028989 1464868 1715090 1763033 1649711 1469304 1337686 1350300 1556242 1958856
-5403 1958856 2531308 3231564 4010340 4812819 5576162 6226094 6677721 6845302 6663755 6115157 5242017
-5392E242017j106086j226546j243317j186577j094978j001862r23680q56156p82188o85194
-5382d864567n58606m08545k49911j01023J8538Q8809R5220L8824n9044j64921k49460k97720
-5370f712406l03298k57886j54829l130J68601L25551M44592N23365N74802O12680O41869
-5359d140089O59633O60764O41449O02701N50187M88006M12156L11566J78247J8970j41866
-5348B41724k70855l39914l39556k84903k09364j49731j33053j67945k40209l19537l77917
-5337b591260m04176m01858l78596l39293k84136k09882j13869J426J27866K56315L79592
-5326c957871M87528N62000N82091N36489M34013L06378J98174J46291J61707K22770K81698
-5315c8732K88513K24087J11127j2256j25042k27141l21846m04560m62125m73935m17398k81610
$$ plain form
-5392 5242017 4135931 2909385 1666068 479491 -615487 -1617349 -2541029 -3397185 -4179373 -4864567
-5382 -4864567 -5423173 -5831718 -6081629 -6182652 -6164114 -6075305 -5980085 -5941261 -6000305 -6165226 -6414686 -6712406
-5370 -6712406 -7015704 -7273590 -7428419 -7431549 -7262948 -6937397 -6492805 -5969440 -5394638 -4781958 -4140089
-5359 -4140089 -3480456 -2819692 -2178243 -1575542 -1025355 -537349 -125193 186373 364620 383590 241724
-5348 241724 -29131 -369045 -708601 -993504 -1202868 -1352599 -1485652 -1653597 -1893806 -2213343 -2591260
-5337 -2591260 -2995436 -3397294 -3775890 -4115183 -4399319 -4609201 -4723070 -4721644 -4593778 -4337463 -3957871
-5326 -3957871 -3470343 -2908343 -2326252 -1789763 -1355750 -1049372 -851198 -704907 -543200 -320430 -38732
-5315 -38732 249781 473868 584995 572739 447697 220556 -101290 -505850 -967975 -1441910 -1859308 -2140918
-5303b140918p9870J49138L52711M85505N31419N09449M55414L94929L30745K52269J53410
-5292A394201M0091p4313j74223k41369k57148k16998j43768p8767n3795p0635j05627j31369
-5280a13720j32946j08217o0346N112P6870J35820J61563J45546J00935N8842M8604P6154
-5268C94217J19359J43927J27241P1266m492p8577j35487j66517j72646j64440j50101j22204
-5256a38454o3099L2681J44091K33635K71654K52630J94075J25198P3298N1896N5080O2233
-5244A294918N0595O630p1327j77085k97881m09936m79128m74132l81663k12932j913K03549
-5232i50305L59249M40952M46646L87620K78618J32306m1428k32657m27374o05814p47524
-5221i59711q42853q99956r35290r54248r42454q75836p37929n29256k65739K4590L05265
$$ plain form
-5303 -2140918 -2220788 -2071650 -1718939 -1233434 -702015 -192566 262848 657777 988522 1240791 1394201
-5292 1394201 1434292 1359979 1185756 944387 687239 470241 326473 247706 193911 123276 17649 -113720
-5280 -113720 -246666 -354883 -415229 -410117 -333247 -197427 -35864 109682 210617 269459 318063 394217
-5268 394217 513576 657503 784744 856010 851518 772941 637454 470937 298291 133851 -16250 -138454
-5256 -138454 -201553 -168872 -24781 208854 480508 733138 927213 1052411 1125709 1177605 1232685 1294918
-5244 1294918 1345513 1352143 1280816 1103731 805850 395914 -83214 -557346 -939009 -1151941 -1153854 -950305
-5232 -950305 -591056 -150104 296542 684162 962780 1095086 1053658 821001 393627 -212187 -959711
-5221 -959711 -1802564 -2702520 -3637810 -4592058 -5534512 -6410348 -7148277 -7677533 -7943272 -7918682 -7613417
-5210g613417N43679P26430Q58500R45693R83197R63877Q93676P93396O83687N72733M62192
-5199H13643L59221K75465K12783J54350P4098m2068j80652l01729l58398l24123k09706n7655
-5187D15229Q2226J77181K18399K11823J66540Q9127j4705j35511k59340l69559m46443m69865
-5175c34898m30593l38223k12776o8568Q9961K57036M14683N37364O07813O24426N92263N11404
-5163B249892L78784K02617J2423j49649k50768k84774k70688k35078j94532j51606j03927
-5152A202694n5566j8916k907K814K7575R6371K05639L24991M23330M91577N39647N75803
-5140C813052N94636N83274N31468M33341K87195J01623j00290k90555m52891n87386o99061
-5129D214406p83589q23940q01167p09685n64576l95740k32543q9510L6445J54997K66895
$$ plain form
-5210 -7613417 -7069738 -6343308 -5484808 -4539115 -3555918 -2592041 -1698365 -904969 -221282 351451 813643
-5199 813643 1172864 1448329 1661112 1815462 1889560 1847492 1666840 1365111 1006713 682590 472884 415229
-5187 415229 497455 674636 893035 1104858 1271398 1360525 1345820 1210309 950969 581410 134967 -334898
-5175 -334898 -765491 -1103714 -1316490 -1385058 -1295097 -1038061 -623378 -86014 521799 1146225 1738488 2249892
-5163 2249892 2628676 2831293 2843716 2694067 2443299 2158525 1887837 1652759 1458227 1306621 1202694
-5152 1202694 1147128 1128212 1125305 1128119 1155694 1252065 1457704 1782695 2206025 2697602 3237249 3813052
-5140 3813052 4407688 4990962 5522430 5955771 6242966 6344589 6244299 5953744 5500853 4913467 4214406
-5129 4214406 3430817 2606877 1805710 1096025 531449 135709 -96834 -186344 -149899 5098 271993
-5118B71993L60867M25560M59515M68895M63136M55907M59916M69646M51172L60566J81672
-5107D828845n0700k64631l91141l97298k91512j10424R4802K71015L79249M07428L65525
-5096D841158K66142J11614r6903l38335n63381p11652p43082o60771n08368l42840k04930
-5085A048652j10948o3348n9269q8674j30932j58756j49974r9674k4068M8852R6822J16685
-5073D25368J21539J23972J22373J05213P0416L9231M6957J16605K39713L77688M79012N01038
-5061B769125M27510K73577P3105j42247l54419n53792p28314q60658r36199r51411r10387
-5050a894110q16850o76523n07690l41948k07349j08703k3380Q3392K32246M08774N65254
-5039c286887O47897O28672N16786L48337J70349K8409m2237k2030R0546K76856M93687O76364
$$ plain form
-5118 271993 632860 1058420 1517935 1986830 2449966 2905873 3365789 3835435 4286607 4647173 4828845
-5107 4828845 4778145 4513514 4122373 3725075 3433563 3323139 3417941 3688956 4068205 4475633 4841158
-5096 4841158 5107300 5218914 5122011 4783676 4220295 3508643 2765561 2104790 1596422 1253582 1048652
-5085 1048652 937704 874356 815087 726413 595481 436725 286751 187077 163009 211861 308683 425368
-5073 425368 546907 670879 793252 898465 968881 1008112 1055069 1171674 1411387 1789075 2268087 2769125
-5061 2769125 3196635 3470212 3543317 3401070 3046651 2492859 1764545 903887 -32312 -983723 -1894110
-5050 -1894110 -2710960 -3387483 -3895173 -4237121 -4444470 -4553173 -4576553 -4493161 -4260915 -3852141 -3286887
-5039 -3286887 -2638990 -2010318 -1493532 -1145195 -974846 -946437 -988674 -1010704 -920158 -643302 -149615 526749
-5027E26749P63032P29364O04369M55294L51385L23833L45296L48994K78982J32849l6729
-5016D823418j56538j71666o9600J13296L08840M52332N10590M84787L98652K89813K01070
-5005G184994J64048J84150K39786K93272L03140K36634Q4688j29913l64289n79848p54316
-4994F862346q70222r00392q16101o10379l08992M0155L83687O72440Q65309R36823Q90508
-4983G145182P64787O17608M97349M22956L83561L49942K89406J81262K8321j42925k95149
-4972A0242300l98189m41257m36096m13539m12037m57115n43583o37674o98768p01769o43018
-4961D459255n31326l78371k00318k5381J10276J81633J89032J53250J02217O1790M8297O2165
-4949D232519Q6644R5180O6703r09r0506j76819k35677k48562k07475j20892j5955O9580J06532
$$ plain form
-5027 526749 1289781 2019145 2623514 3078808 3430193 3754026 4099322 4448316 4727298 4860147 4823418
-5016 4823418 4666880 4495214 4425614 4538910 4847750 5300082 5810672 6295459 6694111 6983924 7184994
-5005 7184994 7349042 7533192 7772978 8066250 8369390 8606024 8690712 8560799 8196510 7616662 6862346
-4994 6862346 5992124 5091732 4275631 3665252 3356260 3396415 3780102 4452542 5317851 6254674 7145182
-4983 7145182 7909969 8527577 9024926 9447882 9831443 10181385 10470791 10652053 10680374 10537449 10242300
-4972 10242300 9844111 9402854 8966758 8553219 8141182 7684067 7140484 6502810 5804042 5102273 4459255
-4961 4459255 3927929 3549558 3349240 3323859 3434135 3615768 3804800 3958050 4060267 4122057 4170354 4232519
-4949 4232519 4319163 4414343 4481046 4480137 4389631 4212812 3977135 3728573 3521098 3400206 3384251 3453831 3560363
-4936C560363R0714L7638l9071j38432k62612m03599n40498o45485o93560o75201o04205n09168
-4924h23116m11830l11128j89889m0599J16192K41639L05667L04920K60958K06321J68359
-4913a72506J58342J71610J99014K39861L02135L88218M82540N52979N60930M74970K87866
-4902C645959K8371k44952m67708n95675o17229n50060m28276k87573j54447m2879M1190R2648
-4890D19369J04576P1186o888j17520k35699l27306l58256l10065j96401o3074L8145Q4941
-4878h96992R8504J24631J99571L28490M90473O58647Q13243R40681J029304J070725J063771
-4867E921048J013987R28947Q14983O77046N18619L39796J36177r6912l55664o22739q69074
-4856H406214j058776j158064j149281j040943q64828o62579m68005k92119j23515N2507K35549
$$ plain form
-4936 3560363 3651077 3688715 3649644 3511212 3248600 2845001 2304503 1659018 965458 290257 -313948 -823116
-4924 -823116 -1234946 -1546074 -1735963 -1776562 -1660370 -1418731 -1113064 -808144 -547186 -340865 -172506
-4913 -172506 -14164 157446 356460 596321 898456 1286674 1769214 2322193 2883123 3358093 3645959
-4902 3645959 3674330 3429378 2961670 2365995 1748766 1198706 770430 482857 328410 285531 326721 419369
-4890 419369 523945 595131 588243 470723 235024 -92282 -450538 -760603 -957004 -1020078 -981933 -896992
-4878 -896992 -798488 -673857 -474286 -145796 344677 1003324 1816567 2757248 3786552 4857277 5921048
-4867 5921048 6935035 7863982 8678965 9356011 9874630 10214426 10350603 10253691 9898027 9275288 8406214
-4856 8406214 7347438 6189374 5040093 3999150 3134322 2471743 2003738 1711619 1588104 1640611 1876160
-4845A876160M09929N55172O51928O85247O50510N55635M15414K46368O9029q9534k03325
-4834E822533k59321k60514k21035j61996j05692o4550l5409q637J9724M6557O5372O7522
-4822D904554M5137k793o9721j46683k23359k84453l10692k85261j99990n9159J21308L20146
-4810C809034N15452O82204P90212Q12715P41292N93726M08120K24015O3546o8963j69685
-4799H401668k24362k19685j60857p0428K9276J26798K14457K77897K99041K68904J94825
-4788I137534R6423k639q0441j20001j14188p3983l0713k1130o6754j70428l25292n12292
-4776G716096o89651q01451q06974p01982n13865k82855m8336J54505K94926L51650L20341
-4765D992404K16112O8935q6712k25043l38228m34796n27555o19245o97552p42186p35796
$$ plain form
-4845 1876160 2286089 2841261 3493189 4178436 4828946 5384581 5799995 6046363 6115392 6025858 5822533
-4834 5822533 5563212 5302698 5081663 4919667 4813975 4749425 4714016 4705379 4725103 4771660 4837032 4904554
-4822 4904554 4949691 4946898 4877177 4730494 4507135 4222682 3911990 3626729 3426739 3367580 3488888 3809034
-4810 3809034 4324486 5006690 5796902 6609617 7350909 7944635 8352755 8576770 8640316 8571353 8401668
-4799 8401668 8177306 7957621 7796764 7726336 7755612 7882410 8096867 8374764 8673805 8942709 9137534
-4788 9137534 9233957 9231318 9150877 9030876 8916688 8842705 8811992 8790862 8724108 8553680 8228388 7716096
-4776 7716096 7026445 6224994 5418020 4716038 4202173 3919318 3870982 4025487 4320413 4672063 4992404
-4765 4992404 5208516 5277451 5190739 4965696 4627468 4192672 3665117 3045872 2348320 1606134 870338
-4754H70338o70256n47998l80250j85320J0690J70696K49381K11755N8969j64305l90605n60299
-4742a327204o40855o27977n35889l85278j93860K5835K60557M91412O96711Q58415R65531
-4731d12602J015725J015476R75135R02430Q03756O90501N76596M67486L59039K53072J67256
-4720F813870J19127J00508P6266J1690j01975k45075l82764m79481n12362m82194m13218
-4709D504392l37996k80153k48120k38932k42471k41086k09688j24840J9407K01806L81378
-4698C183697N17189N81752N60258M47878K55022J3451k27585m15807n14175n18398m65476
-4687C417806m19351m35475n32659o93064q78463j043327j144156j151345j059192q87409
-4677d826635o71818m49173k45188p1689O8661J73241K31775K28662J55461K0675j50799l24966
$$ plain form
-4754 870338 200082 -347916 -728166 -913486 -902796 -732100 -482719 -270964 -211995 -376300 -766905 -1327204
-4742 -1327204 -1968059 -2596036 -3131925 -3517203 -3711063 -3685228 -3424671 -2933259 -2236548 -1378133 -412602
-4731 -412602 603123 1618599 2593734 3496164 4299920 4990421 5567017 6034503 6393542 6646614 6813870
-4720 6813870 6932997 7033505 7109771 7121461 7019486 6774411 6391647 5912166 5399804 4917610 4504392
-4709 4504392 4166396 3886243 3638123 3399191 3156720 2915634 2705946 2581106 2600513 2802319 3183697
-4698 3183697 3700886 4282638 4842896 5290774 5545796 5559247 5331662 4915855 4401680 3883282 3417806
-4687 3417806 2998455 2562980 2030321 1337257 458794 -584533 -1728689 -2880034 -3939226 -4826635
-4677 -4826635 -5498453 -5947626 -6192814 -6264503 -6195842 -6022601 -5790826 -5562164 -5406703 -5386028 -5536827 -5861793
-4665e861793m67015n47112n43170m45102k61413k0127K40231M82411O78151Q13758Q92282
-4654e038899R27061R28368Q94756Q17408O94391N41294L86989K58046J64929R8183L5095
-4643G07621m4349j42412k44493l31691l88883m06160l82828l32951k81618k52956k63235
-4632b363955l22014m30426n71523p02304p62597p05273n27466k74632j4907J92595L13940
-4621f168562L38310K71510J34022m1657k19409l67499m58681m68310l81513k07066J8828
-4610g550027K47236M36748N63130O19420O17176N87430N68667N82968O20880O48388O27940
-4599a430044N41743M06057K64515J61542J17235J22657J54706J93196K22540K23070J72883
-4588A150100O4604q0263k13332k80021k51505j47873k9600L9017K4606o6861k06533l64157
$$ plain form
-4665 -5861793 -6328808 -6875920 -7419090 -7864192 -8125605 -8145732 -7905501 -7423090 -6744939 -5931181 -5038899
-4654 -5038899 -4111838 -3183470 -2288714 -1471306 -776915 -235621 151368 409414 574343 672526 707621
-4643 707621 663272 520860 276367 -55324 -444207 -850367 -1233195 -1566146 -1847764 -2100720 -2363955
-4632 -2363955 -2685969 -3116395 -3687918 -4390222 -5152819 -5858092 -6385558 -6660190 -6675097 -6482502 -6168562
-4621 -6168562 -5830252 -5558742 -5424720 -5466377 -5685786 -6053285 -6511966 -6980276 -7361789 -7568855 -7550027
-4610 -7550027 -7302791 -6866043 -6302913 -5683493 -5066317 -4478887 -3910220 -3327252 -2706372 -2057984 -1430044
-4599 -1430044 -888301 -482244 -217729 -56187 61048 183705 338411 531607 754147 977217 1150100
-4588 1150100 1214704 1134441 921109 641088 389583 241710 212110 251127 275733 208872 2339 -361818
-4576c61818n16665o43099p21303p38131p04615o56214o30874o39908o55929o30446n29930
-4565g428932l61617j66219J4050J59474K71002L56032M18741M57747M67887M44533L88279
-4554d979023L05846K06790J00369k534q2482j09997n8554P8279K83121N24838P67533R73647
-4542a992167J109556J155684J112030R95071Q29810O38918M33162K13428j4578k28480l93953
-4531C858481m82190m85855m20274l09213j72179k7527R7494J68844J62362Q0197m7247j76107
-4519B246786k70093l13614l14336k97010k87636k96242l14272l27725l31459l30964l31275
-4508a167840l28193l14189k91953k79393l00123l66061m65448n67611o40220o62871o28094
-4497f011996n35801l89029j92833M3656L02527N56519P78093R50155J064252J109497J073387
$$ plain form
-4576 -361818 -878483 -1521582 -2242885 -2981016 -3685631 -4341845 -4972719 -5612627 -6268556 -6899002 -7428932
-4565 -7428932 -7790549 -7956768 -7942718 -7783244 -7512242 -7156210 -6737469 -6279722 -5811835 -5367302 -4979023
-4554 -4979023 -4673177 -4466387 -4366018 -4368552 -4451034 -4561031 -4619585 -4541306 -4258185 -3733347 -2965814 -1992167
-4542 -1992167 -882611 273073 1385103 2380174 3209984 3848902 4282064 4495492 4480914 4252434 3858481
-4531 3858481 3376291 2890436 2470162 2160949 1988770 1961243 2058737 2227581 2389943 2470140 2422893 2246786
-4519 2246786 1976693 1663079 1348743 1051733 764097 467855 153583 -174142 -505601 -836565 -1167840
-4508 -1167840 -1496033 -1810222 -2102175 -2381568 -2681691 -3047752 -3513200 -4080811 -4721031 -5383902 -6011996
-4497 -6011996 -6547797 -6936826 -7129659 -7086003 -6783476 -6226957 -5448864 -4498709 -3434457 -2324960 -1251573
-4486a251573R59489P98883O36773N05561M12412L49531L07319K73729K29889J56615M7059
-4475C425687q7153k20123l22445l72753l63846l03879k16237j36893j04637j43257k44781
-4464I09683l68427m61150m87325m44485l55845k49309j40030k8898Q6082K01283L08571L97288
-4452f32562M55435M73547M49674L91902L18681K53962K14515J98642J87883J61613J11837
-4441B585129M5091k6503r1989j39499j53321j20061m1931N7166J41584J86201J91906J79284
-4429B813057J64610J44877J07986N0859j7245q1330j25604j38612j19105p5686j9419M2407
-4417B746795J07271J73952K37507K87300L11942L10077K96441K92291L05711L21549L13076
-4406E703912K65825J91816J21805Q0786O6619N1738N302q6294k14458l53778m68320n18768
$$ plain form
-4486 -1251573 -292084 506799 1143572 1649133 2061545 2411076 2718395 2992124 3222013 3378628 3425687
-4475 3425687 3338534 3118411 2795966 2423213 2059367 1755488 1539251 1402358 1297721 1154464 909683
-4464 909683 541256 80106 -407219 -851704 -1207549 -1456858 -1596888 -1625786 -1539704 -1338421 -1029850 -632562
-4452 -632562 -177127 296420 746094 1137996 1456677 1710639 1925154 2123796 2311679 2473292 2585129
-4441 2585129 2630220 2603717 2511728 2372229 2218908 2098847 2056916 2114082 2255666 2441867 2633773 2813057
-4429 2813057 2977667 3122544 3230530 3281389 3264144 3182814 3057210 2918598 2799493 2723807 2704388 2746795
-4417 2746795 2854066 3028018 3265525 3552825 3864767 4174844 4471285 4763576 5069287 5390836 5703912
-4406 5703912 5969737 6161553 6283358 6364144 6430763 6482501 6487803 6401509 6187051 5833273 5364953 4846185
-4394D846185m76566l46342j78756n2886l3309j34959l21028n26481o86498p58958p38611
-4383E91791o57213n65682n04811m84865m90005n01031n12428n27179n38006n21298m57331
-4372e168058l56206k56925j96314j80979j89491j93625j73686j22687m6161M1329J25252
-4361f717551K02977K88745M02835N52676P23717Q86755J012483J082086J089950J040090
-4351E64763R39985P97890O25548M40551K65133J23345L6028J1583L8040Q6786J30321J59796
-4339D219769J84921K17804K58145K92579L04536K82632K22130J25137K508j27469k43596
-4328E739096l24289l52564l26383k64438j96839j44061j01808n0292J8852Q8309J26916J11660
-4316D324159M2043n7927j52444k13232k25876j82786q1949O3836K22355L52410M22385M20842
$$ plain form
-4394 4846185 4369619 4023277 3844521 3791635 3758326 3623367 3302339 2775858 2089360 1330402 591791
-4383 591791 -65422 -631104 -1135915 -1620780 -2110785 -2611816 -3124244 -3651423 -4189429 -4710727 -5168058
-4372 -5168058 -5524264 -5781189 -5977503 -6158482 -6347973 -6541598 -6715284 -6837971 -6884132 -6842803 -6717551
-4361 -6717551 -6514574 -6225829 -5822994 -5270318 -4546601 -3659846 -2647363 -1565277 -475327 564763
-4351 564763 1504748 2302638 2928186 3368737 3633870 3757215 3793243 3804826 3842866 3929652 4059973 4219769
-4339 4219769 4404690 4622494 4880639 5173218 5477754 5760386 5982516 6107653 6110161 5982692 5739096
-4328 5739096 5414807 5062243 4735860 4471422 4274583 4130522 4028714 3978422 3997274 4085583 4212499 4324159
-4316 4324159 4366202 4308275 4155831 3942599 3716723 3533937 3451988 3515824 3738179 4090589 4512974 4933816
-4304D933816L53901K38310R6012n2618j97011l38372m80033o14195p19412p69844p47178
-4293A703376o49198m93983l14887j44995m470R6475J47450J39099P6985r479p6644q8265
-4281C81464l4344O1660J50011J76107J08274m6293k46884m38987n75002o26127n82826m53159
-4269b126106k65278o3343J10795K34563L01118L05455K47698J53497P6569O6023J30928K42470
-4257e85611L66441M84977N89680O67849P04721O95756O49848N79299M87963L68046K08787
-4246E217756J3864j84991l34970l91930l50172k47062j42445r0613j18239k14023l34862
-4235B822313m27311m54074m10334l19496k15215j27146p5748p0439j08751j77285k54578
-4224A81936l15228l34519k93305j84041j6684J79317L63685N04247N91826O38329O61522
$$ plain form
-4304 4933816 5287717 5526027 5622039 5569421 5372410 5034038 4554005 3939810 3220398 2450554 1703376
-4293 1703376 1054178 560195 245308 100313 95843 192318 339768 478867 555852 546373 469729 381464
-4281 381464 347120 408780 558791 734898 843172 796879 549995 111008 -463994 -1090121 -1672947 -2126106
-4269 -2126106 -2391384 -2454727 -2343932 -2109369 -1808251 -1502796 -1255098 -1101601 -1025032 -959009 -828081 -585611
-4257 -585611 -219170 265807 855487 1523336 2228057 2923813 3573661 4152960 4640923 5008969 5217756
-4246 5217756 5231620 5046629 4711659 4319729 3969557 3722495 3580050 3489437 3371198 3157175 2822313
-4235 2822313 2395002 1940928 1530594 1211098 995883 868737 792989 722550 613799 436514 181936
-4224 181936 -133292 -467811 -761116 -945157 -961841 -782524 -418839 85408 677234 1315563 1977085
-4213A977085O69381O54428O01029N00246L60651K06260O4630m5236j18668j63246j90372
-4202D516188k06344k09984j98961j77765j56243j38189j12940o2141K0530J15075J82492
-4191C571718J89753J31417K8356r6874k41813m16883o18825q19841r82235j078406j099164
-4180a432797j048176r31598p54075n25642k69953k0050J95960L63281M76448N34347N42690
-4169b869565N16776M74558M24848L63790K84715J93709J17762R4987J50199K75039M31597
-4158D58415N75375O76086P23957P25775O94174O35503N50979M53957L79579L63952M07110
-4147F644862M61077M59633L58929J53664j30160m45568p34522r44237j044400j033694r35158
-4136B810426p89034o43444n38960m92029m91460n12249n31255n32535n08160m59552l92721
$$ plain form
-4213 1977085 2646466 3300894 3901923 4402169 4762820 4969080 5033710 4988474 4869806 4706560 4516188
-4202 4516188 4309844 4099860 3900899 3723134 3566891 3428702 3315762 3253621 3274151 3389226 3571718
-4191 3571718 3761471 3892888 3921244 3824370 3582557 3165674 2546849 1727008 744773 -333633 -1432797
-4180 -1432797 -2480973 -3412571 -4166646 -4692288 -4962241 -4982291 -4786331 -4423050 -3946602 -3412255 -2869565
-4169 -2869565 -2352789 -1878231 -1453383 -1089593 -804878 -611169 -493407 -398420 -248221 26818 458415
-4158 458415 1033790 1709876 2433833 3159608 3853782 4489285 5040264 5494221 5873800 6237752 6644862
-4147 6644862 7105939 7565572 7924501 8078165 7948005 7502437 6767915 5823678 4779278 3745584 2810426
-4136 2810426 2021392 1377948 838988 346959 -144501 -656750 -1188005 -1720540 -2228700 -2688252 -3080973
-4125c080973l09953k11892j09043k5288J4945L582m7162j14964j78044k18651k24035j89100
-4113d690578j19082k5454Q4405K10420L50422M91707O14348O99669P34296P10260O25866
-4102c13721M88191L14298J28441m5002j89470k99454l75819m16951m13777l54962k39764
-4091a717990q6988O9171J92281K54612K42124J57422K1352j32561k69675l61171l84453l26411
-4079b342287j91548o752J83452L31219M05769M09775L76499L45498L39799L65366M20814
-4068F37604M97555N77696O43131O86696P10503P15366O95117O39367N40269L99699K32798
-4057F975801O1264r9138k43060l66881m59025n02453m88173m25797l41078k62102k04495
-4046C644863j68632j50551j52945j83106k39230k98780l23627k85363j91409q0539J2496
$$ plain form
-4125 -3080973 -3390926 -3602818 -3711861 -3737149 -3722204 -3718622 -3765784 -3880748 -4058792 -4277443 -4501478 -4690578
-4113 -4690578 -4809660 -4835114 -4750709 -4540289 -4189867 -3698160 -3083812 -2384143 -1649847 -939587 -313721
-4102 -313721 174470 488768 617209 572207 382737 83283 -292536 -709487 -1123264 -1478226 -1717990
-4091 -1717990 -1804978 -1735807 -1543526 -1288914 -1046790 -889368 -868016 -1000577 -1270252 -1631423 -2015876 -2342287
-4079 -2342287 -2533835 -2540587 -2357135 -2025916 -1620147 -1210372 -833873 -488375 -148576 216790 637604
-4068 637604 1135159 1712855 2355986 3042682 3753185 4468551 5163668 5803035 6343304 6743003 6975801
-4057 6975801 7037065 6937927 6694867 6327986 5868961 5366508 4878335 4452538 4111460 3849358 3644863
-4046 3644863 3476231 3325680 3172735 2989629 2750399 2451619 2127992 1842629 1651220 1570681 1583177
-4035A583177Q4160J53657K36581L31472M22762M87269N01165M49343L34484J80062K2042
-4024D786174j09440k08427k97309m11100n71911p72349r77624j139789j215800j186887j071492
-4013c175954r16830p69422o49956n54412m71847l94125l11601k09131p3279R6858K85623
-4002g144076M66452O15011P21178P90517Q33104Q47706Q17289P24653N73859L94038K22825
-3991a37444Q6386j2218r3934j92372l31456n06463o84195q20359q79370q46593p29784n51046
-3979e698848l38726j25444N3756J69362K07416J71406P5846n9057k07091l35964m12767m16122
-3967f916233l49799k43968j36347m9254J4383O0385R9148J49331K32781L54477M87422N84269
-3955e713405O09781N65609M86230M12209L64889L42407L38236L61023M30145N51983P04967
$$ plain form
-4035 1583177 1667337 1820994 2057575 2389047 2811809 3299078 3800243 4249586 4584070 4764132 4786174
-4024 4786174 4676734 4468307 4170998 3759898 3187987 2415638 1438014 298225 -917575 -2104462 -3175954
-4013 -3175954 -4092784 -4862206 -5512162 -6066574 -6538421 -6932546 -7244147 -7453278 -7526557 -7429699 -7144076
-4002 -7144076 -6677624 -6062613 -5341435 -4550918 -3717814 -2870108 -2052819 -1328166 -754307 -360269 -137444
-3991 -137444 -51058 -63276 -157210 -349582 -681038 -1187501 -1871696 -2692055 -3571425 -4418018 -5147802 -5698848
-3979 -5698848 -6037574 -6163018 -6109262 -5939900 -5732484 -5561078 -5485232 -5544289 -5751380 -6087344 -6500111 -6916233
-3967 -6916233 -7266032 -7510000 -7646347 -7695601 -7681218 -7620833 -7521685 -7372354 -7139573 -6785096 -6297674 -5713405
-3955 -5713405 -5103624 -4538015 -4051785 -3639576 -3274687 -2932280 -2594044 -2233021 -1802876 -1250893 -545926
-3944e45926Q46612R32795R34584Q45601O79832M64901K34256J7500j68507l22023m50320
-3933C469305n60739o56329p37994q06202q57386q77996q42455p22862n08601k20205R5808
-3922c225656L86217O11781P58724Q35871Q63658Q64913Q57487Q48668Q34510Q05733P56448
-3911E198354O89492O12246N27599M31836L22056K03478Q8313j1845r2262j54156j96659k10448
-3899G408004j82310j06001J2212J52653K81379L57738L57148K91484K04196J42018J27748
-3888I046269J54036J97378K36547K61667K71323K64748K39055J95729J47060J10138R3380
-3877A1217330R3626J05649J26129J45625J44803J05028K1299r6547k31520l66424m85545
-3866A0779453n73888o19377o20260n90160n53273n32672n38588n62441n82093n77627n44899
$$ plain form
-3944 -545926 300686 1233481 2168065 3013666 3693498 4158399 4392655 4410155 4241648 3919625 3469305
-3933 3469305 2908566 2252237 1514243 708041 -149345 -1027341 -1869796 -2592658 -3101259 -3321464 -3225656
-3922 -3225656 -2839439 -2227658 -1468934 -633063 230595 1095508 1952995 2801663 3636173 4441906 5198354
-3911 5198354 5887846 6500092 7027691 7459527 7781583 7985061 8073374 8061529 7969267 7815111 7618452 7408004
-3899 7408004 7225694 7119693 7131905 7284558 7565937 7923675 8280823 8572307 8776503 8918521 9046269
-3888 9046269 9200305 9397683 9634230 9895897 10167220 10431968 10671023 10866752 11013812 11123950 11217330
-3877 11217330 11310956 11416605 11542734 11688359 11833162 11938190 11959489 11862942 11631422 11264998 10779453
-3866 10779453 10205565 9586188 8965928 8375768 7822495 7289823 6751235 6188794 5606701 5029074 4484175
-3855D484175m95001m41940l91191l38555k78506k10628j36500n5646K7398R5249J26931J16063
-3843B501849P5806K8844n892k3665l6238o2419j13330j83770k54585l02193l09190k70446
-3831A044771j91393q2993L8489J50410K30369K67361K66088K40921K06175J70467J35632
-3820B476297R7470M8929j1639p1807j08568j07018p5265l8579j9060k1053l2685l8116k9295
-3807B069611j1777m022k7902r2298j82557k69175l29586l60871l68803l51435l03866k37593
-3795d70274j85836j86484k56212l74188m89891n54016n48592m93970m32255l97891l92510
-3784d782119l84349l37070k42902j26500j9175O3032J17322J42994J41458J25665J22045
-3773e179599J59046K51576L91765N49432O83256P60048P68453P17742O28720N27216M41457
$$ plain form
-3855 4484175 3989174 3547234 3156043 2817488 2538982 2328354 2191854 2136208 2163606 2258855 2385786 2501849
-3843 2501849 2577655 2606499 2600607 2576942 2540704 2478285 2364955 2181185 1926600 1624407 1315217 1044771
-3831 1044771 853378 770385 808874 959284 1189653 1457014 1723102 1964023 2170198 2340665 2476297
-3820 2476297 2573767 2622696 2611057 2539250 2430682 2323664 2248399 2209820 2190760 2169707 2137022 2098906 2069611
-3807 2069611 2057834 2053812 2025910 1933612 1751055 1481880 1152294 791423 422620 71185 -232681 -470274
-3795 -470274 -656110 -842594 -1098806 -1472994 -1962885 -2516901 -3065493 -3559463 -3991718 -4389609 -4782119
-3784 -4782119 -5166468 -5503538 -5746440 -5872940 -5892115 -5829083 -5711761 -5568767 -5427309 -5301644 -5179599
-3773 -5179599 -5020553 -4768977 -4377212 -3827780 -3144524 -2384476 -1616023 -898281 -269561 257655 699112
-3762F99112L95436L96174M26541M54251M50696M07229L40156K79961K48924K44161K41843
-3751D584484K17945J65491R4498J9258m9902j03229j28740j18067p3143q304N0329P1222
-3739D721842L3362n9315j81710l06654m18054n06666n60992n72145n48288n15754n00748
-3728E84878n10224n27621n23527m72244l62701j98465O747K29748M36934N89463O57058O34248
-3716E44294N46049M34746L36116K64796K18084J88795J73133J69637J71708J60437J07023
-3705C314818j0722j89423l97391n88258p14720p36601o33004m17816j41584J27777L33437
-3694e3487M49043M81763M62729M29608M07549L99153L91558L74867L54249L43947L50257
-3683D391236L59547L43909K82068J76590N0415p0418j67412k28065k44576k21333j82429
$$ plain form
-3762 699112 1094548 1490722 1917263 2371514 2822210 3229439 3569595 3849556 4098480 4342641 4584484
-3751 4584484 4802429 4967920 5062418 5081676 5031774 4928545 4799805 4681738 4608595 4600291 4650620 4721842
-3739 4721842 4755204 4695889 4514179 4207525 3789471 3282805 2721813 2149668 1601380 1085626 584878
-3728 584878 74654 -452967 -976494 -1448738 -1811439 -2009904 -2003157 -1773409 -1336475 -747012 -89954 544294
-3716 544294 1090343 1525089 1861205 2126001 2344085 2532880 2706013 2875650 3047358 3207795 3314818
-3705 3314818 3304096 3114673 2717282 2129024 1414304 677703 44699 -373117 -514701 -386924 -53487
-3694 -53487 395556 877319 1340048 1769656 2177205 2576358 2967916 3342783 3697032 4040979 4391236
-3683 4391236 4750783 5094692 5376760 5553350 5603765 5533347 5365935 5137870 4893294 4671961 4489532
-3672D489532j65455k00548k90216m04301m92785n10122m41237l12618j79079r5857r4789
-3661A302525j73534k97229m08754m46249l67492j72035R8153L82275O28004Q03263Q93082
-3650B242009Q93938Q13913O75966N15026L67563K58678J92172J48914R6118J699j53163l67465
-3638E685368o22255q85851j113084j244115j221304j021605o75880k57133J50688M80868
-3628g24303O96514P89365P73722O79257N40054L82223K19431O0034q2817j90071k46451k51530
-3616B645428k23436j91320j79823j95681k25143k43227k30245j85247j26950q2482p0933
-3605F90941r1465j23668j36726j00694n87J50183L11467M38334N03599N02367M45946L59038
-3593B948735K74897K19387J94978J81975J57305J13759O7132M9821R4466K14126L90567N78271
$$ plain form
-3672 4489532 4324077 4123529 3833313 3429012 2936227 2426105 1984868 1672250 1493171 1397314 1302525
-3661 1302525 1128991 831762 423008 -23241 -390733 -562768 -464615 -82340 545664 1348927 2242009
-3650 2242009 3135947 3949860 4625826 5140852 5508415 5767093 5959265 6108179 6204297 6205996 6052833 5685368
-3638 5685368 5063113 4177262 3064178 1820063 598759 -422846 -1098726 -1355859 -1205171 -724303
-3628 -724303 -27789 761576 1535298 2214555 2754609 3136832 3356263 3416297 3333480 3143409 2896958 2645428
-3616 2645428 2421992 2230672 2050849 1855168 1630025 1386798 1156553 971306 844356 761874 690941
-3605 690941 599476 475808 339082 238388 237801 387984 699451 1137785 1641384 2143751 2589697 2948735
-3593 2948735 3223632 3443019 3637997 3819972 3977277 4091036 4158168 4207989 4302455 4516581 4907148 5485419
-3581E485419P23967P90219P67043O67697N18516L49923J89285N5749m1890j03031j28212
-3570I274685j13254n5244L1463J07837J25526N5142r8878l08425n41011p68630r66172j109055
-3558E633984j176375j158575j062727r11212p34762n64569m27137l40114l05526l05016l07875
-3547a659904k89422k43658j80784j15547n7604r716L0638P1301J24513K00790L00890M12365
-3535a416138N12432N76702N89085N45978M55886L38626K19851J19722M5622m907l6877n3673
-3523A892309n6892n0055m2043m3984o4316j07611j71950k43832k99520l18518l00584k69303
-3511g6299k53857k64388k83783k80424k27296j12144O0656K69940M81186O59623P86066Q61410
-3499A620690Q96857R01474Q77342Q22749P37878O28768N07965L89250K78344J70574N9012
$$ plain form
-3581 5485419 6209386 6999605 7766648 8434345 8952861 9302784 9492069 9547818 9505928 9402897 9274685
-3570 9274685 9161431 9106187 9137650 9245487 9371013 9426155 9327277 9018852 8477841 7709211 6743039 5633984
-3558 5633984 4457609 3299034 2236307 1325095 590333 25764 -401373 -741487 -1047013 -1352029 -1659904
-3547 -1659904 -1949326 -2192984 -2373768 -2489315 -2546919 -2556635 -2525997 -2454696 -2330183 -2129393 -1828503 -1416138
-3535 -1416138 -903706 -327004 262081 808059 1263945 1602571 1822422 1942144 1987766 1982859 1945982 1892309
-3523 1892309 1835417 1785362 1743319 1699335 1635019 1527408 1355458 1111626 812106 493588 193004 -76299
-3511 -76299 -330156 -594544 -878327 -1158751 -1386047 -1498191 -1437535 -1167595 -686409 -26786 759280 1620690
-3499 1620690 2517547 3419021 4296363 5119112 5856990 6485758 6993723 7382973 7661317 7831891 7890903
-3488G890903n4503j54474k18384k33083k07582j65940j25208q3494l1952K3911N8266M3471
-3476F741931k1517j00750j43563j22446n2914J9834N3241L2750k7256j01597j67035k00636
-3464E910042j81658j06207J137R7654J49187J50263J22694R7357R4177J15912J57352K13132
-3452F821042K72669L13658L12110K62167J80658Q8312r542j17940k32315l33022m00108m27543
-3440F730146m23929m04276l78580l43346k84720j94300q3604K0272R5300J39850J68175J91318
-3428E232306K03010J81624J03587m5455k65478n37017q14876j032800j128413j078424r13097
-3417i5033o94583m82749l14766k02764j41344j19625j28859j63787k22878l08254m20554
-3406c295196n48301o61235p18817o91564n78677m07416k20697o2943L4505O6644N6844M3138
$$ plain form
-3488 7890903 7836400 7681926 7463542 7230459 7022877 6856937 6731729 6648235 6616283 6640194 6698460 6741931
-3476 6741931 6720414 6619664 6476101 6353655 6300741 6320575 6373816 6406566 6379310 6277713 6110678 5910042
-3464 5910042 5728384 5622177 5623314 5720968 5870155 6020418 6143112 6240469 6334646 6450558 6607910 6821042
-3452 6821042 7093711 7407369 7719479 7981646 8162304 8250616 8241074 8123134 7890819 7557797 7157689 6730146
-3440 6730146 6306217 5901941 5523361 5180015 4895295 4700995 4617391 4637663 4732963 4872813 5040988 5232306
-3428 5232306 5435316 5616940 5720527 5675072 5409594 4872577 4057701 3024901 1896488 818064 -95033
-3417 -95033 -789616 -1272365 -1587131 -1789895 -1931239 -2050864 -2179723 -2343510 -2566388 -2874642 -3295196
-3406 -3295196 -3843497 -4504732 -5223549 -5915113 -6493790 -6901206 -7121903 -7184846 -7150341 -7083697 -7026853 -6983715
-3394f983715N8365J17533K16967L38364M54524N41129N89605O09939O21463O42151O81275
-3383b112400P35633P89808Q23426Q23031P88756P28544O47112N42200M08826K43444M5925
-3372D464305j74175l91194n66746o64086o66652n90080m75434l63887k73047j95764j17122
-3361a3882l1174N4484J26651J77680K08239K21526K19657K05505J86204J71771J66211J60778
-3349A853650J41446J03703N7401J9307L964J9618O5947J32908K05511K73779L36499L93431
-3337C607164M37790M61443M65337M57315M38167L94133L05415J64652q985j74402k89732
-3326F258297l32206l03665k23340j17106j1756O4433Q2745K4504j03857k67582m19075n21168
-3314D130224n64597n72691n88424o48654p64594r21506j090670j237985j325833j318648
$$ plain form
-3394 -6983715 -6925350 -6807817 -6590850 -6252486 -5797962 -5256833 -4667228 -4057289 -3435826 -2793675 -2112400
-3383 -2112400 -1376767 -586959 236467 1059498 1848254 2576798 3223910 3766110 4174936 4418380 4464305
-3372 4464305 4290130 3898936 3332190 2668104 2001452 1411372 935938 572051 299004 103240 -13882
-3361 -13882 -45056 9428 136079 313759 521998 743524 963181 1168686 1354890 1526661 1692872 1853650
-3349 1853650 1995096 2098799 2156200 2175507 2179471 2199089 2265036 2397944 2603455 2877234 3213733 3607164
-3337 3607164 4044954 4506397 4971734 5429049 5867216 6261349 6566764 6731416 6722431 6548029 6258297
-3326 6258297 5926091 5622426 5399086 5281980 5270224 5334657 5417402 5441906 5338049 5070467 4651392 4130224
-3314 4130224 3565627 2992936 2404512 1755858 991264 69758 -1020912 -2258897 -3584730 -4903378
-3304d903378j199435r85921p28779m89097l11160k07209j57396j20996n5618O2271K24875
-3293h871843L94307N17577N51328M85992L53849K12420J13034P8524J05071J77738K78523
-3282e603480L82638M58735M81308M43541L55284K27561O1938j40735l62351n65808p13517
-3271d974886p87083p91103p40331o44737n07620l34607j39471N9718K46703M08947N38298
-3260g666172O33016O98236P44867P86761Q31741Q69542Q71619Q10826O83933N14435L39658
-3249A18462J99706J27686J33950J95555K65886K98589K67445J73175L8374j04342k24558
-3238A489928l01565l26846l04372k47481j69616p5444L8069J69405K99559L94211M24366
-3227A390214L90096L25192K74909K63244K76438K76399K31508J38561K1093q7752j63440
$$ plain form
-3304 -4903378 -6102813 -7088734 -7817513 -8306610 -8617770 -8824979 -8982375 -9103371 -9158989 -9096718 -8871843
-3293 -8871843 -8477536 -7959959 -7408631 -6922639 -6568790 -6356370 -6243336 -6164812 -6059741 -5882003 -5603480
-3282 -5603480 -5220842 -4762107 -4280799 -3837258 -3481974 -3254413 -3192475 -3333210 -3695561 -4261369 -4974886
-3271 -4974886 -5761969 -6553072 -7293403 -7938140 -8445760 -8780367 -8919838 -8860120 -8613417 -8204470 -7666172
-3260 -7666172 -7033156 -6334920 -5590053 -4803292 -3971551 -3102009 -2230390 -1419564 -735631 -221196 118462
-3249 118462 318168 445854 579804 775359 1041245 1339834 1607279 1780454 1818828 1714486 1489928
-3238 1489928 1188363 861517 557145 309664 140048 64604 102673 272078 571637 965848 1390214
-3227 1390214 1780310 2105502 2380411 2643655 2920093 3196492 3428000 3566561 3587654 3499902 3336462
-3216C336462j97477j91208j46302o2766N6611K02262L58550N07801O32178P14637P44973
-3205E955721P26563O73517N98118M98514L57411J55538j08210m07271o96983r34233j091480
-3194E727205j160537j151689j091538j014970r48364q92704q22294p03204n18319k79651
-3184b856065k0435K23403M28100N86611P04472P92068Q56756Q97691R05562Q66633P69067
-3173D153863O12289M17882K31107J02851N9178Q3986J31749J56280J29986M7586p7649k23326
-3161E825782l71044n13370o47004p58445q20066q03886o98137n09025k52625M4031L32523
-3150H28734N47862O38994N99837M72809L22236J99706J26027R9193J13506J65836K45867
-3139D360607L29246L83089L78500L03299J67733l137j83981l55887n03527o13373o77219
$$ plain form
-3216 3336462 3138985 2947777 2801475 2738709 2795320 2997582 3356132 3863933 4496111 5210748 5955721
-3205 5955721 6682284 7355801 7953919 8452433 8809844 8965382 8857172 8449901 7752918 6818685 5727205
-3194 5727205 4566668 3414979 2323441 1308471 360107 -532597 -1354891 -2058095 -2576414 -2856065
-3184 -2856065 -2876500 -2653097 -2224997 -1638386 -933914 -141846 714910 1612601 2518163 3384796 4153863
-3173 4153863 4766152 5184034 5415141 5517992 5577170 5661156 5792905 5949185 6079171 6126757 6049108 5825782
-3161 5825782 5454738 4941368 4294364 3535919 2715853 1911967 1213830 704805 452180 496211 828734
-3150 828734 1376596 2015590 2615427 3088236 3410472 3610178 3736205 3835398 3948904 4114740 4360607
-3139 4360607 4689853 5072942 5451442 5754741 5922474 5919337 5735356 5379469 4875942 4262569 3585350
-3128C585350o94998o72386o15996n30325m18346k85407j44314j7648O5402P7006J380j55003
-3116A94715l57784n49700o69948o79582n76930l96049j90481r307J20914J97972K34338K45181
-3104b436661K38103K08749J46140M4437q7082k21717l23734l65430l39931k58823j41522
-3093c537471r724J16252K25357L20179M10616N01431N85309O46175O66592O33698N45155
-3082A103569M13748K66565J38100N9069M5213R1482J74134K58649L11615L14209K69570J97242
-3070C643165J21203O3574M2828O6933J26317J97699K56270K85388K79016K39472J73206Q7769
-3058E582840p657j00310j74743k19360k37004k49537k85828l60938m65792n73820o53711
-3047B254140o79418o36780n26213l59973j59258M5786K21340L42968M04413M12011L74536
$$ plain form
-3128 3585350 2890352 2217966 1601970 1071645 653299 367892 223578 205930 271332 348338 349718 194715
-3116 194715 -163069 -712769 -1382717 -2062299 -2639229 -3035278 -3225759 -3235066 -3114152 -2916180 -2681842 -2436661
-3104 -2436661 -2198558 -1989809 -1843669 -1799232 -1886314 -2108031 -2431765 -2797195 -3137126 -3395949 -3537471
-3093 -3537471 -3547195 -3430943 -3205586 -2885407 -2474791 -1973360 -1388051 -741876 -75284 558414 1103569
-3082 1103569 1517317 1783882 1921982 1981051 2026264 2117746 2291880 2550529 2862144 3176353 3445923 3643165
-3070 3643165 3764368 3827942 3870770 3937703 4064020 4261719 4517989 4803377 5082393 5321865 5495071 5582840
-3058 5582840 5575183 5474873 5300130 5080770 4843766 4594229 4308401 3947463 3481671 2907851 2254140
-3047 2254140 1574722 937942 411729 51756 -107502 -61716 159624 502592 907005 1319016 1693552
-3036A693552L03213K18449J48168J12936J12613J29666J45158J50898J48506J40214J21714
-3025C425087Q1734Q045j02651k38982l78120m92857n57395n54569m86445l78313k66593j78650
-3013a19709j22901r5701r6139j31903k07452l08289m01876m56958m65096m47810m42503m72460
-3001c768797n20327n31431m50297k59396J0675L00186N47362P07090P58116P01677N57800
-2990a947342L63420J68167K1561m3152j6944R0360K61770M77049P05925R04878J030439J063683
-2978C079814J023814R52205Q78223Q00647O98307N51691L56729J27457j10253l29734n10089
-2967G518811o34533o87418o56893n41584l57279j41098N4708J84543K34748K30115K15781
-2956E419901K27347K68462L11266L20709K79566J92633P5617n6250j94303l37276m87660
$$ plain form
-3036 1693552 1996765 2215214 2363382 2476318 2588931 2718597 2863755 3014653 3163159 3303373 3425087
-3025 3425087 3506821 3514866 3412215 3173233 2795113 2302256 1744861 1190292 703847 325534 58941 -119709
-3013 -119709 -242610 -338311 -434450 -566353 -773805 -1082094 -1483970 -1940928 -2406024 -2853834 -3296337 -3768797
-3001 -3768797 -4289124 -4820555 -5270852 -5530248 -5519573 -5219387 -4672025 -3964935 -3206819 -2505142 -1947342
-2990 -1947342 -1583922 -1415755 -1394194 -1437346 -1454290 -1363930 -1102160 -625111 80814 985692 2016131 3079814
-2978 3079814 4103628 5055833 5934056 6734703 7433010 7984701 8341430 8468887 8358634 8028900 7518811
-2967 7518811 6884278 6196860 5539967 4998383 4641104 4500006 4554714 4739257 4974005 5204120 5419901
-2956 5419901 5647248 5915710 6226976 6547685 6827251 7019884 7095501 7039251 6844948 6507672 6020012
-2945F020012o45485q01948r35517j016149j019970r43532q04623o30991m47568k69735j04450
-2934a599956M3623J67965K61398L20727L50034L57603L46436L07621K28483J10966k1542
-2923H73358j37928k19860k73076l22746l95953n02226o25085p29676p80233p56200o59890
-2912d529515n12283l40524j68822j9653Q3528J22826R6909K2539p5164j72465k50241k93591
-2900f036456k93077k46036j56117l4899R3525J93554K30317J89764R1939j2882o2423o613
-2888f049404J69880M37898P37299J007221J210603J337871J395494J392879J335415J227118
-2878D202274J077121Q99756P05195M92401K54808m203k60668m76468o21435o92746p10189
-2867D865846o92091o40119n48795m23741k87082j66498p9964k8800l397L583j0349n1523
$$ plain form
-2945 6020012 5374527 4572579 3637062 2620913 1600943 657411 -147212 -778203 -1225771 -1495506 -1599956
-2934 -1599956 -1556333 -1388368 -1126970 -806243 -456209 -98606 247830 555451 783934 894900 873358
-2923 873358 735430 515570 242494 -80252 -476205 -978431 -1603516 -2333192 -3113425 -3869625 -4529515
-2912 -4529515 -5041798 -5382322 -5551144 -5570797 -5487269 -5364443 -5267534 -5244995 -5320159 -5492624 -5742865 -6036456
-2900 -6036456 -6329533 -6575569 -6731686 -6766585 -6673060 -6479506 -6249189 -6059425 -5967486 -5980368 -6042791 -6049404
-2888 -6049404 -5879524 -5441626 -4704327 -3697106 -2486503 -1148632 246862 1639741 2975156 4202274
-2878 4202274 5279395 6179151 6884346 7376747 7631555 7627352 7366684 6890216 6268781 5576035 4865846
-2867 4865846 4173755 3533636 2984841 2561100 2274018 2107520 2027556 1998756 1995359 1998942 1988593 1937070
-2855A937070j17391j88467k31240k10829j10531N0694K21088L46890M07046M20878M27108
-2844B952316M56250N15426N88224O41241O32102N23735L06916J6088k79675n09183o30043
-2833E213397o36891n49221l95734k06659j3789J48306K46977K61719J94155P1566o0839j57959
-2821D115028j95228j78282j34428r3063o9794o2167n8327n3464n6901q0790j23794j66414
-2809B842376j80047j42608n3641O1842J68857K45658K93368L27483L63389M06783M50657
-2798D784117M78182M71488M20793L28369K07148P5063n3305j69055k59450k97703k50358
-2787E735289j03950J11169L25666M65790M90717M04870K43867N6059j10884k26057k89396
-2776G103140l26984l65958m09458m33463m08238l23995j97221n6861O9353J56747J85752
$$ plain form
-2855 1937070 1819679 1631212 1399972 1189143 1078612 1129306 1350394 1697284 2104330 2525208 2952316
-2844 2952316 3408566 3923992 4512216 5153457 5785559 6309294 6616210 6632298 6352623 5843440 5213397
-2833 5213397 4576506 4027285 3631551 3424892 3411103 3559409 3806386 4068105 4262260 4333826 4272987 4115028
-2821 4115028 3919800 3741518 3607090 3514027 3444233 3382066 3323739 3270275 3213374 3132584 3008790 2842376
-2809 2842376 2662329 2519721 2466080 2527922 2696779 2942437 3235805 3563288 3926677 4333460 4784117
-2798 4784117 5262299 5733787 6154580 6482949 6690097 6765160 6711855 6542800 6283350 5985647 5735289
-2787 5735289 5631339 5742508 6068174 6533964 7024681 7429551 7673418 7729477 7618593 7392536 7103140
-2776 7103140 6776156 6410198 6000740 5567277 5159039 4835044 4637823 4580962 4650315 4807062 4992814
-2765D992814J52486P5046j6259r4755j42852j46058q9775L1638K02432L83663N27241N97518
-2753F473139N85652N07504L89825K56566J22381p016j30211k45005l45249m20429m60404
-2742F726753m63631m41906m15223l97311l82110l46067k67937j47906r459J14728K00353
-2731D170284K41202K47414K39873K44204K76916L29048L70279L77710L58223L38411L36355
-2720G529919L48959L64537L80694M03950M31185M38778L97552K96967J52237n028j39059
-2709A0600691k23299k55022k58478k69363l12134l84715m58787m97052m75718l94550k72663
-2698F798910j41034l4592J9903J6877k5589p8369j17148j26474r5289j7693R8891K30355
-2686F528748L43856M08752M02623L14892J53816m7836k39383l73440m29210m20240l82145
$$ plain form
-2765 4992814 5145300 5220346 5204087 5109332 4966480 4820422 4730647 4762285 4964717 5348380 5875621 6473139
-2753 6473139 7058791 7566295 7956120 8212686 8335067 8328051 8197840 7952835 7607586 7187157 6726753
-2742 6726753 6263122 5821216 5405993 5008682 4626572 4280505 4012568 3864662 3855203 3969931 4170284
-2731 4170284 4411486 4658900 4898773 5142977 5419893 5748941 6119220 6496930 6855153 7193564 7529919
-2720 7529919 7878878 8243415 8624109 9028059 9459244 9898022 10295574 10592541 10744778 10739750 10600691
-2709 10600691 10377392 10122370 9863892 9594529 9282395 8897680 8438893 7941841 7466123 7071573 6798910
-2698 6798910 6657876 6623284 6643187 6660064 6634475 6556106 6438958 6312484 6217195 6199502 6298393 6528748
-2686 6528748 6872604 7281356 7683979 7998871 8152687 8104851 7865468 7492028 7062818 6642578 6260433
-2675F260433l53165l62048m22746n29234o54589p62992q29593q50606q32987p76169o68537
-2664g82233n00889k78730k3971K27180M29366N39312N28410L90804J50179j37900l99566
-2653A41962n69216o10414n22284l35912j05102J08493K57764L29646L40882L10934K43388
-2642d09859J36939J1212q6414j07035l8342P9161J73014J80635Q3236q8733k77815m30953
-2630g74954n21003n49718n35150m94756m37407l66684k85247j94658r8465o723O8319J22365
-2618d074081J62992K04435K56047L09256L36201L10524K37263J59360J30049J76861K86271
-2607a504822M13305N06307N32889M92498M09579L15162K30618J63504J14008Q0051N4897
-2596A807996K5345k1362q6749j53851j87548j49030j9615J86973M33480O74447Q64821R67818
$$ plain form
-2675 6260433 5907268 5545220 5122474 4593240 3938651 3175659 2346066 1495460 662473 -113696 -782233
-2664 -782233 -1283122 -1561852 -1585823 -1358643 -929277 -389965 138445 529249 679428 541528 141962
-2653 141962 -427254 -1037668 -1559952 -1895864 -2000966 -1892473 -1634709 -1305063 -964181 -653247 -409859
-2642 -409859 -272920 -261708 -348122 -455157 -493499 -414338 -241324 -60689 22547 -66186 -344001 -774954
-2630 -774954 -1295957 -1845675 -2380825 -2875581 -3312988 -3679672 -3964919 -4159577 -4258042 -4264765 -4196446 -4074081
-2618 -4074081 -3911089 -3706654 -3450607 -3141351 -2805150 -2494626 -2257363 -2098003 -1967954 -1791093 -1504822
-2607 -1504822 -1091517 -585210 -52321 440177 849756 1164918 1395536 1559040 1673048 1753099 1807996
-2596 1807996 1833341 1811979 1725230 1571379 1383831 1234801 1215186 1402159 1835639 2510086 3374907 4342725
-2584D342725R68369Q81861P45438N96599M57452L36903K42011J79898J49373J37448J25860
-2573I163937J00094N4302r968r0641j92745l28352n04156p05903q96278j030544j075613
-2562D484133j019481q73882o74582m72963l14304k16620j67686j41394j17720q8394m8045
-2551C49062J0892Q9239J73377K43195K86908L04864L01459K77872K33115J71401J06509N7096
-2539B604989L7224M8736P6031Q6491M3476p2021k47729m46638o27814p64377q47599q80422
-2527i89653q68992q17177p24913n88575m03822j72948Q7248L45589N66798P24398Q07006
-2516b035041Q15457P57289O45993N03468L57577K31055J30682M9237j9907o9740q2590m6062
-2504A237418L5995J46906K66040L73971M55282N01015N06466M65046L69601K23405M5026
$$ plain form
-2584 4342725 5311094 6192955 6938393 7534992 7992444 8329347 8571358 8751256 8900629 9038077 9163937
-2573 9163937 9264031 9318333 9308365 9217724 9024979 8696627 8192471 7486568 6590290 5559746 4484133
-2562 4484133 3464652 2590770 1916188 1443225 1128921 912301 744615 603221 485501 397107 349062
-2551 349062 359954 449193 622570 865765 1152673 1457537 1758996 2036868 2269983 2441384 2547893 2604989
-2539 2604989 2642213 2690949 2766980 2853471 2896947 2824926 2577197 2130559 1502745 738368 -109231 -989653
-2527 -989653 -1858645 -2675822 -3400735 -3989310 -4393132 -4566080 -4478832 -4133243 -3566445 -2842047 -2035041
-2516 -2035041 -1219584 -462295 183698 687166 1044743 1275798 1406480 1455717 1435810 1366070 1283480 1237418
-2504 1237418 1273413 1420319 1686359 2060330 2515612 3016627 3523093 3988139 4357740 4581145 4626171
-2493D626171j41628l21150m89217o42037p66349q43261q64390q41624p95873p39300o73639
-2482b492297o01025n29248m67078m18213l78560l36391k76401j86705o5179P6313K12128
-2471e462656L12406L58346L49169K93335J97173O6328q3046k21121l17651l57775l43279
-2460e208771k84280j96609j02641k4130K7310N0386N0475M1868M9280R6568J90630L17962
-2448d991952M54444N74289O54765O85280O76088O49868O17715N65327M65772L06393J04087
-2437G62076j03299k78617m00896m64822m71285m24722l41378k52521j90667j68969j73024
-2426b508124j70303j29277l7753R0888K29196L55050M59732N39150N83289N77582N12288
-2415E01718L89216K22774L9422j24632k33404k66783k30613j52195o4074J0697O2724R2284
$$ plain form
-2493 4626171 4484543 4163393 3674176 3032139 2265790 1422529 558139 -283485 -1079358 -1818658 -2492297
-2482 -2492297 -3093322 -3622570 -4089648 -4507861 -4886421 -5222812 -5499213 -5685918 -5751097 -5674784 -5462656
-2471 -5462656 -5150250 -4791904 -4442735 -4149400 -3952227 -3885899 -3968945 -4190066 -4507717 -4865492 -5208771
-2460 -5208771 -5493051 -5689660 -5792301 -5816431 -5789121 -5738735 -5688260 -5646392 -5597112 -5500544 -5309914 -4991952
-2448 -4991952 -4537508 -3963219 -3308454 -2623174 -1947086 -1297218 -679503 -114176 351596 657989 762076
-2437 762076 658777 380160 -20736 -485558 -956843 -1381565 -1722943 -1975464 -2166131 -2335100 -2508124
-2426 -2508124 -2678427 -2807704 -2845457 -2754569 -2525373 -2170323 -1710591 -1171441 -588152 -10570 501718
-2415 501718 890934 1113708 1153130 1028498 795094 528311 297698 145503 81429 92126 154850 247134
-2403B47134J06014J15786J34445J69846K22348K83092L31183L38196K85068J80357N9352
-2392B472821l4797p2030m7890J7405R2289J52034J89658K16025K52235L15491M03117M86515
-2380D442873N26206M97440M05463K78774J50322L8610o1339j70364l03509m51859n83579
-2369D769038o63507o76488o39499n93240n76319n99057o35766o39685n68038m01899j53627
-2358a378087J36429M11993O19127P23600P20250O32395N00153L62311K45269J66103J38013
-2347C277556J64580K27871K88642L06688K66897J85973R3097P054o6033j17883j30705r0902
-2335D412835q687Q0720J37934J43174J03155L8284l3796j01491j52408j70932j44083o8555
-2323D236150M6989J84051L18198M27195N02368N50500N78819N79571N33865M30503K79880
$$ plain form
-2403 247134 353148 468934 603379 773225 995573 1278665 1609848 1948044 2233112 2413469 2472821
-2392 2472821 2438024 2365994 2318104 2335509 2427798 2579832 2769490 2985515 3237750 3553241 3956358 4442873
-2380 4442873 4969079 5466519 5871982 6150756 6301078 6339688 6278349 6107985 5804476 5352617 4769038
-2369 4769038 4105531 3429043 2789544 2196304 1619985 1020928 385162 -254523 -822561 -1224460 -1378087
-2358 -1378087 -1241658 -829665 -210538 513062 1233312 1865707 2365860 2728171 2973440 3139543 3277556
-2347 3277556 3442136 3670007 3958649 4265337 4532234 4718207 4811304 4818358 4752325 4634442 4503737 4412835
-2335 4412835 4404148 4484868 4622802 4765976 4869131 4907415 4873619 4772128 4619720 4448788 4304705 4236150
-2323 4236150 4283139 4467190 4785388 5212583 5714951 6265451 6844270 7423841 7957706 8388209 8668089
-2312H668089J10968m2145j54243k20665k62957l17248m06342n18194o13194o52677o20707
-2301D970685n26305l95423k61756j56319r8482r1907j25738j80247k33080k61005k44630
-2290B395793j82387j00700m2571m1303j02710k06425l17362l97904m20273l78620k94303
-2279h8765k07951j59114j64244k07784k52771k62058k14019j05675N0054K25804L84894M95819
-2267e05810N47604N53178N39906N36557N63903O29485P26096Q34554R29167R84256R79397
-2256G318293Q99917P37168M94770J94942j26780m35443p06067r22114j069880j138180j125697
-2245D120929j049216r42012q39990p64775p13878o63819n83856m53624k76792q0909R8274
-2234b149668K34662L18294L51429L40396K86295J83175K9979j54312l28280m40840m51375
$$ plain form
-2312 8668089 8779057 8736912 8582669 8362004 8099047 7781799 7375457 6857263 6244069 5591392 4970685
-2301 4970685 4444380 4048957 3787201 3630882 3532400 3440493 3314755 3134508 2901428 2640423 2395793
-2290 2395793 2213406 2112706 2070135 2028832 1926122 1719697 1402335 1004431 584158 205538 -88765
-2279 -88765 -296716 -455830 -620074 -827858 -1080629 -1342687 -1556706 -1662381 -1612327 -1386523 -1001629 -505810
-2267 -505810 41794 594972 1134878 1671435 2235338 2864823 3590919 4425473 5354640 6338896 7318293
-2256 7318293 8218210 8955378 9450148 9645090 9518310 9082867 8376800 7454686 6384806 5246626 4120929
-2245 4120929 3071713 2129701 1289711 524936 -188942 -852761 -1436617 -1890241 -2167033 -2247942 -2149668
-2234 -2149668 -1915006 -1596712 -1245283 -904887 -618592 -435417 -405438 -559750 -888030 -1328870 -1780245
-2223a780245l49286j64435M2781K12855L18809L72466M02924M31277M61694M87292M97713
-2212I33845M81914M30596L42792K32045J24864N1000K8022M7793P7957Q2983N0109k211m1679
-2199B840030n0889l9500k8667k9096l8735n4598p6646j00434j14208j04687o4894j455O4147
-2186B200368J05526J06272O9729J9017j4289q605L5759J02424J75168K46943L14652L68647
-2174C721611L90944L66726K96054J91187O4395p8150k31899l86831n24384o19109o48041
-2163B542503o05387n07028l78534k42222j16772k1548K7547L0681J0110k780J0582M6414
-2151G93566Q6990J12682J08433O6815j0156j12660k27846l43395m45389n12761n17234m35480
-2139a436435k67180m1750J92652L87820N10122N48072N14404M42188L73544L40860L46743
$$ plain form
-2223 -1780245 -2129531 -2293966 -2251185 -2038330 -1719521 -1347055 -944131 -512854 -51160 436132 933845
-2212 933845 1415759 1846355 2189147 2421192 2546056 2597056 2625078 2672871 2750828 2833811 2883920 2881709 2840030
-2199 2840030 2789141 2749641 2720974 2691878 2653143 2598545 2521899 2421465 2307257 2202570 2137676 2136221 2200368
-2186 2200368 2305894 2412166 2481895 2500912 2486623 2478018 2513777 2616201 2791369 3038312 3352964 3721611
-2174 3721611 4112555 4479281 4775335 4966522 5030917 4952767 4720868 4334037 3809653 3190544 2542503
-2163 2542503 1937116 1430088 1051554 809332 692560 671012 698559 729240 739350 736570 747152 793566
-2151 793566 880556 993238 1101671 1168486 1158330 1045670 817824 474429 29040 -483721 -1000955 -1436435
-2139 -1436435 -1703615 -1745365 -1552713 -1164893 -654771 -106699 407705 849893 1223437 1564297 1911040
-2128A911040L61208L45721K81760J76771N1516p2256j77259k52093k91429k97508k81694
-2117A755777k59693k42961k34741k32328k30222k21683k01612j72565j48733j47922j72342
-2106e09025j97774j86613j14095J4756J65984K93538L63910L71506L31674K62214J75423
-2095I71498Q2128o459q3908j52767k22391l00539l85061m63511n18624n32260m87397l74502
-2083b473793k01916K490K05414L83538N23965O18930O68958O86068O84741O69081O28623
-2072B396099N46582M16490K55066R7569k2077q7941j04144q7391n7246k8914j4199k9475
-2060C280419r7658k36487m42382o83870r11628j081235j173117j194880j166309j103513
-2050d810660j016640r16121q13334p14791o22819n42574m81236m35325l80919k80590j04047
$$ plain form
-2128 1911040 2272248 2617969 2899729 3076500 3128016 3055760 2878501 2626408 2334979 2037471 1755777
-2117 1755777 1496084 1253123 1018382 786054 555832 334149 132537 -40028 -188761 -336683 -509025
-2106 -509025 -706799 -893412 -1007507 -992751 -826767 -533229 -169319 202187 533861 796075 971498
-2095 971498 1053626 1047167 963259 810492 588101 287562 -97499 -561010 -1079634 -1611894 -2099291 -2473793
-2083 -2473793 -2675709 -2673219 -2467805 -2084267 -1560302 -941372 -272414 413654 1098395 1767476 2396099
-2072 2396099 2942681 3359171 3614237 3711806 3689729 3601788 3497644 3410253 3353007 3324093 3309894 3280419
-2060 3280419 3182761 2946274 2503892 1820022 908394 -172841 -1345958 -2540838 -3707147 -4810660
-2050 -4810660 -5827300 -6743421 -7556755 -8271546 -8894365 -9436939 -9918175 -10353500 -10734419 -11015009 -11119056
-2039a1119056J51560M53971P45490R65665J077193J083795J027376R61317R18360Q98113
-2029b836216Q77523Q28256P29194N73024L67726J35561q9541k69648l75369l93161l22164
-2018g74815j68599N1367L04345N40082P02924P49481O64967M73566K36793L3132p5279o7223
-2006B670741L6539J88086L28403M02802L76320K42708K5054k31479m76014o71157q02950
-1995B089053q74818q92114q52536p52678o04591m45603l27948k91278l37109m24006m86652
-1984d200280m70997l68473k22547r6223k7447j2047k2107l3230l5369k5871j96M8933J23190
-1971e342664K08110K74492K99442K90715K88204L38586M65225O55676Q68796J052251J161620
-1960E60453J172275J080092Q96918O45806L58570P5083j62317l23073m00270m10197l82009
$$ plain form
-2039 -11119056 -10967496 -10513525 -9768035 -8802370 -7725177 -6641382 -5614006 -4652689 -3734329 -2836216
-2029 -2836216 -1958693 -1130437 -401243 171781 539507 675068 585527 315879 -59490 -452651 -774815
-2018 -774815 -943414 -892047 -587702 -47620 655304 1404785 2069752 2543318 2780111 2813243 2737964 2670741
-2006 2670741 2707280 2895366 3223769 3626571 4002891 4245599 4270653 4039174 3563160 2892003 2089053
-1995 2089053 1214235 322121 -530415 -1283093 -1887684 -2333287 -2661235 -2952513 -3289622 -3713628 -4200280
-1984 -4200280 -4671277 -5039750 -5262297 -5358520 -5385967 -5398014 -5420121 -5453351 -5488720 -5514591 -5514787 -5465854 -5342664
-1971 -5342664 -5134554 -4860062 -4560620 -4269905 -3981701 -3643115 -3177890 -2522214 -1653418 -601167 560453
-1960 560453 1732728 2812820 3709738 4355544 4714114 4789197 4626880 4303807 3903537 3493340 3111331
-1949C111331l42834l03072k51312j65759l3105J43061L45748N48541P20651Q40039R04967
-1938E518256R26135R05644Q27790O71483M30661J26478j94980m77205o72379p57723p43332
-1927F560828o66415n73151m97893m50060m13602l59944k67478j35336J6312J56936K58815
-1916C629012L08605L14946L05888L11011L40798L80844M02701L81661L10930K03019P8055
-1905F967470m9391j73719k91300l93162m67950n11406n28577n26384n08087m73007m18332
-1894B626155l41725k43692j26803N848J49716K96676M37141N65024O75424P56846P92724
-1883E593334P75020P13656O30757N45434M63601L81698K96885K11613J29163M7949l8774
-1872I750336j37010k42818l41247m19243m79751n39903o17559p18789q27328r04551r09940
$$ plain form
-1949 3111331 2768497 2465425 2214113 2048354 2015249 2158310 2504058 3052599 3773250 4613289 5518256
-1938 5518256 6444391 7350035 8177825 8849308 9279969 9406447 9211467 8734262 8061883 7304160 6560828
-1927 6560828 5894413 5321262 4823369 4373309 3959707 3599763 3332285 3196949 3213261 3370197 3629012
-1916 3629012 3937617 4252563 4558451 4869462 5210260 5591104 5993805 6375466 6686396 6889415 6967470
-1905 6967470 6918079 6744360 6453060 6059898 5591948 5080542 4551965 4025581 3517494 3044487 2626155
-1894 2626155 2284430 2040738 1913935 1919783 2069499 2366175 2803316 3368340 4043764 4800610 5593334
-1883 5593334 6368354 7082010 7712767 8258201 8721802 9103500 9400385 9611998 9741161 9789110 9750336
-1872 9750336 9613326 9370508 9029261 8610018 8130267 7590364 6972805 6254016 5426688 4522137 3612197
-1861C612197q30073o86814n19658l66294k56507k09417k24096k74816l20847l21967k48762
-1850f47054r2004J27915L61959N49186O40491O16489M92572L11443J26577j8518j05049j37894
-1838B226113j31996j00786n5207n097M5829J02315J66348K25310K60068K67775K72257L03920
-1826C576849L64075M11816L91585K74360P4922j60584l77118n27306n80256n26082l76836
-1815B545425j61108Q4923L25156N29316O78199P66710P99616P80879P06957N73074L85813
-1804H014960J67210n2597k42847l73863m21074l76169k56615j01815M3530J46740J95028
-1793F742488J93474J60367J24593J18842J64755K59258L74246M70464N15021M92422M06697
-1782A0022627K76136J23030l6081j94764l54588n17219o74102q03932q83353q98244q45353
$$ plain form
-1861 3612197 2782124 2095310 1575652 1209358 952851 743434 519338 244522 -76325 -398292 -647054
-1850 -647054 -739058 -611143 -249184 300002 940493 1556982 2049554 2360997 2487574 2469056 2364007 2226113
-1838 2226113 2094117 1993331 1938124 1933027 1978856 2081171 2247519 2472829 2732897 3000672 3272929 3576849
-1826 3576849 3940924 4352740 4744325 5018685 5093607 4933023 4555905 4028599 3448343 2922261 2545425
-1815 2545425 2384317 2469240 2794396 3323712 4001911 4768621 5568237 6349116 7056073 7629147 8014960
-1804 8014960 8182170 8129573 7886726 7512863 7091789 6715620 6459005 6357190 6400720 6547460 6742488
-1793 6742488 6935962 7096329 7220922 7339764 7504519 7763777 8138023 8608487 9123508 9615930 10022627
-1782 10022627 10298763 10421793 10385712 10190948 9836360 9319141 8645039 7841107 6957754 6059510 5214157
-1771E214157p32057n80319m26182l06187k38317k14421k11251k08758k00153j90559j90138
-1760A715815k04290k26037k41349k45456k49173k66245k97452l26967l30651k86371j80526
-1749a138702j2595J99075M16496N94317O99380P22829O81767O14221N65225N64786O11588
-1738D518387O75953P17282P02952O20153M76228K88681P5603j44753l49967n15152o22348
-1727F443019o68333o65059o33454n95299n66622n55706n64141n87042o12877o25880o11804
-1716b43198n64956m91061m03944l21538k60422k23921j93243j36292k8218J33176L24394
-1705b409223N04847O32617O77697O27262M85760K73380K2804k27284m41221n95653o84494
-1694a133508p13321o87152o06449m75355l09558j33151L0734J65221K60238L13063L27695
$$ plain form
-1771 5214157 4482100 3901781 3475599 3169412 2931095 2716674 2505423 2296665 2096512 1905953 1715815
-1760 1715815 1511525 1285488 1044139 798683 549510 283265 -14187 -341154 -671805 -958176 -1138702
-1749 -1138702 -1151297 -952222 -535726 58591 757971 1480800 2162567 2776788 3342013 3906799 4518387
-1738 4518387 5194340 5911622 6614574 7234727 7710955 7999636 8075239 7930486 7580519 7065367 6443019
-1727 6443019 5774686 5109627 4476173 3880874 3314252 2758546 2194405 1607363 994486 368606 -243198
-1716 -243198 -808154 -1299215 -1703159 -2024697 -2285119 -2509040 -2702283 -2838575 -2866793 -2733617 -2409223
-1705 -2409223 -1904376 -1271759 -594062 33200 518960 792340 815144 587860 146639 -449014 -1133508
-1694 -1133508 -1846829 -2533981 -3140430 -3615785 -3925343 -4058494 -4027760 -3862539 -3602301 -3289238 -2961543
-1683b961543L12946K82113K53563K44920K61000K89791L17318L47099M00872M97867O33011
-1672H78957P73766Q76650R10299Q70320P77541O61722N44003M30856L18171J95346M7535
-1661G285166j37464l57262n86000p77631q84817q84615p94144o64723n55121n00497n00754
-1650F42138n33035n68791n81814n52036m71881l49645k03631n0508J00230K41594L63217
-1639a964162M52291M98697M98728M57071L86145L02509K23484J67354J52546J90438K77341
-1628A642442L93528N08338N88781O09725N60440M42853K68016N8900j47228l08877l97052
-1617D219866m05506l49591k57163j57244p0543l379N3306J16448J98109K97441M03708N02859
-1605D548311N80715O26816O41625O38107O30486O16489N68481M45610K24700p2228l78262
$$ plain form
-1683 -2961543 -2648597 -2366484 -2112921 -1868001 -1607001 -1317210 -999892 -652793 -251921 245946 878957
-1672 878957 1652723 2529373 3439672 4309992 5087533 5749255 6293258 6724114 7042285 7237631 7285166
-1661 7285166 7147702 6790440 6204440 5426809 4541992 3657377 2863233 2198510 1643389 1142892 642138
-1650 642138 109103 -459688 -1041502 -1593538 -2065419 -2415064 -2618695 -2669203 -2568973 -2327379 -1964162
-1639 -1964162 -1511871 -1013174 -514446 -57375 328770 631279 854763 1022117 1174663 1365101 1642442
-1628 1642442 2035970 2544308 3133089 3742814 4303254 4746107 5014123 5073023 4925795 4616918 4219866
-1617 4219866 3814360 3464769 3207606 3050362 2979819 2976440 3029746 3146194 3344303 3641744 4045452 4548311
-1605 4548311 5129026 5755842 6397467 7035574 7666060 8282549 8851030 9296640 9521340 9449112 9070850
-1594I070850o14060p31120p36855o83894o32979o17803o35120o61112o74436o65005o26568
-1583A791898n52698m45886l24677k14695j31553p0669r666P8104K05747L63074N23440O59095
-1571A871514P51525P93918P88955P44619O68842N64661M30245K65992Q1698j04801k76592
-1560F580576m25407n50169o48930p14327p38218p19829o67872n98032n32267m94693m97946
-1549g114n29398n50332n10570l72806j36144J58679M50961O91310Q56676R43712R55080Q93112
-1537B843166P62327N74415L49129J09727j21476l22164m69732n48556n57520n07023m10256
-1526A702037k81534j40648j1895Q5009J41147J53947J22177N2993k5842o6672k1576J31873
-1514A841016L75507O55692R06388J075401J138766J099653R78352Q00696N91465L74197J74048
$$ plain form
-1594 9070850 8456790 7725670 6988815 6304921 5671942 5054139 4419019 3757907 3083471 2418466 1791898
-1583 1791898 1239200 793314 468637 253942 122389 51720 42054 120158 325905 688979 1212419 1871514
-1571 1871514 2623039 3416957 4205912 4950531 5619373 6184034 6614279 6880271 6961969 6857168 6580576
-1560 6580576 6155169 5605000 4956070 4241743 3503525 2783696 2115824 1517792 985525 490832 -7114
-1549 -7114 -536512 -1086844 -1597414 -1970220 -2106364 -1947685 -1496724 -805414 51262 994974 1950054 2843166
-1537 2843166 3605493 4179908 4529037 4638764 4517288 4195124 3725392 3176836 2619316 2112293 1702037
-1526 1702037 1420503 1279855 1267960 1352969 1494116 1648063 1770240 1823233 1797391 1730719 1709143 1841016
-1514 1841016 2216523 2872215 3778603 4854004 5992770 7092423 8070775 8871471 9462936 9837133 10011181
-1503A0011181J6827p8231j07909q7737m3627J122L3441N2384O8424R9567J62468K60713L79792
-1490A0768415M99068O10064P17067Q20171R06148R57927R65933R29904Q55849P51913O27036
-1479A9409495M93221L64729K50492J45197K6926j32587l47945o06195q71939j105881j278627
-1468A6346886j370240j367508j269142j090762q59255o02181l41855r4644J26033L04969
-1458I782301M28008M94047N21722N38723N61147N81529N75866N23293M24659L07524K12940
-1447A4951759J73893K01436K85621M03556N26987O31627P07055P56040P82339P83619P60975
-1436B0964907P30750P17060P30520P59445P81767P80990P52649P05326O58647O32456O32590
-1425B8847107O49054O68199O84015O97191P09613P26281P61756Q37907R69466J148312J339000
$$ plain form
-1503 10011181 10028008 9949777 9841868 9754131 9710504 9711626 9745067 9797451 9865875 9965442 10127910 10388623 10768415
-1490 10768415 11267483 11877547 12594614 13414785 14320933 15278860 16244793 17174697 18030546 18782459 19409495
-1479 19409495 19902716 20267445 20517937 20663134 20690060 20557473 20209528 19603333 18731394 17625513 16346886
-1468 16346886 14976646 13609138 12339996 11249234 10389979 9787798 9445943 9351299 9477332 9782301
-1458 9782301 10210309 10704356 11226078 11764801 12325948 12907477 13483343 14006636 14431295 14738819 14951759
-1447 14951759 15125652 15327088 15612709 16016265 16543252 17174879 17881934 18637974 19420313 20203932 20964907
-1436 20964907 21695657 22412717 23143237 23902682 24684449 25465439 26218088 26923414 27582061 28214517 28847107
-1425 28847107 29496161 30164360 30848375 31545566 32255179 32981460 33743216 34581123 35550589 36698901 38037901
-1414C8037901J490303J558368J526337J408405J242038J076521R58994R22613R86514J161791
-1404E0369785J446768J815968K222707K621425K991070L342285L703931M100648M541385
-1395G7155972N023820N541018O077768O608583P109443P573641Q016988Q475012R003579
-1386A40585824R677551J0576174J1756836J3236679J4994157J6990177J9194447K1603856
-1378B58615701K4247664K7182789L0485475L4242163L8529717M3375478M8692734N4211109
-1370E59582830N9426857O3599165O5811718O5126692O0810956N2538519M0461687K5149489
-1362I92507913P492086j1344276k9945997m6751842o0265691o9372370p3642652p3462693
-1354F35214478o9860917o4124243n7422930n0604429m4171244l8357445l3220786k8723237
$$ plain form
-1414 38037901 39528204 41086572 42612909 44021314 45263352 46339873 47298867 48221480 49207994 50369785
-1404 50369785 51816553 53632521 55855228 58476653 61467723 64810008 68513939 72614587 77155972
-1395 77155972 82179792 87720810 93798578 100407161 107516604 115090245 123107233 131582245 140585824
-1386 140585824 150263375 160839549 172596385 185833064 200827221 217817398 237011845 258615701
-1378 258615701 282863365 310046154 340531629 374773792 413303509 456678987 505371721 559582830
-1370 559582830 619009687 682608852 748420570 813547262 874358218 926896737 967358424 992507913
-1362 992507913 999999999 988655723 958709726 911957884 851692193 782319823 708677171 635214478
-1354 635214478 565353561 501229318 443806388 393201959 349030715 310673270 277452484 248729247
-1346B48729247k4794718k1379658j8454040j6005507j3999062j2359415j0987418r793902
-1338A20955527q726453p772107o937413o224670n622571n116410m700732m375219m127500
-1329F7352452l926477l736005l529969l293298l017883k706417k375169k047638j747080
-1320D0972516j497349j323887j242830j245033j292174j332679j326457j261849j155535
-1311B9294723j038146r36337q63585q22491q10873q25009q58792r01787r40903r65240r68993
-1300A9362567r51375r15316q64477p99742p17465o10412m73044l11745j52680l4665J4160
-1289A3545806l483n7136j10204j40760j45421j26811q3427j4204P3756J68926K63544L52070
-1277A3722656M22397M54492M30885L48456K22345Q0148n1494j59283k44832l17231l86110
$$ plain form
-1346 248729247 223934529 202554871 184100831 168095324 154096262 141736847 130749429 120955527
-1338 120955527 112229074 104456967 97519554 91294884 85672313 80555903 75855171 71479952 67352452
-1329 67352452 63425975 59689970 56160001 52866703 49848820 47142403 44767234 42719596 40972516
-1320 40972516 39475167 38151280 36908450 35663417 34371243 33038564 31712107 30450258 29294723
-1311 29294723 28256577 27320240 26456655 25634164 24823291 23998282 23139490 22237703 21296800 20331560 19362567
-1300 19362567 18411192 17495876 16631399 15831657 15114192 14503780 14030736 13718991 13566311 13531646 13545806
-1289 13545806 13542323 13485187 13374983 13234223 13088802 12961991 12878564 12864360 12938116 13107042 13370586 13722656
-1277 13722656 14145053 14599545 15030430 15378886 15601231 15681379 15629885 15470602 15225770 14908539 14522429
-1266A4522429m56888n25423n75416n84731n41074m54381l51582k59557j94903j64149j63937
-1255A0250388j76744j69417j05729K8570K09862L87403N10263N45722M82266L30465J25048
-1244A2418097q2158k41274l21792l16132k33499r5382O7171K18426L24904L61276L15404
-1233A2415041J93329J8909j77230l71543n49781o97704p95458q23753p74304o55289m91707
-1222G290510l20786j78885q5191l3130N760O8887J83194L46486N23074O60494P17730O85087
-1210I863230N81799M37404K75359J07789o2009k32883l99455n50514o72643p55884p96130
-1199G796063p93522p52377o84394o06878n32873m61804l80231k73210j40141l844R8797J41518
-1187C407104J26921Q2708M2688K9922N1394J02223J73572K57973L46997M24422M66504M53681
$$ plain form
-1266 14522429 14065541 13540118 12964702 12379971 11838897 11384516 11032934 10773377 10578474 10414325 10250388
-1255 10250388 10073644 9904227 9798498 9827068 10036930 10424333 10934596 11480318 11962584 12293049 12418097
-1244 12418097 12335939 12094665 11772873 11456741 11223242 11127860 11195031 11413457 11738361 12099637 12415041
-1233 12415041 12608370 12627279 12450049 12078506 11528725 10831021 10035563 9211810 8437506 7782217 7290510
-1222 7290510 6969724 6790839 6705648 6672518 6678278 6747165 6930359 7276845 7799919 8460413 9178143 9863230
-1210 9863230 10445029 10882433 11157792 11265581 11203572 10970689 10571234 10020720 9348077 8592193 7796063
-1199 7796063 7002541 6250164 5565770 4958892 4426019 3964215 3583984 3310774 3170633 3166789 3265586 3407104
-1187 3407104 3534025 3616733 3659421 3689343 3740737 3842960 4016532 4274505 4621502 5045924 5512428 5966109
-1175E966109L84711K81378J78727J05486O8626N4046M2212K5221R397J375n287k7628p8771
-1162G005602j59208k61050l73767m79383n45796n34437m22854k24523J2738K27671L68065
-1151D613058M05436L42695K10663M9737j08290k41412l30330l59880l28014k50906j60210
-1140C842547r0695o1211o4565p8438q5098p8313n7249k3115J5936M4381M8391K3606k5358
-1127C410819q8695j54066k08874k40339k34208j78004o9437Q0962K58547M52305O49061Q21230
-1115D499301R28673R43719Q76516P70425O69899N93931N35878M77132L93584K58414N4304
-1104A1001776k08595m88067p24379q64972q89823q23303p20545o34445n89713n81780n91938
-1093C884216o01576o00040n87574n73121n67640n74541n82927n70621n16677m13705k72131
$$ plain form
-1175 5966109 6350820 6632198 6810925 6916411 6985037 7039083 7081295 7106516 7115913 7117288 7112001 7084373 7005602
-1162 7005602 6846394 6585344 6211577 5732194 5186398 4651961 4229107 4004584 4017322 4244993 4613058
-1151 4613058 5018494 5361189 5571852 5621589 5513299 5271887 4941557 4581677 4253663 4002757 3842547
-1140 3842547 3751852 3690641 3626076 3547638 3462540 3384227 3326978 3303863 3319799 3364180 3412571 3436177 3410819
-1127 3410819 3322124 3168058 2959184 2718845 2484637 2306633 2237196 2318158 2576705 3029010 3678071 4499301
-1115 4499301 5427974 6371693 7248209 8018634 8688533 9282464 9818342 10295474 10689058 10947472 11001776
-1104 11001776 10793181 10305114 9580735 8715763 7825940 7002637 6282092 5647647 5057934 4476154 3884216
-1093 3884216 3282640 2682600 2095026 1521905 954265 379724 -203203 -773824 -1290501 -1704206 -1976337
-1082a976337j18483J3144R7888J34933J46565J61251J95333K45670K92667L11013K85261
-1071b11095K20027J37251O4000J8783M675J0867J9552J3184k2599r4959j92726k80361l13772
-1058f27173k69192j57547j3126J29026K47449L35638L95698M31130M44674M42529M36874
-1047A795980M39820M52366M60492M47035M09593L63467L25133K97291K72441K43860K07252
-1036E714730J57060Q6713q506j28753k66551m04476n14538n64035n31694m23597k73874j25649
-1024B716830k853J05677K30945L87940N53266O78420P24705O87799N94930M81689L68484
-1013G527832K53075J21711l2224j95662l36226m14771m03319k99716j31955N1865K03820
-1002F344430K92696L06353K45382J21921l3984j73474k44930k20377j13400K5859J35390
$$ plain form
-1082 -1976337 -2094820 -2081676 -1983788 -1848855 -1702290 -1541039 -1345706 -1100036 -807369 -496356 -211095
-1071 -211095 8932 146183 210183 228966 233641 244508 264060 277244 254645 159686 -33040 -313401 -627173
-1058 -627173 -896365 -1053912 -1067038 -938012 -690563 -354925 40773 471903 916577 1359106 1795980
-1047 1795980 2235800 2688166 3148658 3595693 4005286 4368753 4693886 4991177 5263618 5507478 5714730
-1036 5714730 5871790 5958503 5949997 5821244 5554693 5150217 4635679 4071644 3539950 3116353 2842479 2716830
-1024 2716830 2713977 2819654 3050599 3438539 3991805 4670225 5394930 6082729 6677659 7159348 7527832
-1013 7527832 7780907 7902618 7870394 7674732 7338506 6923735 6520416 6220700 6088745 6140610 6344430
-1002 6344430 6637126 6943479 7188861 7310782 7276798 7103324 6858394 6638017 6524617 6550476 6685866
-991F685866J68617J08401l2419k15547l87067m96966n22806m79562m06601l44677l20097
-980C757142l39983l93563m56480n01979n16770n05912m80235m41180l78319k80211j49326
-969f86816r555J02398J57948J55441J23185J00214J08026J38874J69341J81705J72639J43791
-957H57191Q8640n870j43258l07069m65783n83544o30068n90994m74969l10321j32220K8546
-945b669719J46110J96105J61680M7453j15052k78561m00447m58484m52855l96608l04700
-934d525078j90540p0874K8083P4094M6677m2761j49804k19509k13240j20870L9938K29628
-922e114256M00794N17550N65855N50438M87872M00727L10942K33601J74212J29996R3103
-911a249166N0494j6803j22580k56083l78748m46983m39030l63734k50874j31270j7668R7643
$$ plain form
-991 6685866 6854483 6962884 6930465 6714918 6327851 5830885 5308079 4828517 4421916 4077239 3757142
-980 3757142 3417159 3023596 2567116 2065137 1548367 1042455 562220 121040 -257279 -537490 -686816
-969 -686816 -696371 -593973 -436025 -280584 -157399 -57185 50841 189715 359056 540761 713400 857191
-957 857191 945831 939961 796703 489634 23851 -559693 -1189761 -1780755 -2255724 -2566045 -2698265 -2669719
-945 -2669719 -2523609 -2327504 -2165824 -2118371 -2233423 -2511984 -2912431 -3370915 -3823770 -4220378 -4525078
-934 -4525078 -4715618 -4786492 -4758409 -4684315 -4637638 -4680399 -4830203 -5049712 -5262952 -5383822 -5343884 -5114256
-922 -5114256 -4713462 -4195912 -3630057 -3079619 -2591747 -2191020 -1880078 -1646477 -1472265 -1342269 -1249166
-911 -1249166 -1198672 -1215475 -1338055 -1594138 -1972886 -2419869 -2858899 -3222633 -3473507 -3604777 -3622445 -3524802
-899c524802K24751L57179M71204N41648N59269N37041N02542M83381M93849N26385N50764
-888A723211N25274M19266K34097O756k07194l59654m29160m24528l73290l02393k24273j39478
-876D48634n0916K6645O8572N2648k4946j41080k55077l31882l60236l51660l27904l12163
-864a559365l24420l74818m54867n33347n66121n19647l92912k20174n0280Q3549J79338K55114
-852d477950L24740L85115M20163M14999L74195L31578L35138M11595N38214O49669O80070
-841C87526O06500M56155K75782R7890o7399k16300l35704m05101m08883l46824k37916j13634
-829c07908l48R5012J82143K73131L72018M71078N47963N68029N02280L51677J52147m6896
-817C160326k10499l29244m12019m74059n27227n72473n97251n81014n06555l70103j82372
$$ plain form
-899 -3524802 -3300051 -2942872 -2471668 -1930020 -1370751 -833710 -331168 152213 646062 1172447 1723211
-888 1723211 2248485 2667751 2901848 2908604 2701410 2341756 1912596 1488068 1114778 812385 588112 448634
-876 448634 397718 424363 492935 545583 520637 379557 124480 -207402 -567638 -919298 -1247202 -1559365
-864 -1559365 -1883785 -2258603 -2713470 -3246817 -3812938 -4332585 -4725497 -4945671 -4995951 -4912402 -4733064 -4477950
-852 -4477950 -4153210 -3768095 -3347932 -2932933 -2558738 -2227160 -1892022 -1480427 -942213 -292544 387526
-841 387526 994026 1450181 1725963 1823853 1756454 1540154 1204450 799349 390466 43642 -194274 -307908
-829 -307908 -308256 -213244 -31101 242030 614048 1085126 1633089 2201118 2703398 3055075 3207222 3160326
-817 3160326 2949827 2620583 2208564 1734505 1207278 634805 37554 -543460 -1050015 -1420118 -1602490
-806a602490L7311K63212M62297O01834O65534O61599O13347N44482M71706M02765L34723
-795C456320K55543J52487K2386j25530k77410m24701n63362o82388p61296p85332p58471
-784d91754o96643o14131n20041m18671l05773j68354L698K01535L95429N53278O59069P10926
-772f91432P08868O54203N58445M43755L30574K27655J37266O7935L5844N0440R8261J41436
-760B763250J36381O2987o0968j96008l10548l93501m43554m55163m19582l38978k35739j42174
-748c3597p8980m4914k4728l716K5081O5882J28193K22217L43942M66669N47100N42112M29308
-735B584569K21153l7000k84728m70579n69420n84994n38443m53369l48354k38935j41375
-724h61475p1812l9405l8609n0634n4820l8544J466O2500J39560K27180L17696M00847M69405
$$ plain form
-806 -1602490 -1565179 -1301967 -839670 -237836 427698 1089297 1702644 2247126 2718832 3121597 3456320
-795 3456320 3711863 3864350 3886736 3761206 3483796 3059095 2495733 1813345 1052049 266717 -491754
-784 -491754 -1188397 -1802528 -2322569 -2741240 -3047013 -3215367 -3211669 -3010134 -2614705 -2061427 -1402358 -691432
-772 -691432 17436 671639 1230084 1673839 2004413 2232068 2369334 2437269 2473113 2523553 2621814 2763250
-760 2763250 2899631 2962618 2901650 2705642 2395094 2001593 1558039 1102876 683294 344316 108577 -33597
-748 -33597 -112577 -157491 -182219 -185935 -160854 -94972 33221 255438 599380 1066049 1613149 2155261 2584569
-735 2584569 2805722 2768722 2483994 2013415 1443995 859001 320558 -132811 -481165 -720100 -861475
-724 -861475 -933287 -972692 -1011301 -1061935 -1116755 -1155299 -1153833 -1091333 -951773 -724593 -406897 -6050 463355
-711D63355N23629N68349O05401O27676O18878N59474M36781K57486N5794j15440k09285k07193
-699D184905j23831N291J42126K57800L35527L71975L77835L71104L64711L59846L51875L41849
-687G341013L39274L50155L63200L51456K90471J74341J2475j85169m12413o54366q75180
-676G095257j025556j068741j001603q54667o75722n07771l73577k77191k16479j92004k07822
-665F94124k65498l53418m43547n03504n13116m71078l89561k84658j71212o4093K0372O9538
-653b675651Q1326O1389J3228o2790j57246k40770k68441k01209l2318K01894M36650O07799
-641b236139O77099O44429N45402M33724L53490L18056L11232L09628L03732K96644K86662
-630B243959K58065J93317R4528o322n9042k2928J07538K94288M71725N79143N88881N15001
$$ plain form
-711 463355 986984 1555333 2160734 2788410 3407288 3966762 4403543 4661029 4716823 4601383 4392098 4184905
-699 4184905 4061074 4066365 4208491 4466291 4801818 5173793 5551628 5922732 6287443 6647289 6999164 7341013
-687 7341013 7680287 8030442 8393642 8745098 9035569 9209910 9222385 9037216 8624803 7970437 7095257
-676 7095257 6069701 5000960 3999357 3144690 2468968 1961197 1587620 1310429 1093950 901946 694124
-665 694124 428626 75208 -368339 -871843 -1384959 -1856037 -2245598 -2530256 -2701468 -2765561 -2745189 -2675651
-653 -2675651 -2594325 -2532936 -2519708 -2582498 -2739744 -2980514 -3248955 -3450164 -3482482 -3280588 -2843938 -2236139
-641 -2236139 -1559040 -914611 -369209 64515 418005 736061 1047293 1356921 1660653 1957297 2243959
-630 2243959 2502024 2695341 2789869 2783547 2724505 2701577 2809115 3103403 3575128 4154271 4743152 5258153
-618E258153M01578K96312K22544J69925J10173K2697r1760k16264l31309m22414m78522m90073
-606D451040m53564l76814k75967j65848n3501N7987J60583K39669K83505K92181K72168K23792
-594D655231J41505K6325j06639k34926l41862m22547m76812m98969m78538m13343l19866
-583A529559k25741j49345q8118k7098M4500J22263J83962J96241J33507j865j75286l36144
-571A206435m42256m75842m42034l56750k39051j11758J898Q5855J29086J15355K4973j45614
-559f49703l66877n83962p48461q47555r02555r40266r67919r71463r32953q48163p27171
-548i487048n81368m15831k32079l1674J80554L91013N76601P14024P91301Q11848P89812
-537f492847P40249O71380N86888M98777M34733M23841M70927N46782O03675O01725N26484
$$ plain form
-618 5258153 5659731 5956043 6178587 6348512 6458685 6481382 6389622 6173358 5842049 5419635 4941113 4451040
-606 4451040 3997476 3620662 3344695 3178847 3125346 3183333 3343916 3583585 3867090 4159271 4431439 4655231
-594 4655231 4796736 4823061 4716422 4481496 4139634 3717087 3240275 2741306 2262768 1849425 1529559
-583 1529559 1303818 1154473 1066355 1039257 1083757 1206020 1389982 1586223 1719730 1717865 1542579 1206435
-571 1206435 764179 288337 -153697 -510447 -749498 -861256 -859358 -773503 -644417 -529062 -504089 -649703
-559 -649703 -1016580 -1600542 -2349003 -3196558 -4099113 -5039379 -6007298 -6978761 -7911714 -8759877 -9487048
-548 -9487048 -10068416 -10484247 -10716326 -10748000 -10567446 -10176433 -9599832 -8885808 -8094507 -7282659 -6492847
-537 -6492847 -5752598 -5081218 -4494330 -3995553 -3560820 -3136979 -2666052 -2119270 -1515595 -913870 -387386
-526c87386L90726K26414P3634l0341n9934n741J23971L01566M83478O25366P01384P12128
-514C155265O77069O21135N63316N08726M47797L66172K57431J26609j1513j30268j93025
-503F388714j71648o9332P5795K09797K88167K90935K22905J05248l3201j60820k47879k78458
-491F620223k63423k33381k10167j88620j51628r6696m1812r288p185k4320l9398l2743Q181
-478E329743Q6517J93019L05955L97576M43562M28163L44374J94847l160k15963m02811n33289
-466F568533n99502o12362n84539n18253m10916k67730j03779O3217K20433L61548M78268
-455D594918N49718N46396M48065K59754J6072k28540m19998n25947n46859n10151m51043
-444C732385l92593l37767k78103k09941j42821r6314r0141j32684k13689l05111l68616l68905
$$ plain form
-526 -387386 3340 229754 303388 273047 213113 207372 331343 632909 1116387 1741753 2443137 3155265
-514 3155265 3832334 4453469 5016785 5525511 5973308 6339480 6596911 6723520 6712007 6581739 6388714
-503 6388714 6217066 6147734 6223529 6433326 6721493 7012428 7235333 7340581 7307380 7146560 6898681 6620223
-491 6620223 6356800 6123419 5913252 5724632 5573004 5476308 5434496 5425208 5418023 5393703 5354305 5321562 5329743
-478 5329743 5416260 5609279 5915234 6312810 6756372 7184535 7528909 7723756 7720596 7504633 7101822 6568533
-466 6568533 5969031 5356669 4772130 4253877 3842961 3575231 3471452 3534669 3755102 4116650 4594918
-455 4594918 5144636 5691032 6139097 6398851 6414923 6186383 5766385 5240438 4693579 4183428 3732385
-444 3732385 3339792 3002025 2723922 2513981 2371160 2274846 2184705 2052021 1838332 1533221 1164605 795700
-432G95700k89396j40768M7478K50600M68746P24292J038642J408595J798727K153946K427628
-421A0684190K606298K708815K763040K785796K780810K746728K684814K602571K510322K415785
-411C7289169K329655K280496K315958K478510K777965L190752L683954M233420M820284N419511
-401G0819674N997418O516854O936762P203370P246003O990862O386992N426175M148057K633715
-391A30305882R92842o50307k173648l477917m504296n240662n713804n970755o056340o004690
-381I1506305n846647n614637n332210n003036m618775m179392l701953l213214k741264k313421
-371D8941756j951737j663769j439298j258191j099419r44401p79428o01168m20278k58398
-361C8525669j39875p9869p2537q9896r6901p1219j2035O8429J60324K58362L46105L83673
$$ plain form
-432 795700 506304 365536 413014 663614 1132360 1856652 2895294 4303889 6102616 8256562 10684190
-421 10684190 13290488 15999303 18762343 21548139 24328949 27075677 29760491 32363062 34873384 37289169
-411 37289169 39618824 41899320 44215278 46693788 49471753 52662505 56346459 60579879 65400163 70819674
-401 70819674 76817092 83333946 90270708 97474078 104720081 111710943 118097935 123524110 127672167 130305882
-391 130305882 131298724 130648417 128474769 124996852 120492556 115251894 109538090 103567335 97510995 91506305
-381 91506305 85659658 80045021 74712811 69709775 65091000 60911608 57209655 53996441 51255177 48941756
-371 48941756 46990019 45326250 43886952 42628761 41529342 40584941 39805513 39204345 38784067 38525669
-361 38525669 38385794 38305925 38233388 38143492 38046591 37975372 37963337 38031766 38192090 38450452 38796557 39180230
-349C9180230L21562J33549j65608n32410r14505j259577j524962j695829j792223j851352
-339B9898875j899994j941688j961784j936594j843905j675987j448713j195244r48199p26780
-329A4319987n40397l98806l13578k90442l22185l87548m55997m96513m88212m29251l36388
-318I860670k31577j28714l3009N1754J20213J67389J89933J86211J59065J21250R7909J18491
-306A0679585J99787L33515M87006O12709O60490N93422M05694J31571j61451l91674m89833
-295A3060821m27735k33598K2763K68271M56496N70306O09697N81704M94848L57358J79373
-284A5940304k3967k30095m06774n15139n22668m19069k22939K5402K82389N21991P44674
-273A5174109R68300J209807J469729J728709J957808K131574K230943K239730K148939J967057
$$ plain form
-349 39180230 39501792 39635341 39469733 38937323 38022818 36763241 35238279 33542450 31750227 29898875
-339 29898875 27998881 26057193 24095409 22158815 20314910 18638923 17190210 15994966 15046767 14319987
-329 14319987 13779590 13380784 13067206 12776764 12454579 12067031 11611034 11114521 10626309 10197058 9860670
-318 9860670 9629093 9500379 9467370 9519124 9639337 9806726 9996659 10182870 10341935 10463185 10561094 10679585
-306 10679585 10879372 11212887 11699893 12312602 12973092 13566514 13972208 14103779 13942328 13550654 13060821
-295 13060821 12633086 12399488 12422251 12690522 13147018 13717324 14327021 14908725 15403573 15760931 15940304
-284 15940304 15916337 15686242 15279468 14764329 14241661 13822592 13599653 13625055 13907444 14429435 15174109
-273 15174109 16142409 17352216 18821945 20550654 22508462 24640036 26870979 29110709 31259648 33226705
-263C3226705J719437J433257J122726P87031M21601L2354l58708p22432j037357j295144
-253C5329470j491438j616609j657595j604774j457508j227094r36113o15662l01576k7056
-243B4394045J86974L35018M23911M70150M98475N36711O04715P02709Q10526R02042R66896
-232C0832172J024627J118361J292237J570981J950398K397730K864834L311502L722053M101918
-222E4186813M463796M819887N183541N570520N994950O464913O980945P540666Q146799Q803920
-212A18156750R494667J0155618J0678223J0933263J0800791J0191453R057271P396233N255416
-203B02119685K736614J878k735555n249982p358687q962565j0048909j0660311j0857563
-194A48984605j0704902j0278551r671886q977717q264386p570250o917525o327006n818929
$$ plain form
-263 33226705 34946142 36379399 37502125 38289156 38710757 38743111 38384403 37661971 36624614 35329470
-253 35329470 33838032 32221423 30563828 28959054 27501546 26274452 25338339 24722677 24421101 24394045
-243 24394045 24581019 24916037 25339948 25810098 26308573 26845284 27449999 28152708 28963234 29865276 30832172
-232 30832172 31856799 32975160 34267397 35838378 37788776 40186506 43051340 46362842 50084895 54186813
-222 54186813 58650609 63470496 68654037 74224557 80219507 86684420 93665365 101206031 109352830 118156750
-212 118156750 127651417 137807035 148485258 159418521 170219312 180410765 189468036 196864269 202119685
-203 202119685 204856299 204858177 202122622 196872640 189513953 180551388 170502479 159842168 148984605
-194 148984605 138279703 128001152 118329266 109351549 101087163 93516913 86599388 80272382 74453453
-185G4453453n401903n062332m769088m494154m229483l982454l754983l528660l270071k952969
-175C3007356k577802k171334j768220j393925j061889p79519n50409l73123k44333j65612
-165B1921190j44519j86815k88812m35861o04406p64698q85320r41178r23981q47202p36211
-154A5162187o11973m86540l71837k85253k41361k37898k54857k71434k82046k92699l03975
-143A1522314l02786k70236j96173q9140K4987J15375J60183J51907R4282j582j16700k23713
-131A0868718k95626l20524l05585k65589k12349j56355j11439r1692j01456j30436j64650
-120H713017k03975k61884l45706m44514n37690o08778o50734o63003o45656n96085n11935
-109C243057l98852k75552j68802r8007o1111l7583n588M4123J04849J58949J91692K06049
$$ plain form
-185 74453453 69051550 63989218 59220130 54725976 50496493 46514039 42759056 39230396 35960325 33007356
-175 33007356 30429554 28258220 26490000 25096075 24034186 23254667 22704258 22331135 22086802 21921190
-165 21921190 21776671 21589856 21301044 20865183 20260777 19496079 18610759 17669581 16745600 15898398 15162187
-154 15162187 14550214 14063674 13691837 13406584 13165223 12927325 12672468 12401034 12118988 11826289 11522314
-143 11522314 11219528 10949292 10753119 10663979 10688966 10804341 10964524 11116431 11210713 11209131 11092431 10868718
-131 10868718 10573092 10252568 9946983 9681394 9469045 9312690 9201251 9109559 9008103 8877667 8713017
-120 8713017 8509042 8247158 7901452 7456938 6919248 6310470 5659736 4996733 4351077 3754992 3243057
-109 3243057 2844205 2568653 2399851 2301844 2240733 2203150 2197562 2241685 2346534 2505483 2697175 2903224
-97B903224K21542K58295L24117M11057M97502N55009N60161N07152M11188K97026J80908
-86G127181O3521n9737j84734k99807l99396m92436n96662p26782q86522j066407j243375
-75A234844j381987j443108j402398j263778j050969p85123m73805j22446K48036O00631R00245
-64d939858J129163J282716J356024J345188J261005J129933R77786Q17321O53130M92859
-54E505267L51253K45834J89157J80273J99790K13253J82654Q2905q4098k89190m93150o67397
-42E616551q00966q91511r31710r05169p98792o25618m34812k90674k37759k85076m14968
-31a000504n96036p88030r44956j025019j004394q83960o82454m22698j24014J95619N14303
-20f762143Q04154J034125J177672J222072J172789J052179Q95737P41127O09992M99798L97607
$$ plain form
-97 2903224 3124766 3383061 3707178 4118235 4615737 5170746 5730907 6238059 6649247 6946273 7127181
-86 7127181 7190702 7130965 6946231 6646424 6247028 5754592 5157930 4431148 3544626 2478219 1234844
-75 1234844 -147143 -1590251 -2992649 -4256427 -5307396 -6092519 -6566324 -6688770 -6440734 -5840103 -4939858
-64 -4939858 -3810695 -2527979 -1171955 173233 1434238 2564171 3541957 4359278 5012408 5505267
-54 5505267 5856520 6102354 6291511 6471784 6671574 6884827 7067481 7150386 7066288 6777098 6283948 5616551
-42 5616551 4815585 3924074 2992364 2087195 1288403 662785 227973 -62701 -300460 -585536 -1000504
-31 -1000504 -1596540 -2384570 -3329526 -4354545 -5358939 -6242899 -6925353 -7348051 -7472065 -7276446 -6762143
-20 -6762143 -5957989 -4923864 -3746192 -2524120 -1351331 -299152 596585 1337712 1947704 2447502 2845109
-9B845109K99502K13393J47059R8640N7873J7249j3421m997O8792J99043L33007M03066L68293
3E032608K33438M0084j53502k94635l56847l46001k85719j98641j02427j6907L3401K7976
15C612828l7941j48158k69739l63232l97025l62442k80555j92031j33866j20027j38896j65736
27A003180j79228j71637j48570j23551j11200j20208j50459j94410k36095k51604k21638j47986
39a053406n2516M1578J25106K01597K76033L45174L96066M10037L66457K46957M5060k19285
51A128858m94037p10687q13070p78650o23972l97840j64565K0073J29987J74020J84207J97559
63b148117K42326L29257M45542N58039O30474O42392N94264N00802L83305K64856J65139R3726
75B702005M8557K1421L636j1465k4479k3818J3490J08438K58450M25277N49093N81712N10493
$$ plain form
-9 2845109 3144611 3358004 3505063 3603703 3661576 3678825 3665404 3660407 3729199 3928242 4261249 4664315 5032608
3 5032608 5266046 5306130 5152628 4857993 4501146 4155145 3869426 3670785 3568358 3551451 3584852 3612828
15 3612828 3574887 3426729 3156990 2793758 2396733 2034291 1753736 1561705 1427839 1307812 1168916 1003180
27 1003180 823952 652315 503745 380194 268994 148786 -1673 -196083 -432178 -683782 -905420 -1053406
39 -1053406 -1105922 -1064344 -939238 -737641 -461608 -116434 279632 689669 1056126 1303083 1348143 1128858
51 1128858 634821 -75866 -888936 -1667586 -2291558 -2689398 -2853963 -2833890 -2703903 -2529883 -2345676 -2148117
63 -2148117 -1905791 -1576534 -1130992 -572953 57521 699913 1294177 1794979 2178284 2443140 2608279 2702005
75 2702005 2750562 2771983 2775619 2764154 2739675 2715857 2729347 2837785 3096235 3521512 4070605 4652317 5162810
88E162810L57073J60736l6284j97207l00369l49509l70694l91149m17552m36189m34033m16079
100B331554m01931m08472m35996m68492m88364m92987m96902n17095n55826n95874o11507
111c141892n83688n06840l88291k46096j04243J6707J05935J61081J84688J81517J57039J17352
123d046731O9007J7652l1689p2102r3610q6323m8706O404N7191Q6363Q9887P4664N0492K6856
137c900645J8765N0822J46576L08378N08054O99991Q45242R28001R54512R39023Q89907Q07499
149C196125O90960N47468M00127K89182K58165L28464M82147O66301Q13395Q64226P86625
160I323185N85279K98349j7878l06637n23996o48030o81951o46290n63923m51390l24229k06195
172E836294j28577j18528j85012l12262m64484n98684o77639o78741n97930m49944k63740
$$ plain form
88 5162810 5519883 5680619 5644335 5447128 5146759 4797250 4426556 4035407 3617855 3181666 2747633 2331554
100 2331554 1929623 1521151 1085155 616663 128299 -364688 -861590 -1378685 -1934511 -2530385 -3141892
111 -3141892 -3725580 -4232420 -4620711 -4866807 -4971050 -4954343 -4848408 -4687327 -4502639 -4321122 -4164083 -4046731
123 -4046731 -3977724 -3960072 -3991761 -4063863 -4157473 -4243796 -4292502 -4286098 -4228907 -4142544 -4052657 -3977993 -3927501 -3900645
137 -3900645 -3881880 -3831058 -3684482 -3376104 -2868050 -2168059 -1322817 -394816 559696 1498719 2388626 3196125
149 3196125 3887085 4434553 4834680 5123862 5382027 5710491 6192638 6858939 7672334 8536560 9323185
160 9323185 9908464 10206813 10188935 9882298 9358302 8710272 8028321 7382031 6818108 6366718 6042489 5836294
172 5836294 5707717 5589189 5404177 5091915 4627431 4028747 3351108 2672367 2074437 1624493 1360753
183A360753p1564J04189K55077L77197M59298M82804M33573L14030J47490k6532j62749k23468
195C450098j93631q8241N6355J99336L07281L58852L47755K86493K05572J41064J12641J09468
207E293043R9267N4477k7050j21576j96749k31937k27621j99522j64403j30455r8191o6795
219C982488l8856k0662j7696k7905l7695k6402K3048J16842K49942M06751N58843O63836O73595
232F506129N56494L21390K1453k67262m75173n60515n17962l73787j73328L0221J84982K55050
244E507692K39027J74492J18340J15240J77001K83485L96416M71778M68488L60468J52110
255H464537j17896l94157o29227p93866q73254q65266p81116o37853m49454k30791p228J88539
267B872968L31812M16713M53169M53315M19452L45482K28826P8111q9631k52280l82769m54523
$$ plain form
183 1360753 1289189 1393378 1648455 2025652 2484950 2967754 3401327 3715357 3862847 3836315 3673566 3450098
195 3450098 3256467 3168226 3224581 3423917 3731198 4090050 4437805 4724298 4929870 5070934 5183575 5293043
207 5293043 5392310 5446787 5419737 5298161 5101412 4869475 4641854 4442332 4277929 4147474 4049283 3982488
219 3982488 3943632 3922970 3905274 3877369 3839674 3813272 3836320 3953162 4203104 4609855 5168698 5832534 6506129
232 6506129 7062623 7384013 7405466 7138204 6663031 6102516 5584554 5210767 5037439 5067660 5252642 5507692
244 5507692 5746719 5921211 6039551 6154791 6331792 6615277 7011693 7483471 7951959 8312427 8464537
255 8464537 8346641 7952484 7323257 6529391 5656137 4790871 4009755 3371902 2922448 2691657 2684429 2872968
267 2872968 3204780 3621493 4074662 4527977 4947429 5292911 5521737 5599848 5510217 5257937 4875168 4420645
279D420645m52501l81628k68436j53960p8116o1936r5888j39954j38561m7889J39114L88086
291C128976O41519Q44252R60687R81523R23225Q18422O97158N71057M34690K83710J30789
302A0416008R65q7307j32896j47096j42319j24689r2095l7254M4013J42093K29626K71057
314A0340106K42043J43548l551j77226l64137n50613p10984q11682q25973p44622n79216l59911
326E597782j26250Q5995K56341L85523M91666N95433P03474Q03331Q73309Q97562Q74872Q15965
338A2255003P31714O20671M67318K55006j5708l16374n93295p84114q44750p72117o03264
349A0400090l90814j77158J5431J80591L19111M34168N32636O23791P10337P83688Q33952
360A4265823Q63034Q81450Q91636Q77486Q12353O81183M98780L06800J50698N8361L7377Q3038
$$ plain form
279 4420645 3968144 3586516 3318080 3164120 3086004 3024068 2928180 2788226 2649665 2601776 2740890 3128976
291 3128976 3770495 4614747 5575434 6556957 7480182 8298604 8995762 9566819 10001509 10285219 10416008
302 10416008 10416973 10329666 10196770 10049674 9907355 9782666 9690571 9653317 9697330 9839423 10069049 10340106
314 10340106 10582149 10725697 10722146 10544920 10180783 9630170 8919186 8107504 7281531 6536909 5957693 5597782
326 5597782 5471532 5557527 5813868 6199391 6691057 7286490 7989964 8793295 9666604 10564166 11439038 12255003
338 12255003 12986717 13607388 14074706 14329712 14314004 13997630 13404335 12620221 11775471 11003354 10400090
349 10400090 10009276 9832118 9847549 10028140 10347251 10781419 11314055 11937846 12648183 13431871 14265823
360 14265823 15128857 16010307 16901943 17779429 18591782 19272965 19771745 20078545 20229243 20287604 20324981 20408019
372B0408019J82433L15117M56150N77819O50679O53012N86467M77504L58150K46791J48497
383B5060638O7244J1791j1145p645K529j264k6915o9268j18923j65434j95107j96289j72487
396B4177725j43848j27575j18156r0567k2934Q1890J92879K68673K81133K25459J13998l4134
408B4804543j98812l60307m98176n92205o31333o24656o01154n95686o29566o95236p56551
419A8620861p67198o95605n41132l31691j03817J18928L29276N21266O74127P52724P27586
430A9305325N95894L83500J28781j30795l58201n17135n82155n46463m20225k27685n487K04063
442A7829417L64437M51898M54173L68152K02785j7445k53937m60806n97758o45233o08522
453A7087161n05162l51267j63794K8606J86197K74937K85681K42096J91516J79972K23674
$$ plain form
372 20408019 20590452 20905569 21361719 21939538 22590217 23243229 23829696 24307200 24665350 24912141 25060638
383 25060638 25127882 25139673 25128528 25120883 25123412 25122148 25095233 25025965 24907042 24741608 24546501 24350212 24177725
396 24177725 24033877 23906302 23788146 23697579 23674645 23756535 23949414 24218087 24499220 24724679 24838677 24804543
408 24804543 24605731 24245424 23747248 23155043 22523710 21899054 21297900 20702214 20072648 19377412 18620861
419 18620861 17853663 17158058 16616926 16285235 16181418 16300346 16629622 17150888 17825015 18577739 19305325
430 19305325 19901219 20284719 20413500 20282705 19924504 19407369 18825214 18278751 17858526 17630841 17625354 17829417
442 17829417 18193854 18645752 19099925 19468077 19670862 19653417 19399480 18938674 18340916 17695683 17087161
453 17087161 16581999 16230732 16066938 16095544 16281741 16556678 16842359 17084455 17275971 17455943 17679617
464A7679617K96837L46330L24027K15299M5024j38885k86539l58745l35400k24624o5887Q0748
476A7577802J57551J33436J7555j45510k99893m09989m74577n12023n33792n30717m81554
487A4498289l75330k28896q3188K0196O3027N5894K4736p549l1516n0595p2777j03069j44585
500A3564637k03257k87918m03474n41115o75581p76140q25334q29473q11255p92087p81879
511F637124p82684p92115p98384p80550p21523o20693m93718l61110k36358j26619m2272L161
523H84259O738j4196k8069j642Q9832K52600M66600O89870Q75436R88361J013017R51659Q20173
536F994638O45161M62718L13989K35909K50999L57898N24445O91703P93208P81432O46909
547A2699009M20056J53769j02337l18726m84087n92634o37165o15418n38769m30073l11826
$$ plain form
464 17679617 17976454 18322784 18646811 18862110 18907134 18768249 18481710 18122965 17787565 17562941 17497054 17577802
476 17577802 17735353 17868789 17886344 17740834 17440941 17030952 16556375 16044352 15510560 14979843 14498289
487 14498289 14122959 13894063 13810875 13831071 13894098 13949992 13974728 13967179 13935663 13885068 13812291 13709222 13564637
500 13564637 13361380 13073462 12669988 12128873 11453292 10677152 9851818 9022345 8211090 7419003 6637124
511 6637124 5854440 5062325 4263941 3483391 2761868 2141175 1647457 1286347 1049989 923370 881098 884259
523 884259 890997 876801 848732 847090 936922 1189522 1656122 2345992 3221428 4209789 5222806 6174465 6994638
536 6994638 7639799 8102517 8416506 8652415 8903414 9261312 9785757 10477460 11270668 12052100 12699009
547 12699009 13119065 13272834 13170497 12851771 12367684 11775050 11137885 10522467 9983698 9553625 9241799
558I241799j94438p2351P0845K48933M57223O65777Q30471R16022R13244Q39289P23325N91255
570A5231394M60870L43520K41587J43786L0265j12974k83174m61981o25991p57016q43637
581A3366649q77039q50093p60888o17603m43841k74703j36278k7831O9159J64039K44859K92671
593A0149101K98781K64448J92141Q7642l0357j31994j92406k05408j80609j28520m9487O2463
605A0135795K06316L65248N08242N98825O08856N34179M01553K55883J34181M7640j3541o0635
617A3722542r5563j20063j47964j99211k83062l92055n06655n99077o37531n97332m76227
628I667802l01768j22851J2105P9650R5114J04604J56497K71311M32015N96884P19536P65569
640A2476468P24568O13076M62688L01132J41998j1934j58594k89964l94279m63418m97169
$$ plain form
558 9241799 9047361 8975010 9045855 9294788 9752011 10417788 11248259 12164281 13077525 13916814 14640139 15231394
570 15231394 15692264 16035784 16277371 16421157 16451422 16338448 16055274 15593293 14967302 14210286 13366649
581 13366649 12489610 11639517 10878629 10261026 9817185 9542482 9406204 9378373 9447532 9611571 9856430 10149101
593 10149101 10447882 10712330 10904471 10992113 10961756 10829762 10637356 10431948 10251339 10122819 10073332 10135795
605 10135795 10342111 10707359 11215601 11814426 12423282 12957461 13359014 13614897 13749078 13796718 13783177 13722542
617 13722542 13626979 13506916 13358952 13159741 12876679 12484624 11977969 11378892 10741361 10144029 9667802
628 9667802 9366034 9243183 9255288 9334938 9430052 9534656 9691153 9962464 10394479 10991363 11710899 12476468
640 12476468 13201036 13814112 14276800 14577932 14719930 14707996 14549402 14259438 13865159 13401741 12904572
651A2904572n01649m85701m56484m13092l41940k24545n6888J38384L20144M46970M90748
662A1820519M44707L27623J76440K5814j08560k26917l26275l87640l86633l17585k02806
673A0838687p7638K8684J01716J42855J69467K08088K76752L67870M50469M93004M82397M26298
685A3908649L44384K59368J92154J58389J63504J96882K32587K41426K06097J25383L859j56268
697A5876414l49308n55461p39738q65476r13567q88996q09921o92279n45279l75998j94508
708H945883j7266J31409K23354K38230J74262M8159j13804k84589m40118n58036o18303o09401
720G119780n35430m16198k79007j47455l6159M6913R7867J17665J10008P4993Q791q4623j83019
733E894126k53859k76378k54819k09763j58115j03722m7206o52J1854l1921j37903k89343
$$ plain form
651 12904572 12402923 11917222 11460738 11047646 10705706 10481161 10424273 10562657 10882801 11329771 11820519
662 11820519 12265226 12592849 12769289 12795103 12686543 12459626 12133351 11745711 11359078 11041493 10838687
673 10838687 10761049 10789733 10891449 11034304 11203771 11411859 11688611 12056481 12506950 12999954 13482351 13908649
685 13908649 14253033 14512401 14704555 14862944 15026448 15223330 15455917 15697343 15903440 16028823 16032682 15876414
697 15876414 15527106 14971645 14231907 13366431 12452864 11563868 10753947 10061668 9516389 9140391 8945883
708 8945883 8928617 9060026 9283380 9521610 9695872 9744031 9630227 9345638 8905520 8347484 7729181 7119780
720 7119780 6584350 6168152 5889145 5741690 5705531 5752444 5850311 5967976 6077984 6152977 6161768 6077145 5894126
733 5894126 5640267 5363889 5109070 4899307 4741192 4637470 4590264 4589612 4601466 4569545 4431642 4142299
745D142299m49917n75464o28841n90940m68087k94150j15313M1261J85695L47223N39520P44785
757B878071R22036J024663J018930R00253O97165M56655K23357K7955j15004k03893k42837
768G587351k35630j87923j14727m2159P47o763p0303j80009l15066m50465n63828o39663o70025
781D111537o50860n78628m53087k84671r6643Q1419K24057L18851L69393L90584M01627M20624
793D254203M59425N19198N89562O52023O88026O90583O70532O46598O24471N86317N03765
804A0884703L63352J80994n132j56481k55537l10881l41331l55025l44639l01436k31594j60166
816H966827j21922j46469k46215m10451o04568p77411q82298r04702q72174q33069q21542
827B346006q39970q66035q67542q12008o76727m63966k08978L3580K17567L24804L65399L66159
$$ plain form
745 4142299 3692382 3116918 2488077 1897137 1429050 1134900 1019587 1060848 1246543 1593766 2133286 2878071
757 2878071 3800107 4824770 5843700 6743953 7441118 7897773 8121130 8149085 8034081 7830188 7587351
768 7587351 7351721 7163798 7049071 7006912 7007659 7000896 6930593 6750584 6435518 5985053 5421225 4781562 4111537
781 4111537 3460677 2882049 2428962 2144291 2047648 2129067 2353124 2671975 3041368 3431952 3833579 4254203
793 4254203 4713628 5232826 5822388 6474411 7162437 7853020 8523552 9170150 9794621 10380938 10884703
804 10884703 11248055 11429049 11423917 11267436 11011899 10701018 10359687 10004662 9660023 9358587 9126993 8966827
816 8966827 8844905 8698436 8452221 8041770 7437202 6659791 5777493 4872791 4000617 3167548 2346006
827 2346006 1506036 640001 -227541 -1039549 -1716276 -2180242 -2389220 -2355640 -2138073 -1813269 -1447870 -1081711
839a081711L56000L53704L62421L73664L77294L70874L62219L60615L64627L62659L48302
850B910668L33453L41680L84449M45832M94785N10187M91311M46964L79296K79416J37844
861G155885m1313k35937m13424n43215o06920o01820n37441m25549k70839p3538J58952M07578
873C972419O48309Q56210J001385J049208R74086P75868M82591J37397k18765n55567q48258
884H274883j069690j197126j230677j198882j137957j065812r78514q66116p25448n62203
894a757542l87762k14778n2841R2935K19702L25384M10726M77225N17033N09397M37070L10378
906H86927J71409O9449L2491O2426J48588K76197M23738N61444O58722O94768O63995N74199
918E224353M40993K81196J09408n9395k05453l07898l56571l58516l31977k94950k60018k38237
$$ plain form
839 -1081711 -725711 -372007 -9586 364078 741372 1112246 1474465 1835080 2199707 2562366 2910668
850 2910668 3244121 3585801 3970250 4416082 4910867 5421054 5912365 6359329 6738625 7018041 7155885
861 7155885 7114572 6878635 6465211 5921996 5315076 4713256 4175815 3750266 3479427 3405889 3564841 3972419
873 3972419 4620728 5476938 6478323 7527531 8501617 9277485 9760076 9897473 9678708 9123141 8274883
884 8274883 7205193 6008067 4777390 3578508 2440551 1374739 396225 -469891 -1195339 -1757542
894 -1757542 -2145304 -2360082 -2412923 -2319988 -2100286 -1774902 -1364176 -886951 -369918 139479 576549 886927
906 886927 1058336 1127785 1160276 1222702 1371290 1647487 2071225 2632669 3291391 3986159 4650154 5224353
918 5224353 5665346 5946542 6055950 5996555 5791102 5483204 5126633 4768117 4436140 4141190 3881172 3642935
930C642935k42561k81205l46056m10266m42337m23886l54841k48737j29117k6047L5416M7815
942H21113K1213k8406q8433j49230j99202k23784k10298j51589m5214J07144K96442N01692
954F51448O89350Q20917Q68122Q25630P11814N59141M04263K78937J97659J50507J11155N1105
966F320048n3174k14592m24529o46854q30589r34266r42104q63876p26171n63152m06577k74107
978e59943j63538o0887M2855J41798K20307K66383K81052K74550K54250K19686J69404J09130
990A195047N3191K0710K7664P4327J38902J90247K10222K01887J75874J32394O0881m2357
1002B438989j60499k62989l24601l39562l23070l00117k84984k66803k18014j19704K2513
1013a38841J83916L34110M46832N06066N08766M62338L80743K84300J98914J47643J38217
$$ plain form
930 3642935 3400374 3119169 2773113 2362847 1920510 1496624 1141783 893046 763929 737882 773298 821113
942 821113 842326 813920 725487 576257 377055 153271 -57027 -208616 -253830 -146686 149756 651448
954 651448 1340798 2161715 3029837 3855467 4567281 5126422 5530685 5809622 6007281 6157788 6268943 6320048
966 6320048 6266874 6052282 5627753 4980899 4150310 3216044 2273940 1410064 683893 120741 -285836 -559943
978 -559943 -723481 -784368 -741513 -599715 -379408 -113025 168027 442577 696827 916513 1085917 1195047
990 1195047 1248238 1268948 1296612 1370939 1509841 1700088 1910310 2112197 2288071 2420465 2481346 2438989
1002 2438989 2278490 2015501 1690900 1351338 1028268 728151 443167 176364 -41650 -161354 -138841
1013 -138841 45075 379185 826017 1332083 1840849 2303187 2683930 2968230 3167144 3314787 3453004
1024C453004J57023J77040J73354J32004N0463n9507j68880k43895k70383k60638k29041j67329
1036B743215n4523J11206K99176M62579N62479N78513N07303L59968J62113m9612k36321l68096
1048E078000m33808m43820m19685l76665l14248k21740r4121N4229J90643K79738K98960K43246
1060C840729J22227m3347k26742m02150n47317o41472o65525o09879m84476l20198j57573
1071a35723l1305L9238N1552J9178l2750p7538r8762r5774q0631p1221q4726j30102j99346
1084i27910k65932k97043k74334k07630j28032o3669j7486L5570J30809K87845M91731O95730
1096e40351Q48903R27217R37978Q96810Q06698O63143M73353K62990O5104r3643k00089k58279
1108D789834k88636l14210l38719l37884k78350j48404K7630K00062L14866L31763K38703
$$ plain form
1024 3453004 3610027 3787067 3960421 4092425 4142888 4083381 3914501 3670606 3400223 3139585 2910544 2743215
1036 2743215 2688692 2799898 3099074 3561653 4124132 4702645 5209948 5569916 5732029 5682417 5446096 5078000
1048 5078000 4644192 4200372 3780687 3404022 3089774 2868034 2773913 2828142 3018785 3298523 3597483 3840729
1060 3840729 3962956 3919609 3692867 3290717 2743400 2101928 1436403 826524 342048 21850 -135723
1071 -135723 -167028 -127790 -76238 -57060 -89810 -167348 -266110 -361884 -442515 -513736 -598462 -728564 -927910
1084 -927910 -1193842 -1490885 -1765219 -1972849 -2100881 -2164550 -2182036 -2146466 -2015657 -1727812 -1236081 -540351
1096 -540351 308552 1235769 2173747 3070557 3877255 4540398 5013751 5276741 5341845 5248202 5048113 4789834
1108 4789834 4501198 4186988 3848269 3510385 3232035 3083631 3111261 3311323 3626189 3957952 4196655
1119D196655N8698j59946l66411n24088o10196o08775n13041l37852j25419O8818K01931K60704
1131A541078K59750K24814J72836J01618j245j35664k74529l74073m01113l53556k57549j45202
1143C57165l4750O9555J64769K43179K97582L24796L21885K85297K18670J40407P9590O1042
1155B529187R0384J49897K07120K30253K01401J20479q25j46787l00723m45454n63926o39918
1167A431088o59327o12511m97849l24681j12700J11900L19481M79812N68448N75319N10758
1178A789738M02931K84151J73696P3232j9915r5730j32069j13845m9844L1064R9137J38238
1190B580784J46903J33347J10320Q6264N8849J8961m0599j22015k23295l34705m33251m87363
1202A494200m76332m09451l23534k56998k24449k16091k16003k18198k29674k61503l13462
$$ plain form
1119 4196655 4255353 4095407 3728996 3204908 2594712 1985937 1472896 1135044 1009625 1078443 1280374 1541078
1131 1541078 1800828 2025642 2198478 2300096 2298851 2163187 1888658 1514585 1113472 759916 502367 357165
1143 357165 322415 391970 556739 799918 1097500 1422296 1744181 2029478 2248148 2388555 2468145 2529187
1155 2529187 2619571 2769468 2976588 3206841 3408242 3528721 3527896 3381109 3080386 2634932 2071006 1431088
1167 1431088 771761 159250 -338599 -663280 -775980 -664080 -344599 135213 703661 1278980 1789738
1178 1789738 2192669 2476820 2650516 2723748 2703833 2608103 2476034 2362189 2312345 2343409 2442546 2580784
1190 2580784 2727687 2861034 2971354 3057618 3116467 3135428 3094829 2972814 2749519 2414814 1981563 1494200
1202 1494200 1017868 608417 284883 27885 -196564 -412655 -628658 -846856 -1076530 -1338033 -1651495
1213a651495l64097l77874l25238j96039J306K44448N00386P32498R10639J016319J041099
1224A531952R84802Q55856O72454M61729K54599P7893m8526j10177j02173l9491M2666J05427
1236D687011J24472R4695K5136o5004j49598k04452k17771j93066j45499r6900o9346p6491
1248C713187j16226j68602k02840j92723j30927l0223Q6625J95631K75270L13773L17980L09973
1260D370898L09539L18311L21411L04461K68256K29166K09879K27786K81179L37933L42013
1271G520832K44019L6859k33381m91462o73111p53216p48210o98898o50924o40320o81148
1282B231040p58148q34310q72059q49666p61172o09099m00464j45742J41773M44856P39589
1293a673402R97192J194620J323397J384748J379766J308217J172721R81244P47490M89640
$$ plain form
1213 -1651495 -2015592 -2393466 -2718704 -2914743 -2913437 -2668989 -2168603 -1436105 -525466 490853 1531952
1224 1531952 2516754 3372610 4045064 4506793 4761392 4839285 4790759 4680582 4578409 4538918 4581584 4687011
1236 4687011 4811483 4906178 4931314 4866310 4716712 4512260 4294489 4101423 3955924 3859024 3789678 3713187
1248 3713187 3596961 3428359 3225519 3032796 2901869 2871646 2958271 3153902 3429172 3742945 4060925 4370898
1260 4370898 4680437 4998748 5320159 5624620 5892876 6122042 6331921 6559707 6840886 7178819 7520832
1271 7520832 7764851 7801710 7568329 7076867 6403756 5650540 4902330 4203432 3552508 2912188 2231040
1282 2231040 1472892 638582 -233477 -1083143 -1844315 -2453414 -2853878 -2999620 -2857847 -2412991 -1673402
1293 -1673402 -676210 518410 1841807 3226555 4606321 5914538 7087259 8068503 8815993 9305633
1303I305633K28878j0142j98882l12252l43122l11788k59424k26985k33749k73606l30688
1314G033873l94039m54158m93093m90248m39656l54550k53743j48870m6359M3248J03573J19402
1326D225380Q4200N452r3399j78957k20730k04116j37399m7202L6625R3544J13424R4496M5123
1339C816441j6339o7683r0531p4524j8786O5935J56032K21099K36004J90951R3793l7263j87936
1352D287193l56012n42585p36396r11132j036291j087942j054848r44666p87115o24689m92095
1363d286578l99893l36141k77856j96366o2474J37679L90513O60627R03700J076642J148090
1374a242057J108818R73211P70592N32857K84846M3137j77407l58112m78872n27204n07677
1385D22132m42018l55659k62609j65710p0868M445M2045M1310K2218J0737K1947N3958R6016
$$ plain form
1303 9305633 9534511 9524369 9325487 9013235 8670113 8358325 8098901 7871916 7638167 7364561 7033873
1314 7033873 6639834 6185676 5692583 5202335 4762679 4408129 4154386 4005516 3959157 4002405 4105978 4225380
1326 4225380 4309580 4315032 4221633 4042676 3821946 3617830 3480431 3433229 3469854 3563398 3676822 3771318 3816441
1339 3816441 3800102 3732419 3641888 3567364 3548578 3614513 3770545 3991644 4227648 4418599 4512392 4475129 4287193
1352 4287193 3931181 3388596 2652200 1741068 704777 -383165 -1438013 -2382679 -3169794 -3794483 -4286578
1363 -4286578 -4686471 -5022612 -5300468 -5496834 -5559308 -5421629 -5031116 -4370489 -3466789 -2390147 -1242057
1374 -1242057 -133239 839972 1610564 2143421 2428267 2471404 2293997 1935885 1457013 929809 422132
1385 422132 -19886 -375545 -638154 -803864 -874732 -870287 -828242 -786932 -764714 -753977 -732030 -678072 -582056
1398e82056J42045J92210K38136K52223K01131P3184j08960l00531m55756n41964n45681m72499
1410a908518l38224j57988N4097K77845M86880O56458P69246Q17093Q01787P33910O29140
1421B821726N03854L70854K36422J03051k1666j21116j80489k00682j98253j93677k03135
1432B916889k37180k99603l86206m86858n85120o54144o62188n92679m59254k98000j45282
1443a889625k1695O7345J21467J40509J30426J09287J02283J28143J87568K62055L24902L58013
1455B0678L64909L69071L95213M47662N05245N35673N15238M40835L28645K00322O7105p0905
1467D119691k09212l26085l86992l62729k48226o9232J28330L00994M25510M97184N15667
1478D384900M77716L83719K48297J01820k1192r7238j20903j02613o2272k0596J2067M3928
$$ plain form
1398 -582056 -440011 -247801 -9665 242558 443689 516873 407913 107382 -348374 -890338 -1436019 -1908518
1410 -1908518 -2246742 -2404730 -2350633 -2072788 -1585908 -929450 -160204 656889 1458676 2192586 2821726
1421 2821726 3325580 3696434 3932856 4035907 4014241 3893125 3712636 3511954 3313701 3120024 2916889
1432 2916889 2679709 2380106 1993900 1507042 921922 267778 -394410 -987089 -1446343 -1744343 -1889625
1443 -1889625 -1911320 -1843975 -1722508 -1581999 -1451573 -1342286 -1240003 -1111860 -924292 -662237 -337335 20678
1455 20678 385587 754658 1149871 1597533 2102778 2638451 3153689 3594524 3923169 4123491 4190596 4119691
1467 4119691 3910479 3584394 3197402 2834673 2586447 2517215 2645545 2946539 3372049 3869233 4384900
1478 4384900 4862616 5246335 5494632 5596452 5575260 5478022 5357119 5254506 5192234 5171638 5183705 5227633
1490E227633R7546J91234L19174M49137N40517N64555N11655L88510K14050J5389j77669l36698
1502H005033m38911m75458m58652m16644l77651l58493l63439l85531m06801m02178l47960
1513C573315k30808n3287J65071L92723N97607P56375Q52555Q71346Q04747O63604M79436
1524H872684K92480J37798L4334k5447p6344j61128k99999m73102o27564p01559o54752m89510
1536E827891k47514J3437K40858L98198M69814M60938L91128K88165J87638J27278J29397
1547H287228J87344K71304L45756L82138L61837K76069J26439p6545l17015n74263q22232
1558H448060j034046j188291j271141j274908j197536j045923q40918o17937m19410k79177
1568g21227k07432j86956j81916j52874p4127N2400J97172L20252L93965M12268L82957L14464
$$ plain form
1490 5227633 5325179 5516413 5835587 6284724 6825241 7389796 7901451 8289961 8504011 8519400 8341731 8005033
1502 8005033 7566122 7090664 6632012 6215368 5837717 5479224 5115785 4730254 4323453 3921275 3573315
1513 3573315 3342507 3289220 3454291 3847014 4444621 5200996 6053551 6924897 7729644 8393248 8872684
1524 8872684 9165164 9302962 9337296 9311849 9235505 9074377 8774378 8301276 7673712 6972153 6317401 5827891
1536 5827891 5580377 5593814 5834672 6232870 6702684 7163622 7554750 7842915 8030553 8157831 8287228
1547 8287228 8474572 8745876 9091632 9473770 9835607 10111676 10238115 10161570 9844555 9270292 8448060
1558 8448060 7414014 6225723 4954582 3679674 2482138 1436215 595297 -22640 -442050 -721227
1568 -721227 -928659 -1115615 -1297531 -1450405 -1524532 -1472132 -1274960 -954708 -560743 -148475 234482 548946
1580E48946K09491O9915r4095k62654m12308n23383n84140n90208n41475m43170l13468j85874
1592c122423r5035n7613o6923j02085j37832j51920j35342j00631p8196j03069k01102l76842
1604d729013o04572q30496r90427j035883r55349p77538n53267l27326j19981P0779K50641
1615a0602432M12378N38002O15057O46021O42485O17456N84115N54420N35620N32551N51018
1626d373309N93256O51822P12351P62627P97836Q17563Q19031P94173P33264O33335N03459
1637C445408L61059K22661R7191j0976r1000j24211j03074m9606o533p341n4898j25028j87851
1650C365801k26835k41931k40986k34116k34472k54374k94594l41661l77128l83803l44800
1661A91101k52551j25954q752N8411O4792L1271q391k7482j2302M3203J39303K63460L88788
$$ plain form
1580 548946 758437 828352 734257 471603 59295 -464088 -1048228 -1638436 -2179911 -2623081 -2936549 -3122423
1592 -3122423 -3217458 -3275071 -3341994 -3444079 -3581911 -3733831 -3869173 -3969804 -4048000 -4151069 -4352171 -4729013
1604 -4729013 -5333585 -6164081 -7154508 -8190391 -9145740 -9923278 -10476545 -10803871 -10923852 -10853073 -10602432
1615 -10602432 -10190054 -9652052 -9036995 -8390974 -7748489 -7131033 -6546918 -5992498 -5456878 -4924327 -4373309
1626 -4373309 -3780053 -3128231 -2415880 -1653253 -855417 -37854 781177 1575350 2308614 2941949 3445408
1637 3445408 3806467 4029128 4126319 4115343 4024343 3900132 3797058 3747452 3740919 3733578 3678680 3553652 3365801
1650 3365801 3138966 2897035 2656049 2421933 2187461 1933087 1638493 1296832 919704 535901 191101
1661 191101 -61450 -187404 -196156 -137745 -72953 -41682 -50073 -77555 -89857 -46654 92649 356109 744897
1674G44897M86790N42715N59801N52454N35201N16033M97472M77778M49644M01981L24248
1685F089014K10441O1658j14094l00669m69888n84573o11118n34394l70483j69450N430J14300
1697C326174J62312J87114K27122K93612L63401L96990L69595K85781J66568L0432j12068
1708E697033k52928l84115m96542n77051o09393n85378n16192m30026l55865l08721k87439
1719H93383k82022k78720k59451k01883q6426Q9948L01062M95597O18787O38109N56067M05089
1731B889540K32119Q1240k1117p4405j00316j26928j73099k44938l38339m37654n17179n53338
1743F15586n36281m67694l51604j92392k458J93224L66283N01432O01059O71307P05782O87660
1755B791904O08966M84042L42455K10927J02341J8458m3750r2961j42248j95840k38422k46141
$$ plain form
1674 744897 1231687 1774402 2334203 2886657 3421858 3937891 4435363 4913141 5362785 5764766 6089014
1685 6089014 6299455 6361113 6247019 5946350 5476462 4891889 4280771 3746377 3375894 3206444 3211874 3326174
1697 3326174 3488486 3675600 3902722 4196334 4559735 4956725 5326320 5612101 5778669 5809101 5697033
1708 5697033 5444105 5059990 4563448 3986397 3377004 2791626 2275434 1845408 1489543 1180822 893383
1719 893383 611361 332641 73190 -128693 -215119 -125171 175891 671488 1290275 1928384 2484451 2889540
1731 2889540 3121659 3202899 3181782 3107377 3007061 2880133 2707034 2462096 2123757 1686103 1168924 615586
1743 615586 79305 -388389 -739993 -932385 -934843 -741619 -375336 126096 727155 1398462 2104244 2791904
1755 2791904 3400870 3884912 4227367 4438294 4540635 4559093 4515343 4422382 4280134 4084294 3845872 3599731
1767C599731k11131j54023j11920j12570j57344k26689k99070l64011m23163m85374n59152
1778D95284o44705p29916p92734q07767p52715o14270l95385j20373J69585M28890O18840
1789c145266P15749P18574O51887N56750M73114M24291M08438M00145L64986K80963J53764
1800B003395J7251q4169j23579j08023o9213l8758l0363l8990n1441n7662n4833m4828l2036
1813A286751k2788k0878j9383j095M7705J23111K04981K71014L07093L05971K61521J68521
1825B912524K9904j36724l02443m37187n17540n30921m82089m00822l38462l44694m36234
1836i84688n81235p11464p53636o62443m41394j41255J63001M03846N46573N99010O00916
1847a962769N98408O18924O61424P04599P24258P05847O46916N55607M50181L55700K94181
$$ plain form
1767 3599731 3388600 3234577 3122657 3010087 2852743 2626054 2326984 1962973 1539810 1054436 495284
1778 495284 -149421 -879337 -1672071 -2479838 -3232553 -3846823 -4242208 -4362581 -4192996 -3764106 -3145266
1789 -3145266 -2429517 -1710943 -1059056 -502306 -29192 395099 803537 1203682 1568668 1849631 2003395
1800 2003395 2020646 1936477 1812898 1704875 1635662 1596904 1566541 1527551 1476110 1418448 1363615 1318787 1286751
1813 1286751 1263963 1243085 1223702 1222607 1270312 1393423 1598404 1869418 2176511 2482482 2744003 2912524
1825 2912524 2942428 2805704 2503261 2066074 1548534 1017613 535524 134702 -203760 -548454 -984688
1836 -984688 -1565923 -2277387 -3031023 -3693466 -4134860 -4276115 -4113114 -3709268 -3162695 -2563685 -1962769
1847 -1962769 -1364361 -745437 -84013 620586 1344844 2050691 2697607 3253214 3703395 4059095 4353276
1858D353276K73320K83457L07076L32700L60315L95545M40658M89557N25602N21437M47043
1869H729986K86096M8122k32189n03546p08785p99745p57195o06942m15672k59541j83552
1880D597037j84172k26999k77294l15527l35617l40408l40386l49202l74514m12810m55306
1891I84802m99696n52768o16992o73291o83221o15303m70925k84895j04086L5337J21545J70360
1903c189133K15202K84216L77635M65303N08078M83223L92072K51215Q2633r0201k43891l56417
1915h20065m09049l90856l06524j82954o5390J3j4647j09269k56008m08296n17241n50745
1927d031031n06484m09778k98278k02410j28882n9324K9182J39692K50050L24027L24671K29937
1939d338628N0714j63599l43949m33235m07399k76171p0870J68095L99307N88106P15080P80108
$$ plain form
1858 4353276 4626596 4910053 5217129 5549829 5910144 6305689 6746347 7235904 7761506 8282943 8729986
1869 8729986 9016082 9064204 8832015 8328469 7619684 6819939 6062744 5455802 5040130 4780589 4597037
1880 4597037 4412865 4185866 3908572 3593045 3257428 2917020 2576634 2227432 1852918 1440108 984802
1891 984802 485106 -67662 -684654 -1357945 -2041166 -2656469 -3127394 -3412289 -3516375 -3481038 -3359493 -3189133
1903 -3189133 -2973931 -2689715 -2312080 -1846777 -1338699 -855476 -463404 -212189 -129556 -219757 -463648 -820065
1915 -820065 -1229114 -1619970 -1926494 -2109448 -2174838 -2174825 -2189472 -2298741 -2554749 -2963045 -3480286 -4031031
1927 -4031031 -4537515 -4947293 -5245571 -5447981 -5576863 -5636187 -5607005 -5467313 -5217263 -4893236 -4568565 -4338628
1939 -4338628 -4287914 -4451513 -4795462 -5228697 -5636096 -5912267 -5983137 -5815042 -5415735 -4827629 -4112549 -3332441
1951c332441P98383P90035P69252P40274P01714O54903O09428N78363N66374N64543N55007
1962C995835N18207M38824L10064J35726o9554k80493m64254n89588o38281o10533n18818
1973B227135l78906k07009k3805J41083K53496K91489K60808J93385J31296J07481J31443
1984C127896J85479K32503K34008J70783N2223r1954k27937l29600l83948l93399l72970l39117
1996A863967k97628k43754j74692j00134l6884O787L8399P3272J21519J78676K24255K32279
2008A886062J86948R1419l2058j47213k15919k13285j34754O506J84524L65821N16826O08345
2020C103222O14379N14010L03706J2234k97741n49657o88200p07676o49350n67412m92045
2031E95470m19475l30815k19379j04243j9148J3974J780k8281m5870k6058M8472J79186L43090
$$ plain form
1951 -3332441 -2534058 -1744023 -974771 -234497 467217 1122120 1731548 2309911 2876285 3440828 3995835
1962 3995835 4514042 4952866 5262930 5398656 5329102 5048609 4584355 3994767 3356486 2745953 2227135
1973 2227135 1848229 1641220 1617415 1758498 2011994 2303483 2564291 2757676 2888972 2996453 3127896
1984 3127896 3313375 3545878 3779886 3950669 4002892 3910938 3683001 3353401 2969453 2576054 2203084 1863967
1996 1863967 1566339 1322585 1147893 1047759 1010875 1017662 1056061 1129333 1250852 1429528 1653783 1886062
2008 1886062 2073010 2164429 2132371 1985158 1769239 1555954 1421200 1427706 1612230 1978051 2494877 3103222
2020 3103222 3717601 4231611 4535317 4547551 4249810 3700153 3011953 2304277 1654927 1087515 595470
2031 595470 175995 -154820 -374199 -478442 -497590 -483616 -481836 -510117 -555987 -582045 -533573 -354387 -11297
2044a1297M97173N97309O20070N72831M87345M04597L59014L65438M14724M82560N43449N76417
2056E909630N61579M79909L23102J05143j37292l56811n11030n74668n45943m44864l01148
2067D507607j39799K2210J69775K87725L65486L98856L86306L25499K14763N7410j35965l48201
2079F111672n57327p37090q58620q96363q37597o89244m77080k41247l2979R4800J09828J9960
2091A008713j30336k82383l84187m02076l28812j86560j6918J39845K62755L50783M05705
2102D36529M16223L63971K46624R2030n1883j41418j57271j10477l3442L7003P5929P9207
2114A253025O2990N5100Q0702J48231K41407L22991L52302L09843K11931J01790K2197j1126
2126C151383j6678k9823p5673j54817k49459l38225m08228m59686n00514n36657n67736n87977
$$ plain form
2044 -11297 485876 1083185 1703255 2276086 2763431 3168028 3527042 3892480 4307204 4789764 5333213 5909630
2056 5909630 6471209 6951118 7274220 7379363 7242071 6885260 6374230 5799562 5253619 4808755 4507607
2067 4507607 4367808 4390018 4559793 4847518 5213004 5611860 5998166 6323665 6538428 6595838 6459873 6111672
2079 6111672 5554345 4817255 3958635 3062272 2224675 1535431 1058351 817104 784125 878925 988753 1008713
2091 1008713 878377 595994 211807 -190269 -519081 -705641 -722559 -582714 -319959 30824 436529
2102 436529 852752 1216723 1463347 1555377 1503494 1362076 1204805 1094328 1060886 1097889 1173818 1253025
2114 1253025 1316015 1371115 1451817 1600048 1841455 2164446 2516748 2826591 3038522 3140312 3162509 3151383
2126 3151383 3134705 3104882 3029209 2874392 2624933 2286708 1878480 1418794 918280 381623 -186113 -774090
2138g74090n87418n54646m82121l70740k30878p9965O4230J94455L21105M66797O50389Q70886
2150e11996J103549J313309J474619J578868J622849J591379J454793J190490Q12258L81030
2160A2011148j6645l10952m80127n49474n65486n65631n59931n35316m79750m03710l37952
2171G206174l09164l14295l17517k76461j76493m2795P8114J47304J50120R7521J9696m4115
2183F218089n8609m767J10973K55254L79815M41563M17813L10546J40608o2211k65525m39613
2195G443936n67025o48005o90223o93439o48259n47218l95183k12860l1208J22123K34658
2206C367297L06941L40651L35435K98087K46241J98518J63802J40083J20596J00833P9387
2217E697871N3052J3728m8597j40952k63578m04847n37807o28488o53769o12027n19828m03828
$$ plain form
2138 -774090 -1361508 -1916154 -2398275 -2769015 -2999893 -3079858 -3015628 -2821173 -2500068 -2033271 -1382882 -511996
2150 -511996 591553 1904862 3379481 4958349 6581198 8172577 9627370 10817860 11630118 12011148
2160 12011148 11994503 11683551 11203424 10653950 10088464 9522833 8962902 8427586 7947836 7544126 7206174
2171 7206174 6897010 6582715 6265198 5988737 5812244 5769449 5847563 5994867 6144987 6242508 6262204 6218089
2183 6218089 6159480 6154713 6265686 6520940 6900755 7342318 7760131 8070677 8211285 8149074 7883549 7443936
2195 7443936 6876911 6228906 5538683 4845244 4196985 3649767 3254584 3041724 3010516 3132639 3367297
2206 3367297 3674238 4014889 4350324 4648411 4894652 5093170 5256972 5397055 5517651 5618484 5697871
2217 5697871 5750923 5764651 5716054 5575102 5311524 4906677 4368870 3740382 3086613 2474586 1954758 1550930
2229A550930k95107k20604j88856j82953j73390j40376q5899k9617M767K858l4490r1047j40280
2242b4064j57020j30878p2341p619L5932M3984J7566l3728r4575j41854j49946j06014k1364
2255h41921P1623J35407J44156R1637r868j35097k56691l58472m39140n01537n41232n47954
2267c189089n14259m39312l25659j75667N169J99417L75742N03065N68092N78784N52541N03286
2279a357890M39840L73028L16965K79296K53515K24969J85775J42856J11654J02645J13947
2290A186600J34190J50574J56956J58099J67160J95594K40136K78289K78572K19387J01067
2301C266624n7973k32172l91840n01487n29717m68559l41641j91891o0474K7085O2206M8786
2313F28947r61p4208j65707k72990l81851m63866m92931m59945l69098k28306n1430J33761
$$ plain form
2229 1550930 1255823 1035219 846363 663410 490020 349644 263745 234128 238895 241753 207263 116216 -24064
2242 -24064 -181084 -311962 -384303 -391922 -355990 -312006 -294440 -328168 -422743 -564597 -714543 -820557 -841921
2255 -841921 -770298 -634891 -490735 -399098 -408966 -544063 -800754 -1159226 -1598366 -2099903 -2641135 -3189089
2267 -3189089 -3703348 -4142660 -4468319 -4643986 -4638817 -4439400 -4063658 -3560593 -2992501 -2413717 -1861176 -1357890
2279 -1357890 -918050 -545022 -228057 51239 304754 529723 715498 858354 970008 1072653 1186600
2290 1186600 1320790 1471364 1628320 1786419 1953579 2149173 2389309 2667598 2946170 3165557 3266624
2301 3266624 3208651 2976479 2584639 2083152 1553435 1084876 743235 551344 490870 517955 580161 628947
2313 628947 627986 553778 388071 115081 -266770 -730636 -1223567 -1683512 -2052610 -2280916 -2332346 -2198585
2325b198585K89551L84418M05604L59361K66907J63173R0964Q3088J43922K47191L51916M23475
2337A010985M43982M07955L15986J76363J0466j46711k56467k94422k63594j91744j18016
2348A094783p9722j01355j84976l08000m33840n26396n59907n28050m48323l50730k55883
2359b682399j63094n5341Q7951K77301N03688P38924R44172J082428J131647J091936R82025
2370C939238Q28060O49133M46470K07180p3619l69438o24883p84255q16828p21235n20499
2381B159324k57686J3696K46091M09883M94257M99783M30117K91322R8688j20793l35372n17352
2393C411958o45355p03115o82389n87987m38309k63720j04748m32L3148J2645k6026n0325
2405d4655m5115j4098K6958N7965O1646L1204k5296q9054j40206j66253j63586j32979p8171
$$ plain form
2325 -2198585 -1909034 -1524616 -1119012 -759651 -492744 -329571 -238607 -155519 -11597 235594 587510 1010985
2337 1010985 1454967 1862922 2178908 2355271 2365737 2219026 1962559 1668137 1404543 1212799 1094783
2348 1094783 1015061 913706 728730 420730 -13110 -539506 -1099413 -1627463 -2075786 -2426516 -2682399
2359 -2682399 -2845493 -2900834 -2812883 -2535582 -2031894 -1292970 -348798 733630 1865277 2957213 3939238
2370 3939238 4767298 5416431 5862901 6070081 5996462 5627024 5002141 4217886 3401058 2679823 2159324
2381 2159324 1901638 1915334 2161425 2571308 3065565 3565348 3995465 4286787 4385475 4264682 3929310 3411958
2393 3411958 2766603 2063488 1381099 793112 354803 91083 -13665 -14097 19051 31696 5670 -44655
2405 -44655 -89770 -103868 -76910 -18945 42701 73905 48609 -40445 -180651 -346904 -510490 -643469 -721640
2418g21640r661N5399J04819J45860K04575L04341M44126N99440P41838Q53215R24995R52684
2430D599991R35154Q75571P80301O58271N22600L90696K79658K00796J58126J49991J68478
2441I719633J97683K19540K26370K24374K20810K09988J74915R9685k4228j99674m21278o67152
2453I980666q99259j077129j172227j172235j077888r03445o81715m60324k82479j66248r8650
2464A989067m9437M616O5711J23337J70118K03438K15508J93372J34389N7444n325k7792j794
2477C072652O5294J59478K65624L67491M47852M93355M99843M70593M09305L18067K01308
2488F770862O8628o5807j83548k62557k82999k38685j44072k7996Q1341J67198K24544K52475
2500F359384K45495J91517Q2264p0272k28928l47906l99072l85653l33190k69111k09925j60888
$$ plain form
2418 -721640 -731301 -675902 -571083 -425223 -220648 83693 527819 1127259 1869097 2722312 3647307 4599991
2430 4599991 5535145 6410716 7191017 7849288 8371888 8762584 9042242 9243038 9401164 9551155 9719633
2441 9719633 9917316 10136856 10363226 10587600 10808410 11018398 11193313 11292998 11268770 11069096 10647818 9980666
2453 9980666 9081407 8004278 6832051 5659816 4581928 3678483 2996768 2536444 2253965 2087717 1989067
2464 1989067 1939630 1944246 2009957 2133294 2303412 2506850 2722358 2915730 3050119 3107563 3102238 3074446 3072652
2477 3072652 3137946 3297424 3563048 3930539 4378391 4871746 5371589 5842182 6251487 6569554 6770862
2488 6770862 6839490 6773683 6590135 6327578 6044579 5805894 5661822 5633826 5715167 5882365 6106909 6359384
2500 6359384 6604879 6796396 6878660 6808388 6579460 6231554 5832482 5446829 5113639 4844528 4634603 4473715
2512D473715j21657r2963p9748q6906j12349j46125j76476j97649k13852k35783k72511l25888
2524B411808l89935m49502m78990m50763l52782j97364j0787J81866L60833N08447O10420
2535A743251O63761O81151O82544O78986O65557O31373N75675N12424M57807M13358L62548
2546H068435K85108J75482N1010n5710j15518j23172j03286r2082j10859j56400k12541k66128
2558G344339l11528l44198l54392l28093k55342j41527j0587J07032J93160K48273K79362
2569F426499K85124K58135J99576J23430M2697m3912j44783k53300l37701l57103k89497j48884
2581E760281J8502J57766K33138K39432J90817J02730j3028j40399k56629l44167m03786m53110
2593E091547n12648n92349o84479p62173p86222p23528n71020l65502j63991p837R7238J70518
$$ plain form
2512 4473715 4352058 4259095 4179347 4092441 3980092 3833967 3657491 3459842 3245990 3010207 2737696 2411808
2524 2411808 2021873 1572371 1093381 642618 289836 92472 81685 263551 624384 1132831 1743251
2535 1743251 2407012 3088163 3770707 4449693 5115250 5746623 6322298 6834722 7292529 7705887 8068435
2546 8068435 8353543 8529025 8580035 8524325 8408807 8285635 8182349 8090267 7979408 7823008 7610467 7344339
2558 7344339 7032811 6688613 6334221 6006128 5750786 5609259 5598672 5705704 5898864 6147137 6426499
2569 6426499 6711623 6969758 7169334 7292764 7335461 7291549 7146766 6893466 6555765 6198662 5909165 5760281
2581 5760281 5778783 5936549 6169687 6409119 6599936 6702666 6689638 6549239 6292610 5948443 5544657 5091547
2593 5091547 4578899 3986550 3302071 2539898 1753676 1030148 459128 93626 -70365 -78202 19036 189554
2605A89554K30994K81086L08882L01665K56548J83336J00409K5771k9186n7727n3521j2762
2617A725049N8546J44807K31265L12510L89911M63467N27538N72770N88386N61827M80698
2628F056774L41472J60068k6713j73790k47191k39941j75659r4671l1169P72M876o699k2101
2641E546028l7463o1055j07524j82231k68104l30308l38118k84960j90884q8862p917L4708
2653C683310L1930j4501r1000j70827k18713k02406j10428L3503J73898K48189K17092Q0625
2665C660672j26298l52209n52677p07743q21839r09867r84294j049752j100105j117453j077439
2676e139004r60785p65480n12202k38129K1172K49823M53960O43096Q07912R20586R60571
2687c558480R38961Q96027Q73897Q88252R24345R59942R88245J015657J040567J041819R92262
$$ plain form
2605 189554 420548 701634 1010516 1312181 1568729 1752065 1852474 1878245 1849059 1791332 1737811 1725049
2617 1725049 1783595 1928402 2159667 2472177 2862088 3325555 3853093 4425863 5014249 5576076 6056774
2628 6056774 6398246 6558314 6531601 6357811 6110620 5870679 5695020 5600349 5569180 5569952 5574828 5568129 5546028
2641 5546028 5508565 5447510 5339986 5157755 4889651 4559343 4221225 3936265 3745381 3656519 3648602 3683310
2653 3683310 3715240 3700739 3609739 3438912 3220199 3017793 2907365 2940868 3114766 3362955 3580047 3660672
2665 3660672 3534374 3182165 2629488 1921745 1099906 190039 -794255 -1844007 -2944112 -4061565 -5139004
2676 -5139004 -6099789 -6865269 -7377471 -7615600 -7594428 -7344605 -6890645 -6247549 -5439637 -4519051 -3558480
2687 -3558480 -2619519 -1723492 -849595 38657 963002 1922944 2911189 3926846 4967413 6009232 7001494
2698G001494Q83807P40160O05277N16219M79128M64811M27724L34197J77739k5105k48111
2709A1357340m65351o55469q04887r09492r69317r82201r43946q53758p18962n57784l94866
2720C101307k48922j23871j3455Q6001J67151K13786K11218J55257N1285r3223k72141m76596
2732B757797o89218q80335j012350j055443j000520q60389o62578m42124k34911p0331L3780
2743d116622P2583N6064O706m9773r2877j07970q3228j4547Q3586J78519K40606K69043K94809
2756c263101L53601M51505N54829O13383N94400M97574L46860J78925L5694m8667o7303m8582
2768A99118l9854p7252j67270k91543m20559n23287n74509n60589m77617l26840j17052J28411
2780c248843L69131N53240O32027N81882M22102K12939K9372p6588j00872q3584q0918j31561
$$ plain form
2698 7001494 7885301 8625461 9230738 9746957 10226085 10690896 11118620 11452817 11630556 11605451 11357340
2709 11357340 10891989 10236520 9431633 8522141 7552824 6570623 5626677 4772919 4053957 3496173 3101307
2720 3101307 2852385 2728514 2715059 2801060 2968211 3181997 3393215 3548472 3599757 3506534 3234393 2757797
2732 2757797 2068579 1188244 175894 -879549 -1880069 -2740458 -3403036 -3845160 -4080071 -4150402 -4116622
2743 -4116622 -4044039 -3987975 -3981269 -4031042 -4123919 -4231889 -4315117 -4329664 -4246078 -4067559 -3826953 -3557910 -3263101
2756 -3263101 -2909500 -2457995 -1903166 -1289783 -695383 -197809 149051 327976 363670 315003 247700 199118
2768 199118 159264 82012 -85258 -376801 -797360 -1320647 -1895156 -2455745 -2933362 -3260202 -3377254 -3248843
2780 -3248843 -2879712 -2326472 -1694445 -1112563 -690461 -477522 -448150 -524738 -625610 -709194 -790112 -921673
2792i21673k35718l55166m34723m34565l51540k11360m2802J38293L22613M92340O18108O72405
2804g43788O46375N54927M26626K87347J50683J9907j03880k12809k88788l11912k75275j93110
2816d3697r5913j6951J9532J572p3447j99359l56352n09319o15879o40073n65200m01389j84202
2829c680677L6656K15774L30097L87010M17804M58027N23938O01794O59743O73020O42117
2840A265303N91077N49636N33081N31529N12909M41784L05926J28409m6454j76872k35799
2851D400529k14096j25886j1648P4526R0431K3968j07403k69260m23527n38406n94006n82120
2863A723102n03987l74791k28889j05859k2456L8070J05213J92355K87990L69750M21425M36196
2875B338119M09486L36737K20285P5055p3893j98399k74526k87428k33196j22782J2534J25416
$$ plain form
2792 -921673 -1157391 -1512557 -1947280 -2381845 -2733385 -2944745 -2987547 -2849254 -2526641 -2034301 -1416193 -743788
2804 -743788 -97413 457514 884140 1171487 1322170 1342077 1238197 1025388 736600 424688 149413 -43697
2816 -43697 -139610 -156561 -137029 -135457 -208904 -408263 -764615 -1273934 -1889813 -2529886 -3095086 -3496475 -3680677
2829 -3680677 -3644021 -3428247 -3098150 -2711140 -2293336 -1835309 -1311371 -709577 -49834 623186 1265303
2840 1265303 1856380 2406016 2939097 3470626 3983535 4425319 4731245 4859654 4813200 4636328 4400529
2851 4400529 4186433 4060547 4048899 4123425 4213856 4237824 4130421 3861161 3437634 2899228 2305222 1723102
2863 1723102 1219115 844324 615435 509576 487120 525190 630403 822758 1110748 1480498 1901923 2338119
2875 2338119 2747605 3084342 3304627 3379682 3305789 3107390 2832864 2545436 2312240 2189458 2201992 2327408
2887B327408J68827J14281l5075k39962m34371n50611n49857m39263k63040p5038Q5896K03617
2899C12812K76551L05972K94383K53424K05156J68576J46263J27906J03481O7851J6115n7873
2911B220617j56102k69875l78458m54697m75126m28856l21539j74647k0267J07353J81322
2922a70275J90658J44539O8690l676m3976m0729l733M6640R4177J30640J51592J55400J45755
2935H65702J29578J10376Q6312N6453K4374r805o0608j54789l09376n06098o91257q08249
2947a267387q35539p95836p30994o67357o01155n10392l74635j84654N7334L35117O14527
2958d960971Q50768J009070J081103J080669J027829R41772Q43784P54832O82145O08548N02084
2969D421633L41845J35586q1564k60086l57318l59789k89107j86080q7341j1301M0139P0924
$$ plain form
2887 2327408 2496235 2610516 2575441 2335479 1901108 1350497 800640 361377 98337 23299 109195 312812
2899 312812 589363 895335 1189718 1443142 1648298 1816874 1963137 2091043 2194524 2262375 2278490 2220617
2911 2220617 2064515 1794640 1416182 961485 486359 57503 -264036 -438683 -458950 -351597 -170275
2922 -170275 20383 164922 233612 229936 185960 145231 141498 188138 282315 412955 564547 719947 865702
2935 865702 995280 1105656 1191968 1248421 1272795 1262990 1202382 1047593 738217 232119 -459138 -1267387
2947 -1267387 -2102926 -2898762 -3629756 -4297113 -4898268 -5408660 -5783295 -5967949 -5910615 -5575498 -4960971
2958 -4960971 -4110203 -3101133 -2020030 -939361 88468 1030240 1874024 2628856 3311001 3919549 4421633
2969 4421633 4763478 4899064 4817500 4557414 4200096 3840307 3551200 3365120 3277779 3266478 3306617 3377541
2981C377541Q2425P1184K9308n2063j74788l26661m79513n93376o29779n69519m20872k14386
2993I9501J0246K19429L94401N27244O12074O45043O31208N85714N21893M37305L16732J53269
3005E154059l2893j96353k90027k91462k10367p7330O8553J87626K49892K45777J87128R5562
3017E090165j3410j37034k74354m09179n09207n46576n20172m57344l95548l60629l56572
3028A110140l70889l86884l89638l65009k99800j85154k1185J78723L86168N62001O67632
3039H86105O78556N92977M32392K34503L8341j29602k54581l20921l08668k08214l5090J72435
3051A778233L68751N17913O04210O32793O22310N96649N79825N88786O22936O62406O80727
3062H255539O59960N96855N00581L85374K62473J36589J0085j09212k05880k65804k87233
$$ plain form
2981 3377541 3459966 3531150 3560458 3508395 3333607 3006946 2527433 1934057 1304278 734759 313887 99501
2993 99501 109747 329176 723577 1250821 1862895 2507938 3139146 3724860 4246753 4684058 5000790 5154059
3005 5154059 5121166 4924813 4634786 4343324 4132957 4055627 4124180 4311806 4561698 4807475 4994603 5090165
3017 5090165 5076755 4939721 4665367 4256188 3746981 3200405 2680233 2222889 1827341 1466712 1110140
3028 1110140 739251 352367 -37271 -402280 -702080 -887234 -908419 -729696 -343528 218473 886105
3039 886105 1564661 2157638 2590030 2824533 2862874 2733272 2478691 2157770 1849102 1640888 1605798 1778233
3051 1778233 2146984 2664897 3269107 3901900 4524210 5120859 5700684 6289470 6912406 7574812 8255539
3062 8255539 8915499 9512354 10012935 10398309 10660782 10797371 10807456 10698244 10492364 10226560 9939327
3073I939327k82819k72111k71277k87373l19911l63937m08773m37715m35123l97299l37730
3084F125259k81372k51710k59803l00730l55955l99599m07527l66870k84886j89867j16574
3095B910366q6770j03270j58164k42138l48365m71573o03251p27264q22764q72329q64128
3106b389650p87335o36270m26187j97631L830J52583K48594L04616L31319L33103L14433K84209
3118b464386K50971K18618J91655J80833J96608K34899K71495K73183K15414R4232p0992k46326
3130f53796m00550n15857n85681o10252n95228n50475m88724m22873l60083k99197k35501
3141e718217j64527q2056J1805J05314J77377K10531K03061J73791J57055J83251K53860L34994
3153d153761L80716L64316K88795J74447M3999q0863j76957k21398j99186j11978J6766J47039
$$ plain form
3073 9939327 9656508 9384397 9113120 8825747 8505836 8141899 7733126 7295411 6860288 6462989 6125259
3084 6125259 5843887 5592177 5332374 5031644 4675689 4276090 3868563 3501693 3216807 3026940 2910366
3095 2910366 2823596 2720326 2562162 2320024 1971659 1500086 896835 169571 -653193 -1525522 -2389650
3106 -2389650 -3176985 -3813255 -4239442 -4437073 -4433243 -4280660 -4032066 -3727450 -3396131 -3063028 -2748595 -2464386
3118 -2464386 -2213415 -1994797 -1803142 -1622309 -1425701 -1190802 -919307 -646124 -430710 -336478 -407470 -653796
3130 -653796 -1054346 -1570203 -2155884 -2766136 -3361364 -3911839 -4400563 -4823436 -5183519 -5482716 -5718217
3141 -5718217 -5882744 -5964800 -5952995 -5847681 -5670304 -5459773 -5256712 -5082921 -4925866 -4742615 -4488755 -4153761
3153 -4153761 -3773045 -3408729 -3119934 -2945487 -2901488 -2982351 -3159308 -3380706 -3579892 -3691870 -3675104 -3528065
3165c528065K42594K94066L21980L55509M08930M75944N39918N85406O01558N81690N25664
3176A405194M41897L43190K39731J37750M3897l3694r0470j28549j54707j75951j92424j91392
3188A644472j51092n5513Q8553K43397L52121L66735K73059R7197j04149k65697l42810l30532
3200A815741k56960j59335o4360J4555O9606R5421R2574O9406M0309K1912K6123N4107J00042
3213A919141J61420K40764L35575M29725M96365N11216M68617L88030L02874K39784K06328
3224E699839J95707J99649K14208K37208K63580K82915K81261K46626J71276N1498j08852
3235G734915k90978m58158n65172n80309n04232l68686k15226p6204K9284R3986J25512J43874
3247E068606J66049J89473J91822J48267N0194q8497k40829l84090n13583o41152p76653r09421
$$ plain form
3165 -3528065 -3285471 -2991405 -2669425 -2313916 -1904986 -1429042 -889124 -303718 297840 879530 1405194
3176 1405194 1847091 2190281 2430012 2567762 2611659 2577965 2487495 2358946 2204239 2028288 1835864 1644472
3188 1644472 1493380 1437867 1526420 1769817 2121938 2488673 2761732 2858929 2754780 2489083 2146273 1815741
3200 1815741 1558781 1399446 1335086 1349641 1419247 1514668 1607242 1676648 1716957 1738869 1764992 1819099 1919141
3213 1919141 2080561 2321325 2656900 3086625 3582990 4094206 4562823 4950853 5253727 5493511 5699839
3224 5699839 5895546 6095195 6309403 6546611 6810191 7093106 7374367 7620993 7792269 7843767 7734915
3235 7734915 7443937 6985779 6420607 5840298 5336066 4967380 4752154 4675950 4705234 4799220 4924732 5068606
3247 5068606 5234655 5424128 5615950 5764217 5814411 5725914 5485085 5100995 4587412 3946260 3169607 2260186
3259B260186j009110j043097r91974q55076o50686m12087j75262L6833K19369L72237M82375
3270a766292N25849M90650L95943K88198K16252K03017K35578K79960L05744L00096K62717
3281A737712J93740R2537l1369j50925k29065k39170j86211j12845q3154j52798l41869o23020
3293a26437r29422j175635j283388j210322r70248o24861k49432R6808L76038N64511O48583
3304d883805O26473N11530L32968J31391m9777j75415k30365k25070j89348j56015j43287
3315d450720j47451j53419j55065j64693k01294k68175l38899l61981k84142q0797K25750
3326f380886N75554R00596J149423J290795J306688J192845R66367O66252L41911L9791k03525
3337A845811l65968m44181m49638l97535l03125j89784r2524m5285o4082j42459k58337l82400
$$ plain form
3259 2260186 1251076 207979 -783995 -1639071 -2289757 -2701844 -2877106 -2840273 -2620904 -2248667 -1766292
3270 -1766292 -1240443 -749793 -353850 -65652 150600 353617 589195 869155 1174899 1474995 1737712
3281 1737712 1931452 2023989 1992620 1841695 1612630 1373460 1187249 1074404 991250 838452 496583 -126437
3293 -126437 -1055859 -2231494 -3514882 -4725204 -5695452 -6320313 -6569745 -6472937 -6096899 -5532388 -4883805
3304 -4883805 -4257332 -3745802 -3412834 -3281443 -3331220 -3506635 -3737000 -3962070 -4151418 -4307433 -4450720
3315 -4450720 -4598171 -4751590 -4906655 -5071348 -5272642 -5540817 -5879716 -6241697 -6525839 -6606636 -6380886
3326 -6380886 -5805332 -4904736 -3755313 -2464518 -1157830 35015 1001382 1667634 2009545 2049336 1845811
3337 1845811 1479843 1035662 586024 188489 -114636 -304420 -396944 -442229 -506311 -648770 -907107 -1289507
3349a289507m85752n48295n65121n44754m97982m25902l20302j79968k5764J05928J85877
3360d591542K06249J76850J14296L5054m6398j13877j42891j00820L8516K74546N72520Q75335
3372b702162J125028J281693J334155J298314J203751J077808R36447P83877O17946M38092
3382G394949K52931Q2406n0643j33735j67601j56341j02074j5617P1572J13987P7140l7443
3394G329531j87199l11118l65615l43648k64925j53715k4722J15818K57589L76440M41353
$$ plain form
3349 -1289507 -1775259 -2323554 -2888675 -3433429 -3931411 -4357313 -4677615 -4857583 -4883347 -4777419 -4591542
3360 -4591542 -4385293 -4208443 -4094147 -4059093 -4105491 -4219368 -4362259 -4463079 -4424563 -4150017 -3577497 -2702162
3372 -2702162 -1577134 -295441 1038714 2337028 3540779 4618587 5555034 6338911 6956857 7394949
3382 7394949 7647880 7730286 7679643 7545908 7378307 7221966 7119892 7104275 7175847 7289834 7366974 7329531
3394 7329531 7142332 6831214 6465599 6121951 5857026 5703311 5678589 5794407 6051996 6428436 6869789
$$ [...]
##END=	
