##TITLE=	labeled_M9_sacculi 13C 1D and 2D.28.fid
##JCAMPDX=	6.0	$$ NMR Plug-in 1.13 of MestReNova 11.0.4-18998
##DATATYPE=	NMRSPECTRUM
##DATACLASS=	XYDATA
##NUMDIM=	1
##ORIGIN=	Bruker BioSpin GmbH
##OWNER=	ecaudill
##.OBSERVEFREQUENCY=	125.72761525999999321
##.OBSERVENUCLEUS=	^13C
##.SOLVENTNAME=	
##.PULSESEQUENCE=	cp
##LONGDATE=	2018/11/14 17:55:47.000
##.ACQUISITIONMODE=	SIMULTANEOUS (DQD)
##$ORIGINALFORMAT=	Bruker XWIN-NMR
##$PARAMETERFILE=	(acqus, ASCII, d:/Desktop/labeled_M9_sacculi%2013C%201D%20and%202D/28/acqus, 0)
$$ ##TITLE= Parameter file, TOPSPIN		Version 3.2
$$ ##JCAMPDX= 5.0
$$ ##DATATYPE= Parameter Values
$$ ##NPOINTS= 7	$$ modification sequence number
$$ ##ORIGIN= Bruker BioSpin GmbH
$$ ##OWNER= ecaudill
$$ $$ 2018-11-14 17:55:47.368 -0600  ecaudill@devon.nmrfam.wisc.edu
$$ $$ /home/ecaudill/NMR/labeled_M9_sacculi 13C 1D and 2D/28/acqus
$$ $$ process /opt/topspin_CPMAS/prog/mod/go
$$ ##$ACQT0= 0
$$ ##$AMP= (0..31)
$$ 100 100 100 100 100 100 100 100 100 100 100 100 100 100 100 100 100 100
$$ 100 100 100 100 100 100 100 100 100 100 100 100 100 100
$$ ##$AMPCOIL= (0..19)
$$ 0 0 0 0 0 0 0 0 0 0 0 0 0 0 0 0 0 0 0 0
$$ ##$ANAVPT= -1
$$ ##$AQSEQ= 0
$$ ##$AQ_mod= 1
$$ ##$AUNM= <au_zgonly>
$$ ##$AUTOPOS= <>
$$ ##$BF1= 125.715042
$$ ##$BF2= 499.96
$$ ##$BF3= 499.96
$$ ##$BF4= 499.96
$$ ##$BF5= 499.96
$$ ##$BF6= 499.96
$$ ##$BF7= 499.96
$$ ##$BF8= 499.96
$$ ##$BYTORDA= 0
$$ ##$CAGPARS= (0..11)
$$ 0 0 0 0 0 0 0 0 0 0 0 0
$$ ##$CFDGTYP= 0
$$ ##$CFRGTYP= 9
$$ ##$CHEMSTR= <none>
$$ ##$CNST= (0..63)
$$ 1 1 1 1 1 1 1 1 1 1 1 0 1 1 1 1 1 1 1 1 1 0 1 1 1 0 1 1 1 1 1 5000 1 1
$$ 1 1 1 1 1 1 1 1 1 1 1 1 1 1 1 1 1 1 1 1 1 1 1 1 1 1 1 1 1 1
$$ ##$CPDPRG= (0..8)
$$ <> <> <swftppm_13> <> <> <> <> <> <>
$$ ##$D= (0..63)
$$ 0 5 0 0 0 0 0 0 0 0 0 0 0 0 0 0 0 0 0 0 0 0 0 0 0 0 0 0 0 0 0 0 0 0 0 0
$$ 0 0 0 0 0 0 0 0 0 0 0 0 0 0 0 0 0 0 0 0 0 0 0 0 0 0 0 0
$$ ##$DATE= 1542239747
$$ ##$DE= 7.699996
$$ ##$DECBNUC= <off>
$$ ##$DECIM= 532
$$ ##$DECNUC= <off>
$$ ##$DECSTAT= 4
$$ ##$DIGMOD= 3
$$ ##$DIGTYP= 12
$$ ##$DQDMODE= 0
$$ ##$DR= 21
$$ ##$DS= 16
$$ ##$DSPFIRM= 4
$$ ##$DSPFVS= 21
$$ ##$DTYPA= 0
$$ ##$EXP= <4mm_CPMAS_13C_CP_100KHz.lz.2016>
$$ ##$F1LIST= <>
$$ ##$F2LIST= <>
$$ ##$F3LIST= <>
$$ ##$FCUCHAN= (0..9)
$$ 0 1 2 0 0 0 0 0 0 0
$$ ##$FL1= 90
$$ ##$FL2= 90
$$ ##$FL3= 90
$$ ##$FL4= 90
$$ ##$FOV= 20
$$ ##$FQ1LIST= <freqlist>
$$ ##$FQ2LIST= <hetcor.jos>
$$ ##$FQ3LIST= <freqlist>
$$ ##$FQ4LIST= <freqlist>
$$ ##$FQ5LIST= <freqlist>
$$ ##$FQ6LIST= <freqlist>
$$ ##$FQ7LIST= <freqlist>
$$ ##$FQ8LIST= <freqlist>
$$ ##$FRQLO3= 1.79769313486232e+308
$$ ##$FRQLO3N= 0
$$ ##$FS= (0..7)
$$ 83 83 83 83 83 83 83 83
$$ ##$FTLPGN= 0
$$ ##$FW= 625000
$$ ##$FnMODE= 0
$$ ##$FnTYPE= 0
$$ ##$GPNAM= (0..31)
$$ <> <> <> <> <> <> <> <> <> <> <> <> <> <> <> <> <> <> <> <> <> <> <> <>
$$ <> <> <> <> <> <> <> <>
$$ ##$GPX= (0..31)
$$ 0 0 0 0 0 0 0 0 0 0 0 0 0 0 0 0 0 0 0 0 0 0 0 0 0 0 0 0 0 0 0 0
$$ ##$GPY= (0..31)
$$ 0 0 0 0 0 0 0 0 0 0 0 0 0 0 0 0 0 0 0 0 0 0 0 0 0 0 0 0 0 0 0 0
$$ [...]
$$ 0 0 0 0 0 0 0 0
$$ ##$SguType= 2
$$ ##$ShimPowMaxUA= (0..63)
$$ 130000 130000 130000 130000 130000 130000 130000 130000 130000 130000 130000
$$ 130000 130000 130000 130000 130000 130000 130000 130000 130000 130000 130000
$$ 130000 130000 130000 130000 130000 130000 130000 130000 130000 130000 130000
$$ 130000 130000 130000 130000 130000 130000 130000 0 0 0 0 0 0 0 0 0 0 0
$$ 0 0 0 0 0 0 0 0 0 0 0 0 0
$$ ##$ShimPowMaxUC= (0..63)
$$ 130000 130000 130000 130000 130000 130000 130000 130000 130000 130000 130000
$$ 130000 130000 130000 130000 130000 130000 130000 130000 130000 130000 130000
$$ 130000 130000 130000 130000 130000 130000 130000 130000 130000 130000 130000
$$ 130000 130000 130000 130000 130000 130000 130000 0 0 0 0 0 0 0 0 0 0 0
$$ 0 0 0 0 0 0 0 0 0 0 0 0 0
$$ ##$ShimPowMaxUG= (0..63)
$$ 524287 524287 524287 524287 524287 524287 524287 524287 524287 524287 524287
$$ 524287 524287 524287 524287 524287 524287 524287 524287 524287 524287 524287
$$ 524287 524287 524287 524287 524287 524287 524287 524287 524287 524287 524287
$$ 524287 524287 524287 524287 524287 524287 0 0 0 0 0 0 0 0 0 0 0 0 0 0 0
$$ 0 0 0 0 0 0 0 0 0 0
$$ ##$ShimPowRcbType= 3
$$ ##$ShimPowRes= (0..63)
$$ 1e-20 1e-20 1e-20 1e-20 1e-20 1e-20 1e-20 1e-20 1e-20 1e-20 1e-20 1e-20
$$ 1e-20 1e-20 1e-20 1e-20 1e-20 1e-20 1e-20 1e-20 1e-20 1e-20 1e-20 1e-20
$$ 1e-20 1e-20 1e-20 1e-20 1e-20 1e-20 1e-20 1e-20 1e-20 1e-20 1e-20 1e-20
$$ 1e-20 1e-20 1e-20 1e-20 0 0 0 0 0 0 0 0 0 0 0 0 0 0 0 0 0 0 0 0 0 0 0 0
$$ ##$ShimPowRng0= (0..63)
$$ 1 1 1 1 1 1 1 1 1 1 1 1 1 1 1 1 1 1 1 1 1 1 1 1 1 1 1 1 1 1 1 1 1 1 1 1
$$ 1 1 1 1 0 0 0 0 0 0 0 0 0 0 0 0 0 0 0 0 0 0 0 0 0 0 0 0
$$ ##$ShimPowRng1= (0..63)
$$ 1 1 1 1 1 1 1 1 1 1 1 1 1 1 1 1 1 1 1 1 1 1 1 1 1 1 1 1 1 1 1 1 1 1 1 1
$$ 1 1 1 1 0 0 0 0 0 0 0 0 0 0 0 0 0 0 0 0 0 0 0 0 0 0 0 0
$$ ##$ShimPowRng2= (0..63)
$$ 1 1 1 1 1 1 1 1 1 1 1 1 1 1 1 1 1 1 1 1 1 1 1 1 1 1 1 1 1 1 1 1 1 1 1 1
$$ 1 1 1 1 0 0 0 0 0 0 0 0 0 0 0 0 0 0 0 0 0 0 0 0 0 0 0 0
$$ ##$ShimPowRng3= (0..63)
$$ 1 1 1 1 1 1 1 1 1 1 1 1 1 1 1 1 1 1 1 1 1 1 1 1 1 1 1 1 1 1 1 1 1 1 1 1
$$ 1 1 1 1 0 0 0 0 0 0 0 0 0 0 0 0 0 0 0 0 0 0 0 0 0 0 0 0
$$ ##$ShimSysFunc= (0..63)
$$ 1 2 3 4 5 6 7 8 9 10 0 37 38 35 16 15 14 13 12 11 28 27 26 25 24 23 36
$$ 22 30 29 20 21 34 33 32 31 17 18 19 0 0 0 0 0 0 0 0 0 0 0 0 0 0 0 0 0 0
$$ 0 0 0 0 0 0 0
$$ ##$ShimSysMatrix= 0
$$ ##$ShimSysType= 4
$$ ##$TFXNUM= 0
$$ ##$TRIPLO2= 0
$$ ##$VTU= 1
$$ ##$VTUETH= <no>
$$ ##$VTUTY= <tty05>
$$ ##$WBREFAM= (0..15)
$$ 99.6 100 100 100 100 100 100 100 100 100 100 100 100 100 100 100
$$ ##$WBREFLM= (0..15)
$$ 1 0 0 0 0 0 0 0 0 0 0 0 0 0 0 0
$$ ##$WBREFPH= (0..15)
$$ 0.22 0 0 0 0 0 0 0 0 0 0 0 0 0 0 0
$$ ##$WBSGU= (0..15)
$$ 0 0 0 0 0 0 0 0 0 0 0 0 0 0 0 0
$$ ##$XFAC= 2
$$ ##END=
$$ 
##$DECIM=	532
##$DSPFVS=	21
##XUNITS=	HZ
##YUNITS=	ARBITRARY UNITS
##FIRSTX=	31076.552771952072362
##LASTX=	-6499.0757524841064878
##XFACTOR=	-18.356437969924854769
##YFACTOR=	1.0000000000000000871e-07
##NPOINTS=	2048
##XYDATA=	(X++(Y..Y))
$$ plain form
-1692 -2477778 -1246089 691559 2196176 2987862 3128112 2515742 1333787 441726 513930 879217 95194
-1681 95194 -1962943 -3357464 -2276585 350503 1502419 -363416 -3254555 -3881241 -1443659 1740359
-1671 1740359 3208304 2785065 1621981 -38856 -2807592 -6096260 -7602843 -5656495 -1440560 1954188
-1661 1954188 2469412 430167 -2704811 -5796481 -7916673 -7958756 -5568853 -2186473 16685 478746
-1651 478746 544484 933084 43779 -3806713 -8854820 -10535496 -6669809 -788249 1448473 -1052973
-1641 -1052973 -3510259 -1406729 3611836 5791729 2711176 -1608483 -1998479 1174921 2747218 -197225
-1631 -197225 -4401511 -4739512 -866532 2545404 1984652 -664163 -1137862 1384593 3361002 1617790
-1621 1617790 -2709881 -5692747 -4972123 -1596345 1846963 3656326 3649953 2648535 1851899 1868366 1732374
$$ packed form
-1692b477778J231689J937648J504617P91686J40250o12370j181955q92061P2204L65287p84023
-1681I5194k058137j394521J080879K627088J151916j865835k891139o26686K437582L184018
-1671A740359J467945m23239j163084j660837k768736l288668j506583J946348M215935L394748
-1661A954188N15224k039245l134978l091670k120192m2083K389903L382380K203158M62061
-1651D78746O5738L88600q89305l850492n048107j680676L865687N881560K236722k501446
-1641a052973k457286K103530N018565K179893l080553m319659l89996L173400J572297k944443
-1631a97225m204286l38001L872980L411936n60752k648815m73699K522455J976409j743212
-1621A617790m327671k982866P20624L375778L443308J809363o373j001418p96636J6467j35992
$$ plain form
-1610 1732374 -320588 -4186115 -6749731 -5035198 -492967 1813843 -530210 -3409226 -816706 6972042
-1600 6972042 12546607 9931427 1993992 -3071627 -1800408 991094 -570093 -5480835 -7700958 -4574508
-1590 -4574508 -63520 1031157 -872019 -2032548 -1523994 -2179061 -5266377 -7408959 -4902194 578922
-1580 578922 3357939 773125 -3633468 -4936846 -2932021 -1534652 -3055128 -5505616 -6046785 -5017670
-1570 -5017670 -4916163 -6367522 -7104822 -5189967 -1726641 495853 161945 -1797527 -4061879 -6199926
-1560 -6199926 -7843230 -7747623 -4747546 467855 5248640 6993399 5263305 2057824 165259 924655
-1550 924655 3058631 3711006 1223300 -2863771 -5087829 -3788922 -1109827 -539950 -2686779 -4564795
-1540 -4564795 -3469491 -517458 766866 -1045061 -3586693 -3839369 -1762020 190116 424553 -324350
$$ packed form
-1610A732374k052962l865527k563616J714533M542231K306810k344053k879016K592520P788748
-1600F972042N574565k615180p937435n065619J271219K791502j561187m910742k220123L126450
-1590d574508M510988J094677j903176j160529N08554o55067l087316k142582K506765N481116
-1580E78922K779017k584814m406593j303378K004825J397369j520476k450488n41169J029115
-1570e017670J01507j451359p37300J914855L463326K222494l33908j959472k264352k138047
-1560f199926j643304R5607L000077N215401M780785J744759j730094l205481j892565P59396
-1550I24655K133976O52375k487706m087071k224058J298907K679095N69877k146829j878016
-1540d564795J095304K952033J284324j811927k541632k52676K077349J952136K34437p48903
$$ plain form
-1530 -324350 -879762 -1501390 -3041660 -5154324 -6569488 -6831756 -6486238 -5449369 -2687258 1550595
-1520 1550595 4362351 2906078 -1512270 -3870459 -1042764 4051109 5406918 806595 -5744079 -8782880
-1510 -8782880 -7178074 -4117448 -2412764 -1734855 -676659 301318 -551699 -3411504 -6145573 -6755063
-1500 -6755063 -5558025 -4386936 -4281914 -4700239 -4666360 -3919923 -2927886 -2393594 -2844500 -4082351 -4844128
-1489 -4844128 -3756138 -1205565 362476 -975418 -3910274 -4958497 -2651649 407910 668623 -1900323
-1479 -1900323 -3952044 -3398952 -2215189 -3507860 -6908634 -8762053 -6985060 -3962758 -3468263 -5712263
-1469 -5712263 -7113293 -5026291 -1231273 149374 -2529962 -6723436 -8636834 -7008455 -3781213 -1737107
-1459 -1737107 -1962103 -3291847 -3712967 -2328633 -254846 446674 -1045430 -3294122 -4091808 -2872098
$$ packed form
-1530c24350n55412o21628j540270k112664j415164k62268L45518J036869K762111M237853
-1520A550595K811756j456273m418348k358189K827695N093873J355809m600323o550674l038801
-1510h782880J604806L060626J704684O77909J058196R77977q53017k859805k734069o09490
-1500f755063J197038J171089J05022m18325L3879P46437R92037N34292m50906j237851p61777
-1489d844128J087990K550573J568041j337894k934856j048223K306848L059559K60713k568946
-1479a900323k051721N53092J183763j292671l400774j853419J776993L022302M94495k244000
-1469e712263j401030K087002L795018J380647k679336m193474j913398J628379L227242K044106
-1459a737107k24996j329744m21120J384334K073787P01520j492104k248692p97686J219710
$$ plain form
-1449 -2872098 -1158643 -582473 -1148298 -1895725 -2554694 -3443660 -3849312 -1975593 2459359 6326537
-1439 6326537 5414477 -763562 -7391989 -8601037 -3320466 3600527 6165791 2812666 -2654699 -5114110
-1429 -5114110 -2863749 1212966 2696797 -88230 -4504609 -6282849 -3896558 -33881 1591006 468086
-1419 468086 -593711 345739 1396237 -665093 -5509902 -8762001 -7164135 -2865402 -918128 -2908848
-1409 -2908848 -4989089 -2970055 2111197 5099855 2881021 -2302349 -6026184 -6622752 -5827144 -5534615
-1399 -5534615 -5671404 -5284741 -4088754 -2145554 724629 3881336 4994419 2173538 -2733547 -4826551
-1389 -4826551 -1532208 3733599 5160486 1674422 -1549991 364441 5623177 7934107 4499374 -551383
-1379 -551383 -1542369 1870633 5128093 5157936 3769742 4014766 5387929 4776971 1414209 -1590376
$$ packed form
-1449b872098J713455N76170n65825p47427o58969q88966m05652J873719M434952L867178
-1439F326537r12060o178039o628427j209048N280571O920993K565264l353125n467365k459411
-1429e114110K250361M076715J483831k785027m416379j778240K386291L862677J624887j122920
-1419D68086j061797R39450J050498k061330m844809l252099J597866M298733J947274j990720
-1409b908848k080241K019034N081252K988658k218834n183370l723835n96568P95608K92529
-1399e534615j36789L86663J195987J943200K870183L156707J113083k820881m907085k093004
-1389d826551L294343N265807J426887l486064l224413J914432N258736K310930l434733n050757
-1379e51383r90986L413002L257460K9843j388194K45024J373163o10958l362762l004585
$$ plain form
-1369 -1590376 -1437329 412279 161166 -3098645 -5940279 -4822367 -406063 3348238 3666615 1343101
-1359 1343101 -1125554 -2360295 -2435504 -1491835 541611 2778037 3163465 425678 -3974268 -6664420
-1349 -6664420 -5534148 -1844276 1121883 1399326 15063 -688198 63499 786378 -104123 -2131819
-1339 -2131819 -3385530 -3088353 -2631350 -3536671 -5004689 -4523296 -1066136 3202414 5077447 3737139
-1329 3737139 1267033 -57604 -93351 -178647 -1072659 -2377144 -3593325 -4717594 -5636063 -5788553 -4930794
-1318 -4930794 -3658328 -2580156 -1429386 189901 1419421 657287 -2124885 -4490595 -3864730 -407066
-1308 -407066 3241201 4881203 4533206 3370842 2168766 1452533 2013187 3803064 4726445 2326743
-1298 2326743 -2696157 -6084088 -4514762 101679 2325158 -718132 -6232292 -9206297 -7770593 -4157094
$$ packed form
-1369a590376J53047J849608k51113l259811k841634J117912M416304L754301L18377k323514
-1359A343101k468655j234741p5209R43669K033446K236426L85428k737787m399946k690152
-1349f664420J130272L689872K966159K77443j384263p03261P51697P22879q90501k027696
-1339b131819j253711K97177M57003r05321j468018M81393L457160M268550J875033j340308
-1329C737139k470106j324637l5747q5296q94012j304485j216181j124269r18469j52490Q57759
-1318d930794J272466J078172J150770J619287J229520p62134k782172k365710O25865L457664
-1308d07066L648267J640002l47997j162364j202076p16233N60654J789877R23381k399702
-1298B326743n022900l387931J569326M616441K223479l043290n514160k974005J435704L613499
$$ plain form
-1288 -4157094 -1286970 -22650 267193 76533 -443645 -1026788 -1648502 -2809785 -4452515 -5002045
-1278 -5002045 -2849935 1075680 3647938 3225877 1823741 2257918 3857516 2962942 -1964468 -7553687
-1268 -7553687 -9197699 -6537491 -3596210 -3644111 -5672749 -6595448 -5491455 -4219570 -4336768 -4952072
-1258 -4952072 -4064821 -1149891 2175240 3679766 2420003 -427218 -2285816 -1257127 1928341 4346624
-1248 4346624 3879283 1510083 -88117 75317 590111 424439 731807 2608219 4293447 2904555
-1238 2904555 -976216 -2834742 238032 5171258 6308621 2626022 -978992 -262808 2861460 3363672
-1228 3363672 288118 -1878548 652550 5863451 8520232 6556854 2913259 1301279 2063208 2913417
-1218 2913417 2398962 1269793 802689 1008560 917052 122698 -414620 799278 4099782 7862054 9858623
$$ packed form
-1288d157094K870124J264320K89843j90660n20178n83143o21714j161283j642730n49530
-1278e002045K152110L925615K572258m22061j402136M34177J599598q94574m927410n589219
-1268g553687j644012K660208K941281m7901k028638r22699J103993J271885j17198o15304
-1258d952072Q87251K914930L325131J504526j259763k847221j858598J028689L185468K418283
-1248D346624m67341k369200j598200J63434N14794j65672L07368J876412J685228j388892
-1238B904555l880771j858526L072774M933226J137363l682599l605014P16184L124268N02212
-1228C363672l075554k166666K531098N210901K656781j963378l643595j611980P61929Q50209
-1218B913417n14455j129169m67104K05871r1508p94354n37318J213898L300504L762272J996569
$$ plain form
-1207 9858623 9745754 9673658 11706427 15096038 17393501 18246012 20217380 24627637 28159871 26094193
-1197 26094193 18750525 12065979 10613256 12182668 11342135 6874099 2727066 1858954 2475817 1675924
-1187 1675924 -47714 -474878 153716 37301 70753 3102560 8224881 10166741 7117391 5429847
-1177 5429847 11801246 22983479 29756064 31379647 38213138 55591711 72886624 79561028 90561161
-1168 90561161 141909427 252041664 393496818 512887535 577342834 592010650 572912940 518598899
-1160 518598899 420998992 296427421 187029323 124466524 101604051 88075895 67189984 46967949
-1152 46967949 38061113 35353412 27753553 16350201 11643570 15637162 17778745 10996397 2634661
-1143 2634661 3315770 10737518 12856122 5415738 -2262327 -1061251 5478309 7509052 3189455 -58199
$$ packed form
-1207I858623j12869p2096K032769L389611K297463Q52511J971368M410257L532234k065678
-1197B6094193p343668o684546j452723J569412q40533m468036m147033q68112O16863p99893
-1187A675924j723638m27164O28594j16415L3452L031807N122321J941860l049350j687544
-1177E429847O371399J1182233O772585J623583O833491J7378573J7294913O674404J1000133
-1168I0561161N1348266J10132237J41455154J19390717O4455299J4667816j9097710n4314041
-1160E18598899r7599907j24571571j09398098o2562799k2862473j3528156k0885911k0222035
-1152D6967949q906836k707701p599859j1403352m706631L993592K141583o782348q361736
-1143B634661O81109P421748K118604p440384p678065J201076O539560K030743m319597l247654
$$ plain form
-1133 -58199 2594009 6936109 6911847 3048595 160458 37795 811672 1836243 4309551 6968076
-1123 6968076 5955480 893057 -2804161 -858958 3363533 3373286 -929811 -3246236 -761054 1271914
-1113 1271914 -2263475 -7775410 -7647656 -1608958 2495706 43941 -3889515 -2611577 2022188 2885540
-1103 2885540 -961404 -2577343 1920138 6634747 4172046 -3164989 -6150199 -1531282 3790140 2978684
-1093 2978684 -1582222 -3196214 -1328201 -1511366 -5549077 -7811775 -3666504 2857509 4109480 -604772
-1083 -604772 -4283266 -2059005 2778704 4483075 2926312 2450339 4511423 5722635 3513447 10268
-1073 10268 -1538369 -1510030 -2344571 -3778607 -3064091 -67080 1098582 -2685965 -8625370 -10709449
-1063 -10709449 -6723966 -485566 2963379 2481014 511599 -665018 -948580 -1476835 -3082937 -5517411
$$ packed form
-1133e8199K652208M342100k4262l863252k888137j22663P73877J024571K473308K658525
-1123F968076j012596n062423l697218J945203M222491R753m303097k316425K485182K032968
-1113A271914l535389n511935J27754O038698M104664k451765l933456J277938M633765Q63352
-1103B885540l846944j615939M497481M714609k462701p337035k985210M618917N321422q11456
-1093B978684m560906j613992J868013j83165m037711k262698M145271O524013J251971m714252
-1083f04772l678494K224261M837709J704371j556763m75973K061084J211212k209188l503179
-1073A0268j548637K8339q34541j434036P14516K997011J165662l784547n939405k084079
-1063a0709449L985483O238400L448945m82365j969415j176617k83562n28255j606102k434474
$$ plain form
-1053 -5517411 -7204772 -6089884 -2031621 1712968 1139553 -3547310 -7160286 -5332348 -203229 1851278
-1043 1851278 -1791520 -6642645 -6981852 -3186663 -773452 -2763062 -5861737 -5234241 -817967 3267791
-1033 3267791 4482642 4293650 4515331 3866279 193154 -5109372 -7520888 -4751210 171993 2457691
-1023 2457691 1187101 -207476 1117796 3750761 4207677 1783220 -205800 1923784 8357934 16006964
-1013 16006964 21764764 24657349 25099329 23326811 19389947 14241684 9808813 7540168 7186421 7283974
-1003 7283974 6613812 4944642 2703908 568249 -593779 -132256 1445355 2325688 1002399 -1819024
-993 -1819024 -3584968 -2582676 162518 2198657 2506428 2234115 2581638 2989523 2166322 294076
-983 294076 -953348 -708901 -211265 -1157227 -3355898 -4890029 -4420635 -2428691 -51262 2287970
$$ packed form
-1053e517411j687361J114888M058263L744589n73415m686863l612976J827938N129119K054507
-1043A851278l642798m851125l39207L795189K413211j989610l098675O27496M416274M085758
-1033C267791J214851j88992K21681o49052l673125n302526k411516K769678M923203K285698
-1023B457691j270590j394577J325272K632965M56916k424457j989020K129584O434150P649030
-1013A6006964N757800K892585M41980j772518l936864n148263m432871k268645l53747R7553
-1003G283974o70162j669170k240734k135659j162028M61523J577611Q80333j323289k821423
-993a819024j765944J002292K745194K036139L07771k72313L47523M07885q23201j872246
-983B94076j247424K44447M97636r45962k198671j534131M69394J991944K377429K339232
$$ plain form
-973 2287970 4362322 5041341 3144066 -348322 -2200487 -236299 3567129 4590579 786634 -4343769
-963 -4343769 -5025018 446826 7421377 9522038 5216469 -914214 -3455372 -1867573 -282022 -2096433
-953 -2096433 -5996299 -7888454 -5936031 -2455148 -789432 -1521316 -2621508 -2638731 -2365379 -3098069
-943 -3098069 -4403662 -4593350 -3028064 -957883 81387 -22153 -216143 253872 1122380 1555811 872969
-932 872969 -945029 -2932409 -3539974 -2173435 -461286 -1042217 -4385991 -7464095 -6679180 -2046163
-922 -2046163 2608038 3917102 2443767 1221892 1817270 3186732 4042462 4494136 4639617 3133848
-912 3133848 -1028965 -5761136 -6941301 -3076682 2301431 4127843 1211999 -2946355 -4497679 -3078007
-902 -3078007 -1021643 -136256 -447777 -1459183 -3018932 -4525601 -4469836 -1878514 2034119 4575970
$$ packed form
-973B287970K074352O79019j897275l492388j852165J964188L803428J023450l803945n130403
-963d343769o81249N471844O974551K100661m305569o130683k541158J587799J585551j814411
-953b096433l899866j892155J952423L480883J665716p31884j100192j7223K73352p32690
-943c098069j305593j89688J565286K070181J039270j03540j93990M70015Q68508M33431o82842
-932H72969j817998j987380o07565J366539J712149n80931l343774l078104P84915M633017
-922b046163M654201J309064j473335j221875N95378J369462Q55730M51674J45481j505769
-912C133848m162813m732171j180165L864619N378113J826412k915844m158354j551324J419672
-902c078007K056364Q85387l11521j011406j559749j506669N5765K591322L912633K541851
$$ plain form
-892 4575970 4227946 2159436 807906 1185839 1953163 1209950 -1044319 -2615178 -1565779 1160949
-882 1160949 2223927 -463026 -4898495 -6718927 -3953374 806388 3515182 3036113 1262235 -394412
-872 -394412 -2508487 -5069571 -5666750 -2550088 1397777 770037 -5354538 -10950657 -9752101 -3051483
-862 -3051483 1963211 1387375 -1117382 -553436 1899876 979343 -4150161 -7625251 -4538236 2240371
-852 2240371 5748512 3854717 1020789 1165955 2387245 721318 -3380634 -5532141 -3581658 -11386
-842 -11386 2502248 4980787 9554449 14923795 17387996 16040860 14011634 13613382 12728465 8088070
-832 8088070 722140 -4541065 -4969720 -2906777 -1993377 -2460082 -1955139 166510 1758624 1111444
-822 1111444 -836647 -2341241 -3233638 -4051462 -3999263 -1884826 1058902 1477849 -1950774 -6135981
$$ packed form
-892D575970l48024k068510j351530L77933P67324p43213k254269j570859J049399K726728
-882A160949J062978k686953m435469j820432K765553M759762K708794m79069j773878j656647
-872c94412k114075k561084n97179L116662L947865o27740o124575n596119J198556O700618
-862c051483N014694n75836k504757N63946K453312r20533n129504l475090L087015O778607
-852B240371L508141j893795k833928J45166J221290j665927m101952k151507J950483L570272
-842a1386K513634K478539M573662N369346K464201j347136k029226l98252q84917m640395
-832H088070p365930n263205m28655K062943R13400m66705N04943K121649J592114o47180
-822A111444j948091j504594q92397q17824N2199K114437K943728M18947l428623m185207
$$ plain form
-812 -6135981 -6907892 -4070334 -1439174 -1849669 -3845640 -4138071 -2008456 229550 626307 -227618
-802 -227618 -757449 -735483 -1016683 -1670812 -1688039 -620880 518341 559824 -173122 -191869 1260641 3099054
-790 3099054 3284734 681884 -3830345 -7768138 -8655242 -5824482 -1084511 2509980 2966651 745185
-780 745185 -1975767 -3274738 -2803156 -1533967 -582227 -226378 191822 1425002 3188167 4014185 2768750
-769 2768750 439338 -296450 1984158 5253427 5812522 2587795 -1221236 -1606879 1559672 4334245
-759 4334245 3282060 -717910 -3778862 -3348621 -332138 2712141 4198259 3962488 2237068 -611592
-749 -611592 -3483486 -4763104 -3670237 -1044202 1505341 2949783 3188408 2575480 1670049 1188645
-739 1188645 1459572 1815369 1195710 -299595 -1052164 228304 2608957 3708776 2437136 170068
$$ packed form
-812f135981p71911K837558K631160m10495j995971k92431K129615K238006L96757q53925
-802b27618n29831K1966k81200o54129j7227J067159J139221M1483p32946j8747J452510J838413
-790C099054J85680k602850m512229l937793q87104K830760M739971L594491M56671k221466
-780G45185k720952j298971M71582J269189R51740L55849M18200J233180J763165Q26018j245435
-769B768750k329412p35788K280608L269269N59095l224727l809031l85643L166551K774573
-759D334245j052185l999970l060952M30241L016483L044279J486118k35771j725420k848660
-749f11592k871894j279618J092867K626035K549543J444442K38625o12928r05431m81404
-739A188645K70927L55797o19659j495305p52569J280468K380653J099819j271640k267068
$$ plain form
-729 170068 -1175625 -1501974 -2168505 -3675644 -4822103 -4424017 -2945180 -1741902 -1294333 -1113134 -1119555
-718 -1119555 -1900312 -3209791 -3324872 -983044 2460707 4071989 2793015 851819 1062119 3448801
-708 3448801 5554041 5756211 5005146 4949260 5574284 5770729 5568519 6277780 8188287 9562090 9011703
-697 9011703 8136631 10286341 16488617 23789644 28311991 29089264 27856903 25694112 21644096 15225061
-687 15225061 8770886 5537614 5716297 6034034 4037438 1479035 1977888 5839058 9166618 8907829
-677 8907829 7203425 8759685 14130550 17821370 14461067 5724198 -931320 -631613 3567382 4808866
-667 4808866 677319 -4615792 -6136200 -4105144 -2568572 -3661808 -5509955 -5791807 -4971404 -4539486
-657 -4539486 -3690528 -324335 4676837 6776195 3004373 -3558312 -6699777 -4264010 -370349 119014
$$ packed form
-729A70068j345693l26349o66531j507139j146459L98086J478837J203278M47569J81199o421
-718a119555p80757j309479j15081K341828L443751J611282j278974j941196K10300K386682
-708C448801K105240K02170p51065n5886O25024J96445k02210P09261J910507J373803n50387
-697I011703q75072K149710O202276P301027M522347P77273j232361k162791m050016o419035
-687A5225061o454175l233272J78683L17737j996596k558403M98853L861170L327560k58789
-677H907829j704404J556260N370865L690820l360303q736869o655518K99707M198995J241484
-667D808866m131547n293111j520408K031056J536572j093236j848147k81852Q20403M31918
-657d539486Q48958L366193N001172K099358l771822o562685l141465K435767L893661M89363
$$ plain form
-647 119014 -2586883 -4449378 -3296626 -881706 610407 1479412 2605779 2625802 -466642 -5392678
-637 -5392678 -7896231 -5842699 -2067291 -655087 -1796785 -2406004 -1079634 291835 366972 1024461
-627 1024461 4164695 7786604 8566758 8181568 13476318 28348627 47665662 62025408 67591328 68112440
-617 68112440 67207202 62600183 50670428 34254322 21584005 16956504 15852719 11315106 2973942
-608 2973942 -3086071 -2607698 1775971 4406484 2991708 -500462 -3519483 -5015279 -4450290 -1517136
-598 -1517136 2215684 3369137 232496 -4641500 -6930681 -5333923 -2395112 -659843 138577 1324402
-588 1324402 2435810 1895236 -188205 -1851330 -2128516 -2362618 -3809168 -5255060 -4439361 -1236560
-578 -1236560 2050325 3448715 2910898 938903 -2660555 -7446556 -10959421 -10587536 -6797455 -2899772
$$ packed form
-647A19014k705897j862495J152752K414920J492113Q69005J126367K0023l092444m926036
-637e392678k503553K053532L775408J412204j141698o09219J326370J371469P5137O57489
-627A024461L140234L621909P80154l85190N294750J4872309J9317035J4359746N565920N21112
-617F8112440r05238m607019j1929755j6416106j2670317m627501j103785m537613q341164
-608B973942o060013M78373M383669K630513j414776l492170l019021j495796N64989K933154
-598a517136L732820J153453l136641m873996k289181J596758K938811J735269P98420J185825
-588A324402J111408n40574k083441j663125k77186k34102j446550j445892Q15699L202801
-578a236560L286885J398390n37817j971995l599458m786001l512865L71885L790081L897683
$$ plain form
-568 -2899772 -1126104 -358294 1338468 3299012 3220864 1124241 169161 2621155 6506131 7844353
-558 7844353 5605810 2792122 2488551 4398649 6094292 6491003 6593757 7122664 7033414 5154882 2439101
-547 2439101 1494187 3826527 8118221 11448649 12011867 10580886 9492598 10244978 11969691 12308007
-537 12308007 9961706 6285049 4040590 4591358 6724852 8316899 8522276 7836463 6603071 4626936
-527 4626936 2478318 2084834 5005552 10367339 15448321 18556264 20719900 24103522 29055719 33163647
-517 33163647 33244032 28225679 20363602 13792284 11407326 12523130 13650614 12112253 8867871 7153975
-507 7153975 8343515 10240548 10174435 8765678 9029231 11883684 14458106 13913573 11580322 11406067
-497 11406067 14570845 17629042 16760293 12380388 8190776 6578388 6751065 7293442 8567752 11563993
$$ packed form
-568b899772J773668P67810J696762J960544p8148k096623r55080K451994L884976J338222
-558G844353k238543k813688l03571J910098J695643L96711J02754N28907q9250j878532k715781
-547B439101r44914K332340M291694L330428N63218j430981j088288P52380J724713L38316
-537A2308007k346301l676657k244459N50768K133494J592047K05377o85813j233392j976135
-527D626936k148618l93484K920718N361787N080982L107943K163636L383622M952197M107928
-517C3163647Q0385n018353p862077o571318k384958J115804J127484j538361l244382j713896
-507G153975J189540J897033o6113j408757K63553K854453K574422n44533k333251j74255
-497A1406067L164778L058197q68749m379905m189612j612388J72677N42377J274310K996241
$$ plain form
-487 11563993 15687915 19270972 21894402 24783501 28808755 33386368 37831406 42697010 49002032 57045021
-477 57045021 67010951 80021314 97464437 120733528 155071477 214291458 316251163 465434417
-469 465434417 635892524 774673004 829882888 782978591 658743209 506337089 369598388 269589595
-461 269589595 206252403 169290466 146743965 128766345 109855403 90354280 74672789 66045088
-453 66045088 62522883 58666944 51167368 41923923 35142631 32260961 30901212 28547010 25537190 23435940
-443 23435940 21724090 18201843 12755950 8545409 7986762 8980432 7460767 3436644 1767444 5636124
-433 5636124 11453667 12883566 9055095 5538228 6413887 8563685 6529158 1223199 -139235 6626447
-423 6626447 16777926 22295956 21357402 19177914 20176687 22765021 22942910 20181150 17254825 15669671
$$ packed form
-487A1563993M123922L583057K623430K889099M025254M577613M445038M865604O305022Q042989
-477E7045021R965930J3010363J7443123K3269091L4337949N9219981J01959705J49183254
-469D65434417J70458107J38780480N5209884m6904297j24235382j52406120j36738701j00008793
-461B69589595o3337192l6961937k2546501j7977620j8910942j9501123j5681491q627701
-453F6045088l522205l855939p499576r243445o781292k881670j359749k354202l009820k101250
-443B3435940j711850l522247n445893m210541n58647R93670j519665m024123j669200L868680
-433E636124N817543J429899l828471l516867Q75659K149798k034527n305959j362434O765682
-423F626447J0151479N518030r38554k179488R98773K588334J77889k761760k926325j585154
$$ plain form
-413 15669671 14124852 11448527 8492600 6284664 4387028 2470010 1766853 2919450 3590975 1063671
-403 1063671 -2827756 -2510257 4013451 11104689 11494189 5245834 -382119 -109648 3555600 5131981
-393 5131981 3914315 3841305 6974498 10915762 13346308 15787957 20680956 26884446 31031799 32555670
-383 32555670 34319357 37933516 41303563 42122874 41270637 40411071 38106012 31836323 23579807 19413527
-373 19413527 21754050 24971470 21871924 13050366 6087113 5460408 7209638 5487028 1100337 -212112
-363 -212112 3347655 6937898 6200101 3274384 2922689 5030589 4956005 1128296 -1636545 1713224
-353 1713224 9555598 15648483 17039011 16911405 19222584 23251786 25192608 23498201 20263280 17590953
-343 17590953 14851294 10485743 5148122 1562477 1454838 3617504 5216108 4534422 2340881 927544
$$ packed form
-413A5669671j544819k676325k955927k207936j897636j917018p03157J152597O71525k527304
-403A063671l891427L17499O523708P091238L89500o248355n627953K72471L665248J576381
-393E131981j217666p3010L133193L941264K430546K441649M892999O203490M147353J523871
-383C2555670J763687L614159L370047Q19311q52237q59566k305059o269689q256516m166280
-373A9413527K340523L217420l099546q821558o963253o26705J749230j722610m386691j312449
-363b12112L559767L590243p37797k925717l51695K107900p4584l827709k764841L349769
-353A713224P842374O092885J390528j27606K311179M029202J940822j694407l234921k672327
-343A7590953k739659m365551n337621l585645j07639K162666J598604o81686k193541j413337
$$ plain form
-333 927544 1871992 4428433 6108120 5214974 2833206 1800597 3480534 6044937 6443421 3818811
-323 3818811 452749 -598523 1610161 5228931 7207759 5607110 1152565 -3076354 -4122193 -1952405
-313 -1952405 562456 1023143 313113 1037081 3535139 5148544 4074007 2349867 3414695 7547820
-303 7547820 11802369 14602195 18641518 29089236 51746492 94852895 169538726 282296352 423804588
-294 423804588 567035140 679336776 737420120 732439575 666845550 553738555 419696807 299560317
-286 299560317 218604412 177042961 155019083 134342203 113359375 100420236 97941999 98305139 94287414
-277 94287414 87462978 83426151 82409410 79163069 71242804 62966589 59616575 60591344 60653018 56367006
-267 56367006 48755311 40338826 32526679 26523838 24075970 25232858 26748061 25099382 20894722 18145140
$$ packed form
-333I27544R44448K556441J679687q93146k381768j032609J679937K564403L98484k624610
-323C818811l366062j051272K208684L618770J978828j600649m454545m228919j045839K169788
-313a952405K514861M60687p10030P23968K498058J613405j074537j724140J064828M133125
-303G547820M254549K799826M039323J0447718K2657256M3106403P4685831J12757626J41508236
-294D23804588J43230552J12301636N8083344m980545o5594025j13106995j34041748j20136490
-286B99560317q0955905m1561451k2023878k0676880k0982828j2939139k478237L63140m017725
-277I4287414o824436m036827j016741l246341p920265q276215l350014R74769O1674m286012
-267E6367006p611695q416485p812147o002841k447868J156888J515203j648679m204660k749582
$$ plain form
-257 18145140 18711482 19517916 16661628 10841082 6574203 6374769 7945319 7894427 6348791 6067777
-247 6067777 7815840 8886646 6845097 3099083 1322150 2989357 6040153 8069593 9282578 11212335
-237 11212335 13467313 13613160 10735098 7621414 7892020 11365443 14056352 13501619 12611206 16344424
-227 16344424 24806294 31846299 31809720 26352467 22531733 24418196 28920602 30898389 30351119 32090487
-217 32090487 38793344 47023477 51077265 48820853 42161679 33376464 23708171 15352636 11634174 13326953
-207 13326953 16552351 16792227 14533704 14605499 19581137 26081857 28895316 27044186 23806052 21716594
-197 21716594 20090966 17650336 15057383 13418120 11988586 9398430 6349235 4945878 5426126 5677288
-187 5677288 4526273 3398776 3467876 3191767 1046437 -564063 2507196 9669312 14618743 12839721
$$ packed form
-257A8145140N66342Q06434k856288n820546m266879j99434J570550n0892j545636k81014
-247F067777J748063J070806k041549l746014j776933J667207L050796K029440J212985J929757
-237A1212335K254978J45847k878062l113684K70606L473423K690909n54733q90413L733218
-227A6344424Q461870P040005l6579n457253l820734J886463M502406J977787n47270J739368
-217C2090487O702857Q230133M053788k256412o659174q785215r668293q355535l718462J692779
-207A3326953L225398K39876k258523P1795M975638O500720K813459j851130l238134k089458
-197B1716594j625628k440630k592953j639263j429534k590156l049195j403357M80248K51162
-187E677288j151015j127497O9100k76109k145330j610500L071259P162116M949431j779022
$$ plain form
-177 12839721 7653284 5781369 8260201 9641703 6438635 2133560 1453809 3076151 2246155 -829534
-167 -829534 -345305 6404808 14526783 18990803 23109064 34386854 52758069 68331222 72430920 66666717
-157 66666717 58648481 53041019 51355524 57035489 73551621 98998908 133783836 198907146 333744888
-148 333744888 554798698 810026855 989104080 1000000000 844823989 618147506 428829269 323856582
-140 323856582 281386661 260010375 240201396 222806110 207556133 187608795 161232967 136479330
-132 136479330 120349645 109657535 97242469 83325090 74929242 74957985 77346014 74752430 67108898
-123 67108898 59498028 53993811 47678213 38541941 29507699 24668297 23658933 22257905 17959765 12717894
-113 12717894 9785715 9592028 9899049 9191015 8548636 9999371 13700083 17154368 17239671 13152526
$$ packed form
-177A2839721n186437j871915K478832J381502l203068m305075o79751J622342q29996l075689
-167h29534M84229O750113Q121975M464020M118261J1277790J8371215J5573153M099698n764203
-157F6666717q018236n607462j685495N679965J6516132K5447287L4784928O5123310J34837742
-148C33744888K21053810K55228157J79077225J0895920j55176011k26676483j89318237j04972687
-140C23856582m2469921k1376286j9808979j7395286j5249977j9947338k6375828k4753637
-132A36479330j6129685j0692110j2415066j3917379q395848K8743K388029k593584p643532
-123F7108898p610870n504217o315598r136272r034242m839402j009364j401028m298140n241871
-113A2717894k932179j93687L07021p08034o42379J450735L700712L454285Q5303m087145
$$ plain form
-103 13152526 7459197 3907521 3859527 5175434 5051009 3478422 2857822 4220038 5347214 3724571
-93 3724571 385912 -968127 1229319 4211097 4446977 2196390 897445 2405831 4642242 4570147
-83 4570147 2154247 174057 773092 3477642 6470311 8536272 9448195 9620326 10175818 12463151
-73 12463151 16298605 19054261 17875810 13096438 8293339 6300735 6150425 5035704 2577672 1418254
-63 1418254 3327739 6402487 7415686 6089625 5344732 7216858 10076113 10812555 8828809 6518009
-53 6518009 5954971 6456185 5995800 4126946 2433279 2238277 2866390 2666718 1281404 230352 1170492
-42 1170492 3976031 6813356 7976533 7340292 5934344 4436786 2584877 160118 -1987023 -2520301
-32 -2520301 -1188656 786247 2142961 2873584 3611445 4231878 4012088 3148442 2947022 3851331 4252878
$$ packed form
-103A3152526n693329l551676m7994J315907j24425j572587o20600J362216J127176j622643
-93C724571l338659j354039K197446K981778K35880k250587j298945J508386K236411p2095
-83D570147k415900j980190N99035K704550K992669K065961R11923J72131N55492K287333
-73A2463151L835454K755656j178451m779372m803099j992604j50310j114721k458032j159418
-63A418254J909485L074748J013199j326061p44893J872126K859255P36442j983746k310800
-53F518009n63038N01214m60385j868854j693667j95002O28113j99672j385314j051052R40140
-42A170492K805539K837325J163177o36241j405948j497558j851909k424759k147141n33278
-32b520301J331645J974903J356714P30623P37861O20433k19790q63646k01420R04309M01547
$$ plain form
-21 4252878 2567805 108689 147122 3508619 6671242 5836659 2118345 532851 3429217 6976945
-11 6976945 5822736 112259 -4364144 -3138242 1863646 5220481 4411401 1571776 -314464 -705647
-1 -705647 -607668 -437643 -190815 -491132 -1615639 -1940335 547990 4757165 6515343 3532280 -1012570
9 -1012570 -1948081 1226675 3552546 1217181 -3254265 -4399971 -1185578 1779168 661407 -2588092
19 -2588092 -3374773 -918025 1087822 67791 -1911042 -1530498 799970 1714463 89979 -1099003
29 -1099003 955342 4681903 6073220 4057515 1718741 1728390 2545038 820300 -3330213 -5692254 -3214898
40 -3214898 1705480 3785183 1242655 -2061698 -1476582 2672178 5533396 3689792 -813083 -3133802
50 -3133802 -1405041 1489068 1883976 -240054 -1694080 -282343 2704831 4415107 3844405 2559703
$$ packed form
-21D252878j685073k459116L8433L361497L162623q34583l718314j585494K896366L547728
-11F976945j154209n710477m476403J225902N001888L356835q09080k839625j886240l91183
-1g05647R7979J70025K46828l00317j124507l24696K488325M209175J758178k983063m544850
9a012570r35511L174756K325871k335365m471446j145706L214393K964746j117761l249499
19b588092p86681K456748K005847j020031j978833L80544K330468R14493j624484j188982
29a099003K054345L726561J391317k015705k338774R649Q16648j724738m150513k362041K477356
40c214898M920378K079703k542528l304353N85116M148760K861218j843604m502875k320719
50c133802J728761K894109L94908k124030j454026J411737K987174J710276n70702j284702
$$ plain form
60 2559703 2493408 3942475 5790494 6877595 6713968 5423350 3716549 2793139 3565746 5715718 7904962
71 7904962 9256654 10510765 13529688 19646190 28270215 36593565 40652384 37744054 28975124 19242812
81 19242812 13373066 11628679 9851158 4783509 -1606732 -4458097 -2277767 1039322 1196162 -1169388
91 -1169388 -1865814 978198 4702262 6068783 5181938 4047094 2953120 760211 -1717919 -1513400
101 -1513400 2227754 6003912 6054393 3435564 2447718 4319730 5460653 3133739 115592 903768
111 903768 4597862 5193870 -285646 -7041119 -8106839 -2913548 2587196 3741289 1993938 1118237
121 1118237 1640048 1463481 394232 741844 3178529 4819740 2952597 -1053535 -3418204 -2546713
131 -2546713 9832 2643326 5293257 7491012 7277063 3887453 13312 -1010556 229505 37460
$$ packed form
60B559703o6295J449067J848019J087101j63627j290618j706801r23410P72607K149972K189244
71G904962J351692J254111L018923O116502Q624025Q323350M058819k908330q768930r732312
81A9242812n869746j744387j777521n067649o390241k851365K180330L317089J56840k365550
91a169388o96426K844012L724064J366521q86845j134844j093974k192909k478130K04519
101a513400L741154L776158N0481k618829r87846J872012J140923k326914l018147P88176
111I03768L694094N96008n479516o755473j065720N193291N500744J154093j747351q75701
121A118237N21811j76567j069249L47612K436685J641211j867143m006132k364669Q71491
131b546713K556545K633494K649931K197755k13949l389610l874141j023868J240061j92045
$$ plain form
141 37460 -2593621 -3712033 159983 6193035 7862950 3197944 -2541878 -3587977 -658901 1047970
151 1047970 -569430 -2173239 -622894 2010664 1231937 -3507277 -7852581 -8034011 -5111029 -2769596
161 -2769596 -2525823 -2837797 -2266013 -1433106 -1286231 -984298 1007266 4113216 5396859 2762652 -2205966
172 -2205966 -5438749 -4521062 -1178261 731450 -485920 -2624687 -2414090 410614 2752529 2050694
182 2050694 -392577 -923856 1956963 5774612 7025479 4855773 1095155 -2310706 -4419807 -4334128
192 -4334128 -1285670 3379513 5947495 3952162 -485261 -2837966 -1813431 -818454 -2857874 -5879821
202 -5879821 -5343685 -580205 4038300 4711965 2599285 1179151 1216187 857912 -161899 390383 3200761
213 3200761 5245393 3770664 654523 -27023 1882284 2235678 -878942 -3424904 -818359 4903743
$$ packed form
141C7460k631081j118412L872016O033052J669915m665006n739822j046099K929076J706871
151A047970j617400j603809J550345K633558p78727m739214m345304j81430K922982K341433
161b769596K43773l11974N71784Q32907J46875L01933J991564L105950J283643k634207m968618
172b205966l232783R17687L342801J909711j217370k138767K10597K824704K341915p01835
182B050694k443271n31279K880819L817649J250867k169706l760618l405861k109101Q5679
192d334128L048458M665183K567982j995333m437423k352705J024535R94977k039420l021947
202e879821N36136M763480M618505O73665k112680j420134L7036l58275j019811N52282K810378
213C200761K044632j474729l116141o81546J909307L53394l114620k545962K606545N722102
$$ plain form
223 4903743 6962348 2824752 -2282701 -2477978 1024371 2313154 -491619 -2803404 -553748 3807203
233 3807203 4776083 1392686 -1768882 -964308 2298930 4225860 3826844 3086004 3294119 3580453 3064413
244 3064413 2461935 2876456 4461661 7164076 11437531 16769140 20379910 19383059 14405239 9414588
254 9414588 7303467 7008230 5956127 3994938 3094812 3780332 4173511 3188039 2672141 4747543 8110076
265 8110076 9040735 6101477 2053910 465626 1779627 3749839 4665513 4616004 4029616 2751399 1003288
276 1003288 -162000 -292903 -475447 -1711882 -2977685 -2274713 488336 3101851 3926624 3779689 4021100
287 4021100 3973369 1995701 -1194056 -2305268 496636 4612690 5446662 1455185 -4296711 -7432276
297 -7432276 -6096079 -1668624 2876121 4769963 2990269 -634788 -2492274 -839518 1766808 1308144
$$ packed form
223D903743K058605m137596n107453j95277L502349J288783k804773k311785K249656M360951
233C807203R68880l383397l161568Q04574L263238J926930l99016p40840K08115K86334n16040
244C064413o02478M14521J585205K702415M273455N331609L610770r96851m977820m990651
254I414588k111121k95237j052103j961189r00126O85520L93179r85472n15898K075402L362533
265H110076R30659k939258m047567j588284J314001J970212R15674m9509n86388j278217j748111
276A003288j165288j30903j82544j236435j265803P02972K763049K613515Q24773j46935K41411
287D021100m7731j977668l189757j111212K801904M116054Q33972l991477n751896l135565
297g432276J336197M427455M544745J893842j779694l625057j857486J652756K606326m58664
$$ plain form
307 1308144 -2115030 -3473999 902186 7572056 9062925 2915221 -4736375 -6106809 -752536 4541438
317 4541438 4331387 441658 -1487414 783576 4397430 5978988 5370060 4266948 3257181 1912195
327 1912195 807582 1312487 3104175 3649177 1320304 -1902722 -2325518 947765 4727134 5552724
337 5552724 3891869 3496959 6804456 11991323 14960707 13571616 9285386 5027068 2370487 1099162
347 1099162 699415 1224544 2529891 3476979 2723213 317598 -2044027
354 -2044027
$$ packed form
307A308144l423174j358969M376185O669870J490869o147704p651596j370434N354273N293974
317D541438k10051l889729j929072K270990L613854J581558o08928j103112j009767j344986
327A912195j104613N04905J791688N45002k328873l223026m22796L273283L779369Q25590
337E552724j660855l94910L307497N186867K969384j389091m286230m258318k656581j271325
347A099162l99747N25129J305347R47088p53766k405615k361625
354b044027
##END=	
