##TITLE=	labeled_M9_sacculi 13C 1D and 2D.16.fid
##JCAMPDX=	6.0	$$ NMR Plug-in 1.13 of MestReNova 11.0.4-18998
##DATATYPE=	NMRSPECTRUM
##DATACLASS=	XYDATA
##NUMDIM=	1
##ORIGIN=	Bruker BioSpin GmbH
##OWNER=	ecaudill
##.OBSERVEFREQUENCY=	125.72761525999999321
##.OBSERVENUCLEUS=	^13C
##.SOLVENTNAME=	
##.PULSESEQUENCE=	cp
##LONGDATE=	2017/10/30 18:47:45.000
##.ACQUISITIONMODE=	SIMULTANEOUS (DQD)
##$ORIGINALFORMAT=	Bruker XWIN-NMR
##$PARAMETERFILE=	(acqus, ASCII, d:/Desktop/labeled_M9_sacculi%2013C%201D%20and%202D/16/acqus, 0)
$$ ##TITLE= Parameter file, TOPSPIN		Version 3.2
$$ ##JCAMPDX= 5.0
$$ ##DATATYPE= Parameter Values
$$ ##NPOINTS= 10	$$ modification sequence number
$$ ##ORIGIN= Bruker BioSpin GmbH
$$ ##OWNER= ecaudill
$$ $$ 2017-10-30 19:27:51.895 -0500  ecaudill@devon.nmrfam.wisc.edu
$$ $$ /home/ecaudill/NMR/labeled_M9_sacculi 13C 1D and 2D/16/acqus
$$ $$ process /opt/topspin_CPMAS/prog/mod/go
$$ ##$ACQT0= 0
$$ ##$AMP= (0..31)
$$ 100 100 100 100 100 100 100 100 100 100 100 100 100 100 100 100 100 100
$$ 100 100 100 100 100 100 100 100 100 100 100 100 100 100
$$ ##$AMPCOIL= (0..19)
$$ 0 0 0 0 0 0 0 0 0 0 0 0 0 0 0 0 0 0 0 0
$$ ##$ANAVPT= -1
$$ ##$AQSEQ= 0
$$ ##$AQ_mod= 1
$$ ##$AUNM= <au_zgonly>
$$ ##$AUTOPOS= <>
$$ ##$BF1= 125.715042
$$ ##$BF2= 499.96
$$ ##$BF3= 499.96
$$ ##$BF4= 499.96
$$ ##$BF5= 499.96
$$ ##$BF6= 499.96
$$ ##$BF7= 499.96
$$ ##$BF8= 499.96
$$ ##$BYTORDA= 0
$$ ##$CAGPARS= (0..11)
$$ 0 0 0 0 0 0 0 0 0 0 0 0
$$ ##$CFDGTYP= 0
$$ ##$CFRGTYP= 9
$$ ##$CHEMSTR= <none>
$$ ##$CNST= (0..63)
$$ 1 1 1 1 1 1 1 1 1 1 1 0 1 1 1 1 1 1 1 1 1 0 1 1 1 0 1 1 1 1 1 5000 1 1
$$ 1 1 1 1 1 1 1 1 1 1 1 1 1 1 1 1 1 1 1 1 1 1 1 1 1 1 1 1 1 1
$$ ##$CPDPRG= (0..8)
$$ <> <> <swftppm_13> <> <> <> <> <> <>
$$ ##$D= (0..63)
$$ 0 5 0 0 0 0 0 0 0 0 0 0 0 0 0 0 0 0 0 0 0 0 0 0 0 0 0 0 0 0 0 0 0 0 0 0
$$ 0 0 0 0 0 0 0 0 0 0 0 0 0 0 0 0 0 0 0 0 0 0 0 0 0 0 0 0
$$ ##$DATE= 1509407265
$$ ##$DE= 7.699996
$$ ##$DECBNUC= <off>
$$ ##$DECIM= 532
$$ ##$DECNUC= <off>
$$ ##$DECSTAT= 4
$$ ##$DIGMOD= 3
$$ ##$DIGTYP= 12
$$ ##$DQDMODE= 0
$$ ##$DR= 21
$$ ##$DS= 16
$$ ##$DSPFIRM= 4
$$ ##$DSPFVS= 21
$$ ##$DTYPA= 0
$$ ##$EXP= <4mm_CPMAS_13C_CP_100KHz.lz.2016>
$$ ##$F1LIST= <>
$$ ##$F2LIST= <>
$$ ##$F3LIST= <>
$$ ##$FCUCHAN= (0..9)
$$ 0 1 2 0 0 0 0 0 0 0
$$ ##$FL1= 90
$$ ##$FL2= 90
$$ ##$FL3= 90
$$ ##$FL4= 90
$$ ##$FOV= 20
$$ ##$FQ1LIST= <freqlist>
$$ ##$FQ2LIST= <hetcor.jos>
$$ ##$FQ3LIST= <freqlist>
$$ ##$FQ4LIST= <freqlist>
$$ ##$FQ5LIST= <freqlist>
$$ ##$FQ6LIST= <freqlist>
$$ ##$FQ7LIST= <freqlist>
$$ ##$FQ8LIST= <freqlist>
$$ ##$FRQLO3= 1.79769313486232e+308
$$ ##$FRQLO3N= 0
$$ ##$FS= (0..7)
$$ 83 83 83 83 83 83 83 83
$$ ##$FTLPGN= 0
$$ ##$FW= 625000
$$ ##$FnMODE= 0
$$ ##$FnTYPE= 0
$$ ##$GPNAM= (0..31)
$$ <> <> <> <> <> <> <> <> <> <> <> <> <> <> <> <> <> <> <> <> <> <> <> <>
$$ <> <> <> <> <> <> <> <>
$$ ##$GPX= (0..31)
$$ 0 0 0 0 0 0 0 0 0 0 0 0 0 0 0 0 0 0 0 0 0 0 0 0 0 0 0 0 0 0 0 0
$$ ##$GPY= (0..31)
$$ 0 0 0 0 0 0 0 0 0 0 0 0 0 0 0 0 0 0 0 0 0 0 0 0 0 0 0 0 0 0 0 0
$$ [...]
$$ 0 0 0 0 0 0 0 0
$$ ##$SguType= 2
$$ ##$ShimPowMaxUA= (0..63)
$$ 130000 130000 130000 130000 130000 130000 130000 130000 130000 130000 130000
$$ 130000 130000 130000 130000 130000 130000 130000 130000 130000 130000 130000
$$ 130000 130000 130000 130000 130000 130000 130000 130000 130000 130000 130000
$$ 130000 130000 130000 130000 130000 130000 130000 0 0 0 0 0 0 0 0 0 0 0
$$ 0 0 0 0 0 0 0 0 0 0 0 0 0
$$ ##$ShimPowMaxUC= (0..63)
$$ 130000 130000 130000 130000 130000 130000 130000 130000 130000 130000 130000
$$ 130000 130000 130000 130000 130000 130000 130000 130000 130000 130000 130000
$$ 130000 130000 130000 130000 130000 130000 130000 130000 130000 130000 130000
$$ 130000 130000 130000 130000 130000 130000 130000 0 0 0 0 0 0 0 0 0 0 0
$$ 0 0 0 0 0 0 0 0 0 0 0 0 0
$$ ##$ShimPowMaxUG= (0..63)
$$ 524287 524287 524287 524287 524287 524287 524287 524287 524287 524287 524287
$$ 524287 524287 524287 524287 524287 524287 524287 524287 524287 524287 524287
$$ 524287 524287 524287 524287 524287 524287 524287 524287 524287 524287 524287
$$ 524287 524287 524287 524287 524287 524287 0 0 0 0 0 0 0 0 0 0 0 0 0 0 0
$$ 0 0 0 0 0 0 0 0 0 0
$$ ##$ShimPowRcbType= 3
$$ ##$ShimPowRes= (0..63)
$$ 1e-20 1e-20 1e-20 1e-20 1e-20 1e-20 1e-20 1e-20 1e-20 1e-20 1e-20 1e-20
$$ 1e-20 1e-20 1e-20 1e-20 1e-20 1e-20 1e-20 1e-20 1e-20 1e-20 1e-20 1e-20
$$ 1e-20 1e-20 1e-20 1e-20 1e-20 1e-20 1e-20 1e-20 1e-20 1e-20 1e-20 1e-20
$$ 1e-20 1e-20 1e-20 1e-20 0 0 0 0 0 0 0 0 0 0 0 0 0 0 0 0 0 0 0 0 0 0 0 0
$$ ##$ShimPowRng0= (0..63)
$$ 1 1 1 1 1 1 1 1 1 1 1 1 1 1 1 1 1 1 1 1 1 1 1 1 1 1 1 1 1 1 1 1 1 1 1 1
$$ 1 1 1 1 0 0 0 0 0 0 0 0 0 0 0 0 0 0 0 0 0 0 0 0 0 0 0 0
$$ ##$ShimPowRng1= (0..63)
$$ 1 1 1 1 1 1 1 1 1 1 1 1 1 1 1 1 1 1 1 1 1 1 1 1 1 1 1 1 1 1 1 1 1 1 1 1
$$ 1 1 1 1 0 0 0 0 0 0 0 0 0 0 0 0 0 0 0 0 0 0 0 0 0 0 0 0
$$ ##$ShimPowRng2= (0..63)
$$ 1 1 1 1 1 1 1 1 1 1 1 1 1 1 1 1 1 1 1 1 1 1 1 1 1 1 1 1 1 1 1 1 1 1 1 1
$$ 1 1 1 1 0 0 0 0 0 0 0 0 0 0 0 0 0 0 0 0 0 0 0 0 0 0 0 0
$$ ##$ShimPowRng3= (0..63)
$$ 1 1 1 1 1 1 1 1 1 1 1 1 1 1 1 1 1 1 1 1 1 1 1 1 1 1 1 1 1 1 1 1 1 1 1 1
$$ 1 1 1 1 0 0 0 0 0 0 0 0 0 0 0 0 0 0 0 0 0 0 0 0 0 0 0 0
$$ ##$ShimSysFunc= (0..63)
$$ 1 2 3 4 5 6 7 8 9 10 0 37 38 35 16 15 14 13 12 11 28 27 26 25 24 23 36
$$ 22 30 29 20 21 34 33 32 31 17 18 19 0 0 0 0 0 0 0 0 0 0 0 0 0 0 0 0 0 0
$$ 0 0 0 0 0 0 0
$$ ##$ShimSysMatrix= 0
$$ ##$ShimSysType= 4
$$ ##$TFXNUM= 0
$$ ##$TRIPLO2= 0
$$ ##$VTU= 1
$$ ##$VTUETH= <no>
$$ ##$VTUTY= <tty05>
$$ ##$WBREFAM= (0..15)
$$ 99.6 100 100 100 100 100 100 100 100 100 100 100 100 100 100 100
$$ ##$WBREFLM= (0..15)
$$ 1 0 0 0 0 0 0 0 0 0 0 0 0 0 0 0
$$ ##$WBREFPH= (0..15)
$$ 0.22 0 0 0 0 0 0 0 0 0 0 0 0 0 0 0
$$ ##$WBSGU= (0..15)
$$ 0 0 0 0 0 0 0 0 0 0 0 0 0 0 0 0
$$ ##$XFAC= 2
$$ ##END=
$$ 
##$DECIM=	532
##$DSPFVS=	21
##XUNITS=	HZ
##YUNITS=	ARBITRARY UNITS
##FIRSTX=	31126.024187447739678
##LASTX=	-6449.6043369884373533
##XFACTOR=	-18.356437969924854769
##YFACTOR=	1.0000000000000000871e-07
##NPOINTS=	2048
##XYDATA=	(X++(Y..Y))
-1695 -3321051 -3430327 -2985997 -1728808 -1353394 -3618764 -6987150 -7336874 -3080494 2100664 3450003
-1685 3450003 1096428 -543138 743680 1907595 -394386 -4095146 -4071800 373058 3828526 1860617
-1675 1860617 -2941278 -4609701 -2001931 73750 -1822603 -4721742 -3658654 1018505 3916854 1804528
-1665 1804528 -2490078 -4359959 -3139910 -1539030 -897012 207961 2641340 4572647 3875818 1088119
-1655 1088119 -1517984 -2812157 -3094662 -2173135 612976 4005025 4556542 364930 -5898662 -9368467
-1645 -9368467 -8123580 -4517728 -1556774 150990 1150689 784585 -1886544 -5415512 -6429039 -3469769
-1635 -3469769 926853 2896269 1195714 -2257589 -4900307 -5362101 -3390426 317978 3875553 5280871
-1625 5280871 4646121 4314614 5652633 6608663 4126123 -1262675 -5211090 -4628005 -1350573 573843
-1615 573843 30258 -741559 -368021 -398033 -2179487 -3824524 -2481292 1205576 3309725 1591819
-1605 1591819 -1828287 -3793983 -4316780 -5518537 -7313554 -6780077 -2522394 2361114 3365515 -145893
-1595 -145893 -4349191 -5510635 -3735327 -1916307 -2242114 -4507076 -6939734 -7597283 -5414651 -1188672
-1585 -1188672 2267010 1991138 -2389825 -8087601 -11596717 -11398531 -8264390 -3896918 -77208 1618866
-1575 1618866 757390 -1125286 -1842417 -1209524 -1286920 -3170318 -4710932 -3097165 786714 2798229
-1565 2798229 1006597 -1367211 -375896 2566231 1922979 -4175146 -10095229 -8826268 -737824 6345738
-1555 6345738 6018632 76031 -4602242 -4193329 -1023780 696297 -222785 -2066775 -3429729 -4525792
-1545 -4525792 -5705963 -6263096 -5266751 -2842131 -94341 1874651 2562730 2112890 1239962 868116
-1535 868116 1341269 2056046 2252122 2023156 2018820 2212655 1744984 327961 -948115 -1020588 -659145
-1524 -659145 -1724367 -4382032 -6124231 -4484751 -268558 3022503 3139398 1538370 1291706 3149697
-1514 3149697 4673663 3402012 55488 -2115426 -1038559 1769421 2883050 871286 -1968353 -2072750
-1504 -2072750 1386259 5461057 6583205 4330927 1521143 751490 1697001 2188097 1165721 -401188
-1494 -401188 -1243537 -1171430 -321149 1774489 5128484 7818711 7197118 3140901 -1042994 -2004708 -97864
-1483 -97864 1350194 274120 -1932086 -2766240 -1850360 -772085 -519430 -557053 -361019 -336650 -597485
-1472 -597485 -130656 1585655 2921568 1762909 -1104316 -2029907 1065385 5470613 6471241 2988899
-1462 2988899 -1209892 -2259579 -570744 630283 -35151 -794429 -63343 811458 -645208 -4391682
-1452 -4391682 -7504848 -7534902 -5219036 -3468648 -4260046 -6873727 -8704154 -7466262 -3219215 1119993
-1442 1119993 1771438 -2277516 -7520930 -8885687 -5031550 116301 1994348 822263 851542 4185705
-1432 4185705 7320793 5401040 -1025359 -5740621 -3958978 1950188 5316451 3005534 -1432276 -2760854
-1422 -2760854 -505112 1066106 -1219270 -5409325 -6918500 -3970486 662077 3153618 2669706 1374801
-1412 1374801 1205323 1808097 1875038 1511301 2139328 3972939 4661837 1591317 -4399390 -8611040 -6772413
-1401 -6772413 286841 6972233 8263078 4307185 -572674 -2771720 -2358752 -1376525 -695593 346275
-1391 346275 1858128 2571111 1615380 51882 -374658 452919 1067874 750799 594197 1582864 2537847
-1380 2537847 1250844 -2411739 -5721494 -5963097 -3423660 -860670 -409444 -1747739 -3094847 -3129651
-1370 -3129651 -1772818 75246 1097108 564465 -502452 229105 3693052 7332445 7155913 2480713
-1360 2480713 -2613015 -3789191 -1627476 -551996 -2681379 -4912707 -3384678 810159 2768307 388098
-1350 388098 -2683819 -1880893 2325088 5320329 4431256 1801695 926392 2505282 4967159 7300099
-1340 7300099 9116367 8742111 4237703 -2721064 -6410278 -2870848 4686161 8695768 5715256 28921
-1330 28921 -2120257 -9218 1769206 -43656 -3529748 -4866495 -3218585 -769557 863977 2126743
-1320 2126743 3514707 4008666 2437217 -659859 -3531736 -4981728 -4756464 -2801045 521312 3514668
-1310 3514668 3947483 1537249 -1283731 -2043448 -1102141 -798308 -2097440 -3490720 -3479276 -2729369 -2739881
-1299 -2739881 -3290332 -2701964 -514003 1513296 1562033 -104954 -1900806 -3012002 -3715943 -4055718
-1289 -4055718 -3471295 -1900308 -164449 1166613 2304210 2939490 1484783 -2860684 -7596588 -8372496
-1279 -8372496 -3895162 1758086 3092536 -899184 -5989404 -7754409 -5940061 -3293203 -1472868 281594
-1269 281594 2704435 4414217 3233996 -899705 -5159583 -6145220 -2946909 1870169 4287056 2348374
-1259 2348374 -1925613 -4505298 -3714063 -2189353 -3624615 -7821081 -10436944 -8311758 -3711837 -1672158
-1249 -1672158 -3566805 -5292288 -2540247 3669250 8166836 7592025 3536504 -122287 -1226657 -16983
-1239 -16983 2513991 5222026 6417173 4870634 1730586 13220 1197425 3201636 2904672 185447
-1229 185447 -1924744 -1196169 1049945 1869081 440851 -1208453 -910794 1279428 3573235 4489005
-1219 4489005 4032317 3357852 3648805 5014578 6262701 6168688 5186386 5200524 6980017 8675583 8185929
-1208 8185929 6739305 8198996 13888667 19718035 20414352 16043516 12041815 12269598 14234195 12874525
-1198 12874525 7609666 3077398 2998826 5871254 7825838 7679444 7075799 6769710 5548427 3212547
-1188 3212547 2178364 4529469 8868364 12005132 13199812 14779220 18489497 23256778 27502756 32073497
-1178 32073497 39239482 49620723 62011733 76418142 96008720 126020612 171917972 237757205
-1170 237757205 322264480 413290023 488196029 525466499 519504547 483059539 433462219 377730293
-1162 377730293 313101062 240222301 170631790 118484420 87301845 68359088 51720399 35643725
-1154 35643725 24308476 19558690 18087567 15994275 13008707 11110652 10787175 10321956 8185981 4735473
-1144 4735473 1502780 -291616 -439505 226801 274815 -1144576 -3175089 -3906750 -2611598 -774245
-1134 -774245 -265760 -1019855 -1520338 -1341633 -1763656 -3287028 -3857966 -1096037 4020481 7312992 5896730
-1123 5896730 1512699 -1566323 -1373440 179026 485998 -347875 -186250 1692030 3105005 1419147
-1113 1419147 -3031744 -6660387 -5959905 -974438 4670789 7116137 5499125 1964491 -979110 -2490379
-1103 -2490379 -2952234 -2616955 -1601796 -712982 -897908 -1582741 -906016 1353815 2184369 -1357413 -7295436
-1092 -7295436 -9515781 -4862741 2096188 3777763 -1287471 -6677425 -6343161 -2142114 -654990 -3850544
-1082 -3850544 -6504813 -3732490 2080415 4544825 1928957 -820883 974054 5763133 8477011 7149997
-1072 7149997 4237140 2158598 564566 -1253271 -1878613 189114 3331942 4107521 1615369 -1606298
-1062 -1606298 -3524518 -5254752 -8270899 -10708636 -9117349 -3744875 535314 -210279 -4206398 -6525998
-1052 -6525998 -5436055 -3978996 -5145313 -7663633 -7899015 -4686170 -598052 1232098 42654 -2848594
-1042 -2848594 -5712531 -7058626 -5859449 -2488567 961182 2523570 2515038 2760418 3544661 2729117
-1032 2729117 -1169998 -6030248 -7782163 -4922451 -40401 3435461 4669104 4790341 4160029 2160831
-1022 2160831 -364804 -420930 4167417 11897319 18903480 22807879 24127640 24010357 22201304 18232134
-1012 18232134 13581665 10952934 11151396 11844588 10164827 5986920 1887003 128327 485672 1113708
-1002 1113708 799095 -137417 -771465 -769925 -592095 -841675 -1576683 -2208608 -2164225 -1753522 -2095344 -3687797
-990 -3687797 -5138987 -4162214 -439599 3046971 2659565 -1649144 -5633018 -5121548 -752191 2592096
-980 2592096 1205738 -3417435 -6522051 -5449799 -2156991 -478521 -1875500 -4427933 -5406700 -3967223
-970 -3967223 -1401121 393385 302568 -1505697 -3750828 -4843834 -4166675 -2692800 -1893905 -1913304 -1411511
-959 -1411511 368431 2005842 1377980 -1275856 -2918303 -1154426 2520190 4090460 1694380 -2196481
-949 -2196481 -3855087 -2628550 -1043140 -1018197 -1610517 -1133362 -97290 -391677 -1898672 -1848003 1521401
-938 1521401 5865234 6850522 3165489 -1997535 -4823929 -4957733 -4745631 -5366517 -5416834 -3495298 -639164
-927 -639164 874564 384751 -725657 -1220149 -1329082 -1556133 -1382160 -169571 1268440 1280436 -372675
-916 -372675 -1957679 -1912360 -693184 236165 566515 1143018 1983399 1664723 -674521 -3658578 -5038243
-905 -5038243 -4363411 -3261729 -3106861 -3527305 -3611407 -3491457 -3739961 -3854815 -2714507 -551501 882174
-894 882174 708062 322805 1267259 2445560 1159198 -2925195 -6490298 -6296213 -3147630 -682165
-884 -682165 -654457 -1190942 -121611 1677036 1652674 -673490 -3193762 -4461734 -5618178 -8119418 -10856878
-873 -10856878 -11186585 -8506047 -5222617 -3800861 -4144247 -4685143 -4966159 -5728304 -6851941 -6898946 -5270048
-862 -5270048 -3578325 -3738503 -5222564 -5455201 -3066266 198738 1299431 -851621 -4322302 -5952495
-852 -5952495 -3953648 669983 4672322 5020939 1795456 -1396641 -899482 2834579 5643274 4879124
-842 4879124 3061282 4714375 10050877 14061557 12822717 8802126 7699698 10677572 12428516 7965599
-832 7965599 -689089 -6654461 -6239128 -2554626 -754396 -1790407 -2449411 -441468 2674499 3854837
-822 3854837 2244087 -417761 -2165943 -2534307 -2238942 -2079250 -2202988 -1851421 103894 3612149
-812 3612149 6367963 5357133 264247 -5292336 -7023074 -4442161 -1187225 -715260 -2650626 -4018790
-802 -4018790 -3288757 -1991661 -2369818 -4513531 -6410868 -6313561 -4460268 -2626672 -2386935 -3747893
-792 -3747893 -5233026 -5422680 -4560831 -4254728 -5203498 -5827929 -4231099 -1365356 -643020 -3485826 -6590906
-781 -6590906 -5501813 -546934 2994625 1432312 -2612506 -3847780 -1400773 448598 -1308951 -4201785
-771 -4201785 -4214677 -1781116 -878014 -2805283 -4320191 -3115601 -2132177 -5479800 -11435296 -13189877
-761 -13189877 -7372151 1047562 4373872 1018241 -3672406 -4559135 -1848744 1228910 2980791 3627620
-751 3627620 3048187 938175 -1217256 -1084499 885339 1075972 -2486807 -6691759 -7011187 -3751753
-741 -3751753 -1816220 -3841105 -6412389 -4984621 -585830 1313852 -1832537 -6461785 -8022591 -6703796
-731 -6703796 -5913369 -6687415 -6687090 -4751237 -3383427 -5041555 -7913300 -7888946 -4201521 -665887 -752682
-720 -752682 -3385747 -4906407 -3861368 -2034720 -1226711 -986686 -58190 1429616 2329697 2277563 1998579
-709 1998579 2103141 2548898 3205283 3987450 4333212 3580774 2300100 2263256 4274597 6853514 8337329
-698 8337329 9839586 14298287 21968255 28405179 28490023 22000851 13807650 8602982 6820496 6047129
-688 6047129 4800763 3526117 2755919 2169231 1663227 1816381 2521308 2306158 183895 -2484805 -3362069
-677 -3362069 -2236528 -1328765 -2114746 -3266526 -2855218 -1574016 -1965517 -4444832 -5899904 -3332955
-667 -3332955 2070972 5860954 5087436 1006888 -3058689 -5358381 -6501183 -7416326 -7706781 -6194249
-657 -6194249 -2540583 1855404 4387181 2978781 -1941775 -7087298 -8752737 -6232223 -2415746 -480459
-647 -480459 -498725 -211665 1192756 1612951 -948526 -5067677 -7090100 -5481564 -2625377 -1816715 -3504908
-636 -3504908 -5374487 -5490270 -4193174 -2905483 -2098399 -903071 1840270 6590741 12817138 19464915
-626 19464915 26212844 34450864 45901389 59110426 68124160 66924800 56032576 43003292 34715156
-617 34715156 30196042 23324708 12295757 3195177 2298023 7080739 8403855 1629623 -7768029 -11378989
-607 -11378989 -8163378 -4570802 -5292423 -7590537 -6162371 -860390 3275800 2740619 -593954 -2776861
-597 -2776861 -2486822 -1122487 -58361 50888 -1814063 -6140828 -10544627 -10833534 -6071693 -1038888
-587 -1038888 -1397664 -6886603 -11617581 -11465458 -8771014 -8216139 -9984642 -9863506 -5822317 -1446044
-577 -1446044 -1371498 -5333687 -9022528 -9919379 -9580771 -9821552 -9381769 -6321228 -2099717 -457091 -2198867
-566 -2198867 -3678506 -1756695 1606447 1923719 -1386145 -3766106 -1509660 3102632 4591827 1354597
-556 1354597 -2299090 -1625500 2824771 6287931 5679106 2759168 1401288 3135632 6127012 7671314
-546 7671314 6672316 3976320 1324442 200431 954122 2580002 3699814 4017753 4342092 4860132
-536 4860132 4199174 1304080 -2039501 -2195699 1897212 6383248 6216887 1199234 -3254716 -2092111
-526 -2092111 3796894 9129770 10520309 9416474 8763920 8925460 8423408 7367843 7643378 9435921
-516 9435921 9840072 6473201 1221662 -1656680 -919629 278822 -888348 -2692574 -1151325 4284673
-506 4284673 9534052 10714517 8360615 5806716 4800966 4451493 3855992 3605985 4156717 4463729
-496 4463729 3516576 2202472 2201899 3645893 5525560 8158611 13050485 19564107 24031438 24420113 24619240
-485 24619240 30892996 43600111 55535340 60696115 62687311 71152877 90471010 116255102 145483407
-476 145483407 187462902 260207195 373819084 517130966 659109420 761579589 793851928 744715423
-468 744715423 629682464 487429809 361299209 275387611 224859600 189393367 155514965 125232553
-460 125232553 105603609 95475969 85694732 70039825 51656179 37895064 31717672 30096149 29072251
-451 29072251 27540102 26020321 24219594 21354937 17841171 14994999 13078449 10867124 7637571 4740958
-441 4740958 4287703 6354607 8278604 7274125 3635797 793023 1754434 5668894 8586612 7945951
-431 7945951 5594238 5344873 7744511 8831237 5116640 -1216758 -3919821 328081 8087602 13168705
-421 13168705 13225950 10953155 9576891 9398485 9249628 9230018 10161556 11195002 10013972 5710014 82800
-410 82800 -4341655 -6407510 -6069744 -3723655 -1113132 -1412557 -5911095 -10895993 -10711736 -5058661
-400 -5058661 -674793 -3256165 -9338289 -9893549 -2201858 5765185 5186390 -2103114 -5773080 114685
-390 114685 10584064 17280875 18676625 19519690 22453713 24862484 24330759 22837848 23010349 23178830
-380 23178830 19960380 14607993 12482756 15255185 17396334 13186317 4900721 285134 2405860 5908650
-370 5908650 4657478 -215106 -2818914 -1246222 89569 -2738113 -7397963 -8483611 -4627903 209661
-360 209661 2106128 1333057 581446 1120288 2250920 3465741 5274190 7881325 10436192 12048696
-350 12048696 12656611 12397922 10894597 7889016 4159108 1031056 -911437 -2057676 -2843412 -3272807
-340 -3272807 -3419581 -3695256 -4292290 -4879458 -5222485 -5628406 -6301376 -6724815 -6371935 -5683898 -5429124
-329 -5429124 -5247791 -4090734 -2482109 -2897261 -6516140 -10408444 -9956806 -4489351 1167813 1938121
-319 1938121 -1685007 -4500232 -2857942 1533570 4284722 3309612 277345 -1819404 -1238226 1901382
-309 1901382 6186097 9908620 12521010 15496796 21270151 31706657 49214706 79723167 132128047
-300 132128047 211957607 315435657 431123809 546231155 647689056 716674575 728841857 669250717
-292 669250717 550635566 412850990 298468284 226301364 187517242 163732624 144544000 128710651
-284 128710651 115844192 103447093 91150741 82385940 79482650 79684123 78317079 74275598 69816226
-275 69816226 65822353 60403532 52813348 45978021 43099551 43182525 42216110 38317279 33400998 29410924
-265 29410924 25211787 18845940 11564825 7399395 8534194 12557133 14879759 13052018 8288081 3644480
-255 3644480 1437691 1821045 2951515 2723531 1002328 -141334 805075 2239204 1154073 -2302966
-245 -2302966 -3777738 216116 7122675 10419973 7129582 1288534 -1212736 290811 1369147 -779639
-235 -779639 -3203182 -981999 6243544 13317676 15103319 11796668 8362356 9339658 14546197 19496558
-225 19496558 19793695 15428534 10914574 10821691 15086942 19312845 19872363 17705348 16171032 16095343
-215 16095343 14866634 10599678 5120096 1446238 -183323 -1524020 -2147639 1003439 8668590 16173702
-205 16173702 17834786 13728607 9498480 9146469 10545977 9456733 5805757 3316758 3729686 4533404
-195 4533404 3257089 1325865 1502357 3049932 2306849 -1980032 -6561759 -8003842 -7024361 -6646499
-185 -6646499 -7355846 -6707320 -3739142 -1179308 -1913002 -4957185 -6897707 -6554329 -6039774 -7020641 -8032551
-174 -8032551 -6737313 -3505568 -1020078 -690090 -1030707 233011 3843430 9362260 16606508 25554409
-164 25554409 35292477 44059119 50195317 52564721 51017107 48037075 49244995 59409461 77563753
-155 77563753 101066389 140040416 225099697 388096122 622170677 859399414 1000000000 979829177
-147 979829177 819258651 607541160 436291503 342208786 304286365 284024581 261361503 237173824
-139 237173824 215320224 192936611 166803512 140352964 119418230 104135475 89790325 75050239
-131 75050239 64804687 63099536 66437015 67169427 62109837 54395985 46996612 38306574 26354475
-122 26354475 14560981 9272028 11630033 15403629 14464579 9941238 7492824 9034816 10610920 8736637
-112 8736637 5470669 5015560 7338353 8290265 5695929 2201354 937749 852288 -1278390 -5400717
-102 -5400717 -7657828 -5695270 -2053661 -736593 -1866348 -1829125 1590992 6171673 7896066 5288124
-92 5288124 298243 -4077685 -5906457 -4742735 -1563943 1433544 2154588 474066 -1681506 -2492309
-82 -2492309 -1874340 -529643 1676843 5144689 8709658 10014108 8308080 5690007 4528293 4457135
-72 4457135 3339054 928975 -155905 2149749 6192501 8076525 5824030 954787 -3774755 -6810179
-62 -6810179 -7760248 -6512541 -3685406 -1236749 -1040644 -2643476 -3578306 -2426213 -680878 -799275
-52 -799275 -3006521 -5044573 -4932895 -3008097 -1094065 -592133 -1830625 -4377352 -7000513 -7759508
-42 -7759508 -5429441 -1225377 1721098 1256449 -1753903 -4672721 -5912606 -5871565 -5443145 -4710936 -3486256
-31 -3486256 -2279933 -1888247 -2269932 -2634483 -2753217 -3508801 -5668858 -8373493 -9363855 -6986417 -2052656
-20 -2052656 2296289 2889267 -723255 -5551809 -7601501 -5496177 -1583943 798771 739347 -203073
-10 -203073 -905175 -2156350 -4627661 -6760039 -6399846 -4190455 -3344699 -5301707 -7287777 -5849530
0 -5849530 -1918123 -169918 -3120281 -7904288 -10060979 -8871108 -6991025 -5722404 -3408367 825350
9 825350 4209979 3309412 -1193718 -4900183 -4769498 -1803367 1613789 4689157 7047358 6616278 1697779
20 1697779 -5086808 -8045185 -5118810 -1245603 -2707115 -9136673 -13879605 -12458941 -7916435 -6222478
30 -6222478 -8481001 -10346516 -8465508 -4503345 -1924356 -1206586 -258889 1718854 3245698 3283233 2632789
41 2632789 1861122 -140794 -3865063 -6794463 -5734668 -1521233 921833 -1648967 -6549823 -8343885
51 -8343885 -5373976 -1108887 941791 1356357 2613719 4452501 3766980 -854978 -6464644 -8704233
61 -8704233 -6485207 -2626190 -311332 -87962 -361691 346989 2347248 5350697 9200090 13937791
71 13937791 19508184 25377659 30233979 32340922 30806617 26609058 21866927 17863317 14212931 10232604
81 10232604 6499329 4246284 3447419 2572354 686956 -1014877 -677837 1478290 2869338 1299344
91 1299344 -2641999 -6395015 -8181006 -8299781 -7894785 -7269349 -5833663 -3323227 -552672 1110455
101 1110455 909485 -582914 -1865577 -1907835 -1368805 -2082691 -4809708 -7665895 -7585529 -3678230 1489323
112 1489323 4518254 4578970 3367713 2085057 5927 -3292387 -5697967 -4421286 -17547 3226250
122 3226250 1886165 -2699637 -6399295 -7466829 -7947757 -9705711 -11037411 -8885518 -3556588 832809
132 832809 1034622 -1737054 -3835930 -3671405 -2681046 -2307395 -1912684 -419155 1338772 1321417 -1035432
143 -1035432 -4086886 -5981004 -6302944 -5418961 -3378057 -470892 1830615 1923768 192065 -1104131
153 -1104131 -611498 344972 -366363 -2662924 -4278920 -3698475 -1795624 -163055 937130 1885923 1875411
164 1875411 -409247 -4035904 -5490723 -2487531 2602679 4758354 1987463 -2279571 -3277812 -564497
174 -564497 1628497 -360656 -5144075 -7679221 -4690631 1913634 6961306 6932147 2965316 -617171
184 -617171 -515884 2723944 5837007 6447871 5150663 3905177 3055344 969589 -3177831 -7303757
194 -7303757 -8118557 -4716337 457142 4285417 5624328 4839507 1970105 -2981193 -8016688 -9311491
204 -9311491 -4935996 2019957 5494604 2251573 -4809202 -9449352 -7905569 -1871269 3591583 4536648
214 4536648 1097278 -2938607 -3371546 622298 5272660 5313781 -806270 -8798303 -12286925 -8945043
224 -8945043 -2522330 1264845 189126 -3442662 -6248064 -6985617 -6368743 -5151972 -3572852 -2252649
234 -2252649 -2339096 -4191006 -6454681 -7042997 -4998309 -1198329 2553688 4859355 5464105 5320035 6015694
245 6015694 8542741 12162548 14769283 14893776 13313394 12192744 12489703 12665804 10361663 5166293
255 5166293 -655753 -4130302 -3937766 -964719 2781214 5376415 5654081 3701676 1060819 -169571
265 -169571 841723 2713512 3203498 1632479 -440165 -1180740 -659542 -487892 -1477741 -2531567 -2281029
276 -2281029 -1154147 -884042 -2055814 -3173608 -2697465 -1235194 -704442 -1584218 -2266653 -1585075 -825774
287 -825774 -2001062 -4614287 -5750607 -3839405 -944520 -113694 -1290202 -1609607 219478 1803033
297 1803033 535454 -2250367 -2826302 -606868 356374 -3112016 -7964218 -7741639 -866495 6344197
307 6344197 6663328 745141 -3342882 381265 8701192 12897580 8581176 139194 -4640575 -2764098
317 -2764098 2071127 4652508 3544874 1000281 -766986 -1612961 -2018440 -1371649 998268 3597683
327 3597683 3264189 -1161285 -6389074 -7296822 -2363828 4383050 7561603 6083490 3760143 4505190
337 4505190 8104239 11182674 11303440 8986836 6163281 4105905 3245335 3723813 5021426 5607824
347 5607824 4193217 1363397 -960590 -1812417
351 -1812417
##END=	
