##TITLE=	labeled_M9_sacculi 13C 1D and 2D.30.fid
##JCAMPDX=	6.0	$$ NMR Plug-in 1.13 of MestReNova 11.0.4-18998
##DATATYPE=	NMRSPECTRUM
##DATACLASS=	XYDATA
##NUMDIM=	1
##ORIGIN=	Bruker BioSpin GmbH
##OWNER=	ecaudill
##.OBSERVEFREQUENCY=	125.72761525999999321
##.OBSERVENUCLEUS=	^13C
##.SOLVENTNAME=	
##.PULSESEQUENCE=	cp
##LONGDATE=	2018/11/18 17:48:33.000
##.ACQUISITIONMODE=	SIMULTANEOUS (DQD)
##$ORIGINALFORMAT=	Bruker XWIN-NMR
##$PARAMETERFILE=	(acqus, ASCII, d:/Desktop/labeled_M9_sacculi%2013C%201D%20and%202D/30/acqus, 0)
$$ ##TITLE= Parameter file, TOPSPIN		Version 3.2
$$ ##JCAMPDX= 5.0
$$ ##DATATYPE= Parameter Values
$$ ##NPOINTS= 7	$$ modification sequence number
$$ ##ORIGIN= Bruker BioSpin GmbH
$$ ##OWNER= ecaudill
$$ $$ 2018-11-18 17:48:34.117 -0600  ecaudill@devon.nmrfam.wisc.edu
$$ $$ /home/ecaudill/NMR/labeled_M9_sacculi 13C 1D and 2D/30/acqus
$$ $$ process /opt/topspin_CPMAS/prog/mod/go
$$ ##$ACQT0= 0
$$ ##$AMP= (0..31)
$$ 100 100 100 100 100 100 100 100 100 100 100 100 100 100 100 100 100 100
$$ 100 100 100 100 100 100 100 100 100 100 100 100 100 100
$$ ##$AMPCOIL= (0..19)
$$ 0 0 0 0 0 0 0 0 0 0 0 0 0 0 0 0 0 0 0 0
$$ ##$ANAVPT= -1
$$ ##$AQSEQ= 0
$$ ##$AQ_mod= 1
$$ ##$AUNM= <au_zgonly>
$$ ##$AUTOPOS= <>
$$ ##$BF1= 125.715042
$$ ##$BF2= 499.96
$$ ##$BF3= 499.96
$$ ##$BF4= 499.96
$$ ##$BF5= 499.96
$$ ##$BF6= 499.96
$$ ##$BF7= 499.96
$$ ##$BF8= 499.96
$$ ##$BYTORDA= 0
$$ ##$CAGPARS= (0..11)
$$ 0 0 0 0 0 0 0 0 0 0 0 0
$$ ##$CFDGTYP= 0
$$ ##$CFRGTYP= 9
$$ ##$CHEMSTR= <none>
$$ ##$CNST= (0..63)
$$ 1 1 1 1 1 1 1 1 1 1 1 0 1 1 1 1 1 1 1 1 1 0 1 1 1 0 1 1 1 1 1 5000 1 1
$$ 1 1 1 1 1 1 1 1 1 1 1 1 1 1 1 1 1 1 1 1 1 1 1 1 1 1 1 1 1 1
$$ ##$CPDPRG= (0..8)
$$ <> <> <swftppm_13> <> <> <> <> <> <>
$$ ##$D= (0..63)
$$ 0 5 0 0 0 0 0 0 0 0 0 0 0 0 0 0 0 0 0 0 0 0 0 0 0 0 0 0 0 0 0 0 0 0 0 0
$$ 0 0 0 0 0 0 0 0 0 0 0 0 0 0 0 0 0 0 0 0 0 0 0 0 0 0 0 0
$$ ##$DATE= 1542584913
$$ ##$DE= 7.699996
$$ ##$DECBNUC= <off>
$$ ##$DECIM= 532
$$ ##$DECNUC= <off>
$$ ##$DECSTAT= 4
$$ ##$DIGMOD= 3
$$ ##$DIGTYP= 12
$$ ##$DQDMODE= 0
$$ ##$DR= 21
$$ ##$DS= 16
$$ ##$DSPFIRM= 4
$$ ##$DSPFVS= 21
$$ ##$DTYPA= 0
$$ ##$EXP= <4mm_CPMAS_13C_CP_100KHz.lz.2016>
$$ ##$F1LIST= <>
$$ ##$F2LIST= <>
$$ ##$F3LIST= <>
$$ ##$FCUCHAN= (0..9)
$$ 0 1 2 0 0 0 0 0 0 0
$$ ##$FL1= 90
$$ ##$FL2= 90
$$ ##$FL3= 90
$$ ##$FL4= 90
$$ ##$FOV= 20
$$ ##$FQ1LIST= <freqlist>
$$ ##$FQ2LIST= <hetcor.jos>
$$ ##$FQ3LIST= <freqlist>
$$ ##$FQ4LIST= <freqlist>
$$ ##$FQ5LIST= <freqlist>
$$ ##$FQ6LIST= <freqlist>
$$ ##$FQ7LIST= <freqlist>
$$ ##$FQ8LIST= <freqlist>
$$ ##$FRQLO3= 1.79769313486232e+308
$$ ##$FRQLO3N= 0
$$ ##$FS= (0..7)
$$ 83 83 83 83 83 83 83 83
$$ ##$FTLPGN= 0
$$ ##$FW= 625000
$$ ##$FnMODE= 0
$$ ##$FnTYPE= 0
$$ ##$GPNAM= (0..31)
$$ <> <> <> <> <> <> <> <> <> <> <> <> <> <> <> <> <> <> <> <> <> <> <> <>
$$ <> <> <> <> <> <> <> <>
$$ ##$GPX= (0..31)
$$ 0 0 0 0 0 0 0 0 0 0 0 0 0 0 0 0 0 0 0 0 0 0 0 0 0 0 0 0 0 0 0 0
$$ ##$GPY= (0..31)
$$ 0 0 0 0 0 0 0 0 0 0 0 0 0 0 0 0 0 0 0 0 0 0 0 0 0 0 0 0 0 0 0 0
$$ [...]
$$ 0 0 0 0 0 0 0 0
$$ ##$SguType= 2
$$ ##$ShimPowMaxUA= (0..63)
$$ 130000 130000 130000 130000 130000 130000 130000 130000 130000 130000 130000
$$ 130000 130000 130000 130000 130000 130000 130000 130000 130000 130000 130000
$$ 130000 130000 130000 130000 130000 130000 130000 130000 130000 130000 130000
$$ 130000 130000 130000 130000 130000 130000 130000 0 0 0 0 0 0 0 0 0 0 0
$$ 0 0 0 0 0 0 0 0 0 0 0 0 0
$$ ##$ShimPowMaxUC= (0..63)
$$ 130000 130000 130000 130000 130000 130000 130000 130000 130000 130000 130000
$$ 130000 130000 130000 130000 130000 130000 130000 130000 130000 130000 130000
$$ 130000 130000 130000 130000 130000 130000 130000 130000 130000 130000 130000
$$ 130000 130000 130000 130000 130000 130000 130000 0 0 0 0 0 0 0 0 0 0 0
$$ 0 0 0 0 0 0 0 0 0 0 0 0 0
$$ ##$ShimPowMaxUG= (0..63)
$$ 524287 524287 524287 524287 524287 524287 524287 524287 524287 524287 524287
$$ 524287 524287 524287 524287 524287 524287 524287 524287 524287 524287 524287
$$ 524287 524287 524287 524287 524287 524287 524287 524287 524287 524287 524287
$$ 524287 524287 524287 524287 524287 524287 0 0 0 0 0 0 0 0 0 0 0 0 0 0 0
$$ 0 0 0 0 0 0 0 0 0 0
$$ ##$ShimPowRcbType= 3
$$ ##$ShimPowRes= (0..63)
$$ 1e-20 1e-20 1e-20 1e-20 1e-20 1e-20 1e-20 1e-20 1e-20 1e-20 1e-20 1e-20
$$ 1e-20 1e-20 1e-20 1e-20 1e-20 1e-20 1e-20 1e-20 1e-20 1e-20 1e-20 1e-20
$$ 1e-20 1e-20 1e-20 1e-20 1e-20 1e-20 1e-20 1e-20 1e-20 1e-20 1e-20 1e-20
$$ 1e-20 1e-20 1e-20 1e-20 0 0 0 0 0 0 0 0 0 0 0 0 0 0 0 0 0 0 0 0 0 0 0 0
$$ ##$ShimPowRng0= (0..63)
$$ 1 1 1 1 1 1 1 1 1 1 1 1 1 1 1 1 1 1 1 1 1 1 1 1 1 1 1 1 1 1 1 1 1 1 1 1
$$ 1 1 1 1 0 0 0 0 0 0 0 0 0 0 0 0 0 0 0 0 0 0 0 0 0 0 0 0
$$ ##$ShimPowRng1= (0..63)
$$ 1 1 1 1 1 1 1 1 1 1 1 1 1 1 1 1 1 1 1 1 1 1 1 1 1 1 1 1 1 1 1 1 1 1 1 1
$$ 1 1 1 1 0 0 0 0 0 0 0 0 0 0 0 0 0 0 0 0 0 0 0 0 0 0 0 0
$$ ##$ShimPowRng2= (0..63)
$$ 1 1 1 1 1 1 1 1 1 1 1 1 1 1 1 1 1 1 1 1 1 1 1 1 1 1 1 1 1 1 1 1 1 1 1 1
$$ 1 1 1 1 0 0 0 0 0 0 0 0 0 0 0 0 0 0 0 0 0 0 0 0 0 0 0 0
$$ ##$ShimPowRng3= (0..63)
$$ 1 1 1 1 1 1 1 1 1 1 1 1 1 1 1 1 1 1 1 1 1 1 1 1 1 1 1 1 1 1 1 1 1 1 1 1
$$ 1 1 1 1 0 0 0 0 0 0 0 0 0 0 0 0 0 0 0 0 0 0 0 0 0 0 0 0
$$ ##$ShimSysFunc= (0..63)
$$ 1 2 3 4 5 6 7 8 9 10 0 37 38 35 16 15 14 13 12 11 28 27 26 25 24 23 36
$$ 22 30 29 20 21 34 33 32 31 17 18 19 0 0 0 0 0 0 0 0 0 0 0 0 0 0 0 0 0 0
$$ 0 0 0 0 0 0 0
$$ ##$ShimSysMatrix= 0
$$ ##$ShimSysType= 4
$$ ##$TFXNUM= 0
$$ ##$TRIPLO2= 0
$$ ##$VTU= 1
$$ ##$VTUETH= <no>
$$ ##$VTUTY= <tty05>
$$ ##$WBREFAM= (0..15)
$$ 99.6 100 100 100 100 100 100 100 100 100 100 100 100 100 100 100
$$ ##$WBREFLM= (0..15)
$$ 1 0 0 0 0 0 0 0 0 0 0 0 0 0 0 0
$$ ##$WBREFPH= (0..15)
$$ 0.22 0 0 0 0 0 0 0 0 0 0 0 0 0 0 0
$$ ##$WBSGU= (0..15)
$$ 0 0 0 0 0 0 0 0 0 0 0 0 0 0 0 0
$$ ##$XFAC= 2
$$ ##END=
$$ 
##$DECIM=	532
##$DSPFVS=	21
##XUNITS=	HZ
##YUNITS=	ARBITRARY UNITS
##FIRSTX=	31114.52251176059508
##LASTX=	-6461.1060126755846795
##XFACTOR=	-18.356437969924854769
##YFACTOR=	1.0000000000000000871e-07
##NPOINTS=	2048
##XYDATA=	(X++(Y..Y))
-1695B608711l674723k978177j596789m37353j02366j84602N7353P42270J400055J688698
-1685b476923J648741J324800O20461k86143p51975k69953Q33918J614628J443560N31728
-1675D232842m56609j035972j097193q14511o04134r23432j730187k227884j589199m6020
-1665f292299J128823R76669j13020j049869j412852j578320j562880n89786J664295L936572
-1655d892667M373327K667496M41513p84147j292665k201418l298761k944316l62224K853636
-1645e440226M243813L116693R69703n43141j204815j595444j752980j292131n08687l87697
-1635d394912j257094k111448j770455l29113J082113J749104J936476K009499J759599J028931
-1625b97300M25521O32436J140073N28595j627479l758703l874874j922621J36126P00615
$$ plain form
-1695 2608711 -1066012 -4044189 -5640978 -6078331 -6180697 -6365299 -6307946 -5565676 -4165621 -2476923
-1685 -2476923 -828182 496618 1117079 830936 78961 -190992 642926 2257554 3701114 4232842
-1675 4232842 3776233 2740261 1643068 828557 224423 -699009 -2429196 -4657080 -6246279 -6292299
-1665 -6292299 -5163476 -4186807 -4299827 -5349696 -6762548 -8340868 -9903748 -10493534 -8829239 -4892667
-1655 -4892667 -519340 2148156 2589669 1805522 512857 -1688561 -4987322 -7931638 -8293862 -5440226
-1645 -5440226 -1196413 1920280 2889983 2346842 1142027 -453417 -2206397 -3498528 -4007215 -4394912
-1635 -4394912 -5652006 -7763454 -9533909 -9863022 -8780909 -7031805 -5095329 -3085830 -1326231 -297300
-1625 -297300 128221 760657 1900730 2429325 801846 -2956857 -6831731 -8754352 -8618226 -7917611
-1615g917611L07875N78389J851080K658114J642441o60917k414064k529652j598054q14979
-1605h897378n60219l53357J46811O57093Q41482R27427J408102K248559K723691K171148
-1595A313359P69341n54497r51540l46804N73914R15904J60792j549537l519024m925080n300219
-1584a3413391m656233l132046o41238K870034O708508R245568Q906959N596018J026273k548564
-1574I961888l964717l548195k199688n22947J071500J915436J371717l07345j844215k081029
-1564a47595j229660o75507j403002k782579l118218j411624J516726L707441L865540K523936
-1554H45458J446555J824815L006723L066375P54612l081618o086859o428253m225861j101550
-1544i979603J365792K572983K650242J936259R39484L79429O72728J314464J209161q5240
$$ plain form
-1615 -7917611 -7609736 -7031347 -5180267 -2522153 -879712 -1540629 -3954693 -6484345 -8082399 -8897378
-1605 -8897378 -9457597 -9810954 -9664143 -9007050 -8165568 -7238141 -5830039 -3581480 -857789 1313359
-1595 1313359 2082700 1528203 576663 229859 803773 1719677 1880469 330932 -3188092 -8113172 -13413391
-1584 -13413391 -18069624 -21201670 -21842908 -18972874 -12264366 -3018798 5888161 11484179 12510452 9961888
-1574 9961888 5997171 2448976 249288 -273659 797841 2713277 4084994 3777649 1933434 -147595
-1564 -147595 -1377255 -2052762 -3455764 -6238343 -9356561 -10768185 -9251459 -5544018 -1678478 845458
-1554 845458 2292013 4116828 7123551 10189926 10944538 7862920 1776061 -4652192 -8878053 -9979603
-1544 -9979603 -8613811 -6040828 -3390586 -1454327 -514843 -135414 537314 1851778 3060939 2975699
-1534B975699j629440j936569n47528J418149K306311J378202p28376k652642l234565k075203
-1524d725962L23106K793131M127263L788602K139969R875j899815l216142l764342l497928
-1514c922243k558926j234791J91108J455421K237139K314472J898464J566696J635828J764291
-1504E347459J470623Q99551N66828K55630j176755m258535p435679q005713m889351j7653
-1494a7243595L464928M103295K868752J429879N52584K58740N40687J140745J161895m9038
-1484a771128j629445j838238m19579N64971p80566l340423l921618j268041K077051K838483
-1474i488533J174557L88020K457580N275043N235380J772342j969190k940917j500983l98455
-1464D844j292874l212503m190258l438493j639489J59409J305100J536209R64260K18035
$$ plain form
-1534 2975699 1346259 -590310 -1137838 280311 2586622 3964824 3236448 583806 -2650759 -4725962
-1524 -4725962 -4402856 -1609725 2517538 6306140 8446109 8455984 6556169 3340027 -424315 -3922243
-1514 -3922243 -6481169 -7715960 -7524852 -6069431 -3832292 -1517820 380644 1947340 3583168 5347459
-1504 5347459 6818082 7717633 8284461 8540091 7363336 3104801 -4330878 -12336591 -17225942 -17243595
-1494 -17243595 -13778667 -9675372 -6806620 -5376741 -4824157 -4565417 -4024730 -2883985 -1722090 -1771128
-1484 -1771128 -3400573 -5238811 -5658390 -5093419 -5873985 -9214408 -13136026 -14404067 -12327016 -9488533
-1474 -9488533 -8313976 -7925956 -5468376 -193333 5042047 6814389 4845199 1904282 403299 4844
-1464 4844 -1288030 -4500533 -8690791 -12129284 -13768773 -13609364 -12304264 -10768055 -9803795 -9585760
-1454i585760J59835J128210K559223L510585L490497K708550J669304O84679k88847j472532
-1444D563744k872167l963963l950381k619657q91028j03952o02460j350921j223321l77471
-1434a3391577J00319k40927o25718j61360J066965K419384L684602M878308N298170L855517
-1424F883683P77368j900279k465720j760281k119728l956022m633166j703134L406394O283845
-1414a187040M322735l78079l445410k829553j98381J704289J853609R59192o6332o99337
-1404C5693m55886Q21475K145464J812873o83401l604362m517991k834149k66691J223305
-1394f323670J367472J264497J690333K317053K444992J917870J153319O38649O08795R46674
-1384H025984J135247N14271j041598k721834l393843k735998j538758p60601n07824j58491
$$ plain form
-1454 -9585760 -9425925 -8297715 -5738492 -2227907 1262590 3971140 5640444 6325123 6036276 4563744
-1444 4563744 1691577 -2272386 -6222767 -8842424 -9733452 -9837404 -10439864 -11790785 -13014106 -13391577
-1434 -13391577 -13291258 -13532185 -14157903 -14319263 -13252298 -10832914 -7148312 -2270004 3028166 6883683
-1424 6883683 7661051 5760772 3295052 1534771 -584957 -4540979 -9174145 -10877279 -7470885 -1187040
-1414 -1187040 3135695 2757616 -687794 -3517347 -3715728 -2011439 -157830 801362 735030 35693
-1404 35693 -420193 401282 2546746 4359619 3676218 71856 -4446135 -7280284 -7546975 -6323670
-1394 -6323670 -4956198 -3691701 -2001368 315685 2760677 4678547 5831866 6470515 7079310 8025984
-1384 8025984 9161231 9675502 8633904 5912070 2518227 -217771 -1756529 -2517130 -3024954 -3183445
-1374c183445O69121J567443J743578P56886j099134k837883l170598j350539J895050M421777
-1364e87744M237539J340858k146990l855044l085873q93445J318003K820407L374848K762067
-1354E284626R92491j233155k769254k886606j755946j18706J267426J844786J322458j20125
-1344A827995j793697k960840l360241l101332k146397l11240K074525L938577M378369L703595
-1334B249314L084896L053365K807862J356731r75979k745671l090970k689290k693494l081902
-1324b725138k611690m40982K616270M674508M432199K131209q51180l039105l633554k783145
-1314b230608j396282n09050n12944r18313r60921m06978L58915R74974J553289K341418L114025
-1303A407525L196249K173369M40421j071150j714154j676101j754971k544550l697573l984379
$$ plain form
-1374 -3183445 -2514324 -946881 796697 1553583 454449 -2383434 -5554032 -6904571 -5009521 -587744
-1364 -587744 3649795 4990653 2843663 -1011381 -4097254 -4990699 -3672696 -852289 2522559 5284626
-1354 5284626 6277117 5043962 2274708 -611898 -2367844 -2486550 -1219124 625662 1948120 1827995
-1344 1827995 34298 -2926542 -6286783 -9388115 -11534512 -11845752 -9771227 -5832650 -1454281 2249314
-1334 2249314 5334210 8387575 11195437 12552168 11576189 8830518 5739548 3050258 356764 -2725138
-1324 -2725138 -5336828 -5777810 -3161540 1512968 5945167 8076376 7225196 4186091 552537 -2230608
-1314 -2230608 -3626890 -4135940 -4648884 -5567197 -6528118 -6935096 -6576181 -5601207 -4047918 -1706500 1407525
-1303 1407525 4603774 6777143 7217564 6146414 4432260 2756159 1001188 -1543362 -5240935 -9225314
-1293i225314k336665Q97600L821822M478761K686445K39270r10637n48031m3662m62727j330395
-1282b733533j515326r03688n54230j136581j806658j117593J126166L396182L916567K328297
-1272I99603j95735k138044k670909j834278k91049R47179J015480j24744j537603k125378
-1262g955478j620742o15321L08148J121501J947267K512126K382956J587610N98403k59575
-1252F895r15012r71186L31943K946385N092264M435691O36378l758342n554243l957051r90448
-1241b696726R53407J342464J181895J249766J366017J135645N89528j07687r73539j836803
-1231B203967k087202j330122o2242R02596J588174K690769M037299M032013J456599k499289
-1221A0932562m968946m385967k033474k77400N6033j19974k737K11222L71520J113285K740212
$$ plain form
-1293 -9225314 -11561979 -10664379 -6842557 -2363796 322649 561919 -348718 -896749 -940411 -1403138 -2733533
-1282 -2733533 -4248859 -5152547 -5706777 -6843358 -8650016 -9767609 -8641443 -5245261 -1328694 999603
-1272 999603 803868 -1334176 -4005085 -5839363 -6130412 -5183233 -4167753 -4292497 -5830100 -7955478
-1262 -7955478 -9576220 -10191541 -9883393 -8761892 -6814625 -4302499 -1919543 -331933 266470 6895
-1252 6895 -908117 -1879303 -1547360 1399025 6491289 10926980 11563358 7805016 2250773 -1706278 -2696726
-1241 -2696726 -1743319 -400855 781040 2030806 3396823 4532468 5121996 5014309 4040770 2203967
-1231 2203967 116765 -1213357 -1275599 -373003 1215171 3905940 7943239 11975252 13431851 10932562
-1221 10932562 5963616 1577649 -455825 -733225 -677192 -797166 -799903 -588681 -217161 896124 3636336
-1210C636336M054706L434806J025343j149864j565152q09281k52432Q5430J197731K882407
-1200A2540030L271308J204936j824061l121314j899393j1702M23658p65688k245088k912907
-1190D659779k469511q77035J603532L796253M073703K039781p25758k097810j256270J220188
-1180I966852M431510P404504Q656201P015910L527000J483746L556690R594059J8578577
-1171G4215049L2115174N3349618Q0804434J04681282J11915245R5880661O0537415J5502663
-1163F29001541l0732880p1747131j00279236j09138222r7190533p2729673m8285961l1512394
-1155F7385511k1791229j4992822r322476n628800l960808k465694L446K020950J532080j124806
-1145A1655352l372140l419361k042332j038418p99081j96348J449218L140152L204171J138611
$$ plain form
-1210 3636336 7691042 11125848 12151191 11001327 9436175 8626894 8374462 8459892 9657623 12540030
-1200 12540030 15811338 17016274 15192213 12070899 10171506 10159804 10583462 9817774 7572686 4659779
-1190 4659779 2190268 1313233 2916765 6713018 10786721 12826502 12100744 10002934 8746664 9966852
-1180 9966852 14398362 21802866 30459067 37474977 41001977 42485723 46042413 55636472 74215049
-1171 74215049 106330223 159679841 240484275 345165557 457080802 552961463 613498878 629001541
-1163 629001541 598268661 526521530 426242294 317104072 219913539 147183866 98897905 67385511
-1155 67385511 45594282 30601460 21278984 15650184 11689376 9223682 9227128 11248078 12780158 11655352
-1145 11655352 8283212 4863851 2821519 1783101 984020 787672 2236890 5377042 8581213 9719824
-1135I719824j825142l847928m002187k813031j536109r51719p90733k90569P68079J739697
-1125c829818J868833J152117K25310m92365j194470k116629k846503k504852o39218K159774
-1115h217821M517759N165938L836281J544917j46952n48489n56557j526556l235903l540413
-1105b707796p75481L636968N876830L534102j710779n774162o277029m322836k345630j245036
-1095a2110849k66166J029773J896903J669198R49904Q68940J545951J968954J319873j72479
-1085a299998j782081l091642l898641l767382k298150J72434K605621M133881M618519M295829
-1075c11610L325778K007923J054285J008813J370488Q85713r51147l069318l977854l583168
-1065b240097l241075l816810m256957k721983R20406M349564M949585K525242n30140j802317
$$ plain form
-1135 9719824 7894682 4046754 44567 -2768464 -4304573 -5256292 -6047025 -6337594 -5569515 -3829818
-1125 -3829818 -1960985 -808868 -583558 -1075923 -2270393 -4387022 -7233525 -9738377 -10377595 -8217821
-1115 -8217821 -3700062 1465876 5302157 6847074 6700122 6151633 5595076 4068520 832617 -2707796
-1105 -2707796 -3483277 153691 6030521 9564623 7853844 2079682 -4197347 -8520183 -10865813 -12110849
-1095 -12110849 -12377015 -11347242 -9450339 -7781141 -6831237 -5962297 -4416346 -2447392 -1127519 -1299998
-1085 -1299998 -3082079 -6173721 -10072362 -13839744 -16137894 -15965460 -13359839 -9225958 -4607439 -311610
-1075 -311610 3014168 5022091 6076376 7085189 8455677 9341390 8390243 5320925 1343071 -2240097
-1065 -2240097 -5481172 -9297982 -13554939 -16276922 -15356516 -11006952 -6057367 -3532125 -4062265 -5864582
-1055e864582j209137n41526r70950j654240j076282P17440J981726J485046J86797O5224
-1045f880484J511519K710703J916561k96404j728380j238904P7192N35835j07657q47261
-1035d347280j066999j014973o61689Q45874L898733P140936Q359706O657067L109698p17907
-1025B2203166m071012o458382o768782m147473L14598L935488N100970M908099N395908O545282
-1015B6957862O090789K518520k642264o190200o500750m737930l044689k360131k236362
-1006G854845k049468j689839j281550q86030o02374n24652m24094J47972J157009J778207
-996C480026J226080j84136j238217j207328o85024p75073j638721k198984j347044P40288
-986c828133K568113K560521M07124k616557m617109m549828k898778r27907O55048K074120
$$ plain form
-1055 -5864582 -7073719 -7615245 -8586195 -10240435 -11316717 -10599277 -8617551 -7132505 -6945708 -6880484
-1045 -6880484 -5368965 -2658262 -741701 -1038105 -2766485 -4005389 -3928197 -3392362 -3500019 -4347280
-1035 -4347280 -5414279 -6429252 -7090941 -6245067 -2346334 4794602 13154308 19811375 22921073 22203166
-1025 22203166 18132154 11673772 4904990 757517 1072115 5007603 10108573 15016672 20412580 26957862
-1015 26957862 33048651 35567171 32924907 26734707 20233957 15496027 12451338 10091207 7854845
-1006 7854845 5805377 4115538 2833988 1947958 1345584 820932 396838 544810 1701819 3480026
-996 3480026 4706106 4521970 3283753 2076425 1391401 616328 -1022393 -3221377 -4568421 -3828133
-986 -3828133 -1260020 1300501 1707625 -908932 -5526041 -10075869 -12974647 -13902554 -13247506 -11173386
-976a1173386L522413M288400L370645R15642j529509k528753k206588j784999j867457j747271
-966a0740863n45063J467399L083889L475741K854578J861726P18396q41174l009517n409001
-956g083889o978003o344745k812669K534549O927405P838552N198259J432485r41157j498193
-946a727406j467326j595978j266036J65040J945899K538730J419694l31537j262567q78096
-936b459583L33512J591449K113777J175297j337755m315988n956028n296905l026330n30411
-926a7708965J571029L554237N453614O414517N449016K542932j230731m479137o130706n625495
-916a0189689l071997N95268L951007N880085O039919M593828J883097j362019l838527m354906
-906A26066k904078p29710Q54653J459260J336647O37935m88611j335467j048059J03593N69920
$$ plain form
-976 -11173386 -7650973 -3362573 8072 923714 -605795 -3134548 -5341136 -7126135 -8993592 -10740863
-966 -10740863 -11285926 -9818527 -6734638 -3258897 -404319 1457407 2175803 1334629 -1674888 -7083889
-956 -7083889 -14061892 -20406637 -23219306 -20684757 -13757352 -5918800 -720541 711944 -229213 -1727406
-946 -1727406 -3194732 -4790710 -6056746 -5891706 -3945807 -1407077 12617 -318920 -1581487 -2459583
-936 -2459583 -2126071 -534622 1579155 2754452 1416697 -2899291 -8855319 -14152224 -17178554 -17708965
-926 -17708965 -16137936 -12583699 -7130085 -715568 4733448 7276380 6045649 1566512 -4564194 -10189689
-916 -10189689 -13261686 -12666418 -8715411 -2835326 3204593 7798421 9681518 8319499 4480972 126066
-906 126066 -2778012 -3507722 -2653069 -1193809 142838 780773 292162 -1043305 -2091364 -1987771 -1417851
-895a417851o68638k465179k547037l22166K147166K509273R40187k02167N74658K081479
-885F29725K084436J42706j915183k206938p88233P61500J181595M84244o51597j785991k783593
-874d847329l322379k788781q56764J850860L823716L676593J406882j347952k637115k024185
-864g066454r25502q53075j468137q92386J837618N056609N782205K828092j712210m262189
-854a675429k919091J146411M995753O243519M379750O16173l027107m747949l846915j131339
-844C3776J597905K849713K558460J959603K217707L074337K953765O35042l109498n762181
-834I008629n247975j949353J591101L005531K002504R343j601481k498338k854927k607762
-824a142728j666057m49536M08139Q69859J457133K225923K317309J031332r18393j889923
$$ plain form
-895 -1417851 -2086489 -4551668 -7098705 -7420871 -5273705 -2764432 -1824245 -2026412 -1451754 629725
-885 629725 2714161 2856867 941684 -1265254 -2053487 -1291987 -110392 373852 -277745 -2063736 -4847329
-874 -4847329 -8169708 -10958489 -11815253 -9964393 -6140677 -2464084 -1057202 -2405154 -5042269 -7066454
-864 -7066454 -7991956 -8845031 -10313168 -11205554 -9367936 -4311327 1470878 4298970 2586760 -1675429
-854 -1675429 -4594520 -3448109 1547644 7791163 12170913 12787086 9759979 5012030 1165115 33776
-844 33776 1631681 4481394 7039854 8999457 11217164 14291501 17245266 17880308 14770810 9008629
-834 9008629 3760654 1811301 3402402 6407933 8410437 8419780 6818299 4319961 1465034 -1142728
-824 -1142728 -2808785 -3258321 -2850182 -1980323 -523190 1702733 4020042 5051374 4132981 2243058
-814B243058j189716M4837J77603j034276k308776k431917j476173l84442J48093P8941l27989
-803f460757p90363j069097j182088j543600k408544l047845k073106Q47811L884277M451487
-793i391825K000027j107512j943421K3835K742541M106364L950757L348265K652127J063269
-783G444427j875065n032911o388446m848958j203244K564594M689606M567748K809740O46015
-773C373506q75435j406575j208552o56443O6104Q37707J431587J674516J643815J461923
-763F342153R55563j53251j624651k626438k613962k094034k043805k518613k345074o04497
-753i326609J822889K762138R87050k307733m479526l752597m97522L431610O171751O750250
-743A561701N175240K187447j122698l836158n547355o171210n538656l513904o30501J748560
$$ plain form
-814 2243058 1053342 1098179 1275782 241506 -2067270 -4499187 -5975360 -6359802 -6211709 -6132768 -6460757
-803 -6460757 -7251120 -8320217 -9502305 -11045905 -13454449 -16502294 -18575400 -17727589 -13843312 -9391825
-793 -9391825 -7391798 -8499310 -10442731 -10418896 -7676355 -3569991 380766 3729031 6381158 7444427
-783 7444427 5569362 536451 -5851995 -10700953 -11904197 -9339603 -4649997 -82249 2727491 3373506
-773 3373506 2498071 1091496 -117056 -773499 -707395 130312 1561899 3236415 4880230 6342153
-763 6342153 7297716 7144465 5519814 2893376 279414 -1814620 -3858425 -6377038 -8722112 -9326609
-753 -9326609 -7503720 -4741582 -3754532 -6062265 -10541791 -14294388 -14791910 -11360300 -5188549 1561701
-743 1561701 6736941 8924388 7801690 3965532 -1581823 -7753033 -13291689 -16805593 -17436094 -15687534
-733a5687534K400305J490052N86153J202978L365565N683972O710211O056724M321585K302551
-723A8432562M90966q81157j676204j880713j688058j437595j471038j997507k917962l670017
-713A303277l419330j736304P76598K713266K982286J782486L90232o2077M36723R79605P77345
-702F924107p1192p12292k93084J329236L380127M597102M118149K223620J54524j064372
-692B0585925j673927k793682m814167o451285n879332k900810M17734J636650L54576j575463
-682c093781k162542j184788J37628Q63142J158517J537922J962347K063033J875331J794224
-672D951033J833665J420322J16465j780524l589809m880466n378559m534824j945145J541842
-662a2246000L785343L195189O06517j294316p11825J411872K579041J492448p63287k133543
$$ plain form
-733 -15687534 -13287229 -11797177 -11211024 -10008046 -6642481 -958509 5751702 11808426 16130011 18432562
-723 18432562 18923528 18042371 16366167 14485454 12797396 11359801 9888763 7891256 4973294 1303277
-713 1303277 -2116053 -3852357 -3075759 -362493 2619793 4402279 4792511 4730434 5167157 6146762 6924107
-702 6924107 6852915 6140623 5847539 7176775 10556902 15154004 19272153 21495773 21650297 20585925
-692 20585925 18911998 16118316 11304149 4852864 -1026468 -3927278 -3509544 -1872894 -1518318 -3093781
-682 -3093781 -5256323 -6441111 -6303483 -5440341 -4281824 -2743902 -781555 1281478 3156809 4951033
-672 4951033 6784698 8205020 8321485 6540961 2951152 -1929314 -7307873 -11842697 -13787842 -12246000
-662 -12246000 -8460657 -5265468 -4658951 -5953267 -6665092 -5253220 -2674179 -1181731 -1945018 -4078561
-652d078561j649867J2422J467277J675978M21095j601084l057006k886637j329852J67825
-642a0858410M04255l36824p86331l03913M62538N99556J11067k65647o7702O03152J642606
-631h795653L088255M477202M733528L408489J825549K178731N164183Q963534J0972891J0252498
-621D6269207P848110M992923J789456k087917o056300q706693r167493p900119o067099m501100
-611A6412975l425028k754796k285838j775920j251495j173334j876173k769264k536615m52494
-601c887982K716367N380930O459737N699456L041251j388641o300111r083097p753754l231356
-591h347200J045604K252276O63228j221437j534799m07845J197854K898918M554623N242917
-581F344139L718007J52099l281276m187842k228215O93846K397282K213750Q64861q82811
$$ plain form
-652 -4078561 -5728428 -5716006 -4248729 -2572751 -2151656 -3752740 -6809746 -9696383 -11026235 -10858410
-642 -10858410 -10454155 -10790979 -11577310 -11881223 -11418685 -10819129 -10708062 -10973709 -11041411 -10438259 -8795653
-631 -8795653 -5707398 -1230196 3503332 6911821 8737370 10916101 16080284 25043818 36016709 46269207
-621 46269207 54117317 59110240 60899696 58811779 52755479 44048786 34881293 26981174 20914075 16412975
-611 16412975 12987947 10233151 7947313 6171393 4919898 3746564 1870391 -898873 -3435488 -3887982
-601 -3887982 -1171615 4209315 10669052 16368508 19409759 18021118 11721007 2637910 -5115844 -8347200
-591 -8347200 -7301596 -5049320 -4386092 -5607529 -7142328 -7550173 -6352319 -3453401 1101222 6344139
-581 6344139 10062146 10214245 6932969 2745127 516912 1210758 3608040 5821790 6686651 5803840
-571E803840k938762n297987p156893p051512m129264O75140M930888O501681N220309K698678
-561g43882M58791j427221l553350n396025n163156j838921L122358O850104P756406O603659
-551F668763M864444K850128P0853l107195n221663n304591l933083k273927p16014Q76006
-541e226279K033483J916723Q30181M46929J754889L383737L006632L13211k447248l221493
-531B790765k524104k279578k934361k938344j151920J410431K919693L045939K952181L306086
-521D596788L449159K776399J860733J391265O52692j735408n494530q153214p465159l846782
-511a1968057J95245K686602L504246L333751K478811J271033Q13546K114823M396608N223653
-501A4050261K998453r71451l505755k734060N5988J829026Q39531j794932l307931j912596
$$ plain form
-571 5803840 2865078 -2432909 -9589802 -16641314 -20770578 -20095438 -15164550 -8662869 -3442560 -743882
-561 -743882 -285091 -1712312 -5265662 -10661687 -15824843 -17663764 -14541406 -7691302 65104 6668763
-551 6668763 11533207 14383335 14454188 11346993 6125330 820739 -3112344 -5386271 -6102285 -5226279
-541 -5226279 -3192796 -1276073 -445892 1037 1755926 5139663 8146295 8459506 6012258 2790765
-531 2790765 266661 -2012917 -4947278 -7885622 -9037542 -7627111 -4707418 -1661479 1290702 4596788
-521 4596788 8045947 10822346 12683079 14074344 14727036 12991628 7497098 -656116 -8121275 -11968057
-511 -11968057 -11772812 -9086210 -5581964 -2248213 230598 1501631 2315177 4430000 8826608 14050261
-501 14050261 17048714 16077263 12571508 9837448 9893436 11722462 12561993 10767061 7459130 5546534
-491E546534J588277M542466M788866K471938k84353j377549l15251K034397M757981P494650
-481C1247956R901212J1281662J1315269J1090069J3189983K0906506L7371998O4323091R9573326
-472C10201072J34312210J53853874J44026185J00007324L0837478m4277877j05089417j38521347
-464E85349502j41999626j22186470r1081009o0885086l9163017k6758242j9917765j4734506
-456F8623781r975176o424589m682808m317065m704086n659838o871405p335148o062207l300774
-446I290685n59599P62722N39360l53038j110158j523116j664040j533546j155229p24292
-436A969749m21385j98336L2733O9961m41029j444136k256906k139146j055786K92148J232137
-425d359996J788042K491610L594500M583673M506529K762372l41298l638812n671842n478718
$$ plain form
-491 5546534 7134811 11677277 16466143 18938081 18653728 17276179 16960928 18995325 23753306 31247956
-481 31247956 41149168 52430830 63746099 74836168 88026151 108932657 146304655 210627746 310201072
-472 310201072 444513282 598367156 742393341 842400665 873238143 828960266 723870849 585349502
-464 585349502 443349876 321163406 230082397 169197311 130034294 103276052 83358287 68623781
-456 68623781 58648605 52224016 47541208 43224143 38520057 32860219 25988814 18653666 12591459 9290685
-446 9290685 8731086 9493808 10033168 9680130 8569972 7046856 5382816 3849270 2694041 1969749
-436 1969749 1548364 1350028 1382761 1452722 1011693 -432443 -2689349 -4828495 -5884281 -5592133 -4359996
-425 -4359996 -2571954 -80344 3514156 8097829 12604358 15366730 15025432 11386620 5714778 236060
-415B36060l252426m14186J201749O86073j168294k524289k157765n35199P94987Q21075o8945
-404f381160q03940q86092o61955n03777j97821O01336J567926J786365P27822j089893k554028
-393h395217k903756k077756l24216K130920M877755P058984P702717O497784M188685K083731
-383B0839631J061316R52878Q55455J01738j036959j682725j455192j099429j725154l377276
-373A3434283m721408m495203l116195k345461l173921m440162l992403j131880K525931M708616
-363f747803M617524L180503J570887P3030j512918k878844l132384j723748Q13268L163100
-353b577385M234925L935123L097296K663614K804058K818169K033201P80587J78180P27434
-343B0695202J373348M28171k482342n774863p468262p136179n957239n000423m044655k326167
$$ plain form
-415 236060 -3016366 -3430552 -2228803 -1542730 -2711024 -5235313 -7393078 -7928277 -7133290 -6312215 -6381160
-404 -6381160 -7185100 -8071192 -8733147 -9236924 -9434745 -8833409 -7265483 -5479118 -4751296 -5841189 -8395217
-393 -8395217 -11298973 -13376729 -13700945 -11570025 -6692270 366714 8069431 14567215 18755900 20839631
-383 20839631 21900947 22853825 23709280 23811018 22774059 21091334 19636142 18536713 16811559 13434283
-373 13434283 8712875 4217672 1101477 -1243984 -4417905 -8858067 -12850470 -13982350 -11456419 -6747803
-363 -6747803 -2130279 1050224 2621111 2694141 1181223 -1697621 -4830005 -6553753 -5740485 -2577385
-353 -2577385 1657540 5592663 8689959 11353573 14157631 16975800 19009001 19789588 19967768 20695202
-343 20695202 22068550 22496721 20014379 14239516 6771254 -364925 -6322164 -11322587 -15367242 -17693409
-333a7693409O922J761626K025882J205280N47167Q72256J982610L130222L746589L712109
-323A297254L212812K531528J900778J423741J122579J047154J213994J379273J045291p9498
-313A6094906j642692k883108l383725l436536l556073l789438l713259l033490j870997k20158
-303a1434570K915627R837586K3486633M5892270P6197319J09249525J36086444J46827279
-295E39058113J34684257R8815765M4751206j7108612p3948746j13812370j29524651j21628685
-287C61286277r7930011o9251519m4180460k6362476j5311976q808269m706287j724348K71501
-278I3282432N17235j571255n191450q214960q773251o811857l992443k166338k054739l159199
-268E1864175m451780m987164m257385k468071n51405L62949l06749k313199m868250o953426
$$ plain form
-333 -17693409 -17686487 -15924861 -13898979 -12693699 -12146532 -11274276 -9291666 -6161444 -2414855 1297254
-323 1297254 4510066 7041594 8942372 10366113 11488692 12535846 13749840 15129113 16174404 16094906
-313 16094906 14452214 11569106 8185381 4748845 1192772 -2596666 -6309925 -9343415 -11214412 -11434570
-303 -11434570 -8518943 1318643 24805276 70697546 146894865 256144390 392230834 539058113
-295 539058113 673742370 772558135 817309341 800200729 726251983 612439613 482914962 361286277
-287 361286277 263356266 194104747 149924287 123561811 108249835 99441566 94735279 93010931 93282432
-278 93282432 93799667 92228412 87036962 78822002 70048751 63236894 59244451 57078113 55023374 51864175
-268 51864175 47412395 42425231 38167846 35699775 35148370 35511319 35204570 32891371 28023121 21069695
-258B1069695p437672n488460j450169K752728M708896L501582N61280j705882k166696j726468
-248A2618834j944971l184976m260478l730420j352122J638229L478147L200233J371703l01249
-238G532930l64545J017499K063513J053989j768989m097333l597846j47622L991303O148108
-228A1831007N277636K215504j507649m624119o132939n220027j890830K411176N470517N986185
-218A3816461M436657K089887m84943l379631n983594o621740m297577m39126K079822J988637
-208C204853J020651J675484M028835N672317M841659K588539J192684J108475O23245j466965
-198B4489777m019661n077715m498735l962831m468196m948212l903686j626594J08039L09321
-188g598493j95505j36676O15779J328362J614415J550284Q57239j000192l570818n074494
$$ plain form
-258 21069695 13632023 8143563 6693394 9446122 14155018 17656600 18217880 16511998 14345302 12618834
-248 12618834 10673863 7488887 3228409 -502011 -1854133 -215904 3262243 6462476 7834179 7532930
-238 7532930 7168385 8185884 10249397 11303386 9534397 5437064 1839218 1691596 5682899 11831007
-228 11831007 17108643 19324147 17816498 13192379 7059440 1839413 -51417 2359759 7830276 13816461
-218 13816461 18253118 20343005 19858062 16478431 10494837 3873097 -424480 -863606 1216216 3204853
-208 3204853 4225504 5900988 9929823 15602140 20443799 23032338 24225022 25333497 25956742 24489777
-198 24489777 20470116 15392401 10893666 6930835 2462639 -2485573 -6389259 -8015853 -7907814 -7598493
-188 -7598493 -7793998 -7930674 -7314895 -5986533 -4372118 -2821834 -1964595 -2964787 -6535605 -11610099
-178a1610099m059563j121543J723669L299770M168808N113779N554496M219398J087058k143552
-168F232221l631666k884423n60493K479705N383622P097628O884904N136090K965731Q13079
-158B9916398j746697m148007l332691M958191K3474157N2731113R2156477J38864975J82595024
-149E15468940K03182717J78744964J02603379n346299j06052017j64385986j69528351j36678238
-141D18009109r1612625n3593102k9399089j7775002j5236607j7778434k0711098k0374479
-133A51528673j6782551j3362093j3118210j5252562j6038789j2878351o993800k077102p36065
-124E4289150k508211m982233o286440o356914o190925o358376o412818n599914l873791k025700
-114C693828q14109j75781M82793J275127J485374N11932j014874j529510j81432K028926
$$ plain form
-178 -11610099 -15669662 -16791205 -15067536 -11767766 -7598958 -2485179 3069317 7288715 8375773 6232221
-168 6232221 2600555 -283868 -844361 1635344 7018966 14116594 21001498 26137588 29103319 29916398
-158 29916398 28169701 24021694 20689003 25647194 49121351 101852464 194008941 332873916 515468940
-149 515468940 718651657 897396621 1000000000 994653701 888601684 724215698 554687347 418009109
-141 418009109 326396484 272803382 243404293 225629291 210392684 192614250 171903152 151528673
-133 151528673 134746122 121384029 108265819 93013257 76974468 64096117 57102317 55025215 54289150
-124 54289150 51780939 46798706 40512266 34155352 27964427 21606051 15193233 9593319 5719528 3693828
-114 3693828 2879719 2703938 3186731 4461858 5947232 6459164 5444290 3914780 3733348 5762274
-104E762274L071532J846933q32114l138089l822024k901753j214052K97301R93695P78586
-94H42289J80681m9558K87104N61037M3898j148465k109150k123974j275215L0810J701099
-83c059444L663959N126776M804065K278286j116033l172085k637120q6310K787192M388743
-73A2978029L869416J285758k333033n305059o338524n541355m179487l277230k669461j594426
-63a3105372P2977J608731K411006K725185L169617L816241M075834L426371J986880L65117
-53A0552587q36170j338749j283509j139851j305401j605296j378839l42978P73459Q99780
-43B995033K0103n35648M37460K471910L772609L078790P93004j760872l648986m539495m088420
-32a004512j967406J290269M065069M831407L480847J179109r42336k542543l602839l860733
$$ plain form
-104 5762274 8833806 10680739 9848625 6710536 2888512 -13241 -1227293 -929992 63703 842289
-94 842289 1022970 973412 1260516 1821553 1865451 716986 -1392164 -3516138 -4791353 -4760543 -3059444
-83 -3059444 604515 5731291 10535356 12813642 11697609 8525524 5888404 5802094 8589286 12978029
-73 12978029 16847445 18133203 15800170 10495111 4156587 -1384768 -5564255 -8841485 -11510946 -13105372
-63 -13105372 -13032395 -11423664 -9012658 -6287473 -3117856 698385 4774219 8200590 10187470 10552587
-53 10552587 9716417 8377668 7094159 5954308 4648907 3043611 1664772 1321794 2095253 2995033
-43 2995033 3015136 2479488 2916948 5388858 9161467 12240257 13033261 11272389 7623403 3083908 -1004512
-32 -1004512 -2971918 -1681649 2383420 7214827 10695674 11874783 10932447 8389904 4787065 926332
-22I26332l157493k019563j276541j021930m45418R97473K551695K756998J099418j245405
-12h34434k451777j653771N42090K844798M240417M280066K937141O06799j808200l213489
-2E489640l071499j882329p67302m48315o56988o12152j7450N94175N67739k7494n19007n53631
9a904613n47545j002553j629990j588788o29444M13330N53228j61345p75421o77598k92143
20h242882l70895r57560j393044j145752k13437J250233L166520N093977N943759M713395
30G844314J608052j872615m099315m411172l106237q26324J660645L347395L342524J661427
40E148694n94850k145614k542380k148912j368547l15418P67321J279788Q45619p2871n60538
51a707708l05350M3237k66533j098069j562792j083748n5282O50111O54779L81673M36222
$$ plain form
-22 926332 -2231161 -4250724 -5527265 -6549195 -6994613 -5997140 -3445445 -688447 410971 -834434
-12 -834434 -3286211 -4939982 -4397892 -1553094 2687323 6967389 9904530 10511329 8703129 5489640
-2 5489640 2418141 535812 -231490 -679805 -1336793 -1948945 -1966395 -1372220 -804481 -831975 -1350982 -1904613
9 -1904613 -2452158 -3454711 -5084701 -6673489 -7302933 -6889603 -6336375 -6497720 -7273141 -7950739 -8242882
20 -8242882 -8613777 -9571337 -10964381 -12110133 -12323570 -11073337 -7906817 -2812840 3130919 7844314
30 7844314 9452366 7579751 3480436 -930736 -4036973 -4863297 -3202652 144743 3487267 5148694
40 5148694 4553844 2408230 -134150 -2283062 -3651609 -3967027 -3199706 -1919918 -1074299 -1147170 -1707708
51 -1707708 -2013058 -1969821 -2236354 -3334423 -4897215 -5980963 -6036245 -5386134 -4731355 -4349682 -3913460
62c913460Q73841J199376J035450O23879N52939J076496J935783K929666M360113O491208
72A7165291Q570351Q928590O535251K306214j629486m037865n486741o922130p891517o927516
82A0610442l680327M7986J817441P93424j795828m021640m552533k986563N2605K799471L211492
93B295970R01587k001478k794270j125929P44078Q51140j82445m72345K50735M46682n33159
104a619434j070003L91199K562992K452612o67146l842576l761088n69059K676970L821860
114C76327L476262K984783K096782j65966l079452m247739k426321O84116K146617P95546
124B640955k040765m354260n123582m289345k145557O30241K902799L840793L728735L493546
134g16440L403484K770309J113057r18507k226968k572584k656588k961386l045590k178902
$$ plain form
62 -3913460 -3039619 -1840243 -804793 -180914 372025 1448521 3384304 6313970 10674083 17165291
72 17165291 25735642 34664232 41199483 43505697 41876211 37838346 32351605 25429475 17537958 10610442
82 10610442 6930115 6978101 8795542 9588966 7793138 3771498 -781035 -3767598 -3714993 -915522 2295970
93 2295970 3197557 1196079 -1598191 -2724120 -1980042 -1128902 -1311347 -1783692 -1532957 -1086275 -1619434
104 -1619434 -2689437 -2298238 264754 2717366 2050220 -1792356 -5553444 -6122503 -3445533 376327
114 376327 3852589 6837372 8934154 8768188 5688736 1440997 -985324 -301208 1845409 2640955
124 2640955 600190 -3754070 -8877652 -13166997 -15312554 -14682313 -11779514 -7938721 -4209986 -716440
134 -716440 2687044 5457353 6570410 5651903 3424935 852351 -1804237 -4765623 -7811213 -9990115
144i990115l07817J857767L441610L836572K890362J166194j27406j49131L96223l18563l050970
155c55274n982012o144272k570029K465777N665507N824510M346933L013661K034912N33924
165H833637j719063l781962m661766m332309l382490k088369l46701J541415K576914J958727
175e401967J75764j169456q48768P61032K102682K081953J096697L40035L13344L96483p0429
186b22630p12256n51074N90410J613516J302698l31555k176546l276902l528516l155281k091559
197a2539695k94598J638071K739464K647337J946212J419095J291997J404399J730676K256326
207D239284K509041J824398K64275j186280j668908j364639r45294m28345O84771K064834
217E993137K207165J36335k895251m282484k860807k74377P73747p45959l534912n559933
$$ plain form
144 -9990115 -10297932 -8440165 -4998555 -1161983 1728379 2894573 2767167 2618036 3014259 2695696 -355274
155 -355274 -6337286 -12481558 -15051587 -12585810 -6920303 -1095793 3251140 6264801 8299713 8833637
165 8833637 7114574 3332612 -1329154 -5661463 -9043953 -11132322 -11479023 -9937608 -7360694 -5401967
175 -5401967 -5226203 -6395659 -7244427 -6483395 -4380713 -2298760 -1202063 -862028 -548684 -152201 -222630
186 -222630 -934886 -1485960 -895550 717966 2020664 1689109 -487437 -3764339 -7292855 -10448136 -12539695
197 -12539695 -12834293 -11196222 -8456758 -5809421 -3863209 -2444114 -1152117 252282 1982958 4239284
207 4239284 6748325 8572723 8836998 7650718 5981810 4617171 3671877 3243532 3928303 5993137
217 5993137 8200302 8336637 5441386 1158902 -1701905 -1976282 -1202535 -1948494 -5483406 -11043339
227a1043339n585231l326331Q00837N388188Q097933P156008L160219j116440l155506k765177
237b388839j566513q31046l95065L89725J360805J676847R92046L7460j7094J424407L928120
248D610853O226847O803222M734025M74219m126582o896181o745742m236519r97628J297613
258A144127J693399L44150j497821k214140j139062O78849J357481R3207j929120k738968
268d207898j585185M95078K016630K551617K725722L059816L271758K748201J339417n21619
278A1893537k273696l519676l964219l441786k206685j006259n62643q84964j195735o15612
288g777738J072454L262633M952532N289402L954513J382932j301291k878096k947545k315640
298B694156k193475k802388k912245j073148K609818O141168P269714N423117J938774j436641
$$ plain form
227 -11043339 -16628570 -19954901 -19154064 -13765876 -5667943 1488065 4648284 3531844 376338 -2388839
237 -2388839 -3955352 -4786398 -5181463 -4791738 -3430933 -1754086 -762040 -724580 -741674 682733 4610853
248 4610853 10837700 17640922 22374947 22849166 18722584 11826403 5080661 844142 -153486 1144127
258 1144127 2837526 3181676 1683855 -530285 -1669347 -990498 366983 460190 -1468930 -4207898
268 -4207898 -5793083 -5298005 -3281375 -729758 1995964 5055780 8327538 11075739 12415156 11893537
278 11893537 9619841 6100165 2135946 -1305840 -3512525 -4518784 -5081427 -5966391 -7162126 -7777738
288 -7777738 -6705284 -3442651 1509881 6799283 10753796 12136728 10835437 7957341 5009796 2694156
298 2694156 500681 -2301707 -5213952 -6287100 -3677282 2463886 9733600 15156717 17095491 15658850
308A5658850l916757n511103o008699m773521j727201J851976L970165L495490J035933j696734
318B378399l251337l245642k193933q69732J80458P80121J013150J009919Q12700M49639R8546
329b837712N8377M84089J205552J885344K319407K494843K380755J798041N73333j203239
339I158790l064678m249001l991586k071487O80976K615265K485107O71549j050722j242332
349e8119j90611O80506
351D31776
$$ plain form
308 15658850 11742093 6230990 222291 -4551230 -6278431 -4426455 -456290 3039200 4075133 2378399
318 2378399 -872938 -4118580 -6312513 -7182245 -7001787 -6221666 -5208516 -4198597 -3385897 -2936258 -2837712
329 -2837712 -2779335 -2295246 -1089694 795650 3115057 5609900 7990655 9788696 10362029 9158790
339 9158790 6094112 1845111 -2146475 -4217962 -3536986 -921721 1563386 2234935 1184213 -58119
349 -58119 -248730 431776
351 431776
##END=	
