##TITLE=	labeled_M9_sacculi 13C 1D and 2D.14.fid
##JCAMPDX=	6.0	$$ NMR Plug-in 1.13 of MestReNova 11.0.4-18998
##DATATYPE=	NMRSPECTRUM
##DATACLASS=	XYDATA
##NUMDIM=	1
##ORIGIN=	Bruker BioSpin GmbH
##OWNER=	ecaudill
##.OBSERVEFREQUENCY=	125.72761525999999321
##.OBSERVENUCLEUS=	^13C
##.SOLVENTNAME=	
##.PULSESEQUENCE=	cp
##LONGDATE=	2017/08/04 20:30:57.000
##.ACQUISITIONMODE=	SIMULTANEOUS (DQD)
##$ORIGINALFORMAT=	Bruker XWIN-NMR
##$PARAMETERFILE=	(acqus, ASCII, d:/Desktop/NMRFAM/labeled_M9_sacculi%2013C%201D%20and%202D/14/acqus, 0)
$$ ##TITLE= Parameter file, TOPSPIN		Version 3.2
$$ ##JCAMPDX= 5.0
$$ ##DATATYPE= Parameter Values
$$ ##NPOINTS= 9	$$ modification sequence number
$$ ##ORIGIN= Bruker BioSpin GmbH
$$ ##OWNER= ecaudill
$$ $$ 2017-08-04 21:11:53.833 -0500  ecaudill@devon.nmrfam.wisc.edu
$$ $$ /home/ecaudill/NMR/labeled_M9_sacculi 13C 1D and 2D/14/acqus
$$ $$ process /opt/topspin_CPMAS/prog/mod/go
$$ ##$ACQT0= 0
$$ ##$AMP= (0..31)
$$ 100 100 100 100 100 100 100 100 100 100 100 100 100 100 100 100 100 100
$$ 100 100 100 100 100 100 100 100 100 100 100 100 100 100
$$ ##$AMPCOIL= (0..19)
$$ 0 0 0 0 0 0 0 0 0 0 0 0 0 0 0 0 0 0 0 0
$$ ##$ANAVPT= -1
$$ ##$AQSEQ= 0
$$ ##$AQ_mod= 1
$$ ##$AUNM= <au_zgonly>
$$ ##$AUTOPOS= <>
$$ ##$BF1= 125.715042
$$ ##$BF2= 499.96
$$ ##$BF3= 499.96
$$ ##$BF4= 499.96
$$ ##$BF5= 499.96
$$ ##$BF6= 499.96
$$ ##$BF7= 499.96
$$ ##$BF8= 499.96
$$ ##$BYTORDA= 0
$$ ##$CAGPARS= (0..11)
$$ 0 0 0 0 0 0 0 0 0 0 0 0
$$ ##$CFDGTYP= 0
$$ ##$CFRGTYP= 9
$$ ##$CHEMSTR= <none>
$$ ##$CNST= (0..63)
$$ 1 1 1 1 1 1 1 1 1 1 1 0 1 1 1 1 1 1 1 1 1 0 1 1 1 0 1 1 1 1 1 5000 1 1
$$ 1 1 1 1 1 1 1 1 1 1 1 1 1 1 1 1 1 1 1 1 1 1 1 1 1 1 1 1 1 1
$$ ##$CPDPRG= (0..8)
$$ <> <> <swftppm_13> <> <> <> <> <> <>
$$ ##$D= (0..63)
$$ 0 5 0 0 0 0 0 0 0 0 0 0 0 0 0 0 0 0 0 0 0 0 0 0 0 0 0 0 0 0 0 0 0 0 0 0
$$ 0 0 0 0 0 0 0 0 0 0 0 0 0 0 0 0 0 0 0 0 0 0 0 0 0 0 0 0
$$ ##$DATE= 1501896657
$$ ##$DE= 7.699996
$$ ##$DECBNUC= <off>
$$ ##$DECIM= 532
$$ ##$DECNUC= <off>
$$ ##$DECSTAT= 4
$$ ##$DIGMOD= 3
$$ ##$DIGTYP= 12
$$ ##$DQDMODE= 0
$$ ##$DR= 21
$$ ##$DS= 16
$$ ##$DSPFIRM= 4
$$ ##$DSPFVS= 21
$$ ##$DTYPA= 0
$$ ##$EXP= <4mm_CPMAS_13C_CP_100KHz.lz.2016>
$$ ##$F1LIST= <>
$$ ##$F2LIST= <>
$$ ##$F3LIST= <>
$$ ##$FCUCHAN= (0..9)
$$ 0 1 2 0 0 0 0 0 0 0
$$ ##$FL1= 90
$$ ##$FL2= 90
$$ ##$FL3= 90
$$ ##$FL4= 90
$$ ##$FOV= 20
$$ ##$FQ1LIST= <freqlist>
$$ ##$FQ2LIST= <hetcor.jos>
$$ ##$FQ3LIST= <freqlist>
$$ ##$FQ4LIST= <freqlist>
$$ ##$FQ5LIST= <freqlist>
$$ ##$FQ6LIST= <freqlist>
$$ ##$FQ7LIST= <freqlist>
$$ ##$FQ8LIST= <freqlist>
$$ ##$FRQLO3= 1.79769313486232e+308
$$ ##$FRQLO3N= 0
$$ ##$FS= (0..7)
$$ 83 83 83 83 83 83 83 83
$$ ##$FTLPGN= 0
$$ ##$FW= 625000
$$ ##$FnMODE= 0
$$ ##$FnTYPE= 0
$$ ##$GPNAM= (0..31)
$$ <> <> <> <> <> <> <> <> <> <> <> <> <> <> <> <> <> <> <> <> <> <> <> <>
$$ <> <> <> <> <> <> <> <>
$$ ##$GPX= (0..31)
$$ 0 0 0 0 0 0 0 0 0 0 0 0 0 0 0 0 0 0 0 0 0 0 0 0 0 0 0 0 0 0 0 0
$$ ##$GPY= (0..31)
$$ 0 0 0 0 0 0 0 0 0 0 0 0 0 0 0 0 0 0 0 0 0 0 0 0 0 0 0 0 0 0 0 0
$$ [...]
$$ 0 0 0 0 0 0 0 0
$$ ##$SguType= 2
$$ ##$ShimPowMaxUA= (0..63)
$$ 130000 130000 130000 130000 130000 130000 130000 130000 130000 130000 130000
$$ 130000 130000 130000 130000 130000 130000 130000 130000 130000 130000 130000
$$ 130000 130000 130000 130000 130000 130000 130000 130000 130000 130000 130000
$$ 130000 130000 130000 130000 130000 130000 130000 0 0 0 0 0 0 0 0 0 0 0
$$ 0 0 0 0 0 0 0 0 0 0 0 0 0
$$ ##$ShimPowMaxUC= (0..63)
$$ 130000 130000 130000 130000 130000 130000 130000 130000 130000 130000 130000
$$ 130000 130000 130000 130000 130000 130000 130000 130000 130000 130000 130000
$$ 130000 130000 130000 130000 130000 130000 130000 130000 130000 130000 130000
$$ 130000 130000 130000 130000 130000 130000 130000 0 0 0 0 0 0 0 0 0 0 0
$$ 0 0 0 0 0 0 0 0 0 0 0 0 0
$$ ##$ShimPowMaxUG= (0..63)
$$ 524287 524287 524287 524287 524287 524287 524287 524287 524287 524287 524287
$$ 524287 524287 524287 524287 524287 524287 524287 524287 524287 524287 524287
$$ 524287 524287 524287 524287 524287 524287 524287 524287 524287 524287 524287
$$ 524287 524287 524287 524287 524287 524287 0 0 0 0 0 0 0 0 0 0 0 0 0 0 0
$$ 0 0 0 0 0 0 0 0 0 0
$$ ##$ShimPowRcbType= 3
$$ ##$ShimPowRes= (0..63)
$$ 1e-20 1e-20 1e-20 1e-20 1e-20 1e-20 1e-20 1e-20 1e-20 1e-20 1e-20 1e-20
$$ 1e-20 1e-20 1e-20 1e-20 1e-20 1e-20 1e-20 1e-20 1e-20 1e-20 1e-20 1e-20
$$ 1e-20 1e-20 1e-20 1e-20 1e-20 1e-20 1e-20 1e-20 1e-20 1e-20 1e-20 1e-20
$$ 1e-20 1e-20 1e-20 1e-20 0 0 0 0 0 0 0 0 0 0 0 0 0 0 0 0 0 0 0 0 0 0 0 0
$$ ##$ShimPowRng0= (0..63)
$$ 1 1 1 1 1 1 1 1 1 1 1 1 1 1 1 1 1 1 1 1 1 1 1 1 1 1 1 1 1 1 1 1 1 1 1 1
$$ 1 1 1 1 0 0 0 0 0 0 0 0 0 0 0 0 0 0 0 0 0 0 0 0 0 0 0 0
$$ ##$ShimPowRng1= (0..63)
$$ 1 1 1 1 1 1 1 1 1 1 1 1 1 1 1 1 1 1 1 1 1 1 1 1 1 1 1 1 1 1 1 1 1 1 1 1
$$ 1 1 1 1 0 0 0 0 0 0 0 0 0 0 0 0 0 0 0 0 0 0 0 0 0 0 0 0
$$ ##$ShimPowRng2= (0..63)
$$ 1 1 1 1 1 1 1 1 1 1 1 1 1 1 1 1 1 1 1 1 1 1 1 1 1 1 1 1 1 1 1 1 1 1 1 1
$$ 1 1 1 1 0 0 0 0 0 0 0 0 0 0 0 0 0 0 0 0 0 0 0 0 0 0 0 0
$$ ##$ShimPowRng3= (0..63)
$$ 1 1 1 1 1 1 1 1 1 1 1 1 1 1 1 1 1 1 1 1 1 1 1 1 1 1 1 1 1 1 1 1 1 1 1 1
$$ 1 1 1 1 0 0 0 0 0 0 0 0 0 0 0 0 0 0 0 0 0 0 0 0 0 0 0 0
$$ ##$ShimSysFunc= (0..63)
$$ 1 2 3 4 5 6 7 8 9 10 0 37 38 35 16 15 14 13 12 11 28 27 26 25 24 23 36
$$ 22 30 29 20 21 34 33 32 31 17 18 19 0 0 0 0 0 0 0 0 0 0 0 0 0 0 0 0 0 0
$$ 0 0 0 0 0 0 0
$$ ##$ShimSysMatrix= 0
$$ ##$ShimSysType= 4
$$ ##$TFXNUM= 0
$$ ##$TRIPLO2= 0
$$ ##$VTU= 1
$$ ##$VTUETH= <no>
$$ ##$VTUTY= <tty05>
$$ ##$WBREFAM= (0..15)
$$ 99.6 100 100 100 100 100 100 100 100 100 100 100 100 100 100 100
$$ ##$WBREFLM= (0..15)
$$ 1 0 0 0 0 0 0 0 0 0 0 0 0 0 0 0
$$ ##$WBREFPH= (0..15)
$$ 0.22 0 0 0 0 0 0 0 0 0 0 0 0 0 0 0
$$ ##$WBSGU= (0..15)
$$ 0 0 0 0 0 0 0 0 0 0 0 0 0 0 0 0
$$ ##$XFAC= 2
$$ ##END=
$$ 
##$DECIM=	532
##$DSPFVS=	21
##XUNITS=	HZ
##YUNITS=	ARBITRARY UNITS
##FIRSTX=	31034.58772810336086
##LASTX=	-6541.0407963328152618
##XFACTOR=	-18.356437969924854769
##YFACTOR=	1.0000000000000000871e-07
##NPOINTS=	2048
##XYDATA=	(X++(Y..Y))
-1690c476071R31907R71196K03702m10097K59090P49283O74290O14392J134937J802611J650312
-1679E105552M26958j060109j850565j716204j069458l50416K42393O15321P03533N51276
-1669A598281K96750N9605n5830P4503M18644O05266K16966n94666j043623n33364N62945
-1658A605477J230421Q96833r1584j089668j862440k440726k589452j904939m58008J052684
-1648e651402J967807K240319K157687J740959P62911o96388k055175k694017k406497j324800
-1638e958596L18742K126270L432939L650500K791171J448329J90625q55207j774986k475806
-1628B893981k735836k510213j943312j123457p8861R47880J482358J250637N11558j80147
-1618a485412m55753k83547J93710P31998R74383O76436L0136m58531n19554l37885j08118
$$ plain form
-1690 -3476071 -2544164 -1572968 -1369266 -1779363 -1520273 -770990 -96700 517692 1652629 3455240 5105552
-1679 5105552 5532510 4472401 2621836 905632 -163826 -514242 -271849 343472 1047005 1598281
-1669 1598281 1895031 1954636 1898806 1973309 2391953 2997219 3214185 2619519 1575896 1042532 1605477
-1658 1605477 2835898 3732731 3641147 2551479 689039 -1751687 -4341139 -6246078 -6704086 -5651402
-1648 -5651402 -3683595 -1443276 714411 2455370 3218281 2521893 466718 -2227299 -4633796 -5958596
-1638 -5958596 -5639854 -3513584 -80645 3569855 6361026 7809355 7999980 7144773 5369787 2893981
-1628 2893981 158145 -2352068 -4295380 -5418837 -5497698 -4549818 -3067460 -1816823 -1305265 -1485412
-1618 -1485412 -1941165 -2224712 -2031002 -1299004 -324621 351815 381951 -76580 -596134 -934019 -1042137
-1607a042137L29283J096362J745126J607437O86605k95784r09372j541123k500240l081489
-1597c905332k314027n55579N59155J24204q30366q07453L5818K57596n10206q13742M60362
-1586h299570K173458K280740O49150p51045o01988P0501l20385j419196j457248L4106J411033
-1575f230444J184275M172m12266L75852J291354J532693J453335J466233J149254J26984
-1565A941442q59215o87635N92005J811285K261775K339689K385063J794422j0774k311692
-1555I256365l696263l759027l329030k962177k145287m20980J491038K442865K258730J572577
-1545G08811N95882q87687k257580k027784K00632K605579K974829J246471q05326k110276
-1535B43551l131820l969023l306326m89200K452526K700171L99385j302108m73492J066107
$$ plain form
-1607 -1042137 -712854 383508 2128634 3736071 4422676 4126892 3217520 1676397 -823843 -3905332
-1597 -3905332 -6219359 -6774938 -6215783 -6091579 -6921945 -7729398 -7693580 -7435984 -7946190 -8759932 -8299570
-1586 -8299570 -6126112 -3845372 -3196222 -3947267 -4549255 -4478754 -4799139 -6218335 -7675583 -7641477 -6230444
-1575 -6230444 -5046169 -5041997 -5454263 -5078411 -3787057 -2254364 -801029 665204 1814458 1941442
-1565 1941442 1082227 394592 986597 2797882 5059657 7399346 9784409 11578831 11568057 9256365
-1555 9256365 5560102 1801075 -1527955 -4490132 -6635419 -7056399 -5565361 -3122496 -863766 708811
-1545 708811 1304693 417006 -1840574 -3868358 -3667726 -1062147 1912682 3159153 2353827 243551
-1535 243551 -2888269 -6857292 -10163618 -10652818 -8200292 -5500121 -5100736 -6402844 -6876336 -5810229
-1525e810229O55026j174314j603628O0935J345088O13115j73924J473583M232049M326412
-1515C944113J048705j805484j105742J238067J183688j481406k908252r51804J679653J478470
-1505B320008p82447j472089L29227J560175k7234k357754k035908P24427K485911J435213
-1495B179529n20167j022155n17126p64433j480422o13401K238870M683651M496574K316249
-1485A0997169L39274o55699j589234k867214l518274k860169j696100j039147n62666N87955
-1475b864105J929216J883048K2836k017402k431855j298957o0496N20513R67433J796742
-1465a553027K577039K625930K006398J312468P88569J45152q91555k217552l409622l802110
-1455b418310k730396k97024K094710K667122J094547j071244k222448k470319k934904l623427
$$ plain form
-1525 -5810229 -5155203 -6329517 -7933145 -7872210 -6527122 -5914007 -6087931 -4614348 -382299 3944113
-1515 3944113 4992818 3187334 2081592 3319659 4503347 3021941 113689 -838115 841538 2320008
-1505 2320008 1537561 65472 394699 1954874 1927640 -430114 -2466022 -1741595 744316 2179529
-1495 2179529 1659362 637207 120081 -644352 -2124774 -2738175 -499305 4184346 8680920 10997169
-1485 10997169 11336443 10680744 9091510 6224296 2706022 -154147 -1850247 -2889394 -3452060 -2864105
-1475 -2864105 -934889 948159 970995 -1046407 -3478262 -4777219 -4837715 -4317202 -3349769 -1553027
-1465 -1553027 1024012 3649942 5656340 6968808 7757377 7902529 7010974 4793422 1383800 -2418310
-1455 -2418310 -5148706 -5445730 -3351020 -683898 410649 -660595 -2883043 -5353362 -8288266 -11911693
-1445a1911693l116021o68301K334411L861492L712609L534727M375912N163944M091513R47764
-1435A2326357k524581m351049l916401k034494l4821J144560J430486J406347J431725J023124
-1425E901253m25892k282109k796057j122748J356437K562108K240331J867494K016709J239522
-1415A0557048j541696m619901n078885k579498M3950M28036n31099n64382M87284Q22847
-1405b576296p9119m24407J019824K686783K286620J78218j068711k47917J116767J371557
-1395D263319R99568J172817J346757P4408k254164l417120k440874r85498p66895j040025
-1385c047707j19569J578748K030169R72622N96370K043243L117447J206829k643516m764962
-1375I69674l743919j985874j752199j818730J63128L400636M557691K473143j27277n03643
$$ plain form
-1445 -11911693 -15027714 -15696015 -13361604 -9500112 -5787503 -2252776 2123136 7287080 11378593 12326357
-1435 12326357 9801776 5450727 1534326 -500168 -534989 609571 2040057 3446404 4878129 5901253
-1425 5901253 5475361 3193252 397195 -725553 630884 3192992 5433323 7300817 9317526 10557048
-1415 10557048 9015352 4395451 -683434 -3262932 -3218982 -2790946 -3322045 -3886427 -3399143 -2576296
-1405 -2576296 -2655415 -3079822 -2059998 626785 2913405 3091623 2022912 1774995 2891762 4263319
-1395 4263319 5262887 6435704 7782461 7856869 5602705 2185585 -255289 -1240787 -2007682 -3047707
-1385 -3047707 -3167276 -1588528 441641 1414263 2010633 4053876 7171323 8378152 5734636 969674
-1375 969674 -2774245 -4760119 -6512318 -8331048 -8167920 -4767284 -209593 2263550 2136273 1632630
-1365A632630M62241J06311j826343k972790k019425m23903O4330k29788j73085m0474p79886
-1354f200182j825262j597283j69897M73820n39657j442640n35427R96202Q24583p47916j055006
-1343a1818665P94177K421217J901580Q88921J961898M172856M019968P62177k088487j668794
-1333A346848K84984M27191j056607j245018K63313L96230k164804m046432j932311J959874
-1323e766732K625170l01254j843274O98254L299258J181920l523310m378320j50265L045569
-1313e112984O29101l591334k996007J982801M455853J304619k260824o34537L689657L825707
-1303A292052j125770m505190j651712L501402M243568M74963j886227R7013K483523Q18696
-1293C742318l250056m641560k154398M23123K65504p77526L24124L047679M273481K768135
$$ plain form
-1365 1632630 2094871 2201182 374839 -2597951 -4617376 -5041279 -4976949 -5206737 -5379822 -5420296 -6200182
-1354 -6200182 -8025444 -9622727 -9792624 -9318804 -9858461 -11301101 -11836528 -10840326 -10015743 -10763659 -11818665
-1343 -11818665 -11024488 -8603271 -6701691 -5812770 -3850872 321984 4341952 5104129 3015642 1346848
-1333 1346848 1631832 2059023 1002416 -242602 20711 416941 -1747863 -5794295 -7726606 -5766732
-1323 -5766732 -3141562 -3442816 -5286090 -4587836 -1288578 -106658 -3629968 -8008288 -8158553 -5112984
-1313 -5112984 -4483883 -8075217 -11071224 -9088423 -4632570 -3327951 -5588775 -6223312 -2533655 1292052
-1303 1292052 166282 -4338908 -5990620 -2489218 1754350 2229313 343086 440099 2923622 3742318
-1293 3742318 492262 -4149298 -6303696 -5880573 -5615069 -6392595 -6068471 -3020792 1252689 4020824
-1283D020824M09539q05290q64511m46238N74186K181854L089848K060732k19895j975496
-1273H025553k724071l341741l760807k431044J028034M113166L992626J149814j186385j151678
-1263C713467p8886J98865P4906Q15852J697369N79378k695224n371162n024054k394001Q6851
-1252h396639J543809K905804M387873M601305K691014r3196j985724k903342l783242m318168
-1242e350506l028737J54518K898023L034823J236257n1858J27559M03826m34070j540818
-1232b550983j450643m68526l05310j474054k329084j261757R53585J935228O69741j107017
-1222g388820q54587J863496M902877N894541M562829K378263K91033k288237n783150q471402
-1212d893157p586222k810489K469713M591656L801143L526439N387990O778436M649486K64936
$$ plain form
-1283 4020824 4430363 3625073 2760562 2314324 2888510 5070364 8160212 10220944 10001049 8025553
-1273 8025553 5301482 1959741 -1801066 -4232110 -3204076 909090 4901716 6051530 4865145 3713467
-1263 3713467 3634581 3833446 3908352 4724204 6421573 7000951 4305727 -1065435 -6089489 -8483490 -8396639
-1252 -8396639 -6852830 -3947026 440847 5042152 7733166 7639970 5654246 2750904 -1032338 -5350506
-1242 -5350506 -8379243 -8224725 -5326702 -2291879 -1055622 -1107480 -979921 -576095 -1010165 -2550983
-1232 -2550983 -4001626 -4470152 -4775462 -6249516 -8578600 -9840357 -8886772 -6951544 -6281803 -7388820
-1222 -7388820 -8243407 -6379911 -1477034 4417507 8980336 11358599 11649632 9361395 3578245 -4893157
-1212 -4893157 -12479379 -15289868 -12820155 -8228499 -4427356 -900917 4487073 11265509 15914995 16179931
-1202A6179931k131529j156373j54503k059402m653633l524949J222379M418740K689328j015861
-1192I814128j815576K20315P70638j726033l450475r78503L308644M449377J983564L09555
-1182A2885634J971555M167977L606257J922321L146096P204732R794200R166508R506483
-1173F3371763J5500927K6043281L6298123M4573831N3244248O2415371O6559581O0098954
-1165D28106079M4254264K5277901O834259j2357788l2901115n0449181n9634819o0288410
-1157B88841190n6690846n1394786m3156863l1654386k0946808j5661593j5277519j4995382
-1149C9063007j1966324q059749o019445n497517m553251l201110k946410l437647k254061
-1140h872507J381509M821934N232423L138647J152227K30882p07199j812282j429326R64534
$$ plain form
-1202 16179931 14048402 12892029 12737526 10678124 6024491 2499542 3721921 8140661 10829989 9814128
-1192 9814128 7998552 8218867 8989505 7263472 3812997 2834494 6143138 10592515 12576079 12885634
-1182 12885634 14857189 19025166 22631423 24553744 27699840 34904572 44698772 53865280 63371763
-1173 63371763 78872690 104915971 141214094 185787925 239032173 301447544 368007125 428106079
-1165 428106079 472360343 497638244 504472503 492114715 459213600 408764419 349129600 288841190
-1157 288841190 232150344 180755558 137598695 105944309 84997501 69335908 54058389 39063007
-1149 39063007 27096683 19036934 13017489 7519972 2966721 -234389 -3180799 -6618446 -8872507
-1140 -8872507 -7490998 -2669064 2563359 5702006 6854233 7085115 6377916 4565634 3136308 4100842
-1130D100842L001313K322083M232r91197k59709m11346k632830m224058k297393J636225
-1120B48162L235259J105345j479597j267455P96363J672642Q83463O27487J697530J974993
-1110I494192o6440k453940k191529M09190K007545P18867j694426k707222k282698j884886
-1100f51347j564548j13733K132313K821008P61321j975186k526871r37295K36990k91221
-1090b108569r65254j03507J442907J698279O96496M36831J722240K733674J579893q86579
-1080F246411k071945r70989Q53043J698563J849406K576794L902510M447856L285522R50990
-1070B2768161j539436l813781n823644p055389o843395n297125l251337j276101O56346K392374
-1060i083327L193242K641508J495831Q81706P31699j48764k182850l927679l569789j164431
$$ plain form
-1130 4100842 7102155 9424238 9428470 8437273 8177564 7766218 5133388 909330 -1388063 248162
-1120 248162 3483421 4588766 3109169 1841714 2638077 4310719 5194182 5821669 7519199 9494192
-1110 9494192 9427752 6973812 4782283 5191473 7199018 7917885 6223459 3516237 1233539 -651347
-1100 -651347 -2215895 -2329628 -197315 2623693 3385014 1409828 -1117043 -2054338 -1817348 -2108569
-1090 -2108569 -3073823 -3177330 -1734423 -36144 660352 1097183 2819423 5553097 7132990 6246411
-1080 6246411 4174466 3203477 4056520 5755083 7604489 10181283 14083793 18531649 21817171 22768161
-1070 22768161 21228725 17414944 11591300 4535911 -2307484 -7604609 -10855946 -12132047 -11475701 -9083327
-1060 -9083327 -5890085 -3248577 -1752746 -871040 -139341 -288105 -2470955 -6398634 -9968423 -11132854
-1050a1132854J437480K871489L551281M255789M304958K282459j529867m639526m930187
-1041c528978l095675j623490j659093j951540j102671K82893O35462l1492r647J437953K558356
-1030h087922J250643j886858l896629k902124q2385K275696L656922N133788O828114P135305
-1020I424550N012689J893997K17795N03688J046214N02157m27818m56414J47138p611j208100
-1009A6648285k083392j532665k01826O07763P55877J014891J355004P01518j273370l123817
-999A2868268l212209j819970p74887j110375k013011k290170j972019j801111j741040r91059
-989d857583N46124J720696J458177O4848j268480j865027j882831j490717n07441R62975
-979g119259K175836K474504K049603J560659J257348R68089P74042J001900J405701J046047
$$ plain form
-1050 -11132854 -9695374 -6823885 -3272604 983185 5288143 7570602 6040735 1401209 -3528978
-1041 -3528978 -6624653 -8248143 -9907236 -11858776 -12961447 -12678554 -12043092 -12074584 -12084231 -10646278 -8087922
-1030 -8087922 -6837279 -8724137 -12620766 -15522890 -15605275 -13329579 -9672657 -4538869 2289245 9424550
-1020 9424550 14437239 16331236 16549031 17052719 18098933 18601090 18173272 17716858 17863996 17856385 16648285
-1009 16648285 14564893 13032228 12830402 13438165 14194042 15208933 16563937 17265455 15992085 12868268
-999 12868268 9656059 7836089 7061202 5950827 3937816 1647646 -324373 -2125484 -3866524 -4857583
-989 -4857583 -4311459 -2590763 -1132586 -1067738 -2336218 -4201245 -6084076 -7574793 -8082234 -7119259
-979 -7119259 -4943423 -2468919 -419316 1141343 2398691 3366780 4140822 5142722 6548423 7594470
-969G594470m94380k181506k490940j216793L05047Q61886N96072K49803j49788j057864k118956
-958a02949k115690o07119J057305J065214p28190k625430l032596j983071n58250N61137
-948i069639J396848J886625J634269O76568q2369K50199J369335J916044R13590j187256
-938b95786l005767l557302k901897j640888j32684J609897L387346M492535M156746K335682
-928D447882j09711k149453l417064m128580m254508l214646p48064K128940L617758K848148
-918d979298P92101q33166j347749j381750j495488j194074L08366K737726M760984N317122
-908B684774M469418K836833P14200j799512m091253n099565m278014k159430K21939K189643
-898d310967L474810L741323K635018M23208j825888l030057k945713k053199q03785O20985
$$ plain form
-969 7594470 7100090 4918584 2427644 1210851 1515898 2377784 2973856 3223659 3073871 2016007 -102949
-958 -102949 -2218639 -2825758 -1768453 -703239 -1431429 -4056859 -7089455 -9072526 -9630776 -9069639
-948 -9069639 -7672791 -5786166 -4151897 -3475329 -3557698 -3307499 -1938164 -22120 891470 -295786
-938 -295786 -3301553 -6858855 -9760752 -11401640 -11534324 -9924427 -6537081 -2044546 2112200 4447882
-928 4447882 4338171 2188718 -1228346 -5356926 -9611434 -12826080 -13574144 -11445204 -7827446 -4979298
-918 -4979298 -4187197 -5020363 -6368112 -7749862 -9245350 -10439424 -10131058 -7393332 -2632348 2684774
-908 2684774 7154192 9991025 10705225 8905713 4814460 -285105 -4563119 -6722549 -6500610 -4310967
-898 -4310967 -836157 2905166 5540184 5963392 4137504 1107447 -1838266 -3891465 -4695250 -4074265
-888d074265J805219J879668K89381k276509m147800m119737k527714p22791M02510J093364
-878a2398674J942728K825483L033162K386441J671939J610288J703028P47717j382537l109614
-868i70039k872689j180589j47083q35421j871978j340588M98433J463203M78967q16713k93688
-857g888185J611570K374824R10382p70125k39661J952674K942583J414161o96941r85841
-847F25441J61683M59728o02498p29264J867682N396709O163669L054023j032095k634351
-837A2730727j530328j79210r6338k57821O34382J670785P78692k122374m396508l717892
-827C514115j009280O08463m13506k371655k744375j380270k53603l87917m24621J053228
-817c809421K770305J820664k392795o582731o874749l077659J394182L612016L817720L643507
$$ plain form
-888 -4074265 -2269046 -389378 -99997 -2376506 -6524306 -10644043 -13171757 -13894548 -13492038 -12398674
-878 -12398674 -10455946 -7630463 -4597301 -2210860 -538921 1071367 2774395 3522112 2139575 -970039
-868 -970039 -3842728 -5023317 -5170400 -6005821 -7877799 -9218387 -8719954 -7256751 -6777784 -7594497 -7888185
-857 -7888185 -6276615 -3901791 -2991409 -3761534 -4001195 -2048521 894062 2308223 1611282 625441
-847 625441 787124 1246852 644354 -84910 1782772 7179481 13343150 16397173 15365078 12730727
-837 12730727 11200399 11021189 10924851 10667030 11301412 12972197 13750889 11628515 7232007 3514115
-827 3514115 2504835 3113298 2699792 328137 -2416238 -3796508 -4050111 -4438028 -4862649 -3809421
-817 -3809421 -1039116 781548 -1611247 -8193978 -15068727 -18146386 -16752204 -13140188 -9322468 -5678961
-807e678961L115490J004414k242696l810790j665698K633211N483796N225200L407917K163999
-797I635882J707017J095472L19478K53031Q51696P93436p23322k844710m288726m830008
-787A969246m725348l442349l92276L172036M585125K863092K36991n65114J66149j58379
-777C709173k399462m254535l636582j887033j895598l727863m262916j602434K044932L213935
-767a4698383J723103N25744J376383K695694K428669J287624J526511L281141M053152K073374
-757F273012j404252l991361n155367o005716o713121n839222k626645J343002L743935M116803
-747a6258932L865652L908861L478070J608837j037502k627180k185154n36567P98278J157198
-737g828439R99789R61284J009273O12595l47964j032407l56221J515173K732286J518105
$$ plain form
-807 -5678961 -2563471 -1559057 -3801753 -7612543 -9278241 -6645030 -1161234 4063966 7471883 9635882
-797 9635882 11342899 12438371 12757849 13010880 13862576 14656012 13932690 11087980 6799254 1969246
-787 1969246 -2756102 -6198451 -6590727 -3418691 1166434 4029526 4266517 3701403 3867552 3709173
-777 3709173 1309711 -2944824 -6581406 -8468439 -10364037 -14091900 -18354816 -19957250 -17912318 -14698383
-767 -14698383 -12975280 -12449536 -11073153 -8377459 -5948790 -4661166 -3134655 146486 4199638 6273012
-757 6273012 4868760 877399 -4277968 -10283684 -16996805 -22836027 -25462672 -24119670 -20375735 -16258932
-747 -16258932 -12393280 -8484419 -5006349 -3397512 -4435014 -7062194 -9247348 -9783915 -8985637 -7828439
-737 -7828439 -6828650 -5867366 -4858093 -4245498 -4593462 -5625869 -5982090 -4466917 -1734631 -216526
-727b16526j494899l380869j964417J621197M120500L699514J413999r02467k929825n085027
-717e118820o364070m754061k05130M174846N016516K278829r97417k196982j319077K54005
-707i231361J755785L032956L565152K831093J472471R20186J611516K494143K671911K610619
-697A3734471K993131L206582K183938M19684l05939M63352Q70070p39293l322501m513273
-687A4990222l945029l501468m078831l936915j455919J768262K475258P4420k497316k727175
-677b834491j571143j313485j761889o74508K298269M375633L301954O10914l76241J017441
-667C072454K260404J416452m09138j244245j299708k227599m034559m635656k784921P9780
-657i806736J785379K143088K527759L365013L536524K392564R78437N39090P39649L71906
$$ plain form
-727 -216526 -1711425 -5092294 -7056711 -5435514 -1315014 2384500 3798499 2896032 -33793 -5118820
-717 -5118820 -11482890 -16236951 -16442081 -12267235 -7250719 -4971890 -5969307 -8166289 -9485366 -9231361
-707 -9231361 -7475576 -4442620 -877468 1953625 3426096 4346282 5957798 8451941 11123852 13734471
-697 13734471 16727602 19934184 22118122 22537806 22231867 22695219 23565289 22825996 19503495 14990222
-687 14990222 11045193 7543725 3464894 -472021 -1927940 -159678 2315580 2390000 -107316 -2834491
-677 -2834491 -4405634 -5719119 -7481008 -8155516 -5857247 -1481614 1820340 2431254 2055013 3072454
-667 3072454 5332858 6749310 6340172 5095927 3796219 1568620 -2465939 -7101595 -9886516 -9806736
-657 -9806736 -8021357 -5878269 -3350510 14503 3551027 5943591 6922028 7461118 8200767 8572673
-647H572673o96313j445615j505592j827023l081255m339046m221865k870890j760269j625178
-637a4800373j569782n57428J054509K145337K473750K804633L501194L900757L461558K899811
-627E313966L545532N746775Q420825J0169253J0421507R432497P608719N149136K161350
-618F7969560j152248m417553p113266q807068r509718r642797r444075q553414o512611l620917
-608h04107q81211J004209K157589K792135K431576N01668k409763m606473m897060l704865
-598h416302k231874r67410L94380J830461K638686K433918J811387J503265J307417N08054
-588H11982q29598j739426j664107j206729j178168j419569j181312l76667K90893M58303
-578h034398N98888J070207J325242P07641l44310o94208r7047L91568r5008r83912j071807
$$ plain form
-647 8572673 7876360 6430745 4925153 3098130 16875 -4322171 -8544036 -11414926 -13175195 -14800373
-637 -14800373 -16370155 -16927583 -15873074 -13727737 -11253987 -8449354 -4948160 -1047403 2414155 5313966
-627 5313966 8859498 14606273 23027098 33196351 43617858 53050355 60659074 65808210 67969560
-618 67969560 66817312 62399759 55286493 46479425 36969707 27326910 17882835 9329421 2816810 -804107
-608 -804107 -1685318 -681109 1476480 4268615 6700191 7201859 4792096 185623 -4711437 -8416302
-598 -8416302 -10648176 -11615586 -11221206 -9390745 -6752059 -4318141 -2506754 -1003489 303928 811982
-588 811982 -17616 -1757042 -3421149 -4627878 -5806046 -7225615 -8406927 -8783594 -8492701 -8034398
-578 -8034398 -7435510 -6365303 -5040061 -4332420 -4676730 -5370938 -5467985 -5076417 -5171425 -6155337 -7227144
-567g227144j77537P44882J022027R87637J074970R27532K8167j188674j613450q39331L71470
-556e889451J166799J575205K037063K434739K194541J208644O5042p13069j155288j389735
-546A534490j199789m45124L91077O05347J50488l64910n71191p34972j102590j362918j163280
-535d263372p75986o79626o64672m7828J145966J935399J710443J209753J491212K280156
-525C341445K250908J004603j80924q4310P17738P11241l22886j027956n63154R2604l86267
-514E553042j629498k048833j137302j57971k27909p01761k48706J065146J838002J401999
-504C706209P69396J078744J907861J925163Q20506l31037o51321n40834p93817j295459j281028
-493E314383n85968J30374M55048Q29468J764250K950551L666852L820376M025960M686027
$$ plain form
-567 -7227144 -7404681 -6659799 -5637772 -4650135 -3575165 -2647633 -2619466 -3808140 -5421590 -6260921 -5889451
-556 -5889451 -4722652 -3147447 -1110384 1324355 3518896 4727540 4792582 4079513 2924225 1534490
-546 1534490 334701 -110423 280654 886001 1036489 671579 100388 -634584 -1737174 -3100092 -4263372
-535 -4263372 -5039358 -5718984 -6383656 -6431484 -5285518 -3350119 -1639676 -429923 1061289 3341445
-525 3341445 5592353 6596956 6416032 6331722 7049460 7760701 7437815 6409859 5846705 5939309 5553042
-514 5553042 3923544 1874711 737409 579438 351529 -350232 -598938 466208 2304210 3706209
-504 3706209 4475605 5554349 7462210 9387373 10207879 9876842 9225521 8684687 7890870 6595411 5314383
-493 5314383 4728415 4858789 5313837 6143305 7907555 10858106 14524958 18345334 22371294 27057321
-483B7057321N549268O358710P443592R278193J1811485J4890032J9449100K7777033M2100277
-474A71715011O2636013Q6597996J08422432J20804405J16631393R1956788M8836670m188614
-466H03412094n5000840r2664642j11226768j10860634r6597100p5773925n5235138l9186879
-458A66866168k8554410k2016068j7777967j4740153j2513084j0863409r423304p880964o262682
-449C6834127m913134m165149m004745m052282l898062l460646k970622k598233k203655j550365
-439C017234o89711L7620L99465M98321N05414L39523j66245q28001j117366p32302Q628N23176
-427A795756O25484O20604P66008Q98990P32272L35796R0880K02613M70827N92346M99890
-416G631466K75600j26629q37941j741612k380555k338273j659650p95703j53279K07755M37467
$$ plain form
-483 27057321 32606589 38965299 46408891 55687084 67498569 82388601 101837701 129614734 171715011
-474 171715011 234351024 320949020 429371452 550175857 666807250 758764038 807600708 803412094
-466 803412094 748411254 655746612 544519844 433659210 337062110 261288185 206053047 166866168
-458 166866168 138311758 116295690 98517723 83777570 71264486 60401077 50977773 43096809 36834127
-449 36834127 31920993 27755844 23751099 19698817 15800755 12340109 9369487 6771254 4567599 3017234
-439 3017234 2327523 2365143 2764608 3262929 3768343 4107866 3941621 3113620 1996254 1263952 1272580 1795756
-427 1795756 2421240 3041844 3807852 4706842 5439114 5774910 5865790 6068403 6539230 7131576 7631466
-416 7631466 7907066 7780437 6942496 5200884 2820329 482056 -1177594 -1973297 -2126576 -1918821 -1481354
-405a481354N84047N23150J77236k94330n86439n21402j97330J39776L33924M01092M09100
-394e12530L67353K92297L25847O71330J368842K196355K843124L136080L049111K575827
-384A6313636J747203P88831R0757j21741m1671q9479m82359j089244j676297k125933k369850
-373A0943853k308566j984704j723482j838484k169340k156626j515238o51186k01957k75371
-363c881101m10464k67317k8453K1019J4000K88615Q02434J151957J216502J387862J919654
-352B214708K339840J920392O72605n26790r15032o30653l29475l15976m17428n58789r54483
-341B498919j597383j979040j670634r72619n99683p68037r79173p71929k98689P3993L88603
-330f675672Q92357J369732J228326L92725l51160k60291L96569P18894L93808K158J5547
$$ plain form
-405 -1481354 -897307 -374157 -196921 -491251 -1077690 -1599092 -1796422 -1656646 -1322722 -921630 -512530
-394 -512530 -145177 147120 472967 1144297 2513139 4709494 7552618 10688698 13737809 16313636
-384 16313636 18060839 18849670 18940427 18818686 18777015 18687536 18205177 17115933 15439636 13313703 10943853
-373 10943853 8635287 6650583 4927101 3088617 919277 -1237349 -2752587 -3403773 -3605730 -3881101
-363 -3881101 -4291565 -4558882 -4587335 -4566316 -4552316 -4263701 -3461267 -2309310 -1092808 295054 2214708
-352 2214708 4554548 6474940 7147545 6620755 5705723 5075070 4745595 4429619 4012191 3453402 2498919
-341 2498919 901536 -1077504 -2748138 -3720757 -4320440 -5088477 -6067650 -6839579 -7138268 -7064275 -6675672
-330 -6675672 -5783315 -4413583 -3185257 -2792532 -3143692 -3403983 -3007414 -2288520 -1894712 -1892554 -1877007
-319a877007O3257l77028r48241p52809K86630J085975P67295j22137l24159M43321J231687
-308e23216J384498J570227K788391M901590P110157R947796J5863941K7112236M3392162
-299A13547782O2191468Q1108837R8646755J12158089J16023102J03636131P2311401K6408158
-291G86031723k4343186o9381790j00730286j13986435j08660125q8912201o3037587m0038185
-283A76941928k5022134j7391224j3395605j0213156p569838o205673n936623n688276m872322
-274H0647077l972340l706884m108458m676647n122137n569086o082544o356898o031606n146446
-264B9874031m114680l308149k795024k446751k150831j869581j581686j256873r00326o10857
-254H839273n85849j003247j799011k560551k768402k241508j292715l78230L22132Q56862
$$ plain form
-319 -1877007 -1813750 -2190778 -3139019 -3891828 -3605198 -2519223 -1751928 -1874065 -2198224 -1754903 -523216
-308 -523216 861282 2431509 5219900 10121490 17231647 27179443 43043384 70155620 113547782
-299 113547782 175739250 256848087 355494842 467652931 583676033 687312164 759623565 786031723
-291 786031723 761688537 692306747 591576461 477590026 368929901 280017700 216980113 176941928
-283 176941928 151919794 134528570 121132965 110919809 103349971 97144298 91207675 85519399 80647077
-274 80647077 76674737 72967853 68859395 64182748 59060611 53491525 47408981 41052083 35020477 29874031
-264 29874031 25759351 22451202 19656178 17209427 15058596 13189015 11607329 10350456 9450130 8839273
-254 8839273 8253424 7250177 5451166 2890615 122213 -2119295 -3412010 -3790240 -3468108 -2611246
-244b611246J144100R42654K73497l84173n71437m09899l89371o02834n36494K08201J270421
-233a666581J929325J999950J929167J989741J841216J154401L12641J3340K83975M19169
-223A0206344J9657l92816j43249N64098R00476N73550J36106P219k11353r93681j881454
-212H784897j923459j073799m29485p69818j435396j223951o1569R51996J139920J087909
-202E047245J517643J987432J482193M8692j042204r75222m94321p95622j806042k323889
-192B645905j745761q38828n40878o86595n05131M3977K30696j77071l96383K45631J222849
-181e01589J432763O55999k34916n03356l47181k48763j18718L78256R72573R61104K67651
-170B713823k73507M0004R16579J652451K220485L187163M637689N824714O094318N665483
$$ plain form
-244 -2611246 -1467146 -524492 -250995 -635168 -1206605 -1616504 -2005875 -2608709 -3145203 -2937002 -1666581
-233 -1666581 262744 2262694 4191861 6181602 8022818 9177219 9489860 9503200 9787175 10206344
-223 10206344 10226001 9833185 9689936 10254034 11154510 11728060 11864166 11871385 11660032 10666351 8784897
-212 8784897 6861438 5787639 5358154 4588336 3152940 1928989 1867420 2819416 3959336 5047245
-202 5047245 6564888 8552320 10034513 10083205 9041001 8065779 7571458 6775836 4969794 2645905
-192 2645905 900144 61316 -479562 -1166157 -1671288 -1627311 -1396615 -1573686 -1970069 -1724438 -501589
-181 -501589 931174 1587173 1352257 848901 501720 252957 134239 512495 1485068 2446172 2713823
-170 2713823 2440316 2480320 3396899 5049350 7269835 10456998 15094687 20919401 27013719 32679202
-160C2679202N164170M821356M655952N202961P526951J2869959K3336954M2866173P5318060
-151B14441738J18820400J61247558J83273201J68974915J15996857L7245331m5926896j12604751
-143H41468353j48344422j48554802j20243225p9951744m5879116k8032474k4357472k6146412
-135B19958686k6869335k5809440k4757300k3712492k0954313j6060505j0958042p685948
-127F3151311o264200n423622m677505m686099n752894o940523p070326o047392m706917l652511
-117G929322k789271j921136j234136r57031r01506o81065k47102Q0929P8134j37784l30882
-106a111528l95410l21384j18112J13940J98266J17557R5492K61764L60973O6579m48845n85771
-94a766479p5480O26170R21195P94004O07445L45927m00770j570746k264204j685815k11606
$$ plain form
-160 32679202 37843372 42664728 47320680 52523641 60050592 72920551 96257505 139123678 214441738
-151 214441738 333262138 494509696 677782897 846757812 962754669 1000000000 954073104 841468353
-143 841468353 693123931 544569129 424325904 344374160 298495044 270462570 246105098 219958686
-135 219958686 193089351 167279911 142522611 118810119 97855806 81795301 70837259 63151311
-127 63151311 56887111 51463489 46785984 42099885 36346991 29406468 22336142 16288750 11581833 7929322
-117 7929322 5140051 3218915 1984779 1027748 126242 -554823 -801925 -720996 -642862 -780646 -1111528
-106 -1111528 -1506938 -1828322 -1946434 -1832494 -1634228 -1516671 -1421179 -1159415 -798442 -731863 -1180708 -1766479
-94 -1766479 -1841959 -1215789 -294594 499410 1106855 1452782 1052012 -518734 -2782938 -4468753 -4680359
-83d680359R80170J291227J210058J343965J522316J286805Q60710R33914J516874J706887
-73G972567R03029k71361p66458n03488l29785o58460r02629n52575j64926o21031j703813
-62B401070k203460j531728n26367k63733o11148n89514Q5785N94399K60222m70898p32579
-51c587951m65713l37259n97649o79998r6952P89720J248531J102579P62906N25820L06668
-40a029298N6153l7368O4316M7114k74115n53336l75776M6677R7926l37448o88250n82423
-28c565828m36185p55040j192898r16082J47220J054663J069088N94506M52538O16617L37503
-17b593898n42198j130855o58619M18012R98802P52166L58045L89538N69858L74994j26397
-6a190552m79455o06060q24754j156469j133659m80101M11384R58300J074588J057656J002617
$$ plain form
-83 -4680359 -3700189 -2408962 -1198904 145061 1667377 2954182 3814892 4748806 6265680 7972567
-73 7972567 8875596 8604235 7837777 7334289 7004504 6346044 5443415 4890840 4725914 4104883 2401070
-62 2401070 197610 -1334118 -1860485 -2124218 -2735366 -3324880 -3239095 -2644696 -2384474 -2855372 -3587951
-51 -3587951 -4053664 -4390923 -4988572 -5668570 -5765522 -4975802 -3727271 -2624692 -1861786 -1335966 -1029298
-40 -1029298 -973145 -1010513 -946197 -899083 -1173198 -1726534 -2102310 -2055633 -1957707 -2295155 -2983405 -3565828
-28 -3565828 -4002013 -4757053 -5949951 -6866033 -6718813 -5664150 -4595062 -4000556 -3548018 -2931401 -2593898
-17 -2593898 -3136096 -4266951 -4925570 -4507558 -3508756 -2756590 -2398545 -2009007 -1439149 -1064155 -1190552
-6 -1190552 -1670007 -2276067 -3100821 -4257290 -5390949 -5871050 -5459666 -4501366 -3426778 -2369122 -1366505
4a366505P55200L87745K46987L88968L81846m2441m64370l21430J98468L13904k73006r46609
16g41243j028907o22168k31802J05777P37738J533470J768748J111980K11184j35279o1152
27B648346l43895j181908j885522j889918j472595j116490o67648K64501J321354J567356
37b756419P75154j12257j82395K70133L05092k39885n97322l20935N5671o2628l60415j51930
49c378136M47393O19948J01757l71223j38011M51958O50292M34673L77485N80128M99862k2502
61B53624k86571K59475J058440J155198N99797L64847Q49769J311617J185262J237924K591419
72A0580801M895757O402783N988278M295755K490935O47002j816044m492774n902853n310116
82A7779524l800197k957856k978139k811895j927230j043928r39114j288485j230881o38549
$$ plain form
4 -1366505 -611305 -223560 23427 412395 794241 751800 287430 -34000 164468 478372 205366 -741243
16 -741243 -1770150 -2392318 -2624120 -2518343 -1780605 -247135 1521613 2633593 2844777 2709498 2648346
27 2648346 2304451 1122543 -762979 -2652897 -4125492 -5241982 -5909630 -5645129 -4323775 -2756419
37 -2756419 -1981265 -2093522 -2275917 -2005784 -1700692 -1940577 -2537899 -2858834 -2803163 -2865791 -3226206 -3378136
49 -3378136 -2930743 -2310795 -2209038 -2580261 -2718272 -2266314 -1616022 -1181349 -803864 -223736 276126 253624
61 253624 -32947 226528 1284968 2440166 3039963 3404810 4254579 5566196 6751458 7989382 10580801
72 10580801 15476558 21879341 27867619 32163374 34654309 35301311 33485267 28992493 23089640 17779524
82 17779524 13979327 11021471 8043332 5231437 3304207 2260279 1321165 32680 -1198201 -1836750
92a836750j61092j51670k17130L5748L70669L64271Q2981j09119j83916m06995p36051p73022
104c722076m23150j30794j91710k30374K03430P75826O91836j23257p53870m65413L26114
115d043438O91080M70252L17526N36380N70538m7009p76858o82333K46656R80854P39389j10245
127a107208o73759o44243m00729k51553j07675P9923N9624k89154n87726l77209K28016O39880
139c431813N17347P3993l68779p76284j148710j175510n38094M95680J158963J009004M23086
150c761117R7802K36628M80163N34727N33557O73075P61042M00355m21789j163657j252105
161b881319o86579k1114K33078J11880Q5037M90174J147588J557861J417821Q41937Q6634
172B382998p60889j652628k249077k040613r66236K86343Q78134P00824M23827O13721J059227
$$ plain form
92 -1836750 -1997842 -2149512 -2366642 -2330894 -1960225 -1595954 -1512973 -1622092 -1806008 -2213003 -2949054 -3722076
104 -3722076 -4145226 -4276020 -4467730 -4698104 -4494674 -3718848 -3027012 -3150269 -3904139 -4369552 -4043438
115 -4043438 -3352358 -2882106 -2564580 -2028200 -1457662 -1504671 -2281529 -2963862 -2717206 -1736352 -996963 -1107208
127 -1107208 -1780967 -2425210 -2825939 -3077492 -3185167 -3105244 -3045620 -3334774 -3922500 -4299709 -4071693 -3431813
139 -3431813 -2914466 -2840473 -3209252 -3985536 -5134246 -6309756 -6847850 -6352170 -5193207 -4184203 -3761117
150 -3761117 -3663315 -3426687 -2946524 -2411797 -1878240 -1205165 -444123 -43768 -465557 -1629214 -2881319
161 -2881319 -3567898 -3589012 -3355934 -3244054 -3159017 -2668843 -1521255 36606 1454427 2296364 2382998
172 2382998 1622109 -30519 -2279596 -4320209 -5286445 -5000102 -4121968 -3421144 -2997317 -2383596 -1324369
183a324369J136918O36917o9890o05904r63189j206067j136737n71411J91799N39221K40796
194c131916k64847l96943m8914M61037Q58509J079619J061089O85245K2106o01674r27498
205a204187j016090j031368r22277n43084j0009L37224L68564L08767L47874L58321K00265
216b806000Q7905L04503O32670M92168k25187q29067o38959J20456O20827N16947K64330K71341
228a188066K42289k64500r56266j051988l91927K39854J38679l77238m39241J80139Q23171
239c045094Q80239M97087J65529Q936j40455j56088M03366J633336K939355L555443L228283
250I969937K233427R20358m78521j677732k334123k351866k012243j662259j384323j078438
260A44217p33139m34313j75290J33457M55327O12668N35903L63713K08454j7405l98552p72311
$$ plain form
183 -1324369 -187451 449466 379576 -226328 -1189517 -2395584 -3532321 -4103732 -3911933 -3372712 -3131916
194 -3131916 -3396763 -3793706 -3842620 -3381583 -2523074 -1443455 -382366 302879 324985 -276689 -1204187
205 -1204187 -2220277 -3251645 -4173922 -4717006 -4727015 -4389791 -4021227 -3712460 -3364586 -3006265 -2806000
216 -2806000 -2718095 -2413592 -1780922 -1288754 -1513941 -2343008 -2981967 -2861511 -2240684 -1723737 -1459407 -1188066
228 -1188066 -945777 -1210277 -2166543 -3218531 -3610458 -3370604 -3231925 -3609163 -4048404 -3868265 -3045094
239 -3045094 -2164855 -1667768 -1502239 -1493303 -1633758 -1789846 -1386480 246856 3186211 6741654 9969937
250 9969937 12203364 13123722 12645201 10967469 8633346 6281480 4269237 2606978 1222655 144217
260 144217 -588922 -1023235 -1198525 -1065068 -609741 2927 538830 902543 1110997 1093592 695040 -77271
272g7271q88512p42490n21191k39791K74360R37803J251468Q54000O4156m53417n00869m66616
284e08370n94888n64465n4751O14348Q63304P24849P92703J211443J267648L58200j012034
295C097987j745928j530582j098129j020208q73244l4346J134126J581707R89067K25594J56841
306H82885N31476N03237r0530n90179n96237n45111r36707j457389j348956m64789N18841
317c593459R54888Q80656O98114N65684L84471J61094L4206n203j13762k81477k75581J4887
329e75482M02088O92550R46915J258791J459121J322067R75182P72276P35951M77917j78111
340H289265q20858r94461q78441j006823j396832j459308r12023l02784k59969n63573m99382
351h05189j2312J36132m53906m87020o3200
$$ plain form
272 -77271 -965783 -1708273 -2229464 -2469255 -2194895 -1257092 -5624 848376 912532 459115 -41754 -508370
284 -508370 -1103258 -1667723 -1722474 -1108126 -244822 480027 1272730 2484173 3751821 4110021 3097987
295 3097987 1352059 -178523 -1276652 -2296860 -3170104 -3204450 -2070324 -488617 500450 726044 882885
306 882885 1414361 1917598 1827068 1236889 640652 95541 -841166 -2298555 -3647511 -4112300 -3593459
317 -3593459 -2638571 -1757915 -1059801 -494117 -109646 51448 85654 80451 -33311 -314788 -590369 -575482
329 -575482 -173394 519156 1466071 2724862 4183983 5506050 6481232 7253508 7989459 8467376 8289265
340 8289265 7468407 6473946 5595505 4588682 3191850 1732542 820519 517735 257766 -305807 -805189
351 -805189 -817501 -681369 -1135275 -1622295 -1685495
356a685495
$$ plain form
356 -1685495
##END=	
