##TITLE=	labeled_M9_sacculi 13C 1D and 2D.26.fid
##JCAMPDX=	6.0	$$ NMR Plug-in 1.13 of MestReNova 11.0.4-18998
##DATATYPE=	NMRSPECTRUM
##DATACLASS=	XYDATA
##NUMDIM=	1
##ORIGIN=	Bruker BioSpin GmbH
##OWNER=	ecaudill
##.OBSERVEFREQUENCY=	125.72761525999999321
##.OBSERVENUCLEUS=	^13C
##.SOLVENTNAME=	
##.PULSESEQUENCE=	cp
##LONGDATE=	2018/11/12 17:54:51.000
##.ACQUISITIONMODE=	SIMULTANEOUS (DQD)
##$ORIGINALFORMAT=	Bruker XWIN-NMR
##$PARAMETERFILE=	(acqus, ASCII, d:/Desktop/labeled_M9_sacculi%2013C%201D%20and%202D/26/acqus, 0)
$$ ##TITLE= Parameter file, TOPSPIN		Version 3.2
$$ ##JCAMPDX= 5.0
$$ ##DATATYPE= Parameter Values
$$ ##NPOINTS= 7	$$ modification sequence number
$$ ##ORIGIN= Bruker BioSpin GmbH
$$ ##OWNER= ecaudill
$$ $$ 2018-11-12 17:54:51.290 -0600  ecaudill@devon.nmrfam.wisc.edu
$$ $$ /home/ecaudill/NMR/labeled_M9_sacculi 13C 1D and 2D/26/acqus
$$ $$ process /opt/topspin_CPMAS/prog/mod/go
$$ ##$ACQT0= 0
$$ ##$AMP= (0..31)
$$ 100 100 100 100 100 100 100 100 100 100 100 100 100 100 100 100 100 100
$$ 100 100 100 100 100 100 100 100 100 100 100 100 100 100
$$ ##$AMPCOIL= (0..19)
$$ 0 0 0 0 0 0 0 0 0 0 0 0 0 0 0 0 0 0 0 0
$$ ##$ANAVPT= -1
$$ ##$AQSEQ= 0
$$ ##$AQ_mod= 1
$$ ##$AUNM= <au_zgonly>
$$ ##$AUTOPOS= <>
$$ ##$BF1= 125.715042
$$ ##$BF2= 499.96
$$ ##$BF3= 499.96
$$ ##$BF4= 499.96
$$ ##$BF5= 499.96
$$ ##$BF6= 499.96
$$ ##$BF7= 499.96
$$ ##$BF8= 499.96
$$ ##$BYTORDA= 0
$$ ##$CAGPARS= (0..11)
$$ 0 0 0 0 0 0 0 0 0 0 0 0
$$ ##$CFDGTYP= 0
$$ ##$CFRGTYP= 9
$$ ##$CHEMSTR= <none>
$$ ##$CNST= (0..63)
$$ 1 1 1 1 1 1 1 1 1 1 1 0 1 1 1 1 1 1 1 1 1 0 1 1 1 0 1 1 1 1 1 5000 1 1
$$ 1 1 1 1 1 1 1 1 1 1 1 1 1 1 1 1 1 1 1 1 1 1 1 1 1 1 1 1 1 1
$$ ##$CPDPRG= (0..8)
$$ <> <> <swftppm_13> <> <> <> <> <> <>
$$ ##$D= (0..63)
$$ 0 5 0 0 0 0 0 0 0 0 0 0 0 0 0 0 0 0 0 0 0 0 0 0 0 0 0 0 0 0 0 0 0 0 0 0
$$ 0 0 0 0 0 0 0 0 0 0 0 0 0 0 0 0 0 0 0 0 0 0 0 0 0 0 0 0
$$ ##$DATE= 1542066891
$$ ##$DE= 7.699996
$$ ##$DECBNUC= <off>
$$ ##$DECIM= 532
$$ ##$DECNUC= <off>
$$ ##$DECSTAT= 4
$$ ##$DIGMOD= 3
$$ ##$DIGTYP= 12
$$ ##$DQDMODE= 0
$$ ##$DR= 21
$$ ##$DS= 16
$$ ##$DSPFIRM= 4
$$ ##$DSPFVS= 21
$$ ##$DTYPA= 0
$$ ##$EXP= <4mm_CPMAS_13C_CP_100KHz.lz.2016>
$$ ##$F1LIST= <>
$$ ##$F2LIST= <>
$$ ##$F3LIST= <>
$$ ##$FCUCHAN= (0..9)
$$ 0 1 2 0 0 0 0 0 0 0
$$ ##$FL1= 90
$$ ##$FL2= 90
$$ ##$FL3= 90
$$ ##$FL4= 90
$$ ##$FOV= 20
$$ ##$FQ1LIST= <freqlist>
$$ ##$FQ2LIST= <hetcor.jos>
$$ ##$FQ3LIST= <freqlist>
$$ ##$FQ4LIST= <freqlist>
$$ ##$FQ5LIST= <freqlist>
$$ ##$FQ6LIST= <freqlist>
$$ ##$FQ7LIST= <freqlist>
$$ ##$FQ8LIST= <freqlist>
$$ ##$FRQLO3= 1.79769313486232e+308
$$ ##$FRQLO3N= 0
$$ ##$FS= (0..7)
$$ 83 83 83 83 83 83 83 83
$$ ##$FTLPGN= 0
$$ ##$FW= 625000
$$ ##$FnMODE= 0
$$ ##$FnTYPE= 0
$$ ##$GPNAM= (0..31)
$$ <> <> <> <> <> <> <> <> <> <> <> <> <> <> <> <> <> <> <> <> <> <> <> <>
$$ <> <> <> <> <> <> <> <>
$$ ##$GPX= (0..31)
$$ 0 0 0 0 0 0 0 0 0 0 0 0 0 0 0 0 0 0 0 0 0 0 0 0 0 0 0 0 0 0 0 0
$$ ##$GPY= (0..31)
$$ 0 0 0 0 0 0 0 0 0 0 0 0 0 0 0 0 0 0 0 0 0 0 0 0 0 0 0 0 0 0 0 0
$$ [...]
$$ 0 0 0 0 0 0 0 0
$$ ##$SguType= 2
$$ ##$ShimPowMaxUA= (0..63)
$$ 130000 130000 130000 130000 130000 130000 130000 130000 130000 130000 130000
$$ 130000 130000 130000 130000 130000 130000 130000 130000 130000 130000 130000
$$ 130000 130000 130000 130000 130000 130000 130000 130000 130000 130000 130000
$$ 130000 130000 130000 130000 130000 130000 130000 0 0 0 0 0 0 0 0 0 0 0
$$ 0 0 0 0 0 0 0 0 0 0 0 0 0
$$ ##$ShimPowMaxUC= (0..63)
$$ 130000 130000 130000 130000 130000 130000 130000 130000 130000 130000 130000
$$ 130000 130000 130000 130000 130000 130000 130000 130000 130000 130000 130000
$$ 130000 130000 130000 130000 130000 130000 130000 130000 130000 130000 130000
$$ 130000 130000 130000 130000 130000 130000 130000 0 0 0 0 0 0 0 0 0 0 0
$$ 0 0 0 0 0 0 0 0 0 0 0 0 0
$$ ##$ShimPowMaxUG= (0..63)
$$ 524287 524287 524287 524287 524287 524287 524287 524287 524287 524287 524287
$$ 524287 524287 524287 524287 524287 524287 524287 524287 524287 524287 524287
$$ 524287 524287 524287 524287 524287 524287 524287 524287 524287 524287 524287
$$ 524287 524287 524287 524287 524287 524287 0 0 0 0 0 0 0 0 0 0 0 0 0 0 0
$$ 0 0 0 0 0 0 0 0 0 0
$$ ##$ShimPowRcbType= 3
$$ ##$ShimPowRes= (0..63)
$$ 1e-20 1e-20 1e-20 1e-20 1e-20 1e-20 1e-20 1e-20 1e-20 1e-20 1e-20 1e-20
$$ 1e-20 1e-20 1e-20 1e-20 1e-20 1e-20 1e-20 1e-20 1e-20 1e-20 1e-20 1e-20
$$ 1e-20 1e-20 1e-20 1e-20 1e-20 1e-20 1e-20 1e-20 1e-20 1e-20 1e-20 1e-20
$$ 1e-20 1e-20 1e-20 1e-20 0 0 0 0 0 0 0 0 0 0 0 0 0 0 0 0 0 0 0 0 0 0 0 0
$$ ##$ShimPowRng0= (0..63)
$$ 1 1 1 1 1 1 1 1 1 1 1 1 1 1 1 1 1 1 1 1 1 1 1 1 1 1 1 1 1 1 1 1 1 1 1 1
$$ 1 1 1 1 0 0 0 0 0 0 0 0 0 0 0 0 0 0 0 0 0 0 0 0 0 0 0 0
$$ ##$ShimPowRng1= (0..63)
$$ 1 1 1 1 1 1 1 1 1 1 1 1 1 1 1 1 1 1 1 1 1 1 1 1 1 1 1 1 1 1 1 1 1 1 1 1
$$ 1 1 1 1 0 0 0 0 0 0 0 0 0 0 0 0 0 0 0 0 0 0 0 0 0 0 0 0
$$ ##$ShimPowRng2= (0..63)
$$ 1 1 1 1 1 1 1 1 1 1 1 1 1 1 1 1 1 1 1 1 1 1 1 1 1 1 1 1 1 1 1 1 1 1 1 1
$$ 1 1 1 1 0 0 0 0 0 0 0 0 0 0 0 0 0 0 0 0 0 0 0 0 0 0 0 0
$$ ##$ShimPowRng3= (0..63)
$$ 1 1 1 1 1 1 1 1 1 1 1 1 1 1 1 1 1 1 1 1 1 1 1 1 1 1 1 1 1 1 1 1 1 1 1 1
$$ 1 1 1 1 0 0 0 0 0 0 0 0 0 0 0 0 0 0 0 0 0 0 0 0 0 0 0 0
$$ ##$ShimSysFunc= (0..63)
$$ 1 2 3 4 5 6 7 8 9 10 0 37 38 35 16 15 14 13 12 11 28 27 26 25 24 23 36
$$ 22 30 29 20 21 34 33 32 31 17 18 19 0 0 0 0 0 0 0 0 0 0 0 0 0 0 0 0 0 0
$$ 0 0 0 0 0 0 0
$$ ##$ShimSysMatrix= 0
$$ ##$ShimSysType= 4
$$ ##$TFXNUM= 0
$$ ##$TRIPLO2= 0
$$ ##$VTU= 1
$$ ##$VTUETH= <no>
$$ ##$VTUTY= <tty05>
$$ ##$WBREFAM= (0..15)
$$ 99.6 100 100 100 100 100 100 100 100 100 100 100 100 100 100 100
$$ ##$WBREFLM= (0..15)
$$ 1 0 0 0 0 0 0 0 0 0 0 0 0 0 0 0
$$ ##$WBREFPH= (0..15)
$$ 0.22 0 0 0 0 0 0 0 0 0 0 0 0 0 0 0
$$ ##$WBSGU= (0..15)
$$ 0 0 0 0 0 0 0 0 0 0 0 0 0 0 0 0
$$ ##$XFAC= 2
$$ ##END=
$$ 
##$DECIM=	532
##$DSPFVS=	21
##XUNITS=	HZ
##YUNITS=	ARBITRARY UNITS
##FIRSTX=	31062.597006658212194
##LASTX=	-6513.0315177779657461
##XFACTOR=	-18.356437969924854769
##YFACTOR=	1.0000000000000000871e-07
##NPOINTS=	2048
##XYDATA=	(X++(Y..Y))
$$ plain form
-1692 -530434 -447905 169799 794739 682825 -220352 -1018592 -773713 315852 938153 95606 -1655094
-1681 -1655094 -2735074 -2324166 -1221739 -704991 -903415 -863053 -161843 276389 -520589 -1879561 -1909660
-1670 -1909660 188415 2854343 3723655 2205525 -20385 -1039664 -682432 -260751 -809842 -2083864
-1660 -2083864 -3133749 -3353872 -2838532 -2087157 -1610888 -1627713 -1902368 -1983917 -1756972 -1602571 -1828607
-1649 -1828607 -2195493 -2405433 -2845520 -4094309 -5497586 -5122375 -2026489 1814240 3073486 933036
-1639 933036 -1629549 -1269741 1626499 3465920 1980694 -1101136 -2511497 -1427897 238397 956211
-1629 956211 1278992 2062119 2533147 1458265 -504837 -1246566 -125676 981215 277267 -1405721
-1619 -1405721 -1871593 -789536 -96955 -977892 -1958973 -1066155 1043606 1617559 -587152 -3626297
$$ packed form
-1692e30434Q2529O17704O24940j11914r03177p98240K44879J089565O22301q42547j750700
-1681a655094j079980M10908J102427N16748j98424M0362P01210M38232p96978j358972l0099
-1670a909660K098075K665928Q69312j518130k225910j019279L57232M21681n49091j274022
-1660b083864j049885k20123N15340P51375M76269j6825k74655q1549K26945J54401k26036
-1649a828607l66886k09940m40087j248789j403277L75211L095886L840729J259246k140450
-1639I33036k562585L59808K896240J839421j485226l081830j410361J083600J666294P17814
-1629I56211L22781P83127M71028j074882j963102p41729J120890J106891p03948j682988
-1619a405721m65872J082057O92581q80937r81081Q92818K109761N73953k204711l039145
$$ plain form
-1609 -3626297 -4863701 -4081103 -3085676 -2842227 -2411813 -960789 417956 -125988 -2638465 -4930602
-1599 -4930602 -4859161 -2482712 221827 1303339 220223 -2236429 -4761256 -6261698 -6271400 -5021165
-1589 -5021165 -3157375 -1374378 -274527 -299272 -1405619 -2797030 -3399569 -2895326 -2073305 -1865071
-1579 -1865071 -2188093 -2107223 -1088606 321665 1156042 964299 -74272 -1492939 -2540057 -2236594
-1569 -2236594 -267198 2075374 2638130 685093 -1984311 -2871925 -1597419 -174482 -381992 -1617143
-1559 -1617143 -1865769 -291913 1897606 3046883 2748249 1744936 784586 82175 -385105 -606535
-1549 -606535 -571907 -262542 345362 986903 980036 -88154 -1532568 -2075078 -1479793 -1052104 -1899105
-1538 -1899105 -3213920 -3282525 -2046883 -1393513 -2405238 -3559850 -2894023 -1216234 -1347182 -3943814
$$ packed form
-1609c626297j237404P82598R95427K43449M30414J451024J378745n43944k512477k292137
-1599d930602P1441K376449K704539J081512j083116k456652k524827j500442r702J250235
-1589e021165J863790J782997J099851k4745j106347j391411o02539N04243Q22021K08234
-1579a865071l23022Q0870J018617J410271Q34377j91743j038571j418667j047118L03463
-1569b236594J969396K342572N62756j953037k669404q87614J274506J422937k07510j235151
-1559a617143k48626J573856K189519J149277k98634j003313r60350p02411m67280k21430
-1549f06535L4628L09365O07904O41541o867j068190j444414n42510N95285M27689q47001
-1538a899105j314815o8605J235642O53370j011725j154612O65827J677789j30948k596632
$$ plain form
-1528 -3943814 -5923863 -4318480 -495086 1357901 -318077 -2573081 -2195917 9161 844972 -493963
-1518 -493963 -1606824 -957357 -369504 -2015255 -4514958 -4367917 -1002408 1933292 1231144 -1668191
-1508 -1668191 -2787166 -1010237 720288 -239247 -2650424 -3363883 -1655465 153401 187585 -589318
-1498 -589318 -179371 1410601 2169636 821782 -1551132 -2894924 -2450773 -1150125 -177354 209642
-1488 209642 390447 408546 -271846 -1905732 -3535500 -3390437 -741560 2662458 3741799 1296554
-1478 1296554 -2249369 -3163082 -595878 2338621 2170534 -910470 -3515036 -3189660 -911709 808929
-1468 808929 1127152 1143414 1625809 1883397 1171670 69622 -366804 -227081 -574644 -1808170 -3081260
-1457 -3081260 -3517157 -3223010 -2691653 -1877541 -609951 442985 207419 -1191177 -2035081 -835744
$$ packed form
-1528c943814j980049J605383L823394J852987j675978k255004L77164K205078Q35811j338935
-1518d93963j112861O49467N87853j645751k499703J47041L365509K935700p02148k899335
-1508a668191j118975J776929J730525r59535k411177p13459J708418J808866L4184p76903
-1498e89318M09947J589972P59035j347854k372914j343792M44151J300648R72771L86996
-1488B09642J80805J8099o80392j633886j629768J45063K648877L404018J079341k445245
-1478A296554l545923r13713K567204K934499j68087l081004k604566L25376K277951J720638
-1468H08929L18223J6262M82395K57588p11727j102048m36426J39723l47563j233526j273090
-1457c081260m35897K94147N31357Q14112J267590J052936k35566j398596q43904J199337
$$ plain form
-1447 -835744 1744133 3347525 2308616 -732849 -3549746 -4323357 -2959301 -883555 224260 -229510
-1437 -229510 -1361631 -1805830 -1201860 -512554 -726525 -1583274 -1999327 -1535471 -806302 -383186 -22135
-1426 -22135 586809 917903 272150 -875760 -1133176 -33133 1161517 1017239 -293061 -1475798 -1955943
-1415 -1955943 -2268293 -2690421 -2629014 -1854662 -1369257 -2073099 -3126375 -2860570 -1241580 -103331 -472057
-1404 -472057 -932030 214065 1990070 1627569 -1534874 -4651936 -4739887 -2335791 -522658 -886450
-1394 -886450 -1988809 -1970407 -1137040 -1054620 -2054809 -2905400 -2649985 -1592680 -366477 907499 2115991
-1383 2115991 2712945 2487442 2155113 2360782 2515912 1606460 -39227 -964953 -763485 -765460 -1802514
-1372 -1802514 -2428319 -799618 2205368 3537492 1957703 -186667 -173716 1404259 1778024 151005
$$ packed form
-1447h35744K579877J603392j038909l041465k816897p73611J364056K075746J107815m53770
-1437b29510j132121m44199O03970O89306k13971q56749m16053M63856P29169M23116L61051
-1426b2135O08944L31094o45753j147910k57416J100043J194650j44278j310300j182737m80145
-1415a955943l12350m22128O1407P74352M85405p03842j053276K65805J618990J138249l68726
-1404d72057m59973J146095J776005l62501l162443l117062q7951K404096J813133l63792
-1394h86450j102359J8402Q33367Q2420j000189q50591K55415J057305J226203J273976J208492
-1383B115991N96954k25503l32329K05669J55130r09452j645687r25726K01468j975j037054
-1372a802514o25805J628701L004986J332124j579789k144370J2951J577975L73765j627019
$$ plain form
-1362 151005 -1320214 -936600 147067 99969 -540223 82880 1709201 1815843 -708626 -3732898 -4875885
-1351 -4875885 -4757434 -5442066 -6587374 -5613927 -1988704 1046475 484109 -2313863 -3564116 -2408242
-1341 -2408242 -1870497 -4104384 -7007455 -7120977 -4430312 -2145302 -2155035 -2920997 -2403964 -1158165 -1146660
-1330 -1146660 -2652294 -4087742 -4478656 -4428329 -4418581 -3768393 -2113900 -692130 -867033 -2032576 -2390372
-1319 -2390372 -1626433 -1351181 -2563803 -4076249 -4321987 -3643805 -3471989 -3828937 -3256917 -1321119 364531
-1308 364531 328664 -746389 -1311724 -1386672 -2185949 -3583326 -3701278 -1653284 674673 774831 -1264740
-1297 -1264740 -2964761 -2604149 -892161 571643 1172245 1051142 207517 -1060759 -1552574 -407852
-1287 -407852 1178402 875706 -1773711 -4436489 -4752057 -3020765 -1199682 -156943 540406 539133 -1505308
$$ packed form
-1362A51005j471219L83614J083667m7098o40192O23103J626321J06642k524469l024272j142987
-1351d875885J18451o84632j145308R73447L625223L035179n62366k797972j250253J155874
-1341b408242N37745k233887k903071j13522K690665K285010r733p65962N17033J245799J1505
-1330a146660j505634j435448l90914N0327R748O50188J654493J421770j74903j165543l57796
-1319b390372P63939K75252j212622j512446k45738O78182J71816l56948N72020J935798J685650
-1308C64531l5867j075053n65335p4948p99277j397377j17952K047994K327957J00158k039571
-1297a264740j700021L60612J711988J463804O00602j21103q43625j268276m91815J144722
-1287d07852J586254l02696k649417k662778l15568J731292J821083J042739O97349j273k044441
$$ plain form
-1276 -1505308 -5298618 -7798501 -6403396 -2521316 -216987 -1354373 -3703805 -4267913 -2881308 -1480090
-1266 -1480090 -1110286 -1304185 -1755695 -2645569 -3196670 -1906243 849065 2126181 1910 -3176240
-1256 -3176240 -3241338 284804 3377392 2860126 428600 -284951 983870 1334009 -290501 -1269989
-1246 -1269989 479108 2906491 2628450 -14926 -1379331 183151 2153948 1944362 825409 1687430
-1236 1687430 4203778 4909336 2149533 -1449600 -2457705 -794376 1112403 2047978 2797363 3574167
-1226 3574167 2966197 318008 -2417501 -2645760 -298754 2200869 2871575 1980890 1016755 954716 1756711
-1215 1756711 2638603 2481315 841274 -1025309 -1101027 766443 2225456 1525256 235220 999370
-1205 999370 3124924 3100067 217711 -1212633 2337266 7593321 7884498 2229478 -2938551 -2448182
$$ packed form
-1276a505308l793310k499883J395105L882080K304329j137386k349432n64108J386605J401218
-1266a480090L69804j93899m51510q89874n51101J290427K755308J277116k124271l178150
-1256c176240o5098L526142L092588n17266k431526p13551J268821L50139j624510r79488
-1246a269989J749097K427383k78041k643376j364405J562482J970797k09586j118953Q62021
-1236A687430K516348P05558k759803l599133j008105J663329J906779R35575P49385P76804
-1226C574167o07970k648189k735509k28259K347006K499623O70706q90685r64135o2039Q01995
-1215A756711Q81892j57288j640041j866583p5718J867470J459013p00200j290036P64150
-1205I99370K125554k4857k882356j430344L549899N256055K91177n655020n168029M90369
$$ plain form
-1195 -2448182 960724 1697707 77177 1086859 5259709 6694282 2310903 -2119202 130744 6154832
-1185 6154832 7146663 1980409 -265530 6076276 13971853 14052500 9600113 12245197 23538045 31203727
-1175 31203727 28089456 25388205 37243733 57990932 69720926 75401372 109583902 202592811 338793411
-1166 338793411 464122734 536429634 556413726 544684677 503623695 419530563 299171619 183733234
-1158 183733234 114499511 92768230 85420970 66645131 41595954 27692227 26481351 24449453 15047459
-1149 15047459 6726578 7695590 13021979 12734744 6491514 2546191 4515193 6931260 4918682 1564791
-1139 1564791 1968430 4565453 3688473 -1223582 -4560891 -3020288 -134785 -122473 -1188020 1168914
-1129 1168914 6260269 8257951 4355254 -1096701 -2388551 418027 2689598 1805390 -485653 -1770906
$$ packed form
-1195b448182L408906P36983j620530J009682M172850J434573m383379m430105K249946O024088
-1185F154832R91831n166254k245939O341806P895577Q0647m452387K645084J1292848P665682
-1175C1203727l114271k701251J1855528K0747199J1729994N680446L4182530R3008909J36200600
-1166C38793411J25329323P2306900J9984092j1729049m1060982q4093132j20358944j15438385
-1158A83733234o9233723k1731281p347260j8775839k5049177j3903727j210876k031898r401994
-1149A5047459q320881R69012N326389k87235o243230l945323J969002K416067k012578l353891
-1139A564791M03639K597023q76980m912055l337309J540603K885503J2312j065547K356934
-1129A168914N091355J997682l902697n451955j291850K806578K271571q84208k291043j285253
$$ plain form
-1119 -1770906 -1948970 -1764969 -960042 448265 811730 -1031340 -3161404 -2466063 885176 3114084
-1109 3114084 1735534 -1178043 -2050851 -585646 600285 353210 398727 1890757 2914133 1113837
-1099 1113837 -2545186 -4736797 -4108503 -2646523 -2401464 -2759481 -2096499 -725684 -404064 -1408461
-1089 -1408461 -2011155 -1259415 -677682 -2090225 -4663456 -5526930 -3244811 461302 2755098 2644355
-1079 2644355 1434959 813289 1138135 1486667 888574 -577551 -1765454 -1648786 -643411 -375095
-1069 -375095 -1709487 -3352768 -3176424 -923563 1285893 1512088 199162 -935147 -1476594 -2433437
-1059 -2433437 -3880382 -4107819 -2041577 572457 887095 -1361067 -3293835 -2405594 471830 2445929
-1049 2445929 1988610 90571 -1531693 -2150893 -1892387 -1072797 -269323 -236840 -961961 -1287325 -317472
$$ packed form
-1119a770906j78064J84001Q04927J408307L63465j843070k130064O95341L351239K228908
-1109C114084j378550k913577q72808J465205J185931k47075M5517J492030J023376j800296
-1099A113837l659023k191611O28294J461980K45059l58017O62982J370815L21620j004397
-1089a408461o02694P51740N81733j412543k573231q63474K282119L706113K293796j10743
-1079B644355j209396o21670L24846L48532n98093j466125j187903J16668J005375K68316
-1069c75095j334392j643281J76344K252861K209456K26195j312926j134309n41447r56843
-1059b433437j446945k27437K066242K614034L14638k248162j932768Q88241K877424J974099
-1049B445929m57319j898039j622264o19200K58506Q19590Q03474L2483p25121l25364R69853
$$ plain form
-1038 -317472 1108565 1317780 119698 -874434 -575590 62142 -314194 -1194516 -970698 341979 788465
-1027 788465 -605412 -2006608 -1075723 1699847 3476476 2747761 1113210 933869 2532857 4712111
-1017 4712111 7127603 10671559 15586569 20479195 23574280 24049348 21818554 17140951 11323009 6864787
-1007 6864787 5403356 5657742 4837818 2368968 780847 2071667 4511660 4665580 1996937 -483115
-997 -483115 -421783 916946 1027081 7911 90623 1838549 3028776 1920672 -174978 -935459 -433475
-986 -433475 -666151 -2071450 -2553015 -600497 2231228 3230583 1977574 407896 -153504 -374216 -1079289
-975 -1079289 -1610016 -1015528 118147 337496 -588533 -1537892 -1953772 -2551134 -3659392 -4093678 -2690985
-964 -2690985 -231398 1376420 1509058 1175117 981492 239505 -1275328 -2065694 -831692 1060218
$$ packed form
-1038c17472J426037K09215j198082r94132K98844O37732l76336q80322K23818J312677M46486
-1027G88465j393877j401196R30885K775570J776629p28715j634551j79341J598988K179254
-1017D712111K415492L543956M915010M892626L095085M75068k230794m677603n817942m458222
-1007F864787j461431K54386q19924k468850j588121J290820K439993J53920k668643k480052
-997d83115O1332J338729J10135j019170Q2712J747926J190227j108104k095650p60481N01984
-986d33475k32676j405299m81565J952518K831725R99355j253009j569678n61400k20712p05073
-975a079289n30727N94488J133675K19349r26029r49359m15880n97362j108258m34286J402693
-964b690985K459587J607818J32638l33941j93625p41987j514833p90366J234002J891910
$$ plain form
-954 1060218 792133 -2085231 -4682539 -4414207 -2294138 -1261507 -2059431 -2613022 -1525442 -276638
-944 -276638 -900572 -2788150 -3445563 -2023257 -433761 -628996 -2116982 -2994128 -2511463 -1540852 -995342
-933 -995342 -974986 -1389571 -2218729 -2819559 -2093638 -132318 1110112 -95356 -2812241 -4256960 -3140865
-922 -3140865 -1075918 -237598 -741504 -1253073 -1322813 -1639406 -2162634 -1682186 96762 1362760 386227
-911 386227 -1787852 -2379858 -597785 1204627 731691 -1153066 -1744490 -212260 1516842 1571768 333234
-900 333234 -784133 -1456032 -2138265 -2412868 -1338335 433962 535070 -2116479 -5189088 -5269420 -2127906
-889 -2127906 739682 281383 -2503311 -4056415 -2734541 -533201 -227873 -1908057 -3165197 -2282866
-879 -2282866 -283179 481191 -758739 -2273670 -1944802 41333 1091511 -906114 -4826373 -7107275
$$ packed form
-954A060218k68085k877364k597308K68332K120069J032631p97924n53591J087580J248804
-944b76638o23934j887578o57413J422306J589496j95235j487986q77146M82665R70611N45510
-933i95342K0356m14585q29158o00830P25921J961320J242430j205468k716885j444719J116095
-922c140865K064947Q38320n03906n11569o9740l16593n23228M80448J778948J265998r76533
-911C86227k174079n92006J782073J802412m72936j884757n91424J532230J729102N4926j238534
-900C33234j117367o71899o82233k74603J074533J772297J01108k651549l072609q0332L141514
-889b127906K867588m58299k784694j553104J321874K201340L05328j680184j257140Q82331
-879b282866J999687P64370j239930j514931L28868J986135J050178j997625l920259k280902
$$ plain form
-869 -7107275 -5670340 -2529239 -1647599 -4199149 -6936094 -5916056 -1198087 3227860 4069755 2094756
-859 2094756 374932 269739 430253 -515677 -1813708 -1816081 -439081 716330 511028 -409121 -637707
-848 -637707 319578 1718828 2410583 1672692 -189404 -1462554 199109 5466396 11700972 14784369
-838 14784369 13305158 10153291 8964253 9545555 8369063 3779751 -1077142 -1959851 815879 2543597
-828 2543597 256127 -3285973 -3233547 840294 4257075 3252542 -369466 -1955323 -87275 2157605
-818 2157605 1952791 512608 837185 3048464 4103921 2163215 -734140 -1459735 -38135 588194
-808 588194 -1227334 -3614116 -3885237 -2177628 -1037674 -1867365 -3324302 -3570086 -2760528 -2291945 -2393026
-797 -2393026 -1938081 -662610 -105501 -1497933 -3622083 -4066384 -2455857 -1140426 -2154081 -4461169
$$ packed form
-869g107275J436935L141101Q81640k551550k736945J020038M717969M425947Q41895j974999
-859B094756j719824j05193J60514r45930j298031k373J377000J155411k05302r20149k28586
-848f37707R57285J399250O91755p37891j862096j273150J661663N267287O234576L083397
-838A4784369j479211l151867j189038N81302j176492m589312m856893q82709K775730J727718
-828B543597k287470l542100N2426M073841L416781j004533l622008j585857J868048K244880
-818B157605k04814j440183L24577K211279J055457j940706k897355p25595J421600O26329
-808E88194j815528k386782k71121J707609J139954q29691j456937k45784Q09558M68583j01081
-797b393026M54945J275471N57109j392432k124150m44301J610527J315431j013655k307088
$$ plain form
-787 -4461169 -5240075 -3532751 -1471502 -1606269 -3878655 -5877839 -5601186 -3207852 -260586 1856291
-777 1856291 2528873 1777461 313104 -559467 68875 1610650 2397941 1509666 -191841 -1220826 -1332692
-766 -1332692 -1623324 -2805283 -4082932 -4160940 -2961775 -1717200 -1382553 -1552792 -1257410 -445213 -131782
-755 -131782 -1021937 -2391896 -2671136 -1118645 1249126 2485891 1485323 -1023604 -3177032 -3648131
-745 -3648131 -2665072 -1491847 -1112753 -1577589 -2454397 -3426920 -4158041 -3950982 -2278119 153566 1498011
-734 1498011 621275 -1281817 -1682505 352500 2803435 2916405 533084 -1647483 -1386394 289613
-724 289613 389738 -2213678 -5251539 -5721610 -3366807 -731775 -36554 -931692 -1605338 -1259182 -653504
-713 -653504 -530107 -564063 -268962 -173817 -1236612 -3229364 -4537003 -3916268 -1978371 -448938 -191875
$$ packed form
-787d461169p78906J707324K061249j34767k272386j999184K76653K393334K947266K116877
-777A856291O72582p51412j464357q72571O28342J541775P87291q88275j701507j028985j11866
-766a332692k90632j181959j277649p8008J199165J244575L34647j70239K95382Q12197L13431
-755a31782q90155j369959k79240J552491K367771J236765j000568k508927k153428m71099
-745c648131R83059J173225L79094m64836q76808r72523p31121K07059J672863K431685J344445
-734A498011q76736j903092m00688K035005K450935J12970k383321k180567K61089J676007
-724B89613J00125k603416l037861m70071K354803K635032O95221q95138o73646L46156O05678
-713f53504J23397l3956K95101R5145j062795j992752j307639O20735J937897J529433K57063
$$ plain form
-702 -191875 -496137 -299809 460656 1072935 1344650 2253775 5213696 10709048 17427084 22551486 23343632
-691 23343632 19278144 12948544 8300412 7280067 8229167 7959870 5286980 1964980 185528 64256
-681 64256 199090 -15763 143511 945832 1195352 -131875 -1983838 -2206431 -405783 1290978 818354
-670 818354 -1342214 -3058618 -3357165 -3209827 -3562602 -3803456 -2850499 -967124 494533 889629 848457
-659 848457 976483 928440 237980 -677381 -1110230 -1252078 -1887998 -2958764 -3332864 -2303044 -554034
-648 -554034 838435 1675005 2152224 1739367 -168944 -2468271 -2686156 -5696 3021616 3148794 528852
-637 528852 -1310700 83357 3006165 3914314 1915246 -447263 -623330 1212376 3226922 4411473
-627 4411473 5122985 6206624 9018988 15826420 28199167 44176058 58271427 65628061 65846285 61863541
$$ packed form
-702a91875l04262J96328P60465O12279K71715R09125K959921N495352O718036N124402P92146
-691B3343632m065488o329600m648132j020345R49100k69297k672890l322000j779452j21272
-681F4256J34834k14853J59274Q02321K49520j327227j851963k22593J800648J696761m72624
-670H18354k160568j716404k98547J47338l52775k40854R52957J883375J461657L95096m1172
-659H48457J28026m8043o90460r15361m32849j41848o35920j070766l74100J029820J749010
-648e54034J392469Q36570M77219m12857j908311k299327k17885K680460L027312J27178k619942
-637E28852j839552J394057K922808R08149j999068k362509j76067J835706K014546J184551
-627D411473P11512J083639K812364O807432J2372747J5976891J4095369P356634K18224l982744
$$ plain form
-617 61863541 55686254 46832985 35146608 23278174 14842016 10729572 8706142 6578241 4345176
-608 4345176 2829167 1643291 -172180 -2143236 -2530553 -737899 1557586 2244580 1014686 -836127
-598 -836127 -2166220 -2637473 -2005102 -24061 2582268 4027532 3143180 792310 -1038200 -1334663
-588 -1334663 -646843 176591 936261 1568494 1557440 542884 -908690 -1853371 -2148696 -2459890 -3148086
-577 -3148086 -3827303 -4114736 -4067702 -3554319 -2026884 289381 1599652 201557 -2993437 -4836297
-567 -4836297 -3475590 -616500 660592 -330659 -1557373 -1449048 -774062 -748308 -743359 644897 2898876
-556 2898876 3717656 2107861 -143377 -866744 -226337 154885 -14370 540500 2132865 3118658 2275885
-545 2275885 860142 890733 2113643 2392406 1109448 356706 1864454 4164690 4372054 2138714
$$ packed form
-617F1863541o177287q853269j1686377j1868434q436158m112444k023430k127901k233065
-608D345176j516009j185876j815471j971056l87317J792654K295485O86994j229894j850813
-598h36127j330093m71253O32371J981041K606329J445264q84352k350870j830510k96463
-588a334663O87820Q23434P59670O32233j1054j014556j451574r44681k95325l11194o88196
-577c148086o79217k87433M7034N13383J527435K316265J310271j398095l194994j842860
-567d836297J360707K859090J277092r91251j226714J08325O74986K5754M949J388256K253979
-556B898876Q18780j609795k251238p23367O40407L81222j69255N54870J592365R85793q42773
-545B275885j415743L0591J222910K78763j282958p52742J507748K300236K07364k233340
$$ plain form
-535 2138714 42899 -75893 597187 128086 -1015347 -728305 1365752 3161418 3054318 2159296 2587258
-524 2587258 4542882 6424584 7237333 7348815 6840208 4855988 1547121 -654466 584793 4149392
-514 4149392 6203728 4754647 2104376 1720263 3651671 4673496 2837034 142216 -171290 2185189
-504 2185189 4499580 4840404 4317630 5019115 6868828 7777119 6606463 4705893 4021017 4532781 4503355
-493 4503355 3070633 1647876 2303836 5272629 8746204 11082155 12596764 14886705 18820252 23743205
-483 23743205 28543362 32903552 37389822 42982754 51014862 62867035 78502902 95554618 112420406
-474 112420406 135149040 181154880 271668186 413808326 585143241 735841522 811548461 783401794
-466 783401794 664671020 502439193 350400695 241625385 178667716 144232215 120255632 99347343
$$ packed form
-535B138714k095815j18792O73080m69101j143433K87042K094057J795666j07100q95022M27962
-524B587258J955624J881702Q12749J11482n08607j984220l308867k201587J239259L564599
-514D149392K054336j449081k650271l84113J931408J021825j836462k694818l13506K356479
-504B185189K314391L40824n22774P01485J849713R08291j170656j900570o84876N11764k9426
-493D503355j432722j422757O55960K968793L473575K335951J514609K289941L933547M922953
-483B3743205M800157M360190M486270N592932Q032108J1852173J5635867J7051716J6865788
-474A12420406K2728634M6005840R0513306J42140140J71334915J50698281P5706939k8146667
-466G83401794j18730774j62231827j52038498j08775310o2957669l4435501k3976583k0908289
$$ plain form
-458 99347343 82614707 71309971 63037619 54791855 46412167 39374294 33569030 27379384 20765342
-449 20765342 16150007 15174438 15872294 14641003 10608661 6514697 5079504 5898058 6622691 6061648
-439 6061648 4893014 3959519 3363397 3261077 4072898 5290582 5302315 3494356 1704541 2141580 4143539
-428 4143539 4657125 2356585 -275582 -115256 2455612 4221565 3551558 2240258 2461646 3626277
-418 3626277 3621535 2124912 889306 924050 1147834 364441 -868595 -1341689 -1107463 -980157 -784918
-407 -784918 269070 1580329 1345097 -573409 -1610227 228882 3117321 3343406 208534 -3053658
-397 -3053658 -3684388 -2635119 -2054824 -1389207 1434249 5507419 6715024 3181668 -1372385 -1897197
-387 -1897197 1602408 4500843 4070540 2718330 3711115 6230700 7077641 5940725 5884506 8357441
$$ packed form
-458I9347343j6732636j1304736q272352q245764q379688p037873n805264o189646o614042
-449B0765342m615335r75569O97856j231291m032342m093964j435193Q18554P24633n61043
-439F061648j168634r33495n96122j02320Q11821J217684J1733j807959j789815M37039K001959
-428D143539N13586k300540k632167J60326K570868J765953o70007j311300K21388J164631
-418C626277m742j496623j235606L4744K23784p83393j233036m73094K34226J27306J95239
-407g84918J053988J311259k35232j918506j036818J839109K888439K26085l134872l262192
-397c053658o30730J049269N80295O65617K823456M073170J207605l533356m554053n24812
-387a897197L499605K898435m30303j352210R92785K519585Q46941j136916n6219K472935
$$ plain form
-377 8357441 10555653 9319653 5715372 3468835 3775702 4242161 3085163 1776853 2202075 3202797
-367 3202797 2232320 -412880 -1583623 175071 2343236 1942886 -347056 -1509254 -735530 -289295
-357 -289295 -1574953 -2600803 -807147 2911902 4956907 3539873 728852 -419943 624771 2073131
-347 2073131 2509577 2158271 1889889 2236988 3460367 5432862 6993350 6408655 3392385 147382
-337 147382 -669695 969687 2326613 1160570 -1578588 -2922860 -1383146 1399213 2515412 840703
-327 840703 -1934037 -3084523 -1551339 1041225 2097603 898464 -492945 411516 3403664 5563666
-317 5563666 4686412 2016658 781856 2333023 4744204 5403566 4074273 2821755 3536722 6272702
-307 6272702 9697418 12435898 14143469 16007869 20087275 27452468 37708649 52769551 82188081
$$ packed form
-377H357441K198212j236000l604281k246537L06867M66459j156998j308310M25222J000722
-367C202797r70477k645200j170743J758694K168165m00350k289942j162198P73724M46235
-357b89295j285658j025850J793656L719049K045005j417034k811021j148795J044714J448360
-347B073131M36446l51306k68382L47099J223379J972495J560488n84695l016270l245003
-337A47382q17077J639382J356926j166043k739158j344272J539714K782359J116199j674709
-327H40703k774740j150486J533184K592564J056378j199139j391409R04461K992148K160002
-317E563666q77254k669754j234802J551167K411181O59362j329293j252518P14967K735980
-307F272702L424716K738480J707571J864400M079406P365193J0256181J5060902K9418530
$$ plain form
-298 82188081 141947565 243132762 379053611 523930549 645138702 717129669 726404876 670624084
-290 670624084 560685272 424030952 297807731 209728202 162523994 138565607 119966726 102520551
-282 102520551 91121778 87197999 85344858 80707693 74387264 69752435 66791286 63070144 58480982
-273 58480982 55454521 54409251 52143259 46163120 38454451 32909564 30215969 27607786 23357686 19094948
-263 19094948 16928725 16231687 14818212 12220010 10034306 9342348 9406417 9127613 8406571 7528971 6394401
-252 6394401 5168217 4703716 5220260 5318173 3712760 1540310 1211382 2798272 3475785 1560984 -625132
-241 -625132 133087 2974935 3718189 836351 -1932182 -506008 3873555 6283077 4629375 1827971
-231 1827971 1166864 2158341 2545151 2386785 3548957 5862135 6644278 4689503 2424781 2652139 4783645
$$ packed form
-298H2188081N9759484J01185197J35920849J44876938J21208153P1990967R275207n5780792
-290F70624084j09938812j36654320j26223221q8079529m7204208k3958387j8598881j7446175
-282A02520551j1398773l923779j853141m637165o320429m634829k961149l721142m589162
-273E8480982l026461j045270k265992n980139p708669n544887k693595k608183m250100m262738
-263A9094948k166223o97038j413475k598202k185704o91958O4069k78804p21042q77600j134570
-252F394401j226184m64501N16544R7913j605413k172450l28928J586890O77513j914801k186116
-241f25132P58219K841848P43254k881838k768533J426174M379563K409522j653702k801404
-231A827971o61107R91477L86810j58366J162172K313178P82143j954775k264722K27358K131506
$$ plain form
-220 4783645 6224399 6437947 7183176 8784683 8796583 5595880 1371490 -407277 534428 1474626 990948
-209 990948 652797 1818539 3021147 2283533 653849 1157086 4480443 7780307 8238036 6097900
-199 6097900 3397109 1312478 133943 526224 2699762 4771498 4254019 1647272 477065 2623088
-189 2623088 5395680 5086060 2144095 337323 1180321 2118003 1039160 -256677 746110 2670365
-179 2670365 2038159 -977352 -2134544 688236 4098484 4099735 1888613 1548229 3367272 3533632 773382
-168 773382 -899104 1798627 6052868 7183806 6108452 7974638 13796405 18565990 19225535 19563002
-158 19563002 23698327 29168400 32411608 38154406 54809679 81106071 110552167 157974319 269127674
-149 269127674 478845100 748623504 960923919 1000000000 849697875 607978057 402045593 291854934
$$ packed form
-220D783645J440754K13548P45229J601507J1900l200703m224390j778767R41705R40198m83678
-209I90948l38151J165742J202608p37614j629684N03237L323357L299864M57729k140136
-199F097900k700791k084631j178535L92281K173538K071736n17479k606747j170207K146023
-189B623088K772592l09620k941965j806772Q42998R37682j078843j295837J002787J924255
-179B670365o32206l015511j157192K822780L410248J251k211122l40384J819043J66360k760250
-168G73382j672486K697731M254241J130938j075354J866186N821767M769585O59545L37467
-158A9563002M135325N470073L243208N742798J6655273K6296392K9446096M7422152J11153355
-149B69127674K09717426K69778404K12300415L9076081j50302125k41719818k05932464j10190659
$$ plain form
-141 291854934 252675533 233057842 210353813 191247730 180413379 167782649 144363918 115801076
-133 115801076 93717241 80381689 68813810 55001845 42929263 36964797 34904069 31457791 25421602
-124 25421602 19927253 16942043 14840474 11568323 7652229 5084649 4747985 5861114 6870582 6134015
-114 6134015 2960292 -867037 -1701959 2079361 7240396 8653525 5323039 1532458 1138173 2607749
-104 2607749 1607747 -2617419 -6058750 -5363570 -2095704 -296831 -1402619 -3410864 -4286916 -4085572
-94 -4085572 -3577006 -2709526 -1374120 -369290 -352918 -603519 -86734 759395 733801 167838 807055
-83 807055 2937860 4294958 3040714 623419 -6071 1666136 3628305 5158511 8208744 13636114
-73 13636114 18097918 17325339 11944488 7318359 6920596 8206739 6681470 2297328 -746329 -36028
$$ packed form
-141B91854934l9179401j9617691k2704029j9106083j0834351j2630730k3418731k8562842
-133A15801076k2083835j3335552j1567879j3811965j2072582n964466k060728l446278o036189
-124B5421602n494349k985210k101569l272151l916094k567580l36664J113129J009468p36567
-114F134015l173723l827329q34922L781320N161035J413129l330486l790581l94285J469576
-104B607749j000002m225166l441331O95180L267866J798873j105788k008245q76052K01344
-94d085572N08566Q67480J335406J004830J6372k50601N16785Q46129k5594n65963O39217
-83H07055K130805J357098j254244k417295o29490J672207J962169J530206L050233N427370
-73A3636114M461804p72579n380851m626129l97763J286143j525269m384142l043657P10301
$$ plain form
-63 -36028 2032482 2078558 273032 -773401 -247019 132160 -669222 -1412858 -955333 -273678 -703106
-52 -703106 -1486334 -995946 214084 -185544 -2512593 -3860462 -2028653 884692 925691 -2200623 -4368315
-41 -4368315 -2388983 1774397 3594307 1645499 -1144129 -1614571 125431 1860185 2387750 2235535
-31 2235535 2056626 1761232 1231024 788931 672184 825927 1456887 2895692 4414299 4156936 1349014
-20 1349014 -1935325 -2623869 -430036 1513673 483009 -2440943 -3936022 -2728469 -759111 -11899
-10 -11899 162492 1556460 4021122 5410490 4445574 2250182 627921 -94330 -735263 -1565949 -2054993
0 -2054993 -2036958 -1981773 -1892602 -985301 875732 2190794 1338781 -1074833 -2419919 -986311 1914296
11 1914296 3333793 1856974 -1109077 -3019225 -2629994 -792300 616146 302620 -1498444 -3294646
$$ packed form
-63c6028K068510M6076j805526j046433N26382L79179q01382p43636M57525O81655m29428
-52g03106p83228M90388J210030l99628k327049j347869J831809K913345M0999l126314k167692
-41d368315J979332M163380J819910j948808k789628m70442J740002J734754N27565j52215
-31B235535j78909k95394n30208m42093j16747J53743O30960J438805J518607k57363k807922
-20A349014l284339o88544K193833J943709j030664k923952j495079J207553J969358P47212
-10a1899J74391J393968K464662J389368r64916k195392j622261p22251o40933q30686m89044
0b054993J8035N5185Q9171R07301J861033J315062q52013k413614j345086J433608K900607
11A914296J419497j476819k966051j910148L89231J837694J408446l13526j801064j796202
$$ plain form
21 -3294646 -3644395 -2448340 -912730 -174572 -227212 -422327 -637738 -1290205 -2233275 -2464227 -1423060
32 -1423060 -50421 210704 -671449 -1187918 -269286 1288920 1856302 956830 -384684 -1004056 -560165
43 -560165 793268 2748008 4410924 4351601 2056058 -892041 -2091014 -1030596 291897 -34005 -1324998
54 -1324998 -1288703 786712 2955076 3057986 1342960 -131046 -207706 237796 -99046 -1158439 -1825964
65 -1825964 -1444482 -306162 1141687 2832633 4709298 6502652 8378990 11450881 16930174 24491178
75 24491178 31680307 35226564 33207349 26374261 17780487 10990976 7945560 7911496 8435509 7581096
85 7581096 5387964 3227759 2046814 1600974 1275691 1026694 1134564 1388631 1103816 1538 -1342090
96 -1342090 -2099177 -1956217 -1114946 127846 1417401 2143735 1748086 394337 -1013064 -1740134 -1948944
$$ packed form
21c294646l49749J196055J535610P38158n2640j95115k15411o52467r43070k30952J041167
32a423060J372639K61125q82153n16469R18632J558206N67382q99472j341514o19372M43891
43e60165J353433J954740J662916n9323k295543k948099j198973J060418J322493l25902j290993
54a324998L6295K075415K168364J02910j715026j474006p6660M45502l36842j059393o67525
65a825964L81482J138320J447849J690946J876665J793354J876338L071891N479293P561004
75B4491178P189129L546257k019215o833088q593774o789511l045416l4064N24013q54413
85G581096k193132k160205j180945m45840l25283k48997J07870K54067k84815j102278j343628
96a342090p57087J42960Q41271J242792J289555P26334l95649j353749j407401p27070k08810
$$ plain form
107 -1948944 -2258474 -2752155 -2789625 -1835674 -204893 1094079 1076059 -596828 -3259572 -5303999 -5093496
118 -5093496 -2480610 624336 1820635 615695 -1154080 -1573245 -834790 -606523 -1549232 -2407712 -1810107
129 -1810107 -129551 1138270 1350868 1140730 974197 372878 -945187 -2007039 -1625389 -185161 627572
140 627572 -7014 -1093408 -1475017 -1530360 -2267096 -3251656 -2807161 -511528 1750400 2100591 1222383
151 1222383 1357353 3018488 4167164 3151295 1191383 768275 2216778 3441656 3056393 2219835
161 2219835 2497025 3150165 2214022 -63630 -755014 1951233 5791449 6728075 3781027 54727 -1280465
172 -1280465 -594000 -444695 -1666294 -2444142 -1300764 569116 897965 -562463 -1817853 -1422937 -353162
183 -353162 -569170 -2412421 -4197918 -4202461 -2404370 -198566 1074159 1093429 484282 164861 592749
$$ packed form
107a948944l09530m93681l7470R53951J630781J298972j8020j672887k662744k044427K10503
118e093496K612886L104946J196299j204940j769775m19165P38455K28267r42709q58480N97605
129a810107J680556J267821K12598k10138j66533o01319j318065j061852L81650J440228Q12733
140F27572o34586j086394l81609n5343p36736r84560M44495K295633K261928L50191q78208
151A222383J34970J661135J148676j015869j959912m23108J448503J224878l85263q36558
161B219835K77190O53140r36143k277652o91384K706247L840216R36626k947048l726300j335192
172a280465O86465J49305j221599p77848J143378J869880L28849j460428j255390L94916J069775
183c53162k16008j843251j785497m543J798091K205804J272725J9270o09147l19421M27888
$$ plain form
194 592749 1323615 1378050 302106 -1212821 -2055316 -1964129 -1657940 -1652815 -1534337 -837557 -189809 -742300
206 -742300 -2411617 -3531320 -2819157 -1183026 -738868 -2096853 -3489577 -3002783 -1038399 175758
216 175758 -688226 -2603206 -3584163 -2815530 -926755 1252847 3285055 4488519 3737624 702527 -2981673
227 -2981673 -4631806 -3008017 345257 2511526 1886867 -616180 -2777219 -3133509 -1904993 -318696
237 -318696 638363 872147 900920 1111798 1301976 941908 -84778 -1025106 -632210 1896018 6239043
248 6239043 11057422 14666888 15766725 13964781 10044865 5770963 3014043 2549755 3486509 4002238
258 4002238 2893007 559432 -1469809 -1958383 -937220 574944 1592938 1826988 1551522 1189483
268 1189483 1157180 1803858 3049665 4034959 3593020 1502648 -874919 -1731070 -769485 354359 -90665
$$ packed form
194E92749P30866N4435j075944j514927q42495R1187L06189N125J18478O96780O47748n52491
206g42300j669317j119703P12163J636131M44158j357985j392724M86794J964384J214157
216A75758q63984j914980r80957P68633J888775K179602K032208J203464p50895l035097l684200
227b981673j650133J623789L353274K166269o24659k503047k161039l56290J228516J586297
237c18696R57059K33784K8773K10878J90178l60068j026686r40328L92896K528228M343025
248F239043M818379L609466J099837j801944l919916m273902k756920m64288R36754N15729
258D002238j109231k333575k029241m88574J021163J512164J017994K34050k75466l62039
268A189483l2303O46678J245807R85294m41939k090372k377567q56151R61585J123844m45024
$$ plain form
279 -90665 -1857595 -3072015 -2576483 -1219940 -448330 -272706 434038 1744782 1965705 -139043 -3100143
290 -3100143 -3931389 -1676422 1290073 2140765 997631 345771 1266511 1680018 -841189 -5346894 -7944679
301 -7944679 -6108157 -1552518 1762284 1856381 173591 -832346 -433531 405820 888011 1219387 1737114
312 1737114 2127487 1943603 1406437 1125447 1177922 1003680 294720 -474805 -698511 -518035 -615944 -1168460
324 -1168460 -1438201 -643820 980404 2280112 2303847 1126394 -430610 -1624837 -2183594 -2078915 -1267774
335 -1267774 220073 2099044 3905951 5249150 5903717 5732014 4712408 3149639 1726004 1109365
345 1109365 1390385 1959419 2041238 1388383 436328 -209012 -379093 -404890 -612816
354 -612816
$$ packed form
279i0665j766930j214420M95532J356543P71610J75624P06744J310744K20923k104748k961100
290c100143q31246K254967K966495Q50692j143134o51860R20740M13507k521207m505705k597785
301g944679J836522M555639L314802R4097j682790j005937L98815Q39351M82191L31376N17727
312A737114L90373j83884n37166k80990N2475j74242p08960p69525k23706J80476r7909n52516
324a168460k69741P94381J624224J299708K3735j177453j557004j194227n58757J04679Q11141
335a267774J487847J878971J806907J343199O54567j71703j019606j562769j423635o16639
345A109365K81020N69034Q1819o52855r52055o45340j70081k5797k07926
354f12816
##END=	
