##TITLE=Estratto tot, 10mg/mL, +10% D2O, 25 °C
##JCAMPDX= 6.0         $$ Bruker NMR JCAMP-DX V2.0
##DATA TYPE= NMR FID
##DATA CLASS= NTUPLES
##ORIGIN= Bruker BioSpin GmbH
##OWNER= nmrsu
##LONG DATE= 2020/01/31 14:02:21+0000
$$ 1.90.2.4 TopSpin 3.6.1
$$ 2020-04-07 17:15:35.806 +0200  nmrsu@CZC5192CCN
$$ Compression mode = diff/dup
##.OBSERVE FREQUENCY= 600.1328185
##.OBSERVE NUCLEUS= ^1H
##.DELAY= (23.1043, 23.1043)
##.ACQUISITION MODE= SIMULTANEOUS (DQD)
##.ACQUISITION SCHEME= undefined
##.AVERAGES= 256
##.DIGITISER RES= 22
##SPECTROMETER/DATA SYSTEM= spect
##.PULSE SEQUENCE= noesygppr1d
##.SOLVENT NAME= H2O+D2O
##.SHIFT REFERENCE= INTERNAL, H2O+D2O, 1, 14.98232
##AUDIT TRAIL= $$ (NUMBER, WHEN, WHO, WHERE, PROCESS, VERSION, WHAT)
$$ ##TITLE= Audit trail, TopSpin 3.6.1
$$ ##JCAMPDX= 5.01
$$ ##ORIGIN= Bruker BioSpin GmbH
$$ ##OWNER= nmrsu
$$ $$ C:/Bruker/TopSpin3.6.1/data/nmrsu/nmr/Estratti_Rego/1/audita.txt
$$ ##AUDIT TRAIL=  $$ (NUMBER, WHEN, WHO, WHERE, PROCESS, VERSION, WHAT)
(   1,<2020-01-31 15:02:22.538 +0100>,<nmrsu>,<CZC5192CCN>,<go4>,<TopSpin 3.6.1>,
      <created by zg
	started at 2020-01-31 14:28:54.928 +0100,
	POWCHK enabled, PULCHK disabled,
       configuration hash MD5:
       C8 E9 E3 2E 96 28 5A AD 8C 0A C3 D5 06 4A AF FD
       data hash MD5: 64K
       C3 9E 02 84 95 95 59 B5 47 FA C2 70 CA 50 A6 AB>)
$$ ##END=
$$ 
$$ $$ hash MD5
$$ $$ 46 10 7A 3E 85 91 6B D0 F5 C1 F4 EC EF C3 CF AD
##$RELAX= 
##$RELAX= 
##$RELAX= 
##$RELAX= 
##$RELAX= 
##$RELAX= 
##$RELAX= 
##$RELAX= 
$$ Bruker specific parameters
$$ --------------------------
##$DATPATH= <C:\Bruker\TopSpin3.6.1\data\nmrsu\nmr>
##$EXPNO= 1
##$NAME= <Estratti_Rego>
##$PROCNO= 1
##$ACQT0= -4.89559463790455
##$AMP= (0..31)
100 100 100 100 100 100 100 100 100 100 100 100 100 100 100 100 100 100
100 100 100 100 100 100 100 100 100 100 100 100 100 100
##$AMPCOIL= (0..19)
-1 0 0 0 0 0 0 0 0 0 0 0 0 0 0 0 0 0 0 0
##$ANAVPT= -1
##$AQSEQ= 0
##$AQ_mod= 3
##$AUNM= <au_prof1d>
##$AUTOPOS= <4 >
##$BF1= 600.13
##$BF2= 600.13
##$BF3= 600.13
##$BF4= 600.13
##$BF5= 600.13
##$BF6= 600.13
##$BF7= 600.13
##$BF8= 600.13
##$BWFAC= (0..63)
0 0 0 0 0 0 0 0 0 0 0 0 0 0 0 0 0 0 0 0 0 0 0 0 0 0 0 0 0 0 0 0 0 0 0 0
0 0 0 0 0 0 0 0 0 0 0 0 0 0 0 0 0 0 0 0 0 0 0 0 0 0 0 0
##$BYTORDA= 0
##$CAGPARS= (0..11)
0 0 0 0 0 0 0 0 0 0 0 0
##$CHEMSTR= <none>
##$CNST= (0..63)
1 1 145 1 1 1 1 1 1 1 1 1 1 1 1 1 1 1 1 1 1 1 1 1 1 1 1 1 1 0.75 1 1 1
1 1 1 1 1 1 1 1 1 1 1 1 1 1 1 1 1 1 1 1 1 1 1 1 1 1 1 1 1 1 1
##$CPDPRG= (0..8)
<> <> <> <> <mlev16> <mlev16> <mlev16> <mlev16> <mlev16>
##$D= (0..63)
0 5 0 0 0 0 0 0 0.01 0.06 0 0.03 2e-005 0 0 0 0.0002 0 0 0 0 0 0 0 0 0
0 0 0 0 0 0 0 0 0 0 0 0 0 0 0 0 0 0 0 0 0 0 0 0 0 0 0 0 0 0 0 0 0 0 0 0
0 0
##$DATE= 1580479341
##$DE= 23.10435
##$DECBNUC= <off>
##$DECIM= 1620
##$DECNUC= <off>
##$DECSTAT= 4
##$DIGMOD= 3
##$DIGTYP= 12
##$DQDMODE= 0
##$DR= 22
##$DS= 4
##$DSPFIRM= 4
##$DSPFVS= 21
##$DTYPA= 0
##$EXP= <AC_NOESYGPPR1D>
##$FCUCHAN= (0..9)
0 2 0 0 0 0 0 0 0 0
##$FL1= 90
##$FL2= 90
$$ [...]
##$VDLIST= <>
##$VPLIST= <>
##$VTLIST= <>
##$WBST= 1024
##$WBSW= 8
##$XGAIN= (0..3)
0 0 0 0
##$XL= 0
##$YL= 0
##$YMAX_a= 27947096
##$YMIN_a= -28008097
##$ZGOPTNS= <-DFLAG_BLK>
##$ZL1= 120
##$ZL2= 120
##$ZL3= 120
##$ZL4= 120
##$scaledByNS= no
##$scaledByRG= no
##$ABSF1= 10
##$ABSF2= 0
##$ABSG= 3
##$ABSL= 5
##$ALPHA= 0
##$AQORDER= 0
##$ASSFAC= 0
##$ASSFACI= 0
##$ASSFACX= 0
##$ASSWID= 0
##$AUNMP= <proc_prof1d>
##$AXLEFT= 0
##$AXNAME= <>
##$AXNUC= <off>
##$AXRIGHT= 0
##$AXTYPE= 0
##$AXUNIT= <>
##$AZFE= 0.1
##$AZFW= 0.1
##$BCFW= 1
##$BC_mod= 2
##$BYTORDP= 0
##$COROFFS= 0
##$CY= 100
##$DATMOD= 1
##$DC= 2
##$DFILT= <>
##$DTYPP= 0
##$ERETIC= no
##$F1P= 12
##$F2P= -0.5
##$FCOR= 0.5
##$FTSIZE= 65536
##$FT_mod= 0
##$GAMMA= 1
##$GB= 0
##$INTBC= 1
##$INTSCL= 1
##$ISEN= 128
##$LB= 0.5
##$LEV0= 0
##$LPBIN= 0
##$MAXI= 10000
##$MC2= 0
##$MEAN= 0
##$ME_mod= 0
##$MI= 0
##$MddCEXP= no
##$MddCT_SP= no
##$MddF180= no
##$MddLAMBDA= 0
##$MddMEMORY= 0
##$MddMERGE= 23
##$MddNCOMP= 0
##$MddNITER= 0
##$MddNOISE= 0.8
##$MddPHASE= 0
##$MddSEED= 0
##$MddSRSIZE= 0
##$Mdd_CsALG= 0
##$Mdd_CsLAMBDA= 1
##$Mdd_CsNITER= 0
##$Mdd_CsNORM= 0
##$Mdd_CsVE= yes
##$Mdd_CsZF= 0
##$Mdd_LrLAMBDA= 0
##$Mdd_LrNITER= 0
##$Mdd_LrRANK= 0
##$Mdd_LrZF= 0
##$Mdd_mod= 0
##$NCOEF= 0
##$NC_proc= 0
##$NLEV= 6
##$NOISF1= 7.934625
##$NOISF2= 7.601621
##$NSP= 1
##$NTH_PI= 0
##$NZP= 0
##$OFFSET= 14.98232
##$PC= 1
##$PHC0= -31.89331
##$PHC1= 17.30737
##$PH_mod= 1
##$PKNL= yes
##$PPARMOD= 0
##$PPDIAG= 0
##$PPIPTYP= 0
##$PPMPNUM= 100
##$PPRESOL= 1
##$PSCAL= 4
##$PSIGN= 0
##$PYNMP= <proc.py>
##$RDF1= 0
##$RDF2= 0
##$RDFWHM= 0
##$RDINT= 0
##$RDPOS= 0
##$REVERSE= no
##$SF= 600.13
##$SI= 65536
##$SIGF1= 9
##$SIGF2= 5
##$SINO= 400
##$SIOLD= 65536
##$SPECTYP= <>
##$SREF_mod= 1
##$SREGLST= <1H.D2O>
##$SSB= 2
##$STSI= 0
##$STSR= 0
##$SW_p= 12345.6790123457
##$SYMM= 0
##$S_DEV= 0
##$TDeff= 0
##$TDoff= 0
##$TI= <Cannella CZ3H 15mg/mL, D2O, pD 7.6, TSP 1mM, 25 Â°C

>
##$TILT= no
##$TM1= 0
##$TM2= 0
##$TOPLEV= 0
##$USERP1= <>
##$USERP2= <>
##$USERP3= <>
##$USERP4= <>
##$USERP5= <>
##$WDW= 1
##$XDIM= 8192
##$YMAX_p= 0
##$YMIN_p= 0
##$CURPLOT= <HP LaserJet P2015 Series PCL 6>
##$CURPRIN= <$HP LaserJet P2015 Series PCL 6>
##$DFORMAT= <normdp>
##$LAYOUT= <+/1D_H.xwp>
##$LFORMAT= <normlp>
##$PFORMAT= <normpl>
$$ End of Bruker specific parameters
$$ ---------------------------------
##NTUPLES= NMR FID
##VAR_NAME=  TIME,          FID/REAL,        FID/IMAG
##SYMBOL=    X,             R,               I
##VAR_TYPE=  INDEPENDENT,   DEPENDENT,       DEPENDENT
##VAR_FORM=  AFFN,          ASDF,            ASDF
##VAR_DIM=   32768,         32768,           32768
##UNITS=     SECONDS,       ARBITRARY UNITS, ARBITRARY UNITS
##FACTOR=    8.09999999999999e-005, 1,       1
##FIRST=     0,             4,               0
##LAST=      2.654127,      629,             -1023
##MIN=       0,             -28008097,       -28008097
##MAX=       2.654127,      27947096,        27947096
$$ Real data points
##PAGE= N=1
##DATA TABLE= (X++(R..R)), XYDATA
$$ [...]
23138a591f85d5E4N79K61B73d72m56l85G44Q0f89A637f76n47a94l39a61A718C01
$$ -1591 -685 -45 54 633 894 273 -472 -928 -1313 744 824 -689 1637 -676 -1223 -194 -533 -161 1718 301
23159a104M80b63k24D22d62B43%J52f87C86b12F59A01N88g68j82B31E1i51G8c86
$$ -1104 -624 -263 -487 422 -462 243 243 395 -687 386 -212 659 101 689 -768 -950 231 51 -951 78 -386
23181B23c12F87d46A38a417b03l85j103a99A17a63l4D92e04A150f29A309F4c37
$$ 223 -312 687 -446 138 -1417 -203 -588 -1691 -199 117 -163 -197 492 -504 1150 -629 1309 64 -337
23201A55d8j45Fd95b05l33C74M22a12G99a675N04A040a322j96D05f4B18A08O96
$$ 155 -48 -193 6 -495 -205 -538 374 796 -112 799 -1675 -1171 1040 -1322 -1518 405 -64 218 108 804
23221H04C13j24I4c16j05F1M35a50A010A79a525E5a71k26b1o07j307Q00M18K44
$$ 804 313 189 94 -316 -421 61 496 -150 1010 179 -1525 55 -171 -397 -21 -628 -1935 -1135 -717 -473
23241d73b7F04%k14a08p61L39A44Q13f6k92j271a18F69q7B17O95a005b67P2A596
$$ -473 -27 604 604 390 -108 -869 -530 144 957 -66 -358 -1629 -118 669 582 217 912 -1005 -267 -195 1596
23263A344i2j33k43P9J49H76P11A8i19R9b60L4d2j050D28O4h58J39B9N48A55L72
$$ 1344 -92 -225 -468 -389 -240 876 1587 18 -919 -820 -260 -226 -42 -1092 428 492 -858 -719 29 577 155 527
23285E27C4b36a10o73c05c4m9C07h07k14m24A011f93D37K09J002k27E9K69f8o28
$$ 527 34 -236 -110 -783 -305 -34 -83 307 -807 -1021 -1445 1011 -693 437 646 1648 1421 59 328 -68 -696
23306f96C94e58N8H41c97J20k75J2j154a41j67m54n0F09h47b39J10m26k15c00
$$ -696 394 -558 -500 841 -397 -277 -552 -540 -1694 -141 -308 -762 -812 609 -847 -239 -129 -555 -770 -300
23327c08C7c59D37a40A105a028B35L40J20a463D22b9C24L98J22g40Q2a6l03k78
$$ -308 37 -359 437 -140 1105 -1028 235 575 695 -1463 422 -29 324 722 844 -740 -658 -16 -319 -597
23347e97k31K5@g0l07J46m48K48k23a92k94J68j234f56I13m34L90d35a26l79m53
$$ -597 -828 -803 0 -70 -377 -231 -679 -431 -654 -192 -486 -318 -1552 -656 913 479 869 -435 -126 -505 -958
23368i58C61I0AL68e49G27L45e16B31L87j15i01D35f45a26A225m24f0m70E59c8
$$ -958 361 90 1 369 -549 727 1072 -516 231 618 503 -901 435 -645 -126 1225 801 -60 -530 559 -38
23390g42G86p1a73C64j60a21E60a469c17F54a640d04m81n6D69d0l22H69b24H41
$$ -742 786 715 -173 364 204 -121 560 -1469 -317 654 -1640 -404 -885 -941 469 -40 -362 869 -224 841
23411a832H36a1D44c47n14c00A92k9Q2J051l83n5a194G01i87a76B48K5J60N49
$$ -1832 836 -11 444 -347 -861 -300 192 163 245 1296 913 858 -1194 701 -987 -176 248 273 433 982
23431I82g91C12ak19K8F60f95L24A00M8a27r06a13q33F36H7L15e16A328a93m69
$$ 982 -791 312 -1 -220 -192 660 -695 -371 100 148 -127 -1033 -113 -946 636 87 402 -516 1328 -193 -662
23452f62n17DL37c47C74a58E45j06b1j533O64A05L05d88D2a229d49A104h35a32
$$ -662 -1179 4 341 -347 374 -158 545 439 -21 -1554 -890 105 410 -488 42 -1229 -449 1104 -835 -132
23473f07k81c97n56m9B8O22C11h01i0n02F46f59A44J95@a456g4o08K3C34L73G1
$$ -607 -888 -397 -953 -1002 28 650 311 -801 -90 -592 646 -659 144 339 0 -1456 -74 -682 -659 334 707 71
23496d5j10j390L58k56A305c79m00H70i20F1d94G89a9p11F6d77B83f74I38m36
$$ -45 -155 -1545 -1187 -1443 1305 -379 -779 870 -920 61 -494 789 -19 -730 66 -477 283 -674 938 502
23516E02p7d94l4q2H30c93B71e94B46i95M95F43j88f70L28F31k87k1I8M37f40
$$ 502 425 -494 -528 -610 830 -393 271 -594 246 -995 -500 643 455 -670 -342 631 344 323 98 535 -640
23538a551a25m27a63I1M06R33F08g06o95a96k75O3H03e9k14k84F37a2l50A557
$$ -1551 -125 -552 -163 91 497 1430 608 -706 -1401 -196 -471 -408 803 -59 -273 -557 637 -12 -362 1557
23559g05m86I3g85I82c99I5P15e8n60b87B56K45a054B12L81K88l57B31b35A124
$$ -705 -1191 93 -785 982 -399 95 810 -58 -618 -287 256 501 -1054 212 593 881 524 231 -235 1124
23580C62a002E44c75O4E34O8b68B73c59N2l93aF53g4H16f79p87e80K64E26M64
$$ 362 -1002 544 -375 -311 534 602 -268 273 -359 -307 -700 -1 653 -74 816 -679 -1466 -580 -316 526 990
23601I90E4O21d63n79A59d98A355a5l03j262c57j285c06a22j105e36J58F5J64
$$ 990 54 675 -463 -1042 159 -498 1355 -15 -318 -1580 -357 -1642 -306 -122 -1227 -536 -378 65 229
23620B29K74o8g06o04c55F7J50D4J373n48j42k92h2r5n49A145l04J42a93Ga519
$$ 229 503 435 -706 -1310 -355 67 217 44 1417 869 727 435 -82 -177 -726 1145 841 983 -193 7 -1519
23642G90A55K69J25b57k98D35A0L66i70J19b52A51c92l06I33P5p8l39i2l70C69
$$ 790 155 424 549 -257 -555 435 10 376 -970 -851 -252 151 -392 -698 933 1008 930 591 -92 -462 369
23664b76q34E01a164A98f73a38C17bH67ij380O81E27k25Q11E11K08D8M48A55B8
$$ -276 -1110 501 -1164 198 -673 -138 317 -2 867 -9 -1389 -708 527 302 1113 511 719 48 496 155 28
23686b83A062C32Q2j28K73Qk23K60kd05m04c58D73O53N78f53C1M38a146F42d55
$$ -283 1062 332 414 286 559 567 344 604 602 -405 -809 -358 473 1126 1704 -653 31 469 -1146 642 -455
23708A21a090B31P68D52J51j86d9n62E62h0r62b65H84H0J24P0a49E56j91b12F76
$$ 121 -1090 231 999 452 603 417 -49 -611 562 -80 -1042 -265 884 80 204 274 -149 556 365 -212 676
23730b29n40L39E21b79j52c9E15O1B74LJ1a817D43J119I2i51m80O02A375F69A45
$$ -229 -769 -430 521 -279 -431 -39 515 576 274 277 288 -1817 443 1562 92 -951 -1431 -829 1375 669 145
23752h1C27d45E46O3f01A080b24k29E12i3k45c7A17L94A57K58a93Nj536A256c39
$$ -81 327 -445 546 609 -601 1080 -224 -453 512 -93 -338 -37 117 511 157 415 -193 -188 -1724 1256 -339
23774d11p81A73a44r63D88e53B49B4L5d96b06n12B42g69a18E93f23J91E7Q3R59
$$ -411 -1192 173 -144 -1107 488 -553 249 24 59 -496 -206 -718 242 -769 -118 593 -623 -432 57 140 1099
23795A099e60b6G9N63a016I9Q2d58A87J84i95B37g28A113Qa108A102e09E46a286
$$ 1099 -560 -26 79 642 -1016 99 181 -458 187 371 -995 237 -728 1113 1121 -1108 1102 -509 546 -1286
23816a23A063n28d98P9a48B81N26a38j74B57A24a0m32C73c08n32b7r34K85D20
$$ -123 1063 535 -498 -419 -148 281 807 -138 -312 257 124 -10 -442 373 -308 -840 -27 -961 -676 420
23837I81a60b4C16J2KM86j72eC32M30k19j67M79l14B7Q16c19l79B60k5K48A75
$$ 981 -160 -24 316 328 330 816 644 -5 332 762 543 376 855 541 27 843 -319 -698 260 235 483 175
23860a163D71a561N50A344E34k30EL78a374a03j33I4A1d22C12O59a87D66L73L98
$$ -1163 471 -1561 -1011 1344 534 304 5 383 -1374 -103 -236 94 11 -422 312 971 -187 466 839 1237
23880A237bo70K82k76q19M39a4p48A45g94C9g06A67K92j13d92B87b35l89D73J181
$$ 1237 -2 -672 -390 -666 -1485 -1046 -14 -762 145 -794 39 -706 167 459 346 -492 287 -235 -624 473 1654
23901A654A65J167B05l7J15c2k21A049i27A36g21k51N8a25E87g77K73G66a134
$$ 1654 165 1332 205 168 283 -32 -253 1049 -927 136 -721 -972 -914 -125 587 -777 -504 766 -1134
23921C00f6c0l21J49m89j31b64l72E18N1c88C80j12G7J321b5C35b42a01B95a80
$$ 300 -66 -30 -351 -202 -691 -822 -264 -636 518 569 -388 380 268 77 1398 -25 335 -242 -101 295 -180
23943a818A598F56K24a205E6K26A1M46m6M98b8j31p32K73G22i46K07m83A38d27
$$ -1818 1598 656 880 -1205 56 282 11 457 411 909 -28 -159 -891 -618 722 -946 -739 -1222 138 -427
23964F55c08R6A177E2N2f77o98A829J73F07b08l03k024i07d34D8K17J199b81m54
$$ 655 -308 -212 1177 52 104 -677 -1375 1829 2002 607 -208 -511 -2535 -907 -434 48 265 1464 -281 -735
23984g35E17a98p24D13Dd23m86j06c59a75B00f41C2N8c20k09L8D00j08a377A074
$$ -735 517 -198 -922 413 4 -423 -909 -1015 -359 -175 200 -641 32 90 -320 -529 -491 400 292 -1377 1074
24006B0b77D83b55A086e58m8F65d67B88Q31c00F22A33J49c08F46e62E01J69d80
$$ 20 -277 483 -255 1086 -558 -606 665 -467 288 1119 -300 622 133 282 -308 646 -562 501 670 -480
24027b61j031C00M43n6C41b00I6L26K85d10m59h8C22g8j95M3A77b77B76a178o46
$$ -261 -1292 300 743 687 341 -200 96 422 707 -410 -869 -88 322 -78 -273 -230 177 -277 276 -1178 -1824
24048a824f81n24G09B97L78f86n69D52h11l08K60b45A63H1L22J3d33j29C52M1
$$ -1824 -681 -1205 709 297 675 -686 -1255 452 -811 -1119 -859 -245 163 81 403 416 -433 -562 352 393
24068C93I2d0m96J22C84b47A82i6p66c48A05O19K60a374C11J4O24b22G93B91R55
$$ 393 92 -40 -536 -414 384 -247 182 -96 -862 -348 105 724 984 -1374 311 325 949 -222 793 291 1246
24089A246a074K50l02fE21d75p53A55a270R9E22M60C36d59o78l73d94m05F91J5
$$ 1246 -1074 -824 -1126 -6 521 -475 -1228 155 -1270 -1171 522 982 336 -459 -1137 -1510 -494 -899 691 706
24109G06C17g2b1B9f2m02F83k71N04l59B12a214B5Q78d91D88K37a168e61E97d68
$$ 706 317 -72 -21 29 -62 -464 683 412 916 557 212 -1214 25 903 -491 488 725 -1168 -561 597 -468
24131B8d51R2m90D63B23g41A142g24R1b30n99B78a51p36J51E0J78m4C9a058b34
$$ 28 -451 -359 -849 463 223 -741 1142 -724 -633 -230 -829 278 -151 -887 -736 50 228 184 39 -1058 -234
24153a499B50g41H35d59k94b40E76j33g32n04N98j11G89N54C38@A015A36J093
$$ -1499 250 -741 835 -459 -753 -240 576 443 -732 -1236 -638 -749 789 1343 338 0 1015 136 1229
24172A229l14d0A045D25A71e88Q3D28d61B10M98B50a51F64j68I1O21b09B07h2
$$ 1229 915 -40 1045 425 171 -588 -505 428 -461 210 708 250 -151 664 496 91 712 -209 207 -82
24193h46c8o22a3j325g5k39o57I2g1F97lm3G3a207G6a99OD43M39a186F81B13a0
$$ -846 -38 -660 -13 -1338 -75 -314 -971 92 -71 697 694 651 73 -1207 76 -199 -193 443 882 -1186 681 213 -10
24217F89a23n34K02G28A24K5a053D86a128D80a71n7B48n9d83J35m89q39d61P7
$$ 689 -123 -657 -455 728 124 149 -1053 486 -1128 480 -171 -228 248 189 -483 -348 -837 -1676 -461 -384
24237c84H07L06D40d12A46a06I19q5k61P74c70G14a197d71I97K41J33a8j076e6
$$ -384 807 1113 440 -412 146 -106 919 834 573 1347 -370 714 -1197 -471 997 1238 1371 -18 -1094 -56
24258a843d1j1j57A7M35hB63D2c55D31A88h51B95M10O22E51n1b48q07d73j12D00
$$ -1843 -41 -52 -209 17 452 -8 263 42 -355 431 188 -851 295 705 1327 551 500 -248 -1055 -473 -585 400
24281fE69g50p6K11R1D48r7K79k58JM2r4g16h3l11G46a7k54A7a859A266o19A16
$$ -6 569 -750 -826 -615 -524 448 351 630 372 373 415 321 -716 -83 -394 746 -17 -271 17 -1859 1266 647 116
24305H1N53h63B82K46C4J015D44R35e24q53M44L82m84D92A65k8C3a60E51a57B37
$$ 81 634 -863 282 528 34 1049 444 1379 -524 -1377 -933 -551 -1035 492 165 137 33 -160 551 -157 237
24327c53F73A25M63J03f33A27M2L10b3A255o24k48E4a72E15a41H76m30J155b92
$$ -353 673 125 588 691 -633 127 169 479 -23 1255 631 383 54 -172 515 -141 876 446 1601 -292
24348F57j91a148b03B38L14K25r6j86J96Ea41G20g2B98A14L50A82L80e61C76e55
$$ 657 466 -1148 -203 238 552 777 681 495 691 5 -141 720 -72 298 114 464 182 562 -561 376 -555
24370e93A08g62I97D38N93b14D09d1F9J52e92o13A151D53j68a099E67J1b54D67
$$ -593 108 -762 997 438 1031 -214 409 -41 69 221 -592 -1205 1151 453 285 -1099 567 578 -254 467
24391g91A95a542C18J83M99M8R73d39m84G54k68M4j91K85B0R36e43F4M33a43D94
$$ -791 195 -1542 318 501 1000 1048 2021 -439 -923 754 486 530 339 624 20 956 -543 64 497 -143 494
24413g23D36b98A470E31B61O78e18K57B29l6J020b24C76d67i0G5e75B14e52G00
$$ -723 436 -298 1470 531 261 939 -518 -261 229 193 1213 -224 376 -467 -90 75 -575 214 -552 700
24434D09M7g66H10a42k39O3A66O20b65j0H93C75JK98h79C04O0c1B86M70j52j44
$$ 409 456 -766 810 -142 -381 -318 166 786 -265 -275 893 375 376 674 -879 304 364 -31 286 756 604 460
24456D60M32a07I4P92e96E53g04K42k89a04I84a134E67R15B59g84p6c94A49F8
$$ 460 892 -107 94 886 -596 553 -704 -462 -751 -104 984 -1134 567 1482 259 -784 -860 -394 149 68
24477H47K20j0D04n5J130F20j27f25A077f50d4A307N2n23J78f99m7c62o41E83
$$ 847 1067 1057 404 349 1479 620 493 -625 1077 -650 -44 1307 1359 836 1014 -699 -746 -362 -1003 583
24498A987I2a261b75l45J01g9F67l05b9gm9l25K8D44J36j45h05B87A34E8i93c51
$$ 1987 92 -1261 -275 -620 -519 -79 667 362 -29 -7 -56 -381 -353 444 580 435 -805 287 134 58 -993 -351
24521e9j90c4m4B21e03b43A15L18a167j17D24g78D28L20Q60e44K70k4j063c02
$$ -59 -249 -34 -78 221 -503 -243 115 433 -1167 -1284 424 -778 428 748 1608 -544 -274 -298 -1361 -302
24542c20C81E9Qf13A130n43QJ22b26m34e7A244B76K01L05K01l98h12D08M33e37
$$ -320 381 59 67 -613 1130 587 595 717 -226 -660 -57 1244 276 477 782 983 585 -812 408 841 -537
24564I7a19p95B4J136l20L15h40c52n32b81C64h93C21A53n3J86c3p04a56A443
$$ 97 -119 -914 24 1160 840 1155 -840 -352 -884 -281 364 -893 321 153 100 286 -33 -737 -156 1443
24585G80HR19b76f1n84A080A00a01C31a515b80G98K34i2q53C54A50b15g1q0G7
$$ 780 8 927 -276 -61 -645 1080 100 -101 331 -1515 -280 798 1032 -92 -945 354 150 -215 -71 -151 77
24607b7B44O85M72B70a037d73q93f76J33A057b63j48C54b24r63c00a01l4k4o25
$$ -27 244 929 1401 270 -1037 -473 -1366 -676 -543 1057 -263 -411 354 -224 -1187 -300 -101 -135 -159 -784
24627g84a4E84f1l84M9A17f36q32d76a42a0B49b3o82A240d25j350h22E99g89a5
$$ -784 -14 584 -61 -445 -396 117 -636 -1468 -476 -142 -10 249 -23 -705 1240 -425 -1775 -822 599 -789 -15
24649G00a2q43d0r9A41M46M50m07a97j255I5J296l4a051nd73D3g26A66K19f75
$$ 700 -12 -855 -40 -139 141 587 1037 630 -197 -1452 95 1391 1357 -1051 -1056 -473 43 -726 166 385 -675
24671D7K12g39f9A4M54j92a54j25A58K03L07f29r60f46L07B01e53G77k71J14b3
$$ 47 259 -739 -69 14 468 276 -154 -279 158 361 668 -629 -1589 -646 -339 201 -553 777 506 620 -23
24693A475p14b37H68k04c04B75L93h9F16G4c77E07k2h74K85J84A05M02p3g76a91
$$ 1475 761 -237 868 664 -304 275 668 -89 616 74 -377 507 485 -874 -589 -405 105 507 434 -776 -191
24715b018f5ej27G2P25b14B63J394a082I2L68k23b32l14g6o07j7C80K7K01k56
$$ -2018 -65 -5 -132 72 797 -214 263 1657 -1082 92 460 237 -232 -546 -76 -683 -700 380 407 608 352
24736C52A0h11B42O14g46A00c07k76I7f08A59R61b49n41A21a182b38JF32l1a237
$$ 352 10 -811 242 856 -746 100 -307 -583 97 -608 159 1120 -249 -790 121 -1182 -238 -237 632 601 -1237
24758a504D88c89j615bG28k42d30J99M2P7I71L37f33A07g09E8h92C96Q00d30F31
$$ -1504 488 -389 -2004 -2 728 486 -430 -231 -189 -112 971 1308 -633 107 -709 58 -892 396 1196 -430 631
24780F34k62A26d38F94a68m4j88C31j22f6C3P61M26a184F20k82d57H60j78a36
$$ 634 372 126 -438 694 -168 -212 -400 331 209 -66 33 794 1220 -1184 620 338 -457 860 682 -136
24801A57c34D21g14G77l32K54r2a084M90A317c73A15K15J086b32l79C54J61c71
$$ 157 -334 421 -714 777 445 699 607 -1084 -594 1317 -373 115 330 1416 -232 -611 354 515 -371
24821c58I5e99q2I86a63k71E53L67H8a94G81a262C46N27h02n04H30J113r28J03
$$ -358 95 -599 -681 986 -163 -434 553 920 88 -194 781 -1262 346 873 -802 -1306 830 1943 1015 1118
24841A118C98ma031g3C3f71p81G62A5O0J66J158l59f1B84m9m0L15Q08A89J243
$$ 1118 398 394 -1031 -73 33 -671 -1452 762 15 75 241 1399 1040 -61 284 235 195 510 1318 189 1432
24862A432A32J064g01o13B07a287G06A89l3J422i10b23r13D30J271B07H5J210
$$ 1432 132 1196 -701 -1314 207 -1287 706 189 156 1578 -910 -223 -1136 430 1701 207 85 1295
24880A295B7b74j26I76N72B39a168b24b1j52A046B86N0C7a803h19B49j0a71B27
$$ 1295 27 -274 -400 976 1548 239 -1168 -224 -21 -173 1046 286 336 37 -1803 -819 249 239 -171 227
24901c86n22n02D34b12d6k02A043iI8O16N6f08b39G85B1a086I49B4L90A09f54
$$ -386 -908 -1410 434 -212 -46 -248 1043 -9 98 714 770 -608 -239 785 21 -1086 949 24 414 109 -654
24923a271N03b4j21A64m8a644f79F39B95g62J29B87R8h45j1b26m44c3G22N42c5
$$ -1271 -768 -24 -145 164 116 -1644 -679 639 295 -762 -633 287 385 -845 -856 -226 -670 -33 722 1264 -35
24945c65g0G75k57N44M9D21c52j04E02b11F82J57B05a144d30J12F91l32f40K64
$$ -365 -70 775 518 1062 1111 421 -352 -456 502 -211 682 839 205 -1144 -430 -318 691 359 -640 -376
24965c76j093J29E7M25A83b88J26l0A559A74C1N10K77J31k12b72I0b32H18J317
$$ -376 -1469 -1340 57 482 183 -288 -162 -192 1559 174 31 541 818 949 737 -272 90 -232 818 2135
24985B135e15F81b26D43j77d03J81C48g99j03l12K3C91P05c39k09K6C85K38L62
$$ 2135 -515 681 -226 443 266 -403 -222 348 -799 -902 -1214 -1191 391 1096 -339 -548 -522 385 623 985
25005I85k08a100e6B05i71r34R36G55j17h13E28g52a42H59j96c95E66c38N8m17
$$ 985 777 -1100 -56 205 -971 -1905 -969 755 638 -813 528 -752 -142 859 663 -395 566 -338 -280 -697
25025f97j21C8O18B12qp3f94D56A38e68K17a25l78A276d42F15J058a51I72a287
$$ -697 -818 38 656 212 204 131 -694 456 138 -568 -351 -125 -503 1276 -442 615 1673 -151 972 -1287
25046i7F50l3l0a4A257n06h28d8G33g0A141A28d2F1K66h13e4B65n5g70c62C40
$$ -97 650 617 587 -14 1257 751 -828 -48 733 -70 1141 128 -42 61 327 -813 -54 265 210 -770 -362 340
25069A290CJ34N8K29a014K97C82d08O6A619C43K3M69a276F2g60D95g24f4F67f27
$$ 1290 3 137 195 424 -1014 -717 382 -408 -342 1619 343 366 835 -1276 62 -760 495 -724 -64 667 -627
25091g38r6D84A70O44g64b7D84M50aj01l84m70q7A3M7a67J8m9j018a80F53A81
$$ -738 -834 484 170 814 -764 -27 484 934 -1 -102 -486 -956 -1043 13 60 -167 -149 -198 -1216 -180 653 181
25114I28h3C44L37B13e52B68@C00l1g58J01K94B54j17R33d2A53d59a04G64b02
$$ 928 -83 344 681 213 -552 268 0 300 269 -758 -657 -363 254 137 1070 -42 153 -459 -104 764 -202
25136A047d9o54k64j03D94J10L07q1k00a88I00b91A109K1a165c3C33a187B58e63
$$ 1047 -49 -703 -967 -1070 494 604 911 830 630 -188 900 -291 1109 1130 -1165 -33 333 -1187 258 -563
25157E04L42A52c53A80b18a1H10l20K6a70r71c71p0a19F86P1M73a131N34A156
$$ 504 846 152 -353 180 -218 -11 810 490 516 -170 -1141 -371 -441 -119 686 757 1230 -1131 -597 1156
25178b42l65D94d61o71C69P8a3AL17L07a606B16J8e05I36D23f36K46j267b67i8
$$ -242 -607 494 -461 -1132 369 447 -13 1 318 625 -1606 216 234 -505 936 423 -636 -390 -1657 -267 -98
25200F10p3b05I14e23p41b46H85c47q49C42i17L12a7n1q6G37C34a466gl34B74
$$ 610 537 -205 914 -523 -1264 -246 885 -347 -1196 342 -917 -605 -17 -68 -154 737 334 -1466 -7 -341 274
25222A235j05l07C74a126N53a62l38b46g6D6L98c19b8A239m61l88i5C79h19C18
$$ 1235 1130 823 374 -1126 -573 -162 -500 -246 -76 46 444 -319 -28 1239 778 390 -95 379 -819 318
25243C20e30J76A09L81R09c95C49a95F2L71j20K03d11H9M56A01h2A10a083a21
$$ 320 -530 -354 109 490 1399 -395 349 -195 62 433 313 516 -411 89 545 101 -82 110 -1083 -121
25264H26l45C3P29c98C89g5A310e85A112B39i4C85L1j46g94G38k54c47IN82a81
$$ 826 481 33 762 -398 389 -75 1310 -585 1112 239 -94 385 416 270 -794 738 484 -347 9 591 -181
25286I16f36B5J104D05K76c63j49E79j80j49K34a86C11a035a61C1a317F8a701
$$ 916 -636 25 1129 405 681 -363 -512 579 399 250 484 -186 311 -1035 -161 31 -1317 68 -1701
25306b8o37n45J56b26o59H32J3d91R1J28H16i26n29A452a60j176B70a51j148a45
$$ -28 -665 -1210 -1054 -226 -885 832 845 -491 -400 -272 816 -926 -1455 1452 -160 -1336 270 -151 -1299 -145
25327F03k80J50M16j51A59b90r35a23a3E03ij350L07A119g5m64l7F63a58o35F71
$$ 603 323 473 889 738 159 -290 -1225 -123 -13 503 -9 -1359 -1052 1119 -75 -539 -576 663 -158 -793 671
25349a092d89m11B29B7d06M0a20A075C50e1Lm05B73N40N74n73d75k26a22F95n1
$$ -1092 -489 -900 229 27 -406 -366 -120 1075 350 -51 -48 -453 273 813 1387 814 -475 -701 -122 695 644
25370F44@A488e11A26a289a11k52l47B99J42d61a54o63K07A127C77O25f32K34
$$ 644 0 1488 -511 126 -1289 -111 -363 -710 299 441 -461 -154 -817 -610 1127 377 1002 -632 -398
25389c98o8A08a286A50J204l93a87j25o55H50a196A91J40j7J44e3n14C97a40A52
$$ -398 -466 108 -1286 150 1354 961 -187 -312 -967 850 -1196 191 331 314 458 -53 -567 397 -140 152
25410A99P93a009k17C04a54j42D37a75k22r47B22A0Q47j86B51i37J98H13c47C
$$ 199 992 -1009 -1226 304 -154 -296 437 -175 -397 -1344 222 10 857 671 251 -937 -739 813 -347 3
25431I32j92f88b3A025l6g5q62J84K25a43O1B25b92E1R8O71A76d6l86A178f02
$$ 932 740 -688 -23 1025 989 -75 -937 -753 -528 -143 -82 225 -292 51 149 820 176 -46 -432 1178 -602
25453b6m29o58M66m63A162M92g71j01A01i54E6J49Q00a190e61a8C48O35b40E3
$$ -26 -455 -1113 -647 -1110 1162 1654 -771 -872 101 -954 56 205 1005 -1190 -561 -18 348 983 -240 53
25474B77a03j616b04G34h45A0d92j93A29M8g32o98F91j12k30L7a71B84g9A40N00
$$ 277 -103 -1719 -204 734 -845 10 -492 -685 129 177 -732 -1430 691 579 349 386 -171 284 -79 140 640
25495F40A69k4j6j2ek61E23E8J73n8Q28J15k70j81h91d22m65M01E61J6A78J02
$$ 640 169 145 129 117 -5 -266 523 58 231 173 1001 1116 846 665 -891 -422 -887 -486 561 577 178 280
25517B80h02K92C64e69a62j28J02A184a094a30C25i2H86C82a271H31a23lC30d59
$$ 280 -802 -510 364 -569 -162 -290 -188 1184 -1094 -130 325 -92 886 382 -1271 831 -123 -126 330 -459
25538a79a3A55i68B53c40D20Q38a60r80G59Q2L9b47E62e55H39A1R56a087C49a64
$$ -179 -13 155 -968 253 -340 420 1258 -160 -1140 759 841 880 -247 562 -555 839 11 967 -1087 349 -164
25560f40D37H2b146f96A32d11a62B5h37B73f12F37J7a23j11D68A53L78k4c44o35
$$ -640 437 82 -2146 -696 132 -411 -162 25 -837 273 -612 637 654 -123 -234 468 153 531 507 -344 -979
25581i79n6D29h68E31c6G92h75C3i78b08c1E6d1j085E40B49c99k22A15J84Q58
$$ -979 -1035 429 -868 531 -36 792 -875 33 -978 -208 -31 56 -41 -1126 540 249 -399 -621 115 299 1157
25602A157a73I13h75c43F61a106G06L17E5a162a00k70pI91l88k92g32B4e04k52
$$ 1157 -173 913 -875 -343 661 -1106 706 1023 55 -1162 -100 -370 -377 991 603 311 -732 24 -504 -756
25622g56O6A171f8l59H34g27E95O3k23F3J02K15j17M66j25c1D33a2p62R1F00O91
$$ -756 -690 1171 -68 -427 834 -727 595 658 435 63 165 380 263 729 604 -31 433 -12 -774 -683 600 1291
25644A291L28d92o50a70j2j793C76N84e09E3a635A18b99A577d43@A086C74a403
$$ 1291 1619 -492 -1142 -170 -182 -1975 376 960 -509 53 -1635 118 -299 1577 -443 0 1086 374 -1403
25664a93B98b27B26J56f59j88c57m00F11f75H06A48a94H01A74d54A07d08E65J39
$$ -193 298 -227 226 382 -659 -847 -357 -757 611 -675 806 148 -194 801 174 -454 107 -408 565 704
25684G04b68m38L07J49H77B6e46B6J219f33A519p09d18j63A63J083l8G9e59C73
$$ 704 -268 -706 -399 -250 877 26 -546 26 1245 -633 1519 810 -418 -581 163 1246 1208 79 -559 373
25705E50B43a693G12J51l72A93R80d5A46d7A07i10A262e21j47B12a66m61J94E56
$$ 550 243 -1693 712 863 491 193 1173 -45 146 -47 107 -910 1262 -521 -668 212 -166 -627 -433 556
25726f35k01D70B04g51E05d02J51e5m36C79N98c0l44A197c96K3A434g00C68J21
$$ -635 -836 470 204 -751 505 -402 -251 -55 -491 379 977 -30 -374 1197 -396 -373 1434 -700 368 489
25746D89p3p5M05f02L5K36q5a74el10A51J99c57H38b24p79J64P4a20k67r09c11
$$ 489 416 341 746 -602 -567 -331 -416 -174 -5 -315 151 350 -357 838 -224 -1003 -839 -765 -120 -387 -1296 -311
25769C90f97G8h96L69E48f33B69R00E51f58j8A33E1d95A62f68A49h2o02j74A57
$$ 390 -697 78 -896 -527 548 -633 269 1169 551 -658 -676 133 51 -495 162 -668 149 -82 -684 -858 157
25791C66f71F4b09D90M17a156H50R0e88A55o9Q09J5h3j78c7r56D32CL76c2k30
$$ 366 -671 64 -209 490 907 -1156 850 940 -588 155 86 895 910 -83 -261 -37 -993 432 3 379 -32 -262
25813b62a5q84H6J014l35J99b76A309n53l35b94A426A12g72p66f19H23L3a26c6
$$ -262 -15 -899 86 1100 765 964 -276 1309 756 421 -294 1426 112 -772 -1538 -619 823 856 -126 -36
25834a261e30D13J23a009B72b63RA7P48B90j0f15A94k4L07L22b1A75J127F34f91
$$ -1261 -530 413 536 -1009 272 -263 -254 17 765 290 280 -615 194 170 477 799 -21 175 1302 634 -691
25856B82a764A60h20j22E14k41M97e32E59C3K84M83A08f44a60l0B8h18a72F62
$$ 282 -1764 160 -820 -942 514 273 770 -532 559 33 317 800 108 -644 -160 -190 28 -818 -172 662
25877F46I4J034a72A651m69C10e30A44f79B55Q35e6A410e89A66g9o71c47C32A19
$$ 646 94 1128 -172 1651 1182 310 -530 144 -679 255 1090 -56 1410 -589 166 -79 -750 -347 332 119
25898B99k9A08c24p28A3Q02d53b02j11C6c1A540d50a16A00b94m98J93A669E06
$$ 299 270 108 -324 -1052 13 815 -453 -202 -313 36 -31 1540 -450 -116 100 -294 -792 -599 1669 506
25919C37a472L71d59H26C00d97A410a31p96J17g8A432Hd41m03p0I0a28I98k49
$$ 337 -1472 -1101 -459 826 300 -497 1410 -131 -927 -810 -78 1432 8 -441 -844 -914 90 -128 998 749
25939G49a51A63K01b34j167G37l58M29O81a244A61c22A37d35J88A357a75o41D03
$$ 749 -151 163 364 -234 -1401 737 379 808 1489 -1244 161 -322 137 -435 -247 1357 -175 -816 403
25959B35J4N07J26a28D60A88J34a33q67c94J94r15L89q30a61b1C27j45c90l93
$$ 235 249 756 882 -128 460 188 322 -133 -1000 -394 -200 -1115 -726 -1556 -161 -21 327 182 -390 -783
25979g83K44G28b85C17b5j138c49J51B114c46r19L62E73k76Q83C12g7B80i91D84
$$ -783 -539 728 -285 317 -25 -1163 -349 -198 2114 -346 -1265 -903 573 297 1180 312 -77 280 -991 484
26000h31B81Q75B75c33k38k97L76A52d73H19J51A79J26J57b43D15P66n50c82r55
$$ -831 281 1156 275 -333 -571 -868 -492 152 -473 819 970 179 305 462 -243 415 1181 631 -382 -1337
26020a337e55a06B96e09K21E08R2j93e40p60F85C3J71M07a5j191K98B087e10K35
$$ -1337 -555 -106 296 -509 -288 508 600 407 -540 -1300 685 33 204 611 -15 -1206 -908 2087 -510 -275
26040b75l01J59J91j07m70D2N28B03ni61j81L45f1D53K79h70n06J98E80b009c55
$$ -275 -576 -417 -226 -333 -803 42 570 203 198 -961 -1142 -797 -61 453 732 -870 -1376 -1178 580 -2009 -355
26062E85i82A695C10e66Q1J54A369A24d28j18I9J432N06C69b36f3k86k22C39k3
$$ 585 -982 1695 310 -566 -485 -331 1369 124 -428 -546 99 1531 2037 369 -236 -63 -349 -571 339 316
26082C16j32c9A82o8O03J68C54J14K47g41a02C76e72B14P18J58g6j077c0j105
$$ 316 184 -39 182 114 717 885 354 468 715 -741 -102 376 -572 214 932 1090 -76 -1153 -30 -1135
26102a135f8C55e60B04O66j7A09a87B13N8p4a756d09F87A34N90H3C1e27g9q84
$$ -1135 -68 355 -560 204 870 853 109 -187 213 271 197 -1756 -409 687 134 724 83 31 -527 -79 -963
26123i63A044a570e76D24B4K3c89q81i5A45g53A81b38f4j088A090a89C88a02A47
$$ -963 1044 -1570 -576 424 24 47 -389 -1270 -95 145 -753 181 -238 -64 -1152 1090 -189 388 -102 147
26144e9B6i7E05B25L41K14e24b49B22h67c74G7J345B62h13c84A50c46H60B37g47
$$ -59 26 -97 505 225 566 780 -524 -249 222 -867 -374 77 1422 262 -813 -384 150 -346 860 237 -747
26166c36E99l8k04a23A11N85d17G4J213F43a91l87d7mj65D36O4i0A448A73fG27
$$ -336 599 561 357 -123 111 696 -417 74 1287 643 -191 -578 -47 -51 -216 436 500 -90 1448 173 -6 727
26189d96G69J41J32f89J78l66L51j5E29a061J52F59b97q05E70e2n18K29m42L37
$$ -496 769 910 1042 -689 -511 -877 -526 -541 529 -1061 -909 659 -297 -1102 570 -52 -570 -341 -783 -446
26209d46K3G12g57D2b34G70g64a65A46b41A161n08g21r67a92H36F8L33M08A57
$$ -446 -423 712 -757 42 -234 770 -764 -165 146 -241 1161 653 -721 -1688 -192 836 68 401 809 157
26230A68b7B97J126m86l19e17j26r1B32A14d93D58d2j123J31a41B94J090B51a53
$$ 168 -27 297 1423 937 618 -517 -643 -734 232 114 -493 458 -42 -1165 -1034 -141 294 1384 251 -153
26251A431a916g3k10m60i7E53a314d7l8F90k93a71C76h23B85M65L54C81f07H9
$$ 1431 -1916 -73 -283 -743 -97 553 -1314 -47 -85 690 397 -171 376 -823 285 750 1104 381 -607 89
26272a180A06n0N39k55b41D46c23G50a91I53d29K13m85m71J80K93E49f93B87G1
$$ -1180 106 56 595 340 -241 446 -323 750 -191 953 -429 -216 -701 -1172 -992 -699 549 -693 287 71
26293C40c17B17k4D9Q96d87B72c03o6l66C66L36b99n84a46H41G8i2j091A252C84
$$ 340 -317 217 193 49 945 -487 272 -303 -369 -735 366 702 -299 -883 -146 841 78 -92 -1183 1252 384
26315c01l1o21D84C0Q52i78M27F40A18Q58D60d00D22c61k35A036J99C2M30M84
$$ -301 -332 -953 484 30 882 -978 -551 640 118 976 460 -400 422 -361 -596 1036 1235 32 462 946
26335I46b87C83a378L32l75I09R5D1J037a427h6A68L55a241L38F80k9a339M91
$$ 946 -287 383 -1378 -1046 -1421 909 1004 41 1078 -1427 -86 168 523 -1241 -903 680 651 -1339 -848
26354h48c48P4D93a17A57a050G53A53K83a001a30NC65A53J116c76p50a36n04C08
$$ -848 -348 -274 493 -117 157 -1050 753 153 436 -1001 -130 -125 365 153 1269 -376 -1126 -136 -640 308
26375C14c64A113b2B86d85b2B61J325L24B0c89o62M72A748F43a33G5g9j73G65
$$ 314 -364 1113 -22 286 -485 -22 261 1586 1910 20 -389 -1051 -579 1748 643 -133 75 -79 -252 765
26396E93B6L80K05a294a22j329d07H13k63J04K36B17J89j99b37G27A08a70q40
$$ 593 26 406 611 -1294 -122 -1451 -407 813 550 654 890 217 406 207 -237 727 108 -170 -1010
26415a010D20N6N6k46n3P05m44L0b58H93J95H4NK40c56C31j30h94b77C21B1d80
$$ -1010 420 476 532 286 233 938 494 524 -258 893 1088 84 89 329 -356 331 201 -894 -277 321 21 -480
26438A561F60g61K10k45J34E35i12F21j3J596b55A008a1H13B09N74J28i1A54c05
$$ 1561 660 -761 -551 -796 -662 535 -912 621 608 2204 -255 1008 -11 813 209 783 911 -91 154 -305
26459b09q87a95i0A227cC05e64B35A0L85j65O64a086M42E82g67A856o29k39g0
$$ -209 -1096 -195 -90 1227 -3 305 -564 235 10 395 230 894 -1086 -644 582 -767 1856 1227 988 -70
26480f37D11c9C99e0C3a385K46J39A817K96I75J62Gf21A603d57D30J178a413a69
$$ -637 411 -39 399 -50 33 -1385 -1139 -1000 1817 2113 975 1137 7 -621 1603 -457 430 1608 -1413 -169
26501a79B01i16H20Qd27E64k50e83E1P38k84J009o90k72f33E86J62C07R33n97
$$ -179 201 -916 820 828 -427 564 314 -583 51 789 505 1514 824 552 -633 586 748 307 1240 643
26521F43a43k32a44Be60F09a75F19c52l71q6H0N5e21A57b90P9p9C83a57m64C9
$$ 643 -143 -375 -144 2 -560 609 -175 619 -352 -723 -809 80 135 -521 157 -290 -211 -290 383 -157 -621 39
26544e4B82b60m12A348a761P23K33b99m79g1m18A31O14B56a417D61J002o6g9C44
$$ -54 282 -260 -672 1348 -1761 -1038 -805 -299 -778 -71 -489 131 745 256 -1417 461 1463 1397 -79 344
26565c11m24b55o34I41g81A068a146l51P38F3pi61D22a404A11e59b56E0N54M72
$$ -311 -735 -255 -889 941 -781 1068 -1146 -1497 -759 63 56 -961 422 -1404 111 -559 -256 50 604 1076
26585A076A35N38a72C07p2a72C72A61e80I92b07A05O87a119I19a031A423i82c77
$$ 1076 135 673 -172 307 235 -172 372 161 -580 992 -207 105 792 -1119 919 -1031 1423 -982 -377
26605A459F1a07p22c01l1B35h10D77c86c8q00a51q42A070B8Q4N29a273e86E77
$$ 1459 61 -107 -829 -301 -332 235 -810 477 -386 -38 -838 -151 -993 1070 28 112 641 -1273 -586 577
26626G67i9l07h0p34f6p76D37e25j70j0B15c73A03J483d40j38A166A60d70m92
$$ 767 -99 -406 -80 -814 -66 -842 437 -525 -695 -705 215 -373 103 1586 -440 -578 1166 160 -470 -962
26646i62c58h4D9j6rd3n54K27r53a30o54B88K8d54r4l96m1a31O4A536h8j49C19
$$ -962 -358 -84 49 33 24 -43 -597 -370 -1323 -130 -784 288 316 -454 -548 -944 -985 -131 -67 1536 -88 -237 319
26670b50D52a6I84g68m7B23P97j96A13K41j53K34e2D29h50d22B5e66p1F77e26
$$ -250 452 -16 984 -768 -815 223 1020 824 113 354 201 435 -52 429 -850 -422 25 -566 -637 677 -526
26692B94g41A31a8B84L44i3D69A54J51c22L6G51g58b21n71k80B85f45l93B9M18
$$ 294 -741 131 -18 284 628 -93 469 154 305 -322 -286 751 -758 -221 -792 -1072 285 -645 -1038 29 447
26713D47j66A22g48f1C07O6e0A33h2A458C43C6J17@a5C24J92e2E17J06F6M9L14
$$ 447 281 122 -748 -61 307 373 -50 133 -82 1458 343 36 153 0 -15 324 516 -52 517 623 66 115 429
26736D29i8p8E78b2m87r34A71E0c78B64K66Q80J2l96c72a69j551g0I1L7O9i02
$$ 429 -98 -176 578 -22 -509 -1443 171 50 -378 264 530 1410 1422 1026 -372 -169 -1720 -70 91 128 197 -902
26759e95C55j00N48C25f01K06a51G6b40B72L91c32J50e0j489a54k55D91B08I9
$$ -595 355 255 803 325 -601 -395 -151 76 -240 272 663 -332 -182 -50 -1539 -154 -409 491 208 99
26780i33b65j075F99d60n5A064C2e00K35j46D7N14a07c1j24A503F67A46c42e5
$$ -933 -265 -1340 699 -460 -515 1064 32 -500 -265 -411 47 561 -107 -31 -155 1503 667 146 -342 -55
26801I54a119H9a016B89P38a227J58d45J77E49B02f7j25k87a23j188J10e48R7
$$ 954 -1119 89 -1016 289 1027 -1227 -1069 -445 -268 549 202 -67 -192 -479 -123 -1311 -1201 -548 -451
26820d51J11F15k73g34c42G98A61a217c16m3q11K56b91A319K29n55f8B16Rc04
$$ -451 -340 615 342 -734 -342 798 161 -1217 -316 -359 -1170 -914 -291 1319 1548 993 -68 216 225 -304
26841a64E84a31C95j94D4a14k47G03j77B35d3G8M96c01A45O80l75a001j23J30
$$ -164 584 -131 395 201 44 -114 -361 703 526 235 -43 78 574 -301 145 825 450 -1001 -1124 -994
26861i94C28N92kg08F9g66A13i70D69J79A56f65l07b33I15a62A074A11R8a97D93
$$ -994 328 920 918 -708 69 -766 113 -970 469 648 156 -665 -972 -233 915 -162 1074 111 209 -197 493
26883G04e81D7a07A96@H43e80D15J105e78A42g18q31f81C1J666D44g93E05g36
$$ 704 -581 47 -107 196 0 843 -580 415 1520 -578 142 -718 -1549 -681 31 1697 444 -793 505 -736
26904a63E58J01j12J75B96g29A313D47b76q95D93A36e39k14a95A528a27E70f97
$$ -163 558 659 547 722 296 -729 1313 447 -276 -1171 493 136 -539 -753 -195 1528 -127 570 -697
26924c16PD78e89O4C6J045c42I8J195d97D17C0g65L53C52a478B38h53b11F01L6
$$ -316 -309 478 -589 -525 36 1081 -342 98 1293 -497 417 30 -765 -412 352 -1478 238 -853 -211 601 637
26945F37B08L68a43H69e68k08A079a149a02j258G10N69f02k21d00A485a120D88
$$ 637 208 576 -143 869 -568 -776 1079 -1149 -102 -1360 710 1279 -602 -823 -400 1485 -1120 488
26964b32C08e85G76B92g08A88a87j2H66B79J69e95E34a236A33R68g35A386B98
$$ -232 308 -585 776 292 -708 188 -187 -199 866 279 448 -595 534 -1236 133 1101 -735 1386 298
26984B00e27G86f25a5k34D24i42c35B31f84j03J93b03l10E0h81G06a280a5A346
$$ 200 -527 786 -625 -15 -249 424 -942 -335 231 -684 -787 -594 -203 -513 50 -881 706 -1280 -15 1346
27005A12d23b05j59I34e15j94e2k48G01N98E97A57L96a369a13B40M09f07B44c49
$$ 112 -423 -205 -364 934 -515 -709 -52 -300 701 1299 597 157 553 -1369 -113 240 649 -607 244 -349
27026E50A96I3N43k97N57a286C16i11A125c53A45d7j000A102b71B24L34M71n8
$$ 550 196 93 636 339 896 -1286 316 -911 1125 -353 145 -47 -1047 1102 -271 224 558 1029 971
27045I71a87D41J072b31A085C14L53d49m24a09D33g75A476D1a512O84K92P1D88
$$ 971 -187 441 1513 -231 1085 314 667 -449 -873 -109 433 -775 1476 41 -1512 -828 -536 -465 488
27065A066b44P2j008a85J6o7f0D62M7g15h7j483c32A44c64in39G10P2C64M79d83
$$ 1066 -244 -172 -1180 -185 -169 -236 -60 462 509 -715 -87 -1570 -332 144 -364 -9 -548 710 782 364 843 -483
27088B76K0b72B56i91G39d8D97f17k37D94a26r13b80k65e2j064m10A85a86B05
$$ 276 296 -272 256 -991 739 -48 497 -617 -854 494 -126 -1039 -280 -545 -52 -1116 -1526 185 -186 205
27109A25K87f31H28j58f70G14i48M27J05m2A10b18I27C69J151h41n10a94a5F5
$$ 125 412 -631 828 670 -670 714 -948 -521 -416 -458 110 -218 927 369 1520 -841 -1351 -194 -15 65
27130a88B13a241b89D33L85J0M2B63J83h75A56h23l80N52B65g52D87a78E38b42
$$ -188 213 -1241 -289 433 818 828 870 263 446 -875 156 -823 -1203 -651 265 -752 487 -178 538 -242
27151d4J6A126e52b23D7a96G86C05R7e25E57L74d01D95f02b18Cd37m35M2A205
$$ -44 -28 1126 -552 -223 47 -196 786 305 402 -525 557 931 -401 495 -602 -218 3 -437 -872 -830 1205
27173A93R3f12D22j02N94K73j57b63n48G2d49G51L29C99d10B00b92j57J11C4d62
$$ 193 286 -612 422 320 914 1187 1030 -263 -811 72 -449 751 1080 399 -410 200 -292 -449 -338 34 -462
27195E00j35a634b90l42b97G91b89j68E10P23g06F33A75L96K37ng82j57p78G27
$$ 500 365 -1634 -290 -632 -297 791 -289 -457 510 1233 -706 633 175 571 808 803 -782 -939 -1717 727
27216B00c94a83A335a62H66m27g8o61l76a38j560d40r48C16M31f96K29p02b7A488
$$ 200 -394 -183 1335 -162 866 439 -78 -739 -1115 -138 -1698 -440 -1388 316 747 -696 -467 -1169 -27 1488
27237B35a19G17i40M53A34b2k81F69e98K86m82B61M18k69R61B0L37d08n65H4g83
$$ 235 -119 717 -940 -487 134 -22 -303 669 -598 -312 -794 261 679 410 1371 20 357 -408 -973 84 -783
27259B06L75i72b15l52E71f78a69j02q66L23c27l17D91k35a080a73m26C58J449
$$ 206 581 -972 -215 -567 571 -678 -169 -271 -1137 -814 -327 -644 491 256 -1080 -173 -599 358 1807
27278A807d35I6j6J366B22A11C2L71h72E05c15l27H38l22n1b85F49g81B52j2e57
$$ 1807 -435 96 80 1446 222 111 32 403 -872 505 -315 -642 838 516 465 -285 649 -781 252 240 -557
27300B65J78i4F27a316B35d50A95M99c0A0J81i06G73f07a34m37b51a15D71a483
$$ 265 443 -94 627 -1316 235 -450 195 694 -30 10 191 -906 773 -607 -134 -571 -251 -115 471 -1483
27321a92B14b24m2p40b42H3a42A89L29h98C95A90J236D66R8a725e11K7D55J59
$$ -192 214 -224 -266 -1006 -242 83 -142 189 518 -898 395 190 1426 466 564 -1725 -511 -484 455 614
27341F14CJ07K98L97a351BJ67g89l01a34E02a25E24r5i60D19f82D05h82a42q82
$$ 614 3 110 408 805 -1351 2 169 -789 -1090 -134 502 -125 524 429 -960 419 -682 405 -882 -142 -1024
27362a024K85H09J04k12A71g08b30GN81q7IQ62A10f16H08a096E02c37p64A44h28
$$ -1024 -739 809 913 701 171 -708 -230 7 588 501 9 871 110 -616 808 -1096 502 -337 -1101 144 -828
27384f50l13G47a53q13j2JL94J85A43M71Q10a04l87h5j45A53c35a8B38Dd72m34
$$ -650 -963 747 -153 -966 -978 -977 -583 -398 143 614 1424 -104 -491 -85 -230 153 -335 -18 238 4 -472 -906
27406i06a58A118e46n60E06e0o73G48c18A257l75A4h63J18k79G91d15B87i49J54
$$ -906 -158 1118 -546 -1106 506 -50 -723 748 -318 1257 882 14 -863 -745 -1024 791 -415 287 -949 -795
27426g95A463o84C58h95B9i28F6a58e4C08b51k57J96m38G34r5I7f36l36C70j7
$$ -795 1463 779 358 -895 29 -928 66 -158 -54 308 -251 -508 -312 -750 734 639 97 -636 -972 370 353
27447C53L59e91b23E33j80c91k22P4b24D53a042E90b81G82G8Q03a247B88c41L7
$$ 353 712 -591 -223 533 353 -391 -613 -539 -224 453 -1042 590 -281 782 78 881 -1247 288 -341 -304
27467c04j11I60k76f56K3D28M88l41j73e99A36L05a317b75l3E01B37e42J77D97
$$ -304 -415 960 684 -656 -633 428 916 575 402 -599 136 441 -1317 -275 -308 501 237 -542 -365 497
27488G01a066d03B83c24j78a10G91C22n0a44G5f68A53a145M32o93j32N91d03q35
$$ 701 -1066 -403 283 -324 -502 -110 791 322 272 -144 75 -668 153 -1145 -713 -1406 -1538 -947 -403 -1238
27508a238c26D88a30B53K50k08J275d00Ee22F51L87d58A86b28jl81j65a77p73
$$ -1238 -326 488 -130 253 503 295 1570 -400 5 -522 651 1038 -458 186 -228 -229 -610 -775 -177 -950
27528i50a09l47I11d39C53j29K08b88k45J21A24e10m93E79B6L58f29H87B97g93
$$ -950 -109 -456 911 -439 353 224 432 -288 -533 -412 124 -510 -1003 579 26 384 -629 887 297 -793
27549A87b51l72j99G0g0j08B1O80L19l9D09b56A49D8b38H60b14n25L31A05ej59
$$ 187 -251 -623 -822 70 -70 -178 21 701 1020 981 409 -256 149 48 -238 860 -214 -739 -408 105 -5 -164
27571a64I25c89J89e3H62C60J226B00F9e58I22d82a3n61O1A225J01C61K19c40
$$ -164 925 -389 -200 -53 862 360 1586 200 69 -558 922 -482 -13 -574 -513 1225 1326 361 580 -340
27592C64n5N27j40k69H9d26I24A02M15A63J020c13D16K72B66d14H05k57A01fr47
$$ 364 309 836 696 427 89 -426 924 102 517 163 1183 -313 416 688 266 -414 805 548 101 -6 -953
27613i53d7j033G04a030A135l83b93j06D9a075b74I22a248A196a21E59B28M40
$$ -953 -47 -1080 704 -1030 1135 752 -293 -399 49 -1075 -274 922 -1248 1196 -121 559 228 668
27631F68K71l27g70i5F33f18B15b26j32m48l74A283f27A475a20j204C46f73J78
$$ 668 939 612 -770 -95 633 -618 215 -226 -358 -806 -1180 1283 -627 1475 -120 -1324 346 -673 -495
27650d95F53K29B81a733N59b09C7O5J249B47J61L70J40c60C4N12b00j481g6j64
$$ -495 653 882 281 -1733 -1174 -209 37 102 1351 247 408 778 918 -360 34 546 -200 -1681 -76 -240
27670b40B90i78K78A20K25a027j75a62o3n9F64a0D91r3g71b48p3A67b75C38A49
$$ -240 290 -978 -700 120 345 -1027 -1202 -162 -225 -284 664 -10 491 398 -771 -248 -321 167 -275 338 149
27692f14K15j91k87b0j094d30C94oe01K48c9o3r92c53m25B67J33P4e77m06a48
$$ -614 -399 -590 -877 -20 -1114 -430 394 388 -501 -253 -39 -102 -1094 -353 -778 267 400 474 -577 -983 -148
27714c58E43N1k32A48od81r85B74G4a6j464E57a03q27G82k51a237b01A26a05A505
$$ -358 543 594 362 148 142 -481 -1466 274 74 -16 -1480 557 -103 -930 782 531 -1237 -201 126 -105 1505
27736a547e90H20J23a0B28b66l53E34f74D75a001E81e42D11C5J141A45K25d75
$$ -1547 -590 820 943 -10 228 -266 -619 534 -674 475 -1001 581 -542 411 35 1176 145 370 -475
27756e57a24A443H5e08H24A22f36A334l95A47Q33a64j344O57B90f11G79h0G41
$$ -557 -124 1443 85 -508 824 122 -636 1334 939 147 980 -164 -1508 -851 290 -611 779 -80 741
27776A052A34a63p6F84Q33m11h1F17f67J80B66a99Mj695a32o35m44b25n08j114
$$ 1052 134 -163 -239 684 1517 1106 -81 617 -667 -487 266 -199 -195 -1890 -132 -767 -1211 -225 -733 -1847
27796a847A022h8n74A347c79i6l38F61c89G04h46B90B1M59i84c74n05k05bj17
$$ -1847 1022 -88 -662 1347 -379 -96 -434 661 -389 704 -846 290 21 480 -984 -374 -879 -1084 -2 -119
27816a19A434n82C33N73b97j45C48J83e46J92A00L81b14B49e22F4f77g5I71q4
$$ -119 1434 852 333 906 -297 -442 348 531 -546 -354 100 481 -214 249 -522 64 -677 -75 971 887
27836H87k80C03e24D40j38A34e32k85A043k27b97r84E68J21c19G84A0K52d31l21
$$ 887 607 303 -524 440 302 134 -532 -817 1043 816 -297 -1281 568 689 -319 784 10 262 -431 -752
27856g52I59C97m2e82q00b5B04lR73A74J49J397d27B72J13Q71E52N87h7j42R0
$$ -752 959 397 355 -582 -1382 -25 204 201 1174 174 323 1720 -427 272 385 1256 552 1139 -87 -229 -139
27877a39l94G70dF31P03F8c73j15O7P0A276E26k31o9c81j50A336a42k17a31j133
$$ -139 -533 770 -4 631 1334 68 -373 -488 -421 -351 1276 526 295 226 -381 -531 1336 -142 -359 -131 -1264
27898a264F03j0B4J13K123i11j06F79L26b46H6d89F43J330A08d76F15B53e5B57
$$ -1264 603 593 24 137 2260 -911 -1017 679 1005 -246 86 -489 643 1973 108 -476 615 253 -55 257
27919D78Ca47fl17o84b30a7p62b27r69A76b24M0f1A537B40e55E56a769C85j57
$$ 478 3 -147 -6 -323 -1007 -230 -17 -779 -227 -1196 176 -224 -184 -61 1537 240 -555 556 -1769 385 228
27940B28e88A346a054I4P49f92D92A40c37o7A73c38m52F82d00B35e13a27I0a313
$$ 228 -588 1346 -1054 94 843 -692 492 140 -337 -404 173 -338 -790 682 -400 235 -513 -127 90 -1313
27961a15C22M90L12a029M31I54m18b1o29F44B36N35P06C40e29G60B48b24o50I55
$$ -115 322 812 1124 -1029 -598 954 536 -21 -650 644 236 771 1477 340 -529 760 248 -224 -874 955
27982a477N51k84a95E08O72c31q10b53J1G89j78J34c64F42i95d61H36n0C36O35
$$ -1477 -926 -1210 -195 508 1180 -331 -1141 -253 -242 789 611 745 -364 642 -995 -461 836 786 336 971
28002I71k38A74N33l22c37n9o7C78K2d16D73l4b8l48a79k19n03A069m98N55dA50
$$ 971 733 174 707 385 -337 -396 -463 378 400 -416 473 439 -28 -376 -179 -398 -901 1069 571 1126 -4 150
28025G43l63a108A267f79C36M62a99C44j20J102b47I19l08o1h07M7K82E16b76
$$ 743 380 -1108 1267 -679 336 798 -199 344 224 1326 -247 919 611 550 -807 -760 -478 516 -276
28045G60A69i02j83D57a718bB5K35c51E1O21Q6c20A54a163l53O65E94A49g80I94
$$ 760 169 -902 -1085 457 -1718 -2 25 260 -351 51 672 758 -320 154 -1163 -1516 -851 594 149 -780 994
28067F4R06c93q8l8o06M50a56j95G77g65p55d61G8b89B19d54h5E26a72G3e0j99
$$ 64 970 -393 -481 -519 -1125 -675 -156 -351 777 -765 -1520 -461 78 -289 219 -454 -85 526 -172 73 -50 -249
28089b49H9e9G58H2J3M28a318A67b76B81a081E27K29b84C00j07b39n17k1F28a19
$$ -249 89 -59 758 82 95 523 -1318 167 -276 281 -1081 527 756 -284 300 193 -239 -756 -777 628 -119
28111B13a091a84m89D91A95K22j15M71a08o41F51j50d22A338a393A417A52b83
$$ 213 -1091 -184 -673 491 195 417 302 773 -108 -749 651 501 -422 1338 -1393 1417 152 -283
28130a222B11e64C02J9K59b77A220n93A65b48l13k31C25J33N60N3j75A55Fb03
$$ -1222 211 -564 302 321 580 -277 1220 627 165 -248 -561 -792 325 458 1018 1071 896 155 6 -203
28151f82j8e3I7c66C12i51E22B37J300c03E79B03K250i52H63l18B25R27A57L79
$$ -682 -700 -53 97 -366 312 -951 522 237 1537 -303 579 203 2453 -952 863 545 225 1152 157 536
28171E36a088dj049H15I2J053c72Ca711Q36m7G50g8I0L08D6L98c39M5j88E63B10
$$ 536 -1088 -4 -1053 815 92 1145 -372 3 -1711 -875 -922 750 -78 90 398 46 444 -339 -294 -482 563 210
28194I6f29H29e08A193a93A71O71a081c1G66a05D93A84Q3b87K5D25c15C77j76
$$ 96 -629 829 -508 1193 -193 171 842 -1081 -31 766 -105 493 184 267 -287 -262 425 -315 377 201
28214B01h35o20b15E43k16g81D62q1i5A710D16j16K32e68H17C30a22n85I41M14
$$ 201 -835 -1455 -215 543 327 -781 462 381 -95 1710 416 300 532 -568 817 330 -122 -707 941 1355
28234A355C02d71D97a368H52e33A001B78J361C06j02h33j081c3A67p8P7c80a48
$$ 1355 302 -471 497 -1368 852 -533 1001 278 1639 306 204 -833 -1914 -33 167 89 166 -380 -148
28254a39l05J94B33d78B11f9q02D44L99j67k72K89l37M72K16D21a071A5R33O77
$$ -139 -444 -250 233 -478 211 -69 -871 444 843 676 404 693 356 828 1044 421 -1071 15 948 1625
28274A625a14A069l71e4l92n89B79a92F9c28a12d6F87l32K41L73R75g06a52d6
$$ 1625 -114 1069 698 -54 -446 -1035 279 -192 69 -328 -112 -46 687 355 596 969 1944 -706 -152 -46
28295c70G7J276m87B84eE74b4n92H36C00a48A24E5f0m60A64P7K81Q92f60K1C7
$$ -370 77 1353 866 284 -5 574 -24 -616 836 300 -148 124 55 -60 -520 164 241 522 1414 -660 -639 37
28318c40E84d33l12a76r84d37a93o77K92J06o50E51N35d02I07K28b56E4K7M92
$$ -340 584 -433 -745 -176 -1160 -437 -193 -870 -578 -472 -1122 551 1086 -402 907 1135 -256 54 81 573
28338E73d90B94A36c92H0a108L51B17h49D15i2o41A531a456H73C15A12h93b83
$$ 573 -490 294 136 -392 80 -1108 -757 217 -849 415 -92 -733 1531 -1456 873 315 112 -893 -283
28358h15A31Q26a28A113d91a43H23e48k30p4B80b56D61L77B4M73c27a06l03E10
$$ -815 131 957 -128 1113 -491 -143 823 -548 -778 -852 280 -256 461 838 24 497 -327 -106 -409 510
28379a96e1k85p02j30M42A7a66C5c74H21A54b36q92G44K66a732g60j93b33m49
$$ -196 -51 -336 -1038 -1168 -726 17 -166 35 -374 821 154 -236 -1128 744 1010 -1732 -760 -953 -233 -682
28399f82G84B2N63e62J02D91N23i5E31b4A123n2f68E90a017A37a90q34G34j32
$$ -682 784 22 585 -562 -460 491 1014 -95 531 -24 1123 1071 -668 590 -1017 137 -190 -1024 734 602
28419F02f27D7i9l95b09A532a21m64G0J025a194r8e7F7K04J67J25d69a94j74b
$$ 602 -627 47 -99 -494 -209 1532 -121 -585 70 1095 -1194 -1292 -57 67 271 438 563 -469 -194 -368 -2
28441d9n60b0k52o29E52B48r8Q77o1c08h1E61d72C62L33B60a46A046g20H3N99
$$ -49 -609 -20 -272 -901 552 248 150 1027 966 -308 -81 561 -472 362 695 260 -146 1046 -720 83 682
28462F82H1L14l7h01K60A83M37f65d6p42a78A75c69a80f9j576M95A65d90Pf0B13
$$ 682 81 395 358 -801 -541 183 620 -665 -46 -788 -178 175 -369 -180 -69 -1645 -1150 165 -490 -483 -60 213
28485C72d64J27k64D6J056b62a31G44k6g89A465b47B96F9a084J29d64C80b1l24
$$ 372 -464 -337 -601 46 1102 -262 -131 744 718 -789 1465 -247 296 69 -1084 -955 -464 380 -21 -345
28505c45G1Q52f39G47A15O91B24J52I9K51j32L69M61e21A50b88A666C77Jd52l85
$$ -345 71 923 -639 747 115 806 224 376 99 350 218 587 1048 -521 150 -288 1666 377 378 -452 -837
28526h37a81j48J0j205H3b16d6j48A299B52J7A32d56B48J95e48a73p80a99j023
$$ -837 -181 -329 -319 -1524 83 -216 -46 -194 1299 252 269 132 -456 248 443 -548 -173 -953 -199 -1222
28546a222O10A07N65B67c67o54l19D88Q9B58L17P1a97o03H9g61c61A696e2k25
$$ -1222 -612 107 672 267 -367 -1021 -1340 488 577 258 575 646 -197 -800 89 -761 -361 1696 -52 -277
28566b77j21n90C07GJ69N64a858G48b32k8C09L59g67A336A61J256e19F58d76A108
$$ -277 -398 -988 307 7 176 740 -1858 748 -232 -260 309 668 -767 1336 161 1417 -519 658 -476 1108
28587g0k22k24A099f13G91d99p70B28k3P24C62a281c57j283h20I34d11A009B00
$$ -70 -292 -516 1099 -613 791 -499 -1269 228 205 929 362 -1281 -357 -1640 -820 934 -411 1009 200
28607a22Rn60B99Q05GL63j79O7O03a97D18j10L58i7A32P39B89K53c10B95J9c61
$$ -122 -113 -673 299 1104 7 370 191 258 861 -197 418 308 666 -97 132 871 289 542 -310 295 314 -361
28630d5A133c46l63A81L55b64J6r76c13F41a259C4e29H22b95A95J484d31B93l4
$$ -45 1133 -346 -709 181 536 -264 -248 -1224 -313 641 -1259 34 -529 822 -295 195 1679 -431 293 259
28650B59J064a329b43A028l20d67J04J04B29e32a16OF4b44q05J2D4a669E40I3
$$ 259 1323 -1329 -243 1028 708 -467 -363 -259 229 -532 -116 -110 64 -244 -1049 -1037 44 -1669 540 93
28671G82a221A59e93b74D15f86I52R47a234I1d17J55j2H5O60b42n45J59E53J28
$$ 782 -1221 159 -593 -274 415 -686 952 1899 -1234 91 -417 -262 -274 85 745 -242 -787 -628 553 681
28691F81h73k59e6p73A355i4B51g3j07E57a94l9j7e3D5N08d27L2B5N31g52K51
$$ 681 -873 -1132 -56 -829 1355 -94 251 -73 -180 557 -194 -233 -250 -53 45 553 -427 -395 25 556 -752 -501
28713e01A63K52b51j95n26b15l72A92R7e87@D55b71Q3o45J80A702a80p29m43b41
$$ -501 163 415 -251 -446 -972 -215 -587 192 289 -587 0 455 -271 -188 -833 -653 1702 -180 -909 -1352 -241
28735a262b59E42a451j4D9J278n28A03K51c26B14K9a43j066I89D73a639F50a5
$$ -1262 -259 542 -1451 -1465 49 1327 799 103 354 -326 214 243 -143 -1209 989 473 -1639 650 -15
28755A337B31I1J228B98d90b36C11e43k48A022k65C50b0l82F10D4J96h15A31c5
$$ 1337 231 91 1319 298 -490 -236 311 -543 -791 1022 757 350 -20 -402 610 44 240 -815 131 -35
28776F95O89g65A6b92b9j58D84B37h50c63o12M43A026k98a32l66c3n23n94A84
$$ 695 1384 -765 16 -292 -29 -187 484 237 -850 -363 -975 -532 1026 728 -132 -498 -33 -556 -1150 184
28797G0f91c4k33E00J11k1b87D0J76b34q8C6N50h11A90J559a07d5n07A42b56l81
$$ 70 -691 -34 -267 500 611 590 -287 40 216 -234 -322 36 586 -811 190 1749 -107 -45 -552 142 -256 -637
28819f37D24d2o00j50c43A388l91k09B52a195A067l00b51E94j82n0f3C86h71F91
$$ -637 424 -42 -642 -792 -343 1388 997 788 252 -1195 1067 767 -251 594 412 362 -63 386 -871 691
28840e57D91h45F05K08O31i60A489G35k77N61i78a62C4L59e42B76g61A197dj60
$$ -557 491 -845 605 813 1444 -960 1489 735 458 1019 -978 -162 34 393 -542 276 -761 1197 -4 -164
28860a64A596G59i52d19J20A101c76l11B114C87g5o4o19J51F7c34D16A8e70J0
$$ -164 1596 759 -952 -419 -299 1101 -376 -687 2114 387 -75 -139 -758 -607 67 -334 416 18 -570 -560
28880e60Ei70b07C60N04e23I04a11q14C37F6L28f5l22G0R79A89L13j09M34h20
$$ -560 5 -970 -207 360 864 -523 904 -111 -925 337 66 394 -65 -387 70 1049 189 502 393 827 -820
28902a98m34D32b36p67M23b07A007B23g4E82e90G54A64B4K12Rb58I73h05M00E78
$$ -198 -632 432 -236 -1003 -580 -207 1007 223 -74 582 -590 754 164 24 236 245 -258 973 -805 -405 578
28924G54C20c21J49n40M3o8L38m80J02O7B38j15a20A95e84m82F11a167I89D02
$$ 754 320 -321 -172 -712 -669 -737 -399 -879 -777 -710 238 123 -120 195 -584 -1066 611 -1167 989 402
28945C70f18D37h59L97a9o27D34c13b5C81a33A52g71A67h42K41E11K21e42b44
$$ 370 -618 437 -859 -462 -19 -646 434 -313 -25 381 -133 152 -771 167 -842 -601 511 732 -542 -244
28966a025A08a3n89D93A50P83A14b24E7c02C02f87c22E9f96l60C04c95A284h62
$$ -1025 108 -13 -602 493 150 933 114 -224 57 -302 302 -687 -322 59 -696 -1056 304 -395 1284 -862
28987c89@hD45f81A465d03h2J1o2k24A67K3J36d96n05C96J65f04G4N71O8d04q7
$$ -389 0 -8 445 -681 1465 -403 -82 -71 -133 -357 167 190 326 -496 -1001 396 561 -604 74 645 713 -404 -491
29010d91n6g2A16J676B78d69B83M68q8K34e97l23A262a97n13A011a360b55F09
$$ -491 -547 -72 116 1792 278 -469 283 751 663 897 -597 -920 1262 -197 -710 1011 -1360 -255 609
29030H1g74I7a23e4j145I22B05e32g4m7F23a92A284D61Q9K7b69n23K65J90J16
$$ 81 -774 97 -123 -54 -1199 922 205 -532 -74 -121 623 -192 1284 461 550 577 -269 -792 -527 -337 -221
29051b21H13B92K89r5B6J52i3b1l51m68a88B14i31a7I63b62c9k11E49B49b07G8
$$ -221 813 292 581 486 26 178 -93 -21 -372 -840 -188 214 -931 -17 963 -262 -39 -250 549 249 -207 78
29074a236E54a037I60f89A16J076I5a07A8f8j79j090E77J382i64A650A04d68j028
$$ -1236 554 -1037 960 -689 116 1192 95 -107 18 -68 -247 -1337 577 1959 -964 1650 104 -468 -1496
29093a496C49K68i3j82C80F8g11a50l45G32a7n2C10A7L1J10d73A570c87R0F58
$$ -1496 349 617 -93 -275 380 68 -711 -150 -495 732 -17 -69 310 17 48 158 -473 1570 -387 -297 658
29115f44p80O77C64f86I4g9I76B3d76A88b47A35M27a24A23a2m2r03a25a0H31o3
$$ -644 -1424 -747 364 -686 94 -79 976 23 -476 188 -247 135 562 -124 123 -12 -54 -957 -125 -10 831 768
29137G68d89k81l90G40a115d26F76d48B64c93A70h69c93o13h7I4K01a10o15A47
$$ 768 -489 -770 -1160 740 -1115 -426 676 -448 264 -393 170 -869 -393 -1006 -87 94 295 -110 -725 147
29158D66g12H1J07c35D66H1d63k92A134c12D4h57E31G8a25D48j32g67f1j29j62
$$ 466 -712 81 188 -335 466 81 -463 -755 1134 -312 44 -857 531 78 -125 448 316 -767 -61 -190 -352
29179c52A45K58A72c97H78e65F69L7c27C28d71B41a102c03A023m19A11a244b81
$$ -352 145 403 172 -397 878 -565 669 706 -327 328 -471 241 -1102 -303 1023 604 111 -1244 -281
29199I74c84C2P5a9G52J36e99A56O07b60A6a599cr6D21J606p64b43q58fo99H66
$$ 974 -384 32 107 -19 752 888 -599 156 763 -260 16 -1599 -3 -99 421 2027 1263 -243 -1101 -6 -705 866
29222G48b60j23O1k31j79a47F19a94A588A89J71a96o85A570h70H78e06A69f37
$$ 748 -260 -383 -322 -553 -732 -147 619 -194 1588 189 360 -196 -881 1570 -870 878 -506 169 -637
29242H31C46K33A52n1h07n28b22g2D42a118e2k80A54P69P38q19a79D48K58B73
$$ 831 346 579 152 101 -807 -1335 -222 -72 442 -1118 -52 -332 154 923 1661 842 -179 448 706 273
29263H15c05I85e8j33B93A05m6J61K112C4i57J93A5J686a294d66A80N35a182C50
$$ 815 -305 985 -58 -191 293 105 59 220 2332 34 -957 -764 15 1701 -1294 -466 180 715 -1182 350
29284C23a0j54j125f01E5a3B56K99c53m07c62j72A89O81k69c10B63L78C9J440
$$ 323 -10 -164 -1289 -601 55 -13 256 555 -353 -760 -362 -534 189 870 601 -310 263 641 39 1479
29304A479E37O38l3J16E8d4F27k98d4A185c36D76b96B97a135B64k5J308C27f28
$$ 1479 537 1175 1142 1258 58 -44 627 329 -44 1185 -336 476 -296 297 -1135 264 239 1547 327 -628
29325E25a54Cc2A033D19M8a08A313h06a4lk93m0J25A92a288H44k99B3J351@C77
$$ 525 -154 3 -32 1033 419 467 -108 1313 -806 -14 -17 -310 -350 -225 192 -1288 844 545 23 1374 0 377
29348d12l71E7g9A43K07b16j059A030c65E89J419a04j199b5k87o4l42G57A19a167
$$ -412 -783 57 -79 143 350 -216 -1275 1030 -365 589 2008 -104 -1303 -25 -312 -376 -718 757 119 -1167
29369g54I41g03A39g81m37E98D2J42b56r76E33P90b0A143e02Ca46l10d4A040b42
$$ -754 941 -703 139 -781 -1218 598 42 184 -256 -1232 533 1323 -20 1143 -502 3 -146 -456 -44 1040 -242
29391A86J37g05A221E30e46F4f49A366C91A68a075I86a54G23B24h9A739C82J27
$$ 186 323 -705 1221 530 -546 64 -649 1366 391 168 -1075 986 -154 723 224 -89 1739 382 509
29410E09d75K07H4J040m69P92g12B43ON21M7c39B7P71a11k73I0a208c58A82b47
$$ 509 -475 -268 84 1124 655 1447 -712 243 249 770 817 -339 27 798 -111 -384 90 -1208 -358 182 -247
29432A80Q8J8O7b20q38a6k0E21f3A91d11j5A236J92a035M78k02H0l1Q39C57A69
$$ 180 268 286 353 -220 -1058 -16 -36 521 -63 191 -411 -426 1236 1428 -1035 -557 -759 80 49 888 357 169
29455B35a82C64i03F74E2N7a30B79d21F5N74B11N25l55K9m8b92l93m96a00A339
$$ 235 -182 364 -903 674 52 109 -130 279 -421 65 639 211 736 381 410 362 -292 -685 -1181 -100 1339
29477g52C54HL14O32e04C7b61D76r6M29b2E78a24A48a32B45f62N5C74A82a88c1
$$ -752 354 8 322 954 -504 37 -261 476 380 809 -22 578 -124 148 -132 245 -662 -607 374 182 -188 -31
29500C93J1b53D69a14B53J35f1A008d0A349c79A326B12R52a059b86H96J70g9D28
$$ 393 404 -253 469 -114 253 388 -61 1008 -40 1349 -379 1326 212 1164 -1059 -286 896 1066 -79 428
29521a97r9dI87K46c8C41G5a19E02L85J0b57l68D54e56D3J98d94E04L28l67g64
$$ -197 -296 -4 987 1233 -38 341 75 -119 502 887 897 -257 -625 454 -556 43 241 -494 504 832 465 -764
29544A052e09b34l40C15A01e55a45F20O0c19o94a74m50A039B52d26k90E63hk47
$$ 1052 -509 -234 -574 315 101 -555 -145 620 680 -319 -1013 -174 -624 1039 252 -426 -716 563 -8 -255
29564b55j81F2M6h43B60o4f98f5k38C95M82b85A563a10m08A678G80a45C19K60
$$ -255 -436 62 108 -843 260 196 -698 -65 -303 395 877 -285 1563 -110 -518 1678 780 -145 319 579
29584E79j64c01F12k71d28H40p9b84B63K80L91a22A099a013C72P54b76k90E29
$$ 579 415 -301 612 341 -428 840 761 -284 263 543 934 -122 1099 -1013 372 1126 -276 -566 529
29604BO86l33R93F3c01A117B29f04A93o7J40J616g01A47b71g1nE39i08F81B37
$$ 2 688 355 1348 63 -301 1117 229 -604 193 126 266 1882 -701 147 -271 -71 -76 539 -908 681 237
29626b47J01k05D09a140gp80F7Q46A0c17A121E6M92a093A60K13c7o59C15R8a2
$$ -247 -146 -351 409 -1140 -7 -787 67 913 10 -317 1121 56 548 -1093 160 373 -37 -696 315 413 -12
29648c14A40f35l97a93d4n14a86H35M67i55K22k74F97cA153i14B86f03C42b18
$$ -314 140 -635 -1032 -193 -44 -558 -186 835 1302 -955 -733 -1007 697 -3 1153 -914 286 -603 342 -218
29669B07a172e24E63f63K43j94L9q8B70g43J63D92M10a11A084C53i2A348k00f44
$$ 207 -1172 -524 563 -663 -420 -614 -575 -663 270 -743 -580 492 902 -111 1084 353 -92 1348 1148 -644
29690C3K47J49M20A62J53J05l2i23c28I06k45c90p41H81A67L17c46m87A234c0
$$ 33 280 429 849 162 315 420 388 -923 -328 906 661 -390 -1131 881 167 484 -346 -833 1234 -30
29711a88A47M99e85F03b22C32J52d97o6@F13e05H25j50M87P8F15L61a4o24C15
$$ -188 147 646 -585 603 -222 332 484 -497 -563 0 613 -505 825 675 1162 1240 615 976 -14 -638 315
29733D81a10k35l1l77C4i21r6B03k7R18e90a61q27D29L65L53j28m59b15A30d5
$$ 481 -110 -345 -376 -753 34 -921 -1017 203 176 1094 -590 -161 -988 429 794 1147 1019 560 -215 130 -45
29755D81L14i36c55D16l3d57a99k57m94D69d49B44a96B50f79J16J54A130n01a335
$$ 481 795 -936 -355 416 383 -457 -199 -456 -950 469 -449 244 -196 250 -679 -563 -409 1130 629 -1335
29776bB56N63E4O91d31K03E71b23l12E28B03a729I6K88f24i2p23b2l04n96A078
$$ -2 256 819 54 745 -431 -228 571 -223 -535 528 203 -1729 96 384 -624 -92 -815 -22 -326 -922 1078
29798h31c09B4P95k98F7M90a578I4a58E05d22em78h6A277A18J059B54J015b52
$$ -831 -309 24 819 521 67 557 -1578 94 -158 505 -422 -5 -483 -86 1277 118 1177 254 1269 -252
29819a309b34D71a022C59b85p70C8M99r6aA25Q19m46r5P67A13d23E09i16C91A82
$$ -1309 -234 471 -1022 359 -285 -1055 38 537 441 -1 125 944 498 403 1170 113 -423 509 -916 391 182
29841a6B24J60p8L00a93r7l77J06l68i9C46j26M3H2e0j18j04o2A134E26P3i70
$$ -16 224 384 306 606 -193 -290 -667 -561 -929 -99 346 220 263 82 -50 -168 -272 -334 1134 526 599 -970
29864a09H83A41J8m1N71i70C86h22K30B67a43Ig1m93b27A92a399B94f5B2d68B09
$$ -109 883 141 159 118 689 -970 386 -822 -592 267 -143 9 -71 -564 -227 192 -1399 294 -65 22 -468 209
29887A86d48M2F91c60B32d85E84c33E77d92k32r3E17e79a01A04@A8bB068D48r9
$$ 186 -448 -406 691 -360 232 -485 584 -333 577 -492 -724 -817 517 -579 -101 104 0 18 -2 2068 448 349
29909C49K57i73E18f48g2B53J6a013L23c4m67A34a82m9n44C07a08l13p7E99B60
$$ 349 606 -973 518 -648 -72 253 269 -1013 -690 -34 -501 134 -182 -231 -775 307 -108 -421 -498 599 260
29931f20H16B56d76o80B56eE25j22b93C12K72k79d01a38B24e1l06j53F95A61j6
$$ -620 816 256 -476 -1156 256 -5 525 403 -293 312 584 305 -401 -138 224 -51 -357 -510 695 161 145
29952A45J060b43j23j053f2D60a28l52E95a042A0P30A16J60b28k68j06K15C86
$$ 145 1205 -243 -366 -1419 -62 460 -128 -480 595 -1042 10 740 116 276 -228 -496 -602 -387 386
29972f9E74c80C07g75O4C02f98C80L90a083d38M6a64j502A558e91c6p39B09L50
$$ -69 574 -380 307 -775 -711 302 -698 380 770 -1083 -438 -392 -164 -1666 1558 -591 -36 -775 209 559
29992E59d50j82C90A18M57e0C04E6d62e6p30b40D39G0J254D07M11l91h89C55J
$$ 559 -450 -632 390 118 575 -50 304 56 -462 -56 -786 -240 439 70 1324 407 818 427 -889 355 356
30013C56Q5N55b79Q9H74c14J5n33E12f6GJ284k45n09b5D03I9g21i2K3a4C8a145
$$ 356 441 996 -279 -190 874 -314 -299 -832 512 -66 7 1291 1046 537 -25 403 99 -721 -92 -69 -14 38 -1145
30037G16B95n7a392j15e11A307b77a13E58I6Q1b8k48q84C41F2e41a56m23E44J83
$$ 716 295 238 -1392 -1507 -511 1307 -277 -113 558 96 177 -28 -276 -1160 341 62 -541 -156 -579 544 727
30058G27a40F07g2F04d16GO74j82c17k53J04F36B87C9K20d00A387b14b3m22A6
$$ 727 -140 607 -72 604 -416 7 681 499 -317 -570 -466 636 287 39 259 -400 1387 -214 -23 -445 16
30080d79A51h38a59l19a10B01R30b82I94j4C34A28K61b1D6Q23i2D98a314D01D8
$$ -479 151 -838 -159 -478 -110 201 1131 -282 994 980 334 128 389 -21 46 869 -92 498 -1314 401 48
30102C68e04b38o78H2e50C4J89O20g88k87H12E0f13a78p60pA367a020M6d68p47
$$ 368 -504 -238 -916 82 -550 34 223 843 -788 -1075 812 50 -613 -178 -938 -945 1367 -1020 -974 -468 -1215
30123a215C31P83B19J113e55B20D8M18c26I82a134K05L41A00g43A961b59ql03
$$ -1215 331 1114 219 1332 -555 220 48 466 -326 982 -1134 -929 -588 100 -743 1961 -259 -267 -570
30142e70E04a059c83C19f06m48N15E62J96a293c13D96c06J18A04L6c25J52j165
$$ -570 504 -1059 -383 319 -606 -1054 -539 562 758 -1293 -313 496 -306 -188 104 140 -325 -173 -1338
30161a338N12A127d83o22D10i96E80C9c68A48f61a08D63e74j04J4b75m95b68l80
$$ -1338 -826 1127 -483 -1105 410 -996 580 39 -368 148 -661 -108 463 -574 -678 -664 -275 -770 -268 -648
30181f48F2A8a32B63c54G97AJ68J435A3d11C38i1q82c37A34g50l04A479K08a296
$$ -648 62 18 -132 263 -354 797 1 169 1604 13 -411 338 -91 -973 -337 134 -750 -1054 1479 1687 -1296
30203A225D4d07j770e20A16J13c79A55L56j21a94K9A555A25c6q64j77e3j318E24
$$ 1225 44 -407 -2177 -520 116 229 -379 155 511 390 -194 -165 1555 125 -36 -900 -1077 -53 -1371 524
30224D04g7p98F36N8h42D90b89j465h31A92a016A53O40d37k26B08H5L25L36c75
$$ 404 -77 -875 636 694 -842 490 -289 -1754 -831 192 -1016 153 793 -437 -663 208 85 410 746 -375
30245f53A087j11b2E14J445e79C30k8c97C62l9a062D50e17k40B34i18C69d88H38
$$ -653 1087 976 -22 514 1959 -579 330 302 -397 362 323 -1062 450 -517 -757 234 -918 369 -488 838
30266gF96d23j85l34a78m71f7A36N96a90A53d88n34k78e17b36E92E4M08g02B47
$$ -7 696 -423 -608 -942 -178 -649 -67 136 732 -190 153 -488 -1022 -1300 -517 -236 592 54 462 -702 247
30288c80a61l40I66A51b00o98c24o29q83e83A78b57F4b46cB60H5J73k8J50a171
$$ -380 -161 -501 966 151 -200 -898 -324 -953 -1836 -583 178 -257 64 -246 -3 260 85 258 230 380 -1171
30310G6N05f51e4I78C25O98b70o2D1M62J28Q23A54J045B00J48h68h4o5n23C39
$$ 76 581 -651 -54 978 325 1023 -270 -332 41 503 631 1454 154 1199 200 348 -868 -84 -149 -672 339
30332d03go7l11a86E20b62F81e49H21l98d56d4F40B02I2g13E3L5P47d71C1b10
$$ -403 -7 -74 -385 -186 520 -262 681 -549 821 423 -456 -44 640 202 92 -713 53 88 835 -471 31 -210
30355F90d69f0F97O26B39a152D02Q64D4N58c68a30m42F00k90i08A0L67b71B9e90
$$ 690 -469 -60 697 1323 239 -1152 402 1266 44 602 -368 -130 -572 600 310 -908 10 377 -271 29 -590
30377b53l60E73m8j00a193C21d03p7b31C77A22M13A59a181A55K21@b7A534p59
$$ -253 -613 573 525 425 -1193 321 -403 -480 -231 377 122 535 159 -1181 155 376 0 -27 1534 775
30397G75d11k1J40m9E36Q64c09i3C96b97l38B57j08M94c68E08c8j62r0q3C98d11
$$ 775 -411 -432 -292 -341 536 1400 -309 -93 396 -297 -635 257 149 643 -368 508 -38 -200 -290 -373 398 -411
30420c06j205A41f05b20A094n39a43E54B44e7D28j34e61m23C99A69b2D56d53F22
$$ -306 -1511 141 -605 -220 1094 555 -143 554 244 -57 428 294 -561 -984 399 169 -22 456 -453 622
30441a73j404e42J4l06D04k0i67D25A17A1i6q41B17J50c02k97B82H2L29j33a94
$$ -173 -1577 -542 -528 -834 404 384 -967 425 117 11 -96 -937 217 367 -302 -599 282 82 411 278 -194
30463d62J5F57f09B72I5L46A69e88m52b24i1B75e29I99a059A92b96n32B93i7p7
$$ -462 -447 657 -609 272 95 441 169 -588 -1040 -224 -91 275 -529 999 -1059 192 -296 -828 293 -97 -174
30484a74A85O14c5n91C05N43@a13B19N7a080d80b32q6B08b4A58c21A431C2j0b29
$$ -174 185 799 -35 -626 305 848 0 -113 219 276 -1080 -480 -232 -318 208 -24 158 -321 1431 32 22 -229
30507a15l8B82P27f23i0l55n6C3P32k14L52d75A6a575g68K83g5n2A780E07a035
$$ -115 -153 282 1009 -623 -90 -445 -501 33 765 551 903 -475 16 -1575 -768 -485 -75 -127 1780 507 -1035
30529A29J91a244J98H44a30G34c69C4e87j76m85E74A10a486B2J209a22n19F56
$$ 129 320 -1244 -1046 844 -130 734 -369 34 -587 -763 -1248 574 110 -1486 22 1231 -122 -641 656
30549h9r8j46E07f41G08A37P39c05A48L8D2J65J57f88L38l1B90K06E7b22C60K8
$$ -89 -187 -333 507 -641 708 137 876 -305 148 186 42 207 364 -688 -350 -381 290 496 57 -222 360 388
30571C88k4K2f30E07c62q51L44C4d04C68D6M14f68C21A33e89N1K32q25I15C23
$$ 388 364 386 -630 507 -362 -1213 -869 34 -404 368 46 460 -668 321 133 -589 -538 -306 -1131 915 323
30593h5n09A40f81j78H91a98A140a625C88A4K07Hcm62K07D8e81H74l50A34c97
$$ -85 -594 140 -681 -859 891 -198 1140 -1625 388 14 221 8 -3 -465 -258 48 -581 874 524 134 -397
30615g70B25d17J5A052k51a70j02n44l24B27e08I53e21p59b71A430d67A75a57
$$ -770 225 -417 -402 1052 801 -170 -272 -816 -1140 227 -508 953 -521 -1280 -271 1430 -467 175 -157
30635c3A05bH90b65m53q28h7m89K13r75f45H02e37O3A075B16e00j55l03E37k68
$$ -33 105 -2 890 -265 -718 -1546 -87 -576 -363 -1338 -645 802 -537 -474 1075 216 -500 -655 -958 537 269
30656B69g78K06F1i1j085e4E65d5C07c41A65d45l7A09N3M60fH12B82K132D21J34
$$ 269 -778 -572 61 -91 -1176 -54 565 -45 307 -341 165 -445 -482 109 162 622 -6 812 282 2414 421 555
30678E55j56a321A40f88C50h64k80a72B99O09a322a71P9q83K97j16b61j94J21
$$ 555 399 -1321 140 -688 350 -864 -1144 -172 299 908 -1322 -171 -92 -975 -678 -794 -261 -455 -334
30697c34j115a84F83g54j1A95a22E2c86H10d84j00A088D9R71B79d04l20n3q4a9
$$ -334 -1449 -184 683 -754 -765 195 -122 52 -386 810 -484 -584 1088 49 1020 279 -404 -724 -777 -861 -19
30719A051C72P98C85g67B7J3O40P19A96a05k08F65K69a731E11g41k97G29B76R43
$$ 1051 372 1170 385 -767 27 40 680 1399 196 -105 -313 665 934 -1731 511 -741 -1038 729 276 1219
30739A219a124A664C73b8G06L59c8A095i45b48B32M20C12O59e90B18K12g3p39
$$ 1219 -1124 1664 373 -28 706 1065 -38 1095 -945 -248 232 652 312 971 -590 218 430 -73 -812
30758h12a02C73j51L61o9a005c82m52m9a69q61D86d4aA35a339e42K12j30A209
$$ -812 -102 373 222 583 514 -1005 -382 -834 -883 -169 -1030 486 -44 -1 135 -1339 -542 -330 -460 1209
30779F47f12I57A05N04g0q6C73h98B54H6K65j2b78j817a07B27a226E07K63B94
$$ 647 -612 957 105 609 -70 -156 373 -898 254 86 351 339 -278 -2095 -107 227 -1226 507 770 294
30800a089N27F7pL15Ci5B26i45E81J31c62A374o20a3n72B39b49k23A683D16A07
$$ -1089 -562 67 60 375 3 -95 226 -945 581 712 -362 1374 754 -13 -585 239 -249 -472 1683 416 107
30822a62D52H1d05L8p02A72J092d65I1J36J655A26a006K82K30F16k15a95B95g16
$$ -162 452 81 -405 -367 -1069 172 1264 -465 91 227 1882 126 -1006 -724 -494 616 401 -195 295 -716
30843i64e0j738d2E56k8n9a709H33i2H7M51P1N4c62J73l54j78G10b57G43g58a63
$$ -964 -50 -1788 -42 556 528 469 -1709 833 -92 87 538 609 663 -362 -189 -543 -721 710 -257 743 -758 -163
30866a451f23B71b07j44j77j1q54D02J84b29A79c92q59D05a5j93m24H77f24K95
$$ -1451 -623 271 -207 -351 -528 -539 -1393 402 586 -229 179 -392 -1251 405 -15 -208 -632 877 -624 -329
30886c29k26F42a7m71B45d25J75q06b10F29d62I18i2l92A043A36o3Q78a194d46
$$ -329 -555 642 -17 -488 245 -425 -250 -1056 -210 629 -462 918 -92 -484 1043 136 73 951 -1194 -446
30907f98J56A38d59A227a93j1j02c3k75I21b67G09M4J75F1a23E39k8Q71m77L39
$$ -698 -542 138 -459 1227 -193 -204 -306 -33 -308 921 -267 709 753 928 61 -123 539 511 1382 905 1244
30928A244e23H07K59E1J77R1Q67n64c49a43k84H94a077D97e3m22C87j33B9K54
$$ 1244 -523 807 1066 51 228 319 1186 622 -349 -143 -427 894 -1077 497 -53 -475 387 254 29 283
30948B83A7K39a35n67E66g59A74e65D99J41B52O71l23d58I36e73G4a659A136C5
$$ 283 17 256 -135 -702 566 -759 174 -565 499 640 252 923 600 -458 936 -573 74 -1659 1136 35
30969c41k27A209a073K81m97F54j38j28M16G2K29G7i03@G77J222h39J34l53j95
$$ -341 -568 1209 -1073 -792 -1289 654 516 388 804 72 301 77 -903 0 777 1999 -839 -705 -1058 -1253
30989a253C78a209A654F26N6C40K84p0c16C00N48j11L58d75j59D46J265q54L90
$$ -1253 378 -1209 1654 626 682 340 624 554 -316 300 848 737 1095 -475 -634 446 1711 857 1247
31008A247B29g21A65N68g80H34j29J183a9F38a313E35k08a181b48A67M31L67C74
$$ 1247 229 -721 165 733 -780 834 705 1888 -19 638 -1313 535 327 -1181 -248 167 598 965 374
31028G40d52a41A132k60c1q29E76f96j11E10c23H46d82H2K07@A6J10d4I03m23
$$ 740 -452 -141 1132 872 -31 -860 576 -696 -807 510 -323 846 -482 82 289 0 16 126 -44 903 480
31049D80g13b09l74J50H69b43k31D73A58fm49A103c2A019b49L3E5b65H92M31D49
$$ 480 -713 -209 -583 -433 869 -243 -474 473 158 -6 -455 1103 -32 1019 -249 -216 55 -265 892 1323 449
31071B63g84L79f2j52j257e20k57F56b32p3a5j4H9Q98A8e42l78C71J318d32A87
$$ 263 -784 -405 -62 -214 -1471 -520 -777 656 -232 -305 -15 -29 89 987 18 -542 -920 371 1689 -432 187
31093C31c55J8E69j35g91F99k22a097g0o9@f02IQ11d35F19c58m97G54j04d19F76
$$ 331 -355 -337 569 434 -791 699 477 -1097 -70 -139 0 -602 9 820 -435 619 -358 -855 754 650 -419 676
31116F82d93A443L35h28F6a069N16B49c47i0m00a80D39j86J29d74b09q28L52J54
$$ 682 -493 1443 1778 -828 66 -1069 -553 249 -347 -90 -490 -180 439 253 382 -474 -209 -1037 -685 -531
31136e31J31H44D6J38G0l0J87j01c47C52b17D85d46a05A46k3aE20k45a87p94J65
$$ -531 -400 844 46 184 70 40 227 126 -347 352 -217 485 -446 -105 146 123 -1 520 275 -187 -981 -816
31158h16K4E19L89c67j50m22a27C0L8M31g3I3Q75C06M76e85G28f6B86f34a73n91
$$ -816 -792 519 908 -367 -517 -939 -127 30 68 499 -73 93 968 306 782 -585 728 -66 286 -634 -173 -764
31180g64J51A63B4M65L26d55l86A57h49Q0Q0c09i2A518a555M77A55O87B98J245
$$ -764 -613 163 24 489 815 -455 -841 157 -849 -769 -689 -309 -92 1518 -1555 -1078 155 842 298 1543
31200A543n06b73h6j75j22A042a32C67L96j97n9N77b81K1B26F8P13g09A99J53
$$ 1543 1037 -273 -86 -261 -383 1042 -132 367 763 566 507 1084 -281 -260 226 68 781 -709 199 352
31220C52A19O0a7l88A179m56d8l59k65A063M80b99D58h85k39A316h30D22L08k30
$$ 352 119 179 -17 -405 1179 723 -48 -407 -672 1063 1543 -299 458 -885 -1124 1316 -830 422 730 500
31240E00j49O03g25H63e43B89c1H36k16B83F8c76I4b90A63h11E35J103b87B32
$$ 500 351 954 -725 863 -543 289 -31 836 620 283 68 -376 94 -290 163 -811 535 1638 -287 232
31261C02b33A035C74d9p18J60K43H28K33A20e1E67f47K01C3c98E49a662F53N78
$$ 302 -233 1035 374 -49 -767 -607 -364 828 1061 120 -51 567 -647 -446 33 -398 549 -1662 653 1231
31281A231c58A612f0l33E27J74c7A548a55o97D17P82e6E46I3J375g11Ia095b86
$$ 1231 -358 1612 -60 -393 527 701 -37 1548 -155 -852 417 1199 -56 546 93 1468 -711 9 -1095 -286
31302D35L71g0n26H4a094a40l12p75a54E43b45A72B1P6J63a044a53N8A162m10
$$ 435 806 -70 -596 84 -1094 -140 -452 -1227 -154 543 -245 172 21 97 260 -1044 -153 -95 1162 752
31322G52h72l98L43J61J68A463E49E3a670N66b83j563A295d30C01Q0b15C59b29
$$ 752 -872 -1270 -927 -766 -598 1463 549 53 -1670 -1104 -283 -1846 1295 -430 301 381 -215 359 -229
31342a33n44G67E8c64k1l42E2K77j09K51A90e93q68B02F9a085B25a587c49e2j95
$$ -133 -677 767 58 -364 -385 -727 52 329 220 471 190 -593 -1461 202 69 -1085 225 -1587 -349 -52 -247
31363b47j040A47L42h13a24o29C21c15F73d75J02J3G32B55R02r3c39J52A076A44
$$ -247 -1287 147 489 -813 -124 -753 321 -315 673 -475 -373 -360 732 255 1157 1064 -339 -187 1076 144
31384a345A236l63b46eo45k15c8H82l95d00l78l5L43J06j46K51B78J837a164b25
$$ -1345 1236 873 -246 -5 -650 -865 -38 882 487 -400 -778 -813 -470 -364 -510 -259 278 2115 -1164 -225
31405F43i22G67d58F42b0B14j4K92e00n5k11b33K8G80M82E42b76H27f97K84A97
$$ 643 -922 767 -458 642 -20 214 200 492 -500 -555 -766 -233 -205 780 1262 542 -276 827 -697 -413 197
31427c02a8l24a9j95k70Q5a77G80b52b2I01a253G49A87K33k0M18C89N03a457f32
$$ -302 -18 -342 -19 -214 -484 -399 -177 780 -252 -22 901 -1253 749 187 420 400 818 389 892 -1457 -632
31449G86o7f52K29j82I06d48J63H86J31H6J4a4p65E30b90A118B63K44b94k06j51
$$ 786 719 -652 -423 -605 906 -448 -285 886 1017 86 100 -14 -779 530 -290 1118 263 507 -294 -500 -651
31470f51B10J552c7B54K55c73f6m93a40E42i84D82g89d2C6K24Q21L48e59i7p03
$$ -651 210 1762 -37 254 509 -373 -66 -559 -140 542 -984 482 -789 -42 36 260 1081 1429 -559 -97 -800
31491h00A79c12A183A69Q82g19c7j297N46J10A74L54j7N00c51H95g19E83A04k8
$$ -800 179 -312 1183 169 1051 -719 -37 -1334 -788 -678 174 528 511 1011 -351 895 -719 583 104 76
31511G6P81M56c38J53l22K40C30a50A1K01N71k52d34h0C16m7J065C96e88E76a48
$$ 76 857 1313 -338 -185 -507 -267 330 -150 11 212 783 531 -434 -80 316 269 1334 396 -588 576 -148
31533d47k23L02D00i46a53C15DR12b2l42q74c41l45j49a37n11A025A5J123B35
$$ -447 -670 -368 400 -946 -153 315 4 916 -22 -364 -1238 -341 -686 -835 -137 -648 1025 15 1138 235
31554h21J51D78R45A50i83A074C95a19j004B55A02D5i15b69p73A104l79c83D52
$$ -821 -670 478 1423 150 -983 1074 395 -119 -1123 255 102 45 -915 -269 -1042 1104 725 -383 452
31574a40H87A51J189d41j84p8A164A10b49d5H98l98d40J14f3A27c18C49M36B30
$$ -140 887 151 1340 -441 -625 -703 1164 110 -249 -45 898 500 -440 -326 -63 127 -318 349 785 230
31595f22k32H9e68j64A052e2l48n35L18H32B17K32J64H9N48K77d27D67c58A351
$$ -622 -854 89 -568 -732 1052 -52 -400 -935 -617 832 217 449 613 89 637 914 -427 467 -358 1351
31616a97m67J58m97E08A5d83F08r8a420e35k0A289l58A77R68g04A31O68A80c58
$$ -197 -664 -506 -1003 508 15 -483 608 510 -1420 -535 -555 1289 931 177 1145 -704 131 799 180 -358
31637i90I12L21D41h31C94A48R77m45f79D12A53d03A577j70C42A60i77q21A90
$$ -990 912 1233 441 -831 394 148 1125 680 -679 412 153 -403 1577 1407 342 160 -977 -1798 190
31657a363c69C36K41a01o10A009k02A00a20G6M24b23A87e08A051a446f5E05h7
$$ -1363 -369 336 577 -101 -711 1009 807 100 -120 76 500 -223 187 -508 1051 -1446 -65 505 -87
31677C50Aa213k90G72L97G6c26A88R89a690A729p78A72K17h43h3G22l41c03o9
$$ 350 1 -1213 -1503 772 1169 76 -326 188 1177 -1690 1729 951 172 389 -843 -83 722 381 -303 -372
31697c72J82D71b88n41n37c43R5I40d26A403m07c82A94f27G87k01O80a172d85
$$ -372 -190 471 -288 -829 -1366 -343 -248 940 -426 1403 996 -382 194 -627 787 586 1266 -1172 -485
31717a097F20a000L36A13Q75d81H16b59F26d5l83R8n67a28A074l11B9e97C45a91
$$ -1097 620 -1000 -664 113 988 -481 816 -259 626 -45 -428 -330 -897 -128 1074 763 29 -597 345 -191
31738E54Ab66A346o13g49L18O0k09F55b15g8r36A90L33j16N4l0K71K05A71mp2
$$ 554 1 -266 1346 733 -749 -431 -371 -580 655 -215 -78 -1014 190 523 407 461 431 702 907 171 167 95
31760I5j9a29c9j036H8O22i47A88J210A06L7P6a95k10G34a51n55A30J4M60b76
$$ 95 76 -129 -39 -1075 88 710 -947 188 1398 106 143 219 -195 -405 734 -151 -706 130 144 604 -276
31782D30a101c42F88J96C02a038m68F16M4A29a161d21D39i7A05Q25B17C0a76m47
$$ 430 -1101 -342 688 884 302 -1038 -1506 616 660 129 -1161 -421 439 -97 105 930 217 30 -176 -623
31802f23j8K01A388A19h90L36F60b44m6n7B66Q6a093a69B64L53a048L12L10GK96
$$ -623 -641 -440 1388 119 -890 -554 660 -244 -290 -347 266 352 -1093 -169 264 617 -1048 -736 -426 7 303
31823C03a377B10K96A54n4a56o29B41g65g7A250m42F2a93n78H12A03a304N53D01
$$ 303 -1377 210 506 154 100 -156 -785 241 -765 -77 1250 808 62 -193 -771 812 103 -1304 -751 401
31844F53h47e5A98O3q3b05@a109Ae09J80E46B24K52A13K70F8f24b03j190I78l59
$$ 653 -847 -55 198 261 178 -205 0 -1109 1 -509 -329 546 224 476 113 383 68 -624 -203 -1393 978 619
31866F19d05i0k186C95a55E44B9N38j47M28g47C62J65L5k36J120C06b82j70B87
$$ 619 -405 -90 -2276 395 -155 544 29 567 420 848 -747 362 527 562 326 1446 306 -282 -452 287
31887c57D53N17G9M18r6b20o94a39k28C29J24Q93a115A15K96P24d60a50E75a93
$$ -357 453 970 79 497 401 -220 -914 -139 -367 329 453 1346 -1115 115 411 1135 -460 -150 575 -193
31908D46c3l69j45A108A94j5q1Q72b25r44F7L27a149F11a81D07k00P93k32g26
$$ 446 -33 -402 -547 1108 194 179 98 970 -225 -1169 67 394 -1149 611 -181 407 207 1000 768 -726
31929B86c37E69f80G27f67F14f8B64o0J427p06J33R8L82G20b77H40F4R41c8F24
$$ 286 -337 569 -680 727 -667 614 -68 264 204 1631 925 1058 1156 1538 720 -277 840 64 1005 -38 624
31951D53C4P17e0r60D23j04J16g51B31g94A17e03j26A224h0A603a33A646d1C96
$$ 453 34 751 -50 -1010 423 319 435 -751 231 -794 117 -503 -629 1224 -80 1603 -133 1646 -41 396
31972F34d01A656B69R88c65C58A17d62I48M68d05k032b87H98N90k21l57K53f68
$$ 634 -401 1656 269 1257 -365 358 117 -462 948 1416 -405 -2437 -287 898 1488 1267 910 1163 -668
31992a027H98C9c56a41D07b56j448A8J276d50B29J23d26m03L57J87A368a61k01
$$ -1027 898 39 -356 -141 407 -256 -1704 18 1294 -450 229 352 -426 -829 -472 -285 1368 -161 -362
32011c62j61I02a582G46bC0i89b3l69E63j64a56k5D98B5b06j153i2o06J28D24
$$ -362 -523 902 -1582 746 -2 30 -989 -23 -392 563 399 -156 -181 498 25 -206 -1359 -92 -698 -570 424
32033H94e85K30P0R3A324n95B49m1bDN1N65b29q68D59A23L00R80h38L36n44F10
$$ 894 -585 -355 -285 -192 1324 729 249 208 -2 4 55 620 -229 -1097 459 123 423 1403 -838 -502 -1046 610
32056e71q06O24a74A337L05i0a0m13a61G01b68I7f0I16d35G2a347B38G6b29q69
$$ -571 -1377 -753 -174 1337 1642 -90 -10 -423 -161 701 -268 97 -60 916 -435 72 -1347 238 76 -229 -1098
32077a098C6P53A70a137d50E03f10l8d6o94b74j184a43c4j96A31J31l6J310g03
$$ -1098 36 789 170 -1137 -450 503 -610 -648 -46 -740 -274 -1458 -143 -34 -230 131 262 226 1536 -703
32098G06c40j530A223B84I5M83c09E52c40A09J64ij447Ba01j79A65c36A203b05
$$ 706 -340 -1870 1223 284 95 578 -309 552 -340 109 273 -9 -1456 2 -101 -280 165 -336 1203 -205
32119c29j12F14r9e74C86K1A03J00a037c95K9a73C97a144L27E2Q6J129C50d92
$$ -329 -441 614 515 -574 386 407 103 203 -1037 -395 -366 -173 397 -1144 -817 52 138 1267 350 -492
32140F02M53h37L43F30l4A39c04j69j19D89M12c84j90F0c81D44o6j82F1J303c99
$$ 602 1055 -837 -494 630 596 139 -304 -473 -592 489 901 -384 -574 60 -381 444 378 196 61 1364 -399
32162D93a492O67b05h4G05d15p05D39g7B39f18p1R8k45j061A11b25C9d27B12A02
$$ 493 -1492 -825 -205 -84 705 -415 -1120 439 -77 239 -618 -689 -591 -836 -1897 111 -225 39 -427 212 102
32184D09N07D26j3qJ58e06B80d89G32H8i84e1q87H9P58a307H74h48I3O26K34e75
$$ 409 916 426 413 405 563 -506 280 -489 732 88 -984 -51 -938 89 847 -1307 874 -848 93 719 953 -575
32207I29l65d85a13j376F27b19A047d47b00A05b15k66j52h2F35R47f12H06a004
$$ 929 564 -485 -113 -1489 627 -219 1047 -447 -200 105 -215 -481 -633 -82 635 1582 -612 806 -1004
32227f67l84N19A335e6j91E09A19a018E89A86L76e49I80d09C70a005H87b43A614
$$ -667 -1051 -532 1335 -56 -247 509 119 -1018 589 186 562 -549 980 -409 370 -1005 887 -243 1614
32247A290D35H6e95A16a152d39D3c18B00J94K79K73B26a697B75A11O2J02G7a22
$$ 1290 435 86 -595 116 -1152 -439 43 -318 200 394 673 946 226 -1697 275 111 173 275 77 -122
32268D37b50C11J32J064C94A70E4d30A534a36E29c36BJ077n02e12m88l60G85a66
$$ 437 -250 311 443 1507 394 170 54 -430 1534 -136 529 -336 2 1079 577 -512 -1000 -1360 785 -166
32289C6O17j97A78a017E8g4D25a072j27B1Q2i1D51D5a44F80L34e13B05P00d25
$$ 36 653 456 178 -1017 58 -74 425 -1072 -1199 21 103 -91 451 45 -144 680 1014 -513 205 905 -425
32311C48M76L95a51n46a39p11D5f28k86d31C77i86a46j141D84a30j17A697a021
$$ 348 824 1219 -151 -697 -139 -850 45 -628 -914 -431 377 -986 -146 -1287 484 -130 -247 1697 -1021
32331A191j73A05a117A13e89l78B5J00a335G90k17P29@B7J320C77J141e80F67
$$ 1191 1018 105 -1117 113 -589 -967 25 125 -1335 790 573 1302 0 27 1347 377 1518 -580 667
32351b18g8l39L3j76k79J31A91e65C80D0M18h6j52E91a966A34a85n87F93c29o61
$$ -218 -78 -417 -384 -560 -839 -708 191 -565 380 40 458 -86 -238 591 -1966 134 -185 -772 693 -329 -990
32372i90C56J11f83L12m41A72J99c05i0L6G65o3b113i74dj188N8D57b68k67l54
$$ -990 356 467 -683 -371 -812 172 371 -305 -90 -54 765 702 -2113 -974 -4 -1192 -1134 457 -268 -535 -889
32393h89F43J085D95b27j33H10c0o7A324A12J496a532P23D72r5j84J93Q89c71
$$ -889 643 1728 495 -227 -360 810 -30 -97 1324 112 1608 -1532 -809 472 377 193 386 1275 -371
32413C18p2f50A238k98f23B9f5I69D31c42B10i72h4j316r8e33k91A93e77b20g4
$$ 318 246 -650 1238 940 -623 29 -65 969 431 -342 210 -972 -84 -1400 -1498 -533 -824 193 -577 -220 -74
32435a43H8a238e81i7E37ld36J74g2q59J69H74a86D45j03g12A806a37p22F00g53
$$ -143 88 -1238 -581 -97 537 534 -436 -262 -72 -931 -762 874 -186 445 342 -712 1806 -137 -859 600 -753
32457e99E74k17A17N58e22A66b79C29J83B0K27b53G7M89a61l6n79d5l05A15N49
$$ -599 574 357 117 675 -522 166 -279 329 512 20 247 -253 77 566 -161 -197 -776 -45 -350 115 664
32478F64c63m02F42C21K27d42G6K96a87E83b99H90a205d85I81d83A85J192A51
$$ 664 -363 -765 642 321 548 -442 76 372 -187 583 -299 890 -1205 -485 981 -483 185 1377 151
32498a025a07n42A03Q25m19j00K54B69b08p1A95g50Q5G91A66a407K02B59J081
$$ -1025 -107 -649 103 928 509 409 663 269 -208 -279 195 -750 -665 791 166 -1407 -1205 259 1340
32517A340k35A85J56i07d13E80b12f6l48H5P7a007A451d52B87a00I05B2e96F5
$$ 1340 1105 185 341 -907 -413 580 -212 -66 -414 85 162 -1007 1451 -452 287 -100 905 22 -596 65
32538C98L40a162l97F08B69od48A27a23G91l73k7K81B52i1m58F80D6K69a397L33
$$ 398 738 -1162 -1559 608 269 263 -448 127 -123 791 418 391 672 252 -91 -549 680 46 315 -1397 -1064
32559a064f7j164f7k68j494I00g3j166A09a52d8A174a32D65N21l65P86i4p1A33
$$ -1064 -67 -1231 -67 -335 -1829 900 -73 -1239 109 -152 -48 1174 -132 465 986 621 1407 -94 -165 133
32580H22a32A93K32K28D2K19K7J275d41G48b19o7A464A38J96c93A93h02M6c55
$$ 822 -132 193 425 653 42 261 288 1563 -441 748 -219 -286 1464 138 334 -393 193 -802 -756 -355
32601C3a687B3O29E8J72d01E34f4A90c58F56F6a72A485o76a25H8J106A10g83i6
$$ 33 -1687 23 652 58 230 -401 534 -64 190 -358 656 66 -172 1485 809 -125 88 1194 110 -783 -96
32623h62c01@g30D96d66E28b72l7A100f74J39r0k99b15j81f1o36A837I2J117b45
$$ -862 -301 0 -730 496 -466 528 -272 -309 1100 -674 -535 -625 -924 -215 -396 -61 -697 1837 92 1209 -245
32645f6A47K64f26F26B55a65j28A09J057H7a076L46p6B38C2L87j65d85B36d23
$$ -66 147 411 -626 626 255 -165 -293 109 1166 87 -1076 -730 -806 238 32 419 254 -485 236 -423
32666d3C50c1A026a00A518D21K35e5B30J421b60q07A79O08e51b60o86d8B89a80
$$ -43 350 -31 1026 -100 1518 421 656 -55 230 1651 -260 -1067 179 787 -551 -260 -946 -48 289 -180
32687D11j3N54e73lH22k47a411e34E11H4b31H35c63J48C5K7a073M80C15N78B47
$$ 411 398 952 -573 -576 822 575 -1411 -534 511 84 -231 835 -363 -215 35 62 -1073 -593 315 893 247
32709a87A042d40C93L87B59d28A72Q18f4H64j7g47Ie92K45C99a37r66b47F05e06
$$ -187 1042 -440 393 780 259 -428 172 990 -64 864 847 -747 9 -592 -347 399 -137 -1103 -247 605 -506
32731a62E88B63a052G66A12a77E20R6r4A41L67b81q79d94k04k30B03b70j67I17
$$ -162 588 263 -1052 766 112 -177 520 616 522 141 508 -281 -1160 -494 -698 -928 203 -270 -437 917
32752A473n18f06C24O23e78a23A125n38a48gA79M74c40E88M1
$$ 1473 955 -606 324 947 -578 -123 1125 587 -148 -7 179 653 -340 588 629
32767F29
$$ Imaginary data points
##PAGE= N=2
##DATA TABLE= (X++(I..I)), XYDATA
0@A4@B2a4C4c3F0f6I5a21A49a95B31b97C51d38E19f29G44h88A044a225A434a664
$$ 0 14 0 22 -14 34 -33 60 -66 95 -121 149 -195 231 -297 351 -438 519 -629 744 -888 1044 -1225 1434 -1664
25A933b228B567b939C359c826D343d918E552f256G023g875H800i819A0930a2143
$$ 1933 -2228 2567 -2939 3359 -3826 4343 -4918 5552 -6256 7023 -7875 8800 -9819 10930 -12143
41A3464a4905A6471a8172B0018b2024B4197b6558B9118c1896C4910c8192D1760
$$ 13464 -14905 16471 -18172 20018 -22024 24197 -26558 29118 -31896 34910 -38192 41760
54d5654D9907e4567E9687f5341G1604g8588H6424i5283A05390a17051A30674a46846
$$ -45654 49907 -54567 59687 -65341 71604 -78588 86424 -95283 105390 -117051 130674 -146846
67A66408a90629B21516b62416C19358d04366E45083h20960A573630i143165j8864932
$$ 166408 -190629 221516 -262416 319358 -404366 545083 -820960 1573630 -9143165 -28008097
77b8008097N28964N159378O974069N06992j312299J22924O083702a776814E703653
$$ -28008097 -27479133 -22319755 -15345686 -14838694 -16150993 -16028069 -9944367 -1776814 5703653
87I661186K844274K222685J769074j064728l124009l548775j373315k65488j066618
$$ 9661186 12505460 14728145 16497219 15432491 12308482 8759707 7386392 7120904 6054286
96F054286B463899a829631k853405k22261P51752M70625J2723R02312i41245H50821
$$ 6054286 2463899 -1829631 -4683036 -4905297 -4153545 -3682920 -3670197 -2767885 -941245 850821
107A398709M2024R25995K278087J825914m52967k634201I85574l20786J209920
$$ 1398709 1440733 2366728 4644815 6470729 6017762 3383561 985574 664788 1874708
116A874708M12257H59796a008511o218A090474K074418j74663I07024f59818H1254
$$ 1874708 2286965 859796 -1008511 -1014729 1090474 3164892 2990229 907024 -659818 81254
127B251855J282928o99884j412788k65691J078944P96959q34743C39460f58777
$$ 2251855 3534783 2834899 1422111 1156420 2235364 3032323 2197580 339460 -658777
137A55422J575391N37588j055704c44011p23584L01189a58325C17805O27264J006652
$$ 155422 1730813 2268401 1212697 -344011 -1067595 -766406 -158325 317805 945069 1951721
147A951721Q68767q813p41105m14406N38489O15783q88394h02895k850342p87142
$$ 1951721 2820488 2811675 2070570 1656164 2194653 2810436 1922042 -802895 -3653237 -4440379
157d440379J639845f17347a1739j055331p95951g10960A931127K033116p9382
$$ -4440379 -2800534 -617347 -11739 -1067070 -1863021 -710960 1931127 3964243 3884861
166C884861j633951H44907j74796M17495j82891d7357o88792b45148A059990Q79324
$$ 3884861 2250910 844907 670111 1087606 904715 -47357 -736149 -245148 1059990 1939314
176A939314k44986p47956q5218R30373J080276J15599j010131G67473C61368M90321
$$ 1939314 1694328 946372 861154 1791527 2871803 2987402 1977271 767473 361368 851689
186H51689N97891j06712D30781f93962o16595K40038a37575I54262O64467k0099
$$ 851689 1449580 1342868 430781 -693962 -1310557 -1070519 -137575 954262 1618729 1598630
196A598630l52167J07785J131407J849097J470630O9319j420448j997670I48935
$$ 1598630 1246463 1354248 2485655 4334752 5805382 5874701 4454253 2456583 948935
206B99628I4129b36095n37399m11817p2850M0686k00491l69663N8830g05935A085696
$$ 299628 94129 -236095 -773494 -1185311 -1258161 -1217475 -1417966 -1787629 -1728799 -705935 1085696
218B722317O24183l59396m54113L18295J066522R34840m4153j019794j174513
$$ 2722317 3346500 2987104 2532991 2851286 3917808 4852648 4808495 3788701 2614188
227B614188n06972K77969M93246N9761o06351j080721B7577a073360p78322l07576
$$ 2614188 2107216 2385185 2878431 2938192 2331841 1251120 27577 -1073360 -1851682 -2159258
237b159258J69167M84075N89021c21624B94629O07857M64291K27065P1447J03717
$$ -2159258 -1990091 -1506016 -916995 -321624 294629 902486 1366777 1593842 1665289 1769006
247A769006J71247l022m74008E23668e04873o79687k35231m9378q1310M4412N40225
$$ 1769006 1940253 1937231 1463223 523668 -504873 -1184560 -1419791 -1469169 -1550479 -1506067 -965842
258i65842A02418R89912J30908C88015e42642J06654I48912J646931N00182j139815
$$ -965842 102418 1092330 1223238 388015 -542642 -435988 948912 2595843 3096025 1956210
268A956210G6657a137773R5336b03420C46925A54756c78189j95247a90871E05101
$$ 1956210 76657 -1137773 -1042437 -203420 346925 154756 -378189 -573436 -190871 505101
279A177528N88134N62782L91642j05178p03917r01089m60459K80710O82530L69744
$$ 1177528 1765662 2328444 2720086 2614908 1910991 1009902 549443 830153 1512683 1882427
289A882427m12241D15596g01565o52859n5013L30198M29663c01331a03973c4139
$$ 1882427 1470186 415596 -701565 -1354424 -1409437 -1079239 -649576 -301331 -103973 -34139
300G6828M50164R71822J251826R02139L2844p04805p18764j48132K66379k5256
$$ 76828 526992 1498814 2750640 3652779 3685623 2980818 2262054 2113922 2380301 2355045
310B355045p36608E47236i4139b7717B19633e9356q41493o44815L31856F6690
$$ 2355045 1618437 547236 -94139 -27717 219633 -59356 -900849 -1545664 -1213808 66690
321A502120Q47391K51397K17595N69218O72745J97569n38759r34234q15098n81134
$$ 1502120 2349511 2600908 2818503 3387721 4060466 4258035 3719276 2785042 1969944 1388810
331A388810F88441d38700j295732p52452L33623h94848E16591P92224m5257m44693
$$ 1388810 688441 -438700 -1734432 -2486884 -2153261 -894848 516591 1308815 1263558 818865
341H18865j64039N10388J034539R43856J83858q18267A124462D5874f2055G06229
$$ 818865 654826 1165214 2199753 3143609 3327467 2509200 1124462 45874 -62055 706229
352A575670K01357n89839C27485b07005m8268c4869B64454M06428N03927L09311
$$ 1575670 1777027 1187188 327485 -207005 -255273 -34869 264454 670882 1174809 1484120
362A484120k52109D71027a82934d9494I35294J149400M57112n01599r88686B91403
$$ 1484120 1232011 471027 -182934 -49494 935294 2084694 2541806 2040207 1051521 291403
373G5359Q1421n4017b22112l47965n2765K87540A0073R8430i5905k76845n9731
$$ 75359 156780 102763 -222112 -570077 -622842 -335302 10073 108503 -95905 -372750 -432481
384d32481a65617C04422M31379J89187j10364k74910j67964J84613N49360O02983
$$ -432481 -165617 304422 735801 924988 814624 539714 371750 556363 1105723 1708706
394A708706K24043l59836p35899A68532a07850C3278M00583N16043N38816M18727
$$ 1708706 1932749 1572913 837014 168532 -107850 33278 433861 949904 1488720 1907447
404A907447J19648k04299k58908R6153N68974O28276j993r64345C81426g15989
$$ 1907447 2027095 1822796 1563888 1660041 2229015 2857291 2855298 1890953 381426 -715989
415f50435D98255J349267N73915n00674I06795B58978J64832O92941N86706R7800
$$ -650435 498255 1847522 2421437 1920763 906795 258978 423810 1116751 1703457 1801257
425A801257k71673k82130j01577J5608K4521J01175K88526L87290J54137l64832
$$ 1801257 1529584 1247454 1145877 1161485 1186006 1287181 1575707 1962997 2117134 1752302
435A752302q08972A43062a72860I3193M96389K23417k76613i366l18980h8175
$$ 1752302 943330 143062 -172860 93193 589582 812999 536386 -9366 -328346 -88175
446E76902N87385Q4359l63951l41498J10082N24315M91408N3601l49552l15496
$$ 576902 1164287 1248646 884695 543197 653279 1177594 1669002 1722603 1373051 1057555
456A057555J25906N32415M73532p9412p34810C91371b62290l1119F6639K17346
$$ 1057555 1183461 1715876 2189408 2109996 1375186 391371 -262290 -293409 66639 283985
466B83985h992o94074o33547j94746K81426N02411b83093C8680J81862K8139H9709
$$ 283985 -8992 -703066 -1336613 -1531359 -1249933 -747522 -283093 38680 220542 248681 89709
478a57414o1907A86533Q85161R78005N11872k81706q76168E57907k41794L90933
$$ -157414 -219321 186533 1071694 2049699 2561571 2279865 1403697 557907 316113 707046
488G07046M55950j89934g7064j384514q41982K41824i47762B89947O97843O4233
$$ 707046 1162996 973062 -77064 -1461578 -2303560 -2061736 -947762 289947 987790 1052023
498A052023j37234J57641N96946P65746N38322J15304j93858k65237k49446l30391
$$ 1052023 914789 1072430 1669376 2435122 2973444 3088748 2894890 2629653 2380207 2049816
508B049816m91316m92619k06478J68092K18396j93723C41652d23198j99788a18764
$$ 2049816 1558500 1065881 859403 1027495 1245891 1052168 341652 -423198 -622986 -118764
519E85998K81968k46505k75580K01455O16007M26071k53926E62774b2108A65870
$$ 585998 867966 621461 345881 547336 1163343 1589414 1335488 562774 -22108 165870
530A033012Q64731K05290n16402p21916l19344K69063N50963L64956p6821m50747
$$ 1033012 1897743 2103033 1586631 864715 545371 814434 1365397 1730353 1653532 1202785
540A202785n83031A36389i2517f799C18078L44717J12825k17050A66415a12890
$$ 1202785 619754 136389 -92517 -6799 318078 662795 775620 558570 166415 -112890
551g3295B80071N10407M54757J99915j73859m64911C91892N7252O56014Q65381
$$ -73295 280071 790478 1245235 1445150 1271291 806380 391892 449144 1105158 1970539
561A970539L95440m68874H32035a03754k31654I1177N14278M3998A27752e68356
$$ 1970539 2365979 1897105 832035 -103754 -335408 91177 605455 649453 127752 -568356
572i53164J10540M00808h4513F4878P0892K08297L98333L96118J68230q1522j11104
$$ -953164 -842624 -441816 -84513 64878 135770 344067 742400 1138518 1306748 1225226 1114122
583A114122P4820K50644J88826j08043l99137m73257l20039j31973p5446b3437
$$ 1114122 1188942 1439586 1628412 1520369 1121232 647975 327936 195963 120517 -23437
594a82137J741G3324L38072J10190k55698i2879L0160E74387Q60767L50857n55105
$$ -182137 -180396 73324 411396 521586 265888 -92879 -62719 574387 1435154 1786011 1230906
605A230906A64789e11801b03464H32055Q99298Q1405o93736B80875a09290E2862
$$ 1230906 164789 -511801 -203464 832055 1731353 1812758 1119022 280875 -109290 52862
616D33789K46723J13j45319j88984A28529g0751r536B86963O91059O12641M4017
$$ 433789 680512 680625 535306 346322 128529 -70751 -80287 286963 978022 1590663 1634680
627A634680o49706H1145c77494g711I25693Q12687J53125n00442o82828C50080
$$ 1634680 984974 81145 -377494 -7711 925693 1738380 1891505 1391063 708235 350080
638E28619N40721N50912K39159j92086m88452m88643k27345O6912J74059Q2177
$$ 528619 1069340 1620252 1859411 1667325 1178873 690230 462885 529797 703856 786033
648G86033k8029j866J14420J14315j22677D03132b12033m28427j3211c08178A26456
$$ 786033 758004 756138 870558 984873 862196 403132 -212033 -640460 -653671 -308178 126456
660C84911P557j05583l0453J10629J61680R6602Q886j9647k7764j07722B32708
$$ 384911 392468 286885 256432 367061 528741 625343 634229 614582 586818 479096 232708
672c5650m5130B15967M13809R2531B52442e28693m86502K55345A12922Q18764
$$ -35650 -80780 215967 629776 722307 252442 -528693 -1015195 -759850 112922 931686
682I31686P4201A86357i65247o26270L99665a793A215252N41545k99265F96267
$$ 931686 1005887 186357 -965247 -1591517 -1191852 -1793 1215252 1756797 1457532 696267
693G23c19064P9378A34169N33406M97561J90998k78536D84035H932L3153N21872
$$ 723 -319064 -239686 134169 667575 1165136 1356134 1077598 484035 8932 42085 563957
704E63957N58285P4229n58115b11660n88110n205c60854I8391J02535d8482k57494
$$ 563957 1122242 1196471 638356 -211660 -799770 -804975 -360854 98391 200926 -48482 -305976
715c05976Q9572B56332N76286L37556k312j56520o7130J03823J71051J00290o463
$$ -305976 -216404 256332 832618 1170174 1167862 1011342 944212 1048035 1219086 1319376 1312913
726A312913l8134J0062O2847M1540r4419l07292D89602d9869l70058n8296b25225
$$ 1312913 1274779 1284841 1347688 1389228 1294809 987517 489602 -49869 -419927 -478223 -225225
738A84056L58050J37726j14933k48590A54734J27458M38030N22069K51581k54204
$$ 184056 542106 679832 564899 316309 154734 282192 720222 1242291 1493872 1239668
748A239668E59215a92045l83223K28867C76203P56365K50435n00998h8489p77674
$$ 1239668 559215 -192045 -575268 -346401 376203 1132568 1383003 882005 -88489 -866163
758h66163l4682b03396F57279L60693l62928h6907n31720L1519f5266E89857M34146
$$ -866163 -900845 -203396 657279 1017972 655044 -86907 -618627 -587108 -65266 589857 1024003
769A024003L6676l36187A78214c47677k83112Q5039a54846C02322K37792j11305
$$ 1024003 1060679 724492 178214 -347677 -630789 -545750 -154846 302322 540114 428809
779D28809A13572h1305H6331M43009L53926p0041C28485b06445j89839a60328
$$ 428809 113572 -81305 86331 529340 883266 813225 328485 -206445 -396284 -160328
790B37522K05713j15811D4770a58517n107e0646A3804f5817j65655q5831J18477
$$ 237522 443235 327424 44770 -158517 -163624 -50646 13804 -65817 -231472 -317303 -198826
801a98826H6271K62127M9655j77553i6k8258B41472M66408M22500J35109k82979
$$ -198826 86271 348398 398053 220500 -96 -28354 241472 707880 1130380 1265489 982510
812I82510C39194d00241m55865J15235g4095G70694N14274j30307D54987c78789
$$ 982510 339194 -400241 -856106 -740871 -74095 770694 1284968 1154661 454987 -378789
823h39333J86801E1903P73718L77982j91106D96012A11998O2234M43119M45954
$$ -839333 -652532 51903 825621 1203603 1012497 496012 111998 174232 617351 1063305
833A063305O9794m09057E9177d76021j15090b90814A31068J71421D9086d41328
$$ 1063305 1133099 724042 59177 -476021 -591111 -290814 131068 302489 49086 -441328
844g66167J37441f6640F04107M48272P6715k56612D19447e6359l11360J3635a8543
$$ -766167 -628726 -66640 604107 1052379 1129094 872482 419447 -56359 -367719 -354084 -18543
856D20031K43153r2669B78017F7976L7186K12349J81784L9281N95J54315L51991
$$ 420031 663184 570515 278017 67976 105162 317511 499295 538576 539171 693486 1045477
867A045477L25023m5261n69379a10665o94554j95669K40442L00487J2375l31380
$$ 1045477 1370500 1325239 755860 -110665 -805219 -1000888 -760446 -459959 -447584 -778964
877g78964m32706k17990J81391N82986A60956Q02485M96717L3251l29676l72796
$$ -778964 -1211670 -1429660 -1248269 -665283 160956 963441 1460158 1493409 1163733 790937
887G90937j09515K00455K49159p4617D84624d33070q54374m02961J73955N18871
$$ 790937 681422 881877 1131036 1056419 484624 -433070 -1287444 -1690405 -1516450 -997579
897i97579M36516L2378l65935m34105r6004M34672a60735G10521N62407P8491
$$ -997579 -561063 -528685 -894620 -1328725 -1424729 -990057 -160735 710521 1272928 1351419
907A351419l15490m26177k25681Q9031K45688R9375k37265I1482c77535k01752
$$ 1351419 1035929 609752 384071 473102 718790 818165 580900 91482 -377535 -579287
917e79287J04904a97739G6846J78604Q0692K7489J9249J3355j9620q5493j33252
$$ -579287 -474383 -197739 76846 255450 336142 363631 382880 396235 376615 291122 157870
928A57870E9435O178Q2654L9548F1068b32912l20840j63019J09776b41478B32545
$$ 157870 59435 65613 148267 187815 61068 -232912 -553752 -716771 -606995 -241478 232545
940E87237M7050k80316d1249j59566I8889O72078O44197J70584n02814A09400
$$ 587237 634287 353971 -41249 -200815 98889 770967 1415164 1585748 1082934 109400
951h50212m91162J18027M86129c26203K2230l29350l43532M079d85116C05655
$$ -850212 -1341374 -1223347 -737218 -326203 -303973 -633323 -976855 -972776 -485116 305655
962A030331L22837k03376n60581E6114h1847B51659N04849J94618l93932b83774
$$ 1030331 1353168 1149792 589211 56114 -81847 251659 756508 951126 557194 -283774
973a102029l55476K25400N76397i7853A53229C3352c00326k67205N3368f8709
$$ -1102029 -1457505 -1232105 -655708 -97853 153229 33352 -300326 -567531 -514163 -68709
984F07709O09147K66824j64549m90293B25676b87761l24447j58579o8651p14J10051
$$ 607709 1216856 1483680 1319131 828838 225676 -287761 -612208 -770787 -839438 -840152 -730101
995g30101K62122a27765A17137J6850c572n6006A47034L95396K96957p5431B83569
$$ -730101 -467979 -127765 117137 133987 -3572 -59578 147034 542430 839387 763956 283569
1007c57407m65354p1501K86978b06226D537a25884l77448l41620m4010L18279
$$ -357407 -822761 -894262 -607284 -206226 4537 -125884 -503332 -844952 -888962 -570683
1017e70683e8452C57642R4265A96059b00992k01213a53674E04407O95330K33568
$$ -570683 -58452 357642 451907 196059 -200992 -402205 -153674 504407 1199737 1433305
1027A433305n07928a44004j077970n22005K57029g09852C6293K34642a04486o51480
$$ 1433305 925377 -144004 -1221974 -1743979 -1486950 -709852 36293 270935 -104486 -755966
1037g55966l88738K26077a43070G37590M89643j05363n12558I3764i6946A14955
$$ -755966 -1144704 -918627 -143070 737590 1227233 1121870 609312 93764 -96946 114955
1048E43266L38490M866l66661e0019n14315k86941o4103M8636N5200L0485K9574
$$ 543266 881756 886622 519961 -50019 -564334 -851275 -915378 -866742 -811542 -781057 -751483
1059g51483P7115J81637a58868C04589M45447K29220q1068k92940B86173D6171
$$ -751483 -674368 -492731 -158868 304589 750036 979256 898188 605248 286173 46171
1070a80570l20655l84822k63559N1879L65965b94128i1375j72350l73876k24650
$$ -180570 -501225 -886047 -1149606 -1097727 -731762 -294128 -91375 -263725 -637601 -862251
1080h62251J79575a72996B93845M2862i9493n92611k97139K38936a11714E47120
$$ -862251 -682676 -172996 293845 336707 -99493 -692104 -989243 -750307 -111714 547120
1091H72371j48451B16529c82923l99257j0069L42079a237B07605c8642o11791
$$ 872371 723920 216529 -382923 -782180 -792249 -450170 -1237 207605 -38642 -650433
1101f50433o10872j91529M12393b41963D38367R8813b3716q23910m90521K06686
$$ -650433 -1261305 -1452834 -1040441 -241963 438367 537180 -23716 -847626 -1338147 -1131461
1111a131461c55930D81036M16313j36175C31525c175j9888A89116J75590r9829
$$ -1131461 -355930 481036 897349 761174 331525 -3175 -23063 189116 364706 264877
1121B64877a25336m85996l39413r1557Q0696J21583J16017J55300K03988a79465
$$ 264877 -125336 -611332 -950745 -1042302 -961606 -840023 -724006 -568706 -364718 -179465
1132h8474K3749E141J75511J96639Q3118n9678r1783N295R3128L0718j77783a11012
$$ -88474 -64725 5141 180652 377291 460409 400731 308948 314243 407371 438089 260306 -111012
1145d89401j89878L1087P5357j27305m16519m94104j60566M55468c59907F07256
$$ -489401 -679279 -648192 -572835 -700140 -1116659 -1610763 -1771329 -1315861 -359907 607256
1156A054675k36466B26546a74036d6330E02196N24938P1682n10980b66044p91535
$$ 1054675 818209 226546 -174036 -46330 502196 1027134 1098816 587836 -266044 -1057579
1166a057579m05451L3417K96239K96973R3103j78155l63023l32738j8264M73197
$$ -1057579 -1463030 -1429613 -1133374 -836401 -743298 -921453 -1284476 -1617214 -1635478 -1162281
1176a162281b92377E87652M43491j50521D09629A17267J92247N27418L79884j89028
$$ -1162281 -292377 587652 1031143 880622 409629 117267 309514 836932 1216816 1027788
1186A027788B51132g16059o63764j22935K53759K60221J3159j62739p1331K14540
$$ 1027788 251132 -716059 -1379823 -1502758 -1248999 -988778 -975619 -1138358 -1209689 -995149
1196i95149M30491a56061G6807J12792J49179K45529K31723O1448j66227l12218
$$ -995149 -564658 -156061 76807 189599 338778 584307 816030 877478 711251 399033
1206C99033F0250b24602k03337j16569k9984K3581P697o9132j54238j41363M8365
$$ 399033 60250 -224602 -427939 -544508 -574492 -550911 -543214 -612346 -766584 -907947 -859582
1217h59582L82826B09148O98404K99760l20688A48329d72446n8811e1979D53147
$$ -859582 -476756 209148 907552 1207312 886624 148329 -472446 -531257 -51979 453147
1228D23086b95974j003871o62561O0967O44149e31363a97094j77347m16432k66494
$$ 423086 -295974 -1299845 -1962406 -1901439 -1257290 -531363 -197094 -374441 -790873 -1057367
1238a057367J02327L96500a11002A59356r937a35346m73766m96177k78383J25236
$$ -1057367 -955040 -558540 -111002 159356 149419 -135346 -609112 -1105289 -1383672 -1258436
1248a258436N04144a58819A40153d5723m83652l46145J20258b05523C66585J55367
$$ -1258436 -754292 -158819 140153 -45723 -529375 -875520 -755262 -205523 366585 521952
1258E21952A30358e07939m27557K3381L06979K25313o2099j96929k5030K62421
$$ 521952 130358 -507939 -935496 -912115 -605136 -379823 -441922 -638851 -663881 -401460
1268d01460g6244c0900l41067m84211k41228J90972d32639a2303A00088h2268
$$ -401460 -76244 -30900 -371967 -856178 -1097406 -906434 -432639 -12303 100088 -82268
1279c07968o246c5562C47903K11172j29837A8226d97185m64965l42476j41185
$$ -307968 -314214 -35562 347903 559075 429238 18226 -497185 -962150 -1304626 -1445811
1289a445811J59724M68248b70533a9753k58426n47799k91025L91484B24788Q56785
$$ -1445811 -1286087 -817839 -270533 -19753 -278179 -825978 -1117003 -725519 224788 1081573
1299A081573P5161B97653i47909q08330J14851Q07377d7338A02577d60951q10767
$$ 1081573 1156734 297653 -947909 -1756239 -1641388 -834011 -47338 102577 -460951 -1271718
1309a271718m89099P7789M74027N46893b45407B0457J55151K4227G1485a29250
$$ -1271718 -1760817 -1683028 -1209001 -662108 -245407 20457 175608 199835 71485 -129250
1320b21200i8678A23712J9427b68485p54203o89369j91428M19578P13585b34623
$$ -221200 -98678 123712 143139 -268485 -1022688 -1712057 -1903485 -1483907 -770322 -234623
1331a12464j00984O4001B48402M92067J62715l50758f8438m49287m3783J98574
$$ -112464 -213448 -149447 248402 740469 903184 552426 -68438 -517725 -561508 -362934
1341c62934O6661k53918l83920j03478M24378A64541O27025K5196B26124e40312
$$ -362934 -296273 -550191 -934111 -1037589 -613211 164541 791566 816762 226124 -540312
1352i48526J51070c45174b1531l8541k90270k79522j08936N2900J63986K56240
$$ -948526 -797456 -345174 -21531 -60072 -350342 -629864 -738800 -685900 -521914 -265674
1362b65674D4085J90684H1822d69134o71246l04787L84947a18838H16330L02520
$$ -265674 44085 234769 81822 -469134 -1140380 -1445167 -1060220 -118838 816330 1118850
1372A118850n50531d62959p98244m6955O15453d2057e536p04843r42368m62425
$$ 1118850 568319 -462959 -1261203 -1308158 -692705 -42057 -5536 -710379 -1652747 -2115172
1382b115172L51261h70117b3826C68052l9342A42452G996a23822k59830l47804
$$ -2115172 -1763911 -870117 -23826 368052 328710 142452 7996 -123822 -383652 -731456
1392g31456k07699R5484K79263J48874j61884k85184k7224L92993C0834J73618
$$ -731456 -939155 -843671 -564408 -415534 -577418 -862602 -889826 -496833 30834 204452
1402B04452a85230o58706m19477P3761L47097K05101j24501k45789k1600L31551
$$ 204452 -185230 -843936 -1263413 -1189652 -842555 -637454 -761955 -1007744 -1029344 -697793
1412f97793b54895h1687k63937m93208k89321J98241c62872A14874j3424c96712
$$ -697793 -254895 -81687 -345624 -838832 -1128153 -929912 -362872 114874 101450 -396712
1423i26380n0214d13011D12920N18148j34536I4786g93134o84166k89018R8374
$$ -926380 -976594 -413011 412920 931068 796532 94786 -793134 -1477300 -1766318 -1667944
1433a667944L75911M93446c76691J69511j48327l23805j74025K52635E3958O53055
$$ -1667944 -1292033 -798587 -376691 -207180 -355507 -679312 -853337 -600702 53958 707013
1443G07013J22889B14455g90512o96540J05753f18511A38980J04869c84177q42069
$$ 707013 829902 214455 -790512 -1487052 -1381299 -618511 138980 243849 -384177 -1226246
1453a226246m12183K39294N57986L15730k08340n32061l88124O5769M38072M88989
$$ -1226246 -1638429 -1399135 -841149 -525419 -733759 -1265820 -1653944 -1588175 -1150103 -661114
1463f61114L00014J42982g1120A16896M1811a42324n73796n10476j20480K57758
$$ -661114 -361100 -218118 -71120 116896 158707 -142324 -716120 -1226596 -1347076 -1089318
1473a089318L02378J7884k74030k58469O5591L61916L34169J5161k40175j18925
$$ -1089318 -786940 -769056 -1043086 -1301555 -1235964 -874048 -539879 -524718 -764893 -883818
1483h83818L07341B7720L93694B09571d71161n24094J79511B488P87465P3288
$$ -883818 -576477 27720 421414 209571 -471161 -995255 -815744 2488 789953 863241
1493H63241A19548h85067n51295K08430e41054G7423J94381G8365a97266o7985
$$ 863241 119548 -885067 -1436362 -1227932 -541054 77423 271804 78365 -197266 -265251
1503b65251e3987B88444K50647J6015k20637d9668m82477n16727m12965j04707
$$ -265251 -53987 288444 539091 555106 334469 -49668 -532145 -1048872 -1461837 -1566544
1513a566544L26035O01231a74939j9311m47626l97992J35756b16106D99959J19211
$$ -1566544 -1240509 -639278 -174939 -194250 -641876 -1039868 -904112 -216106 499959 619170
1523F19170a3187r06594m77978K56358d75110c8069j47245n40251m22733R648
$$ 619170 -13187 -919781 -1397759 -1141401 -475110 -38069 -185314 -725565 -1148298 -1138650
1533a138650K98847J89777j48287l49725k16527R6111K85014J98087k3455j29513
$$ -1138650 -839803 -650026 -798313 -1148038 -1364565 -1268454 -983440 -785353 -808808 -938321
1543i38321M236K75912b09618A77935J26778j32528g6015k08428j53027j65468
$$ -938321 -934085 -658173 -209618 177935 304713 172185 -76015 -284443 -437470 -602938
1553f02938j87484q3637J61710L22343J55651l18007p06067n75619R6946Q45417
$$ -602938 -790422 -874059 -712349 -390006 -234355 -552362 -1258429 -1834048 -1737102 -891685
1563h91685A61425N21820l31680d69667n75169J49167a80199D73237M7768d5017
$$ -891685 161425 683245 351565 -469667 -1044836 -895669 -180199 473237 521005 -45017
1574g38005k86815K41581c43017a27766j50449l17438k25780p6110m6398p2768
$$ -738005 -1024820 -783239 -343017 -127766 -278215 -595653 -821433 -897543 -943941 -1016709
1584a016709K1410K54159c65992J54343l33695o85454n20434J13634P26683a08352
$$ -1016709 -995299 -741140 -365992 -211649 -545344 -1230798 -1751232 -1637598 -910915 -108352
1595A52235c13709p87391m73522J70219N91252c30637K5270l25704k72349N2152
$$ 152235 -313709 -1101100 -1574622 -1404403 -813151 -330637 -305367 -631071 -903420 -851268
1605h51268K64355J14227k58680m73024k85721J82217N54488b40417R6652l54137
$$ -851268 -586913 -472686 -731366 -1204390 -1490111 -1307894 -753406 -240417 -143765 -497902
1615d97902m89719k34052J55804L51917K38838j0499j38941n9425R2856J41369
$$ -497902 -987621 -1221673 -1065869 -713952 -475114 -485613 -624554 -683979 -591123 -449754
1625d49754R3201Q7035i0248A43932N3231a54577o86006o23148j37981M14619
$$ -449754 -356553 -269518 -90248 143932 197163 -154577 -840583 -1463731 -1601712 -1187093
1635a187093N61662J41968n16601q18399l98418N21489d27447H02089L97256E97359
$$ -1187093 -625431 -483463 -1000064 -1818463 -2216881 -1695392 -427447 802089 1199345 597359
1646d33467o39832J28895c55134G8008A368d21980l68538j02787N1863J6170m481
$$ -433467 -1073299 -944404 -355134 78008 1368 -421980 -790518 -893305 -841442 -825272 -829753
1657h29753J59500b77068A03581m610d03328o46647k37385M06936a61932B42040
$$ -829753 -670253 -277068 103581 98971 -403328 -1049975 -1287360 -880424 -161932 242040
1668b2444o75687m73241J17518N20226a61226j35720m71020k98752J94220c62882
$$ -22444 -698131 -1171372 -1053854 -533628 -161226 -296946 -767966 -1066718 -872498 -362882
1679a4734j16107m32436l02433J23010c20599d7671k32632o84288o97810k55305
$$ -14734 -130841 -563277 -865710 -742700 -320599 -47671 -280303 -964591 -1662401 -1917706
1689a917706L00354N64830M09683M2372k08972j79366K1104J63346J35077O93
$$ -1917706 -1617352 -1052522 -642839 -600467 -809439 -988805 -967701 -804355 -669278 -668585
1699f68585q7657o3170J1771M0297J5267N5236K60753I6880N78027J61016B66455
$$ -668585 -756242 -819412 -807641 -767344 -752077 -696841 -436088 96880 674907 835923 266455
1711h22244r07755p4104P52891b08128P9383q61860j109214l76391P58451c16416
$$ -822244 -1729999 -1804103 -1051212 -208128 -128745 -990605 -2099819 -2476210 -1717759 -316416
1722H04241K73457m07412A73632C591R2000L3814e6947k56404q9479Q1704L335
$$ 804241 1077698 670286 173632 3591 95591 129405 -56947 -313351 -402830 -321126 -317791
1733c17791k91028m84706l04121J53607M85262L71403p6753m23079l04133J83861
$$ -317791 -608819 -1093525 -1397646 -1244039 -758777 -387374 -464127 -887206 -1191339 -1007478
1743a007478d24264F3600k8008d78430n43929j25944L21634L55305n6386n07759
$$ -1007478 -424264 63600 35592 -478430 -1022359 -1148303 -826669 -471364 -527750 -1035509
1753a035509n40054q5142M49361N74489J80566l37503m57418m6971N22744f5186
$$ -1035509 -1575563 -1660705 -1211344 -636855 -456289 -793792 -1251210 -1298181 -775437 -65186
1764B50874a11484p97817p04638k23864K63007M72867L84680J71773O047r3193
$$ 250874 -111484 -909301 -1613939 -1837803 -1574796 -1101929 -717249 -545476 -539429 -632622
1774f32622j63030k00806j12907J57821d66933A21852K87092A30320e20733m58725
$$ -632622 -795652 -996458 -1109365 -951544 -466933 121852 408944 130320 -520733 -979458
1784i79458K10941E7237Q19562J26510B58248h75981p69529q115N21692M44723
$$ -979458 -768517 57237 876799 1003309 258248 -875981 -1645510 -1653625 -1131933 -687210
1794f87210p1799m93650m27607P0141N97675b48478B71584J46658o7675p9195
$$ -687210 -759009 -1252659 -1680266 -1610125 -1012450 -248478 271584 418242 350567 271372
1804B71372o5130C3740c10142l75097j87215O2775J16587j05653m06009m75488
$$ 271372 206242 33740 -310142 -685239 -872454 -809679 -693092 -798745 -1204754 -1680242
1814a680242j98952K16341M27104K83956k2574j49053O6736M02530a81224f6557
$$ -1680242 -1879194 -1662853 -1235749 -951793 -974367 -1123420 -1056684 -654154 -181224 -66557
1825d45884n33128j67584L80780b37032N2330o65343r42687m66699M18698h45878
$$ -445884 -979012 -1146596 -765816 -237032 -184702 -850045 -1792732 -2259431 -1840733 -845878
1836a9124A08561c49222m59033L3033b63451B95416J82245B30671a85627l53211
$$ -19124 108561 -349222 -808255 -775222 -263451 295416 477661 230671 -185627 -538838
1846e38838k76646l14876l34288j45865K09971M16449K32331k29130n21710k86335
$$ -538838 -815484 -1130360 -1464648 -1610513 -1400542 -984093 -751762 -980892 -1502602 -1788937
1856a788937L63715d98627D39989L93124k58280G2542a38662A39042M68941J36993
$$ -1788937 -1425222 -498627 439989 833113 574833 72542 -138662 139042 607983 744976
1866G44976B50978f91564q82234l94796J07900K85052J15629r9939o6506K33566
$$ 744976 250978 -691564 -1573798 -1968594 -1860694 -1575642 -1460013 -1559952 -1626458 -1392892
1876a392892N33269b80833G9102R6540J2112J01994J81501P1680k07193a23019
$$ -1392892 -859623 -280833 79102 175642 187754 289748 471249 542929 335736 -123019
1887f09483l06379r1666j9536q9688j51742p1184Q8637J66784P4280o3107j654
$$ -609483 -915862 -1007528 -1027064 -1116752 -1268494 -1339678 -1251041 -1084257 -1009977 -1073084 -1074738
1898a074738L34865b3534G29242K61426D68279e65999q56051r0762O61335h3784
$$ -1074738 -739873 -23534 729242 990668 468279 -565999 -1422050 -1512812 -851477 -83784
1909C5424f97071j023892m68167M82144f55184A70991J05834a74316m71741j42440
$$ 35424 -697071 -1720963 -2189130 -1706986 -655184 170991 276825 -174316 -646057 -788497
1919g88497R3544N2289o2721J0295J96412J64380k29682o87545o96627r5947O65555
$$ -788497 -694953 -642664 -705385 -695090 -498678 -334298 -563980 -1251525 -1948152 -2044099 -1378544
1930a378544d66168g2621m34688q06318l64721M96490a42266G01267J57253m00160
$$ -1378544 -466168 -72621 -507309 -1313627 -1678348 -1181858 -142266 701267 858520 458360
1940D58360A5516a03475B7207K7638b40245n13642m33334j46479R8462J34182
$$ 458360 15516 -103475 27207 54845 -240245 -753887 -1187221 -1333700 -1235238 -1101056
1950a101056j07j49838j42140O7064L66344d03905F5759J53018D4096b25385j04037
$$ -1101056 -1101163 -1251001 -1393141 -1326077 -959733 -403905 65759 218777 44096 -225385 -329422
1961c29422J26181a6211B0458a48984k63630k50707k69076l58993l78745j63100
$$ -329422 -203241 -16211 20458 -148984 -412614 -663321 -932397 -1291390 -1670135 -1833235
1971a833235K35574M95929L38494j43168m87839k60177M57475a12936H89100J57545
$$ -1833235 -1597661 -1101732 -763238 -906406 -1394245 -1654422 -1196947 -112936 889100 1046645
1981A046645B06341a037211p98887N2392N91790M68064r3287n59778n80254k07855
$$ 1046645 206341 -1037211 -1836098 -1783706 -1191916 -723852 -817139 -1376917 -1957171 -2165026
1991b165026K54345N41058N96288b82676G999M5422a54694l62130l03891k0791
$$ -2165026 -1910681 -1369623 -773335 -282676 7999 53421 -154694 -516824 -820715 -841506
2001h41506L28649c8786A99514g9052p07592o94733k03930L96550O33089c24020
$$ -841506 -512857 -38786 199514 -79052 -786644 -1481377 -1685307 -1288757 -655668 -324020
2012e21962m42001j56690L88021d6256D21464l3947E9511a19477C5686K12887
$$ -521962 -963963 -1120653 -732632 -46256 421464 387517 59511 -119477 35686 248573
2022B48573F7095f25188p91786l25352L23673N94687K86929k49181m85220k32568
$$ 248573 67095 -625188 -1416974 -1742326 -1418653 -823966 -537037 -786218 -1271438 -1504006
2032a504006K42114N19492c00027a19559j5129p8111j11779j85281k09431o6691
$$ -1504006 -1261892 -742400 -300027 -119559 -134688 -212799 -324578 -509859 -719290 -785981
2042g85981K06573a94053G4404g6465o06206p55977m47313J44796O24567d64445
$$ -785981 -579408 -194053 74404 -76465 -682671 -1438648 -1885961 -1741165 -1116598 -464445
2053b50760l50072n77166k56800L97678a64150F00912J28097A54727f79002n26669
$$ -250760 -600832 -1177998 -1434798 -1037120 -164150 600912 729009 154727 -679002 -1205671
2063a205671J5124L27223K08042j19189k93117j75324P3969K16079J97884J87390
$$ -1205671 -1190547 -863324 -655282 -774471 -1067588 -1242912 -1168943 -952864 -754980 -567590
2073e67590b68138A55528L33362k3853F4284c97993j44667K54693C8518G503e21718
$$ -567590 -268138 155528 488890 465037 64284 -397993 -542660 -287967 38518 7503 -521718
2085a251872m68036Q245K89491J86430r4542j72391J30646N95090I528M95960
$$ -1251872 -1719908 -1711663 -1422172 -1235742 -1330284 -1502675 -1372029 -776939 9528 505488
2095E05488o8070A8306b55638g5554C73137K00349A50320g76077q91516l61999
$$ 505488 437418 18306 -255638 -75554 373137 573486 150320 -776077 -1667593 -2029592
2105b029592K44604N02213L29368O234j47490m6490J39718K27917K18752K42621
$$ -2029592 -1784988 -1282775 -953407 -947173 -1094663 -1141153 -1001435 -773518 -554766 -312145
2115c12145B5269L40699P2378C0221g20781o20035n8016M82297d00997j4560o61824
$$ -312145 25269 365968 438346 30221 -720781 -1340816 -1398832 -916535 -400997 -415557 -1077381
2126a077381q49176l91223L73315Q68067c04205e5360k34502l19201j9452b86195
$$ -1077381 -1926557 -2317780 -1944465 -1076398 -304205 -55360 -289862 -609063 -628515 -286195
2137A43363J74596I9613c55355m12306k02054l8671k5331r5959j06129q844J09582
$$ 143363 317959 99613 -355355 -767661 -969715 -1008386 -1033717 -1129676 -1235805 -1244649 -1135067
2148a135067J26751L2103n0108J5464K22099L86675f7578g560k07487k37376m2761
$$ -1135067 -1008316 -976213 -1026321 -1010857 -788758 -402083 -67578 -7560 -215047 -452423 -495184
2159d95184J44798O3666k43347m66217l30362P8931L71697K34436k28624n39270
$$ -495184 -350386 -286720 -530067 -996284 -1326646 -1247715 -876018 -641582 -870206 -1409476
2169a409476l09831L67614c95161E51281L15923D24484c29593m39030J43401a61042
$$ -1409476 -1719307 -1351693 -395161 551281 867204 424484 -329593 -768623 -625222 -161042
2180A27447d5398n06073m89888k43048k0473P4777J16378J97589K56440J50661
$$ 127447 -45398 -551471 -1041359 -1284407 -1304880 -1230103 -1113725 -916136 -659696 -509035
2190e09035j15541k96991j51899K99132h3647E50811Q8124G8042g31827m89192
$$ -509035 -624576 -921567 -1073466 -774334 -83647 550811 638935 78042 -731827 -1221019
2200a221019J14219M93338b55635j49297n86152o07499k09992K99389N78176d24174
$$ -1221019 -1106800 -613462 -255635 -404932 -991084 -1598583 -1808575 -1509186 -931010 -424174
2211a96095j2609q4050m1631k6357j08945k27772k52741j31557O0070J65397J01917
$$ -196095 -208704 -292754 -334385 -360742 -469687 -697459 -950200 -1081757 -1021687 -856290 -754373
2222g54373o4659j66485j03878P5079K18051K25099J42918Q0446P4256N5327m0896
$$ -754373 -819032 -985517 -1089395 -1014316 -796265 -571166 -428248 -347802 -273546 -218219 -259115
2233b59115j56942j49897M5013b34993I9339O6358a94995o12584m53629L2907
$$ -259115 -416057 -565954 -520941 -234993 99339 165697 -194995 -807579 -1261208 -1228301
2243a228301M81497b13886h7555m16425o42072l34804K85662d61131A91111J13125
$$ -1228301 -746804 -213886 -87555 -503980 -1146052 -1480856 -1195194 -461131 191111 304236
2253C04236a55511o41424l55431J12014M06609b41220d9896j2117j47315k55467
$$ 304236 -155511 -796935 -1152366 -1040352 -633743 -241220 -49896 -62013 -209328 -464795
2263d64795l39603k96712m6594K84731M11062J35013l86425o97154m40803K65235
$$ -464795 -804398 -1101110 -1147704 -862973 -451911 -316898 -703323 -1400477 -1841280 -1576045
2273a576045f91859B09827L04676A16606e31039l22490J77442c07743J17644k66156
$$ -1576045 -691859 209827 514503 116606 -531039 -853529 -676087 -307743 -190099 -456255
2283d56255m08311k18502O3165J68386N2234q0909m5797J36103K81760K17724
$$ -456255 -864566 -1083068 -1019903 -851517 -799283 -880192 -925989 -789886 -508126 -290402
2293b90402m522k25736k84511j69349L119J39687J95422J94718J44548L7008r6804
$$ -290402 -294924 -520660 -805171 -974520 -971401 -831714 -636292 -441574 -297026 -260018 -356822
2304c56822k01349j83757m4067J43977K47045J79315l8586k74620l62791j94521
$$ -356822 -558171 -741928 -785995 -642018 -394973 -215658 -254244 -528864 -891655 -1086176
2314a086176J53326M29595a20607k7143n27143o98371l53681K86871f85668A928
$$ -1086176 -932850 -503255 -120607 -147750 -674893 -1373264 -1726945 -1440074 -685668 1928
2325A73111b04072n42482k45998K39217b11852B58821J13697H9112d37577n36508
$$ 173111 -204072 -746554 -992552 -753335 -211852 258821 372518 89112 -437577 -974085
2335i74085l61456r1532J83254L58470L49610J41867j67600l66346k97879J8021
$$ -974085 -1335541 -1427073 -1243819 -885349 -535739 -393872 -561472 -927818 -1225697 -1207676
2345a207676L62926c74612a28629j37073l48001k08360J50347b72939B4461e0007
$$ -1207676 -844750 -374612 -128629 -265702 -613703 -822063 -671716 -272939 24461 -50007
2356d37393l67605o1403K13172J85593r9100l33372k52094Q5217L71058L44850
$$ -437393 -804998 -866401 -653229 -467636 -566736 -900108 -1152202 -1066985 -695927 -351077
2366c51077P6600j48435j11478J12182a58741B5209b8430k42039k61907j60608
$$ -351077 -274477 -422912 -534390 -422208 -158741 25209 -28430 -270469 -532376 -692984
2376f92984n7884R574R2048K04636a91913g2411j89089m69998m76615j40237L29667
$$ -692984 -750868 -741294 -649246 -444610 -191913 -72411 -261500 -731498 -1208113 -1348350 -1018683
2387a018683d29094C009c7213m71126n50843k34665K38528e24150g4259b0625
$$ -1018683 -429094 3009 -37213 -508339 -1059182 -1293847 -1055319 -524150 -74259 -20625
2398d02582n67099l80674M8300M28249c59711h5473p3468k66574j95468L6257
$$ -402582 -969681 -1350355 -1302055 -873806 -359711 -85473 -158941 -425515 -620983 -584726
2408e84726K09843a63600O8383r5685j90507k14718j88903r9233L8315J66922
$$ -584726 -374883 -163600 -95217 -190902 -381409 -596127 -785030 -884263 -845948 -679026
2418f79026J91154N7783j51033k67800j79435N4746K41849K36160N7899j06544
$$ -679026 -487872 -430089 -581122 -848922 -1028357 -973611 -731762 -495602 -437703 -544247
2428e44247q1306J06916b54368e4297o7245l20053l32617r0416J80434K23585
$$ -544247 -625553 -518637 -254368 -54297 -121542 -441595 -774212 -864628 -684194 -460609
2438d60609j1877l15646m06375j68374K25042M68892b87689N8670k30801k79691
$$ -460609 -472486 -788132 -1194507 -1362881 -1137839 -668947 -287689 -229019 -459820 -739511
2448g39511r9219J36405K63772a86539b1196A2918a36182l42041l97960j95812
$$ -739511 -838730 -702325 -438553 -186539 -21196 12918 -136182 -478223 -876183 -1071995
2458a071995K01717c70531D5020C302e24844o26125k30306L60881c26614B16241
$$ -1071995 -870278 -370531 45020 3302 -524844 -1150969 -1381275 -1020394 -326614 216241
2469B84828f0048m37188k24422O5024K15008J66983J6066j29119j89533j51328
$$ 284828 -60048 -497236 -721658 -656634 -441626 -274643 -258577 -387696 -577229 -728557
2479g28557k3673J22585K01964J45968k5063j98311k44803j31692M3696J42745
$$ -728557 -752230 -629645 -427681 -281713 -306776 -505087 -749890 -881582 -837886 -695141
2489f95141J19764K5079l5531k1558L3814Q1368J05760J02112Q0732K6788l6761
$$ -695141 -575377 -550298 -585829 -607387 -573573 -492205 -386445 -284333 -203601 -176813 -213574
2500b13574p1559o1446m7403q8440j84415k33700j16153J58779M14839a9984I9307
$$ -213574 -285133 -346579 -393982 -482422 -666837 -900537 -1016690 -857911 -443072 -19984 99307
2512b01226n15964l35459J21473d30486G2628J24219a60953o03878m83162j27471
$$ -201226 -717190 -1052649 -931176 -430486 72628 196847 -160953 -764831 -1247993 -1375464
2522a375464K10559L48093K70558O5883j45562k43503j65424P6714L72208f5519
$$ -1375464 -1164905 -816812 -546254 -480371 -625933 -869436 -1034860 -958146 -585938 -65519
2533C26699J5083c6426n22987l14943Q9006L60022a38360q9021m67619n41049
$$ 326699 341782 -36426 -559413 -874356 -785350 -425328 -138360 -227381 -695000 -1236049
2543a236049k36752K25036N22642b39789d0083r5421k18106j44284k735R8630
$$ -1236049 -1472801 -1247765 -725123 -239789 -40083 -135504 -353610 -497894 -500629 -401999
2553d01999J08147O0960n0o7706j13247j28288q7648k3015L0260M7266L5364L6484
$$ -401999 -293852 -232892 -232942 -300648 -413895 -542183 -629831 -652846 -622586 -575320 -539956 -503472
2565e03472O0565P5445M1251m3492j20520j04066R007J33940J43474J346k20843
$$ -503472 -442907 -367462 -326211 -369703 -490223 -594289 -585282 -451342 -307868 -306522 -527365
2576e27365l55416k81267k1088K82166M49582g0220E7414i3692k59712j19000
$$ -527365 -882781 -1164048 -1185136 -902970 -453388 -70220 57414 -93692 -353404 -472404
2586d72404J82828A16821L50904k713I565f93280n78028j55079L04260N14858
$$ -472404 -289576 116821 467725 465012 9565 -693280 -1271308 -1426387 -1122127 -607269
2596f07269b35368J0334l04743l47752j00948K63616b11298B48284J60029A93994
$$ -607269 -235368 -225034 -529777 -877529 -978477 -714861 -211298 248284 408313 193994
2607b62612m28970j64640J70312c26519e8266o3461m11526n38645l45211L5180
$$ -262612 -691582 -856222 -685910 -326519 -58266 -121727 -533253 -1071898 -1417109 -1381929
2617a381929L45625L84885J72193j02160k23265j28630P2852K17046K18081J22568
$$ -1381929 -1036304 -651419 -479226 -581386 -804651 -933281 -860429 -643383 -425302 -302734
2627c02734K3528k5048l9223n8014p5770o7735j4142N2845Q9826P4765K6954k9882
$$ -302734 -279206 -304254 -343477 -401491 -477261 -544996 -559138 -506293 -416467 -341702 -314748 -344630
2639c44630r9395j81192k19539j43828O5758K99215b42842a1962n5110k46175
$$ -344630 -444025 -625217 -844756 -988584 -922826 -623611 -242842 -11962 -67072 -313247
2649c13247j90714P1110a14803B20470R1298F1303d05108m21438j54836J60419
$$ -313247 -503961 -432851 -114803 220470 311768 61303 -405108 -826546 -981382 -820963
2659h20963L46957a62829h0707k09126l85676l16999k9815L04682b77016a2824
$$ -820963 -474006 -162829 -80707 -289833 -675509 -992508 -1022323 -717641 -277016 -12824
2670a36041m35307m28163r0813L40549a83381B57566O7002B2376d25280l16685
$$ -136041 -571348 -999511 -1090324 -749775 -183381 257566 324568 22376 -425280 -741965
2680g41965l2019K14250b78317a15585n3108k21982k36206r2153J15589K54216
$$ -741965 -773984 -559734 -278317 -115585 -168693 -390675 -626881 -719034 -603445 -349229
2690c49229a17910d3216j06966j83750j11277M6472J62291h6579L3162r7392j43542
$$ -349229 -117910 -43216 -150182 -333932 -445209 -398737 -236446 -86579 -53417 -150809 -294351
2701b94351j08723n9890o8078j35559j97261j74561n9771R3694K07798K30814
$$ -294351 -403074 -462964 -531042 -666601 -863862 -1038423 -1098194 -1004500 -796702 -565888
2711e65888J73300R9092Q0759g4088A51526K45478J16403j50793f9734n65641
$$ -565888 -392588 -293496 -212737 -74088 151526 397004 513407 362614 -69734 -635375
2721f35375m38278j09666K17548L32544J71981j19828k92871j87909J38137M48390
$$ -635375 -1073653 -1183319 -965771 -633227 -461246 -581074 -873945 -1061854 -923717 -475327
2731d75327E5485L39005j297A09081b71032k74384n0382J72162a61644a3451j19660
$$ -475327 55485 394490 393193 109081 -271032 -545416 -595798 -423636 -161644 -13451 -133111
2742a33111l82744m43920k37391J19245L69961L28384L2301k71266l35125j13466
$$ -133111 -515855 -959775 -1197166 -1077921 -707960 -379576 -347275 -618541 -953666 -1067132
2752a067132K04403L59220K46682k0605k20711k30033r3272N2286J11285Q5648
$$ -1067132 -862729 -503509 -256827 -277432 -498143 -728176 -821448 -769162 -657877 -572229
2762e72229N0165M4806N3494M4614J0764k0979l4353l5961l2510k3847J8632Q8577
$$ -572229 -522064 -477258 -423764 -379150 -368386 -389365 -423718 -459679 -492189 -516036 -497404 -408827
2774d08827J46517a25591M9846n4287q5195J764g7384I6814L6650a02499m55061
$$ -408827 -262310 -125591 -75745 -130032 -215227 -213463 -77384 96814 133464 -102499 -557560
2785e57560m46004j76413J87301M24033a81610e6850j65465k71302j19532J75347
$$ -557560 -1003564 -1179977 -992676 -568643 -181610 -56850 -222315 -493617 -613149 -437802
2795d37802d5799C07194N5857D4354d80076m17946q5445K61732c26987g0477l1472
$$ -437802 -45799 307194 363051 44354 -480076 -898022 -983467 -721735 -326987 -70477 -101949
2806a01949k61152k92446j29493J06338K73164a28825d223j00144k74097k89408
$$ -101949 -363101 -655547 -785040 -678702 -405538 -128825 -4223 -104367 -378464 -667872
2816f67872j19759J54168b74744G1478J10139g729l26348k09804N7419K36759
$$ -667872 -787631 -633463 -274744 71478 181617 -7729 -334077 -543881 -486462 -249703
2826b49703e8483k9543k24656k33027r5138L9241K9011q6456j66101q1599J17646
$$ -249703 -58483 -88026 -312682 -545709 -640847 -601606 -572595 -659051 -825152 -906751 -789105
2837g89105K79824b41598J14776m6813q7119J287J11505b1012B150a38307k81641
$$ -789105 -509281 -241598 -126822 -173635 -260754 -259467 -147962 -21012 2150 -138307 -419948
2848d19948l48901l34429k21457j1284K28556L73759L22361Q6341j48780j83674
$$ -419948 -768849 -1103278 -1324735 -1336019 -1107463 -733704 -411343 -325002 -473782 -657456
2858f57456M4972b31884C15354L71614p2358A13829d96671l34000J37732b27574
$$ -657456 -612484 -231884 315354 686968 614610 113829 -496671 -830671 -692939 -227574
2869B07516R5075H146d46686k87750O5006c16582H3821K02058r8549a25454l34599
$$ 207516 302591 8146 -446686 -734436 -669430 -316582 83821 285879 187330 -125454 -460053
2880d60053j75126N6782K31878i6804G685a17562k97344k99699j03417J78549
$$ -460053 -635179 -578397 -346519 -96804 7685 -117562 -414906 -714605 -818022 -639473
2890f39473b71500F2876R3539c6262l28497k27880Q749J90008J76906r45j73764
$$ -639473 -271500 62876 156415 -36262 -364759 -592639 -583890 -393882 -216976 -217921 -391685
2901c91685j95959o3663R3859J27056K1740q5504n6224J06659a86199B4910i125
$$ -391685 -587644 -651307 -557448 -430392 -408652 -494156 -550380 -443721 -186199 24910 -9125
2913c09021l63057j64923J42794L17904a28816K3999j67925k07272j13403K0707
$$ -309021 -672078 -837001 -694207 -376303 -128816 -104817 -272742 -480014 -593417 -572710
2923e72710J13563J44342J16597K2741j33403k77920k75946n7471K83106a31232
$$ -572710 -459147 -314805 -198208 -175467 -308870 -586790 -862736 -920207 -637101 -131232
2934B69983q029a78235n63031k59162K44046b02280B11092p2869d01495o37214
$$ 269983 261954 -178235 -741266 -1000428 -756382 -202280 211092 138223 -401495 -1038709
2944a038709l04003K05752N48733d9336B03345p6426a21218k06647m3595J14599
$$ -1038709 -1342712 -1136960 -588227 -49336 203345 126919 -121218 -327865 -371460 -256861
2954b56861e8630A21813P7607q8098a53382l56886k93447r6712J20118K05032
$$ -256861 -58630 121813 199420 111322 -153382 -510268 -803715 -900427 -780309 -575277
2964e75277J08935n9666j31086q292K24488f8864B37501O8038j52550e2316r7664
$$ -575277 -466342 -526008 -657094 -665386 -440898 -68864 237501 305539 152989 -52316 -149980
2975a49980M496m6447k32979l84892l31568q0764J85677K63828J23198p2950j06714
$$ -149980 -145484 -191931 -424910 -809802 -1141370 -1222134 -1036457 -772629 -649431 -722381 -829095
2986h29095P6797L36787C2547K99170j7268C6225b81957j40867J05535f8576A42918
$$ -829095 -752298 -415511 32547 331717 314449 36225 -281957 -422824 -317289 -68576 142918
2998A88135D4692b21436k86994j94815j1249K05392a74297I3618Q863a75564l55711
$$ 188135 44692 -221436 -508430 -703245 -714494 -509102 -174297 93618 102481 -175564 -531275
3009e31275j12388L10209B59547M93277M1467C59437b32923l24765J25427d3542
$$ -531275 -643663 -333454 259547 752824 794291 359437 -232923 -557688 -432261 -43542
3020B28122r5674b64419m02302j49989J36756K49582J80113M8730j5076p389O139
$$ 228122 132448 -264419 -666721 -816710 -679954 -430372 -250259 -201529 -216605 -223994 -217855
3031b17855j8684l4490J1544R7838c9931J0116j76502k89006k28691m0434J06801
$$ -217855 -236539 -271029 -259485 -161647 -39931 -29815 -206317 -495323 -724014 -764448 -657647
3042f57647R4542k5539r9555o91K04529a48833A04352J2220f9659j73357K6151
$$ -657647 -563105 -588644 -688199 -688890 -484361 -148833 104352 116572 -69659 -243016 -216865
3053b16865f178A72730o9597b40323m09870j93935J53150c25124c4323j2404l05892
$$ -216865 -6178 172730 103133 -240323 -650193 -844128 -690978 -325124 -34323 -46727 -352619
3064c52619l70011j68679J33188L15422a71627P4791j21285k10203j73913o7158
$$ -352619 -722630 -891309 -758121 -442699 -171627 -96836 -218121 -428324 -602237 -669395
3074f69395Q1009K27396d1665B10019N489i8766m76970l26861N8720M05957e49
$$ -669395 -588386 -360990 -41665 210019 215508 -98766 -575736 -902597 -843877 -437920 -549
3086A32556a20634l87807j67297K19390b7322B71184m4878g7466k75245k0181
$$ 132556 -120634 -508441 -675738 -456348 -27322 271184 226306 -77466 -352711 -372892
3096c72892a60187G2277O2557A8430a21220k0505c9749F0556j0184d7438p0158
$$ -372892 -160187 72277 134834 18430 -121220 -141725 -39749 60556 50372 -47438 -117596
3107a17596L5132A4366L1644f0628j88105j34727q776N5889K389r4267j07083
$$ -117596 -82464 14366 46010 -60628 -248733 -383460 -392236 -336347 -333958 -428225 -535308
3118e35308j6294P3773K7763j26501k11322o3675K83041g251D97960Q8901A79274
$$ -535308 -551602 -477829 -450066 -576567 -787889 -851564 -568523 -7251 497960 586861 179274
3130d30851l75891R3960b90711E9977A8509d05771m95027k11306J99892M50161
$$ -430851 -806742 -712782 -290711 59977 18509 -405771 -900798 -1112104 -912212 -462051
3140d62051e6536A13408D3949a34511j50752o7131J4627P3550J09776f9937k9605
$$ -462051 -56536 113408 43949 -134511 -285263 -352394 -337767 -264217 -154441 -69937 -99542
3151i9542j99975k99746k06864O2627L27860e1738E8001a83638l90926j82685
$$ -99542 -299517 -599263 -806127 -743500 -415640 -51738 58001 -183638 -574564 -757249
3161g57249K25203c1463C91729N5973A63027a83118j29816J13510e2551l2017
$$ -757249 -532046 -31463 391729 447702 163027 -183118 -312934 -199424 -52551 -84568
3171h4568k24546k21462k9050J68406J80079J6283j49515j41272M3751b06977
$$ -84568 -309114 -530576 -559626 -391220 -211141 -194858 -344373 -485645 -441894 -206977
3182D6517Q0462a1726k23043j25422N5669a29794C7254R4472L0369l952o7596
$$ 46517 126979 -11726 -234769 -360191 -304522 -129794 37254 131726 162095 158143 90547
3193I0547g6797k39042j73141L7712b11221B0294b1884l92036m98456k02006L17567
$$ 90547 -76797 -315839 -488980 -451268 -211221 20294 -21884 -413920 -912376 -1114382 -796815
3204g96815a27131D37766O6164E6974e34992k82900J94292a51305B15459O880
$$ -796815 -127131 437766 503930 56974 -534992 -817892 -623600 -151305 215459 222339
3214B22339i3228l86265k15920L9374K01878K25268g8308c3207n2177j21324j30473
$$ 222339 -93228 -479493 -695413 -656039 -454161 -228893 -78308 -33207 -85384 -206708 -337181
3225c37181l1484J60794A35265L64724J53518j79228G6318b49871o445C9085L17754
$$ -337181 -368665 -207871 135265 499989 653507 474279 76318 -249871 -256316 39085 356839
3236C56839L7436I3978c03934j77000J53982c0113A22980B8187a51759k1843A1626
$$ 356839 394275 93978 -303934 -480934 -326952 -30113 122980 28187 -151759 -173602 11626
3248A97993n6756a98930l80714j24807K16650a29173G2048b3735k78930k34459
$$ 197993 141237 -198930 -579644 -704451 -487801 -129173 72048 -23735 -302665 -537124
3258e37124m9378J14798J62376J22051O5875J5760m6757j24830j54628p3597J02532
$$ -537124 -586502 -471704 -309328 -187277 -121402 -105642 -152399 -277229 -431857 -505454 -402922
3269d02922a54303F9112p086b35230m13391k25857J57707b66915A40598L5676
$$ -402922 -154303 69112 62026 -235230 -648621 -874478 -716771 -266915 140598 176274
3279A76274b03801m93780j93223L04248A1369M52084k0903b558n05647k11092
$$ 176274 -203801 -697581 -890804 -586556 11369 463453 442550 -2558 -508205 -719297
3289g19297J65345b18231B0920M8004E049e3911l5262o9783r7961l1357J27204
$$ -719297 -553952 -218231 20920 68924 5049 -53911 -89173 -158956 -256917 -288274 -161070
3300a61070E5983R8327b9767l95537l24816k716L01572a27076N7213k42207k91554
$$ -161070 55983 154310 -29767 -425304 -750120 -752836 -451264 -127076 -69863 -312070 -603624
3311f03624n4517K45230h8042C6291a05058k06706j401b4423C55672J81760j33962
$$ -603624 -658141 -412911 -88042 36291 -105058 -311764 -313165 -24423 355672 537432 403470
3322D03470A12919e1119E1323K34596Q9380A52739b77814l54141n9784K12982
$$ 403470 112919 -51119 51323 285919 375299 152739 -277814 -631955 -691739 -478757
3332d78757b06543h0968o2538j35650p5216J4024N9878O8788i0740A09895K11022
$$ -478757 -206543 -80968 -143506 -279156 -354372 -340348 -280470 -211682 -90740 109895 320917
3343C20917O2965j88157a41886k28979Q7220E6009K73233j18875c34969o48834
$$ 320917 383882 195725 -141886 -370865 -283645 56009 329242 210367 -334969 -983803
3353i83803l05709K45336d45046F2997Q7761a45555l38813m0289b14833A93737
$$ -983803 -1289512 -1044176 -445046 62997 150758 -145555 -484368 -524657 -214833 193737
3364C95841j16160h094k34544p3466M542k7472o1531L314J40565e7867C0254f7289
$$ 395841 279681 -8094 -242638 -316104 -311562 -339034 -400565 -397251 -256686 -57867 30254 -67289
3377b34085k5732e3017B48572J49900j22162B2717a20616c8552A28149L242a08969
$$ -234085 -259817 -53017 248572 398472 276310 22717 -120616 -38552 128149 131391 -108969
3389d18304j02004K13785C3500J62501D3578b52845j18516a34229C19569L27810
$$ -418304 -520308 -306523 33500 196001 43578 -252845 -371361 -134229 319569 647379
3399F47379n3978A91389b63970k04296J37013c1692A52739G5331a85763k36654
$$ 647379 593401 191389 -263970 -468266 -331253 -31692 152739 75331 -185763 -422417
3409d22417n7465J24118a60152A4578J26144Q3625N756I0345a77883k41330m509
$$ -422417 -479882 -355764 -160152 14578 140722 224347 230103 90345 -177883 -419213 -423722
3420d23722a31669B53891J33244I7222d29338l45648J19132a84638B21378o607
$$ -423722 -131669 253891 387135 97222 -429338 -774986 -655854 -184638 221378 214771
3430B14771a72686m04960p7725K74484d1723G1298h7869k23822o8090J12165a30739
$$ 214771 -172686 -577646 -655371 -380887 -41723 71298 -87869 -311691 -379781 -267616 -130739
3442a24946j09401q8800M7802a25843d181a411q0851n8438L6751g760D9605I304
$$ -124946 -234347 -323147 -275345 -125843 -4181 -1411 -82262 -140700 -103949 -7760 49605 9304
3455i0284n3746N1690A4746N3745F768a00327l423F1898K25121N2937H5061c52368
$$ -90284 -144030 -92340 14746 68491 6768 -100327 -103750 61898 287019 339956 85061 -352368
3468f42862J13537f3814C92572P7378A13345c59914j74896b65336B14698K86109
$$ -642862 -529325 -63814 392572 469950 113345 -359914 -534810 -265336 214698 500807
3478E00807j24502d9008m20057j93555L5419J19195Q9359N8182N8470L8539n0388
$$ 500807 376305 -49008 -469065 -662620 -627201 -508006 -418647 -360465 -301995 -263456 -313844
3489c13844j42760j05939R8923a19201B73078J53603B03878b29427k85916J05820
$$ -313844 -456604 -562543 -463620 -119201 273078 426681 203878 -229427 -515343 -409523
3499d09523A739L56600k3506g3309m77586j86491J94348a97161a7624r0333j81580
$$ -409523 1739 358339 334833 -73309 -550895 -737386 -543038 -197161 -17624 -107957 -289537
3510b89537j3731g7938A97236R0936j36309b2317P23A72794J87886k9395F4055
$$ -289537 -303268 -77938 197236 288172 151863 -22317 -21594 172794 360680 331285 64055
3522b34822j17032J02777f9203B1702a4028p3864k5020O919l1618q8600n7819
$$ -234822 -351854 -249077 -69203 21702 -14028 -87892 -112912 -105993 -137611 -226211 -284030
3533b84030Q7986D3067K41096N5044A48885a35532j15773d2126C76548L11410
$$ -284030 -196044 43067 284163 339207 148885 -135532 -251305 -42126 376548 687958
3543F87958r7357F8741e66399l24292J97897a58291B89146L0711c5060l94618
$$ 687958 590601 68741 -566399 -890691 -692794 -158291 289146 319857 -35060 -429678
3553d29678p7476b03173B46221K89162J490j82927A54140A7661g8886o4097K7864
$$ -429678 -507154 -203173 246221 535383 536873 353946 154140 17661 -78886 -142983 -115119
3564a15119E9721K32195Q1653A43769c07453l61829R884b87858A33729J24178
$$ -115119 59721 291916 373569 143769 -307453 -669282 -659398 -287858 133729 257907
3574B57907A0061c52745j25425K36905A47982K10898j23991h5832k33892J1156
$$ 257907 10061 -352745 -478170 -241265 147982 358880 234889 -85832 -319724 -308568
3584c08568J54224P1947j27993k10858o5320J93903C5564K14420n1233c8689j97763
$$ -308568 -154344 -82397 -210390 -421248 -486568 -292665 35564 249984 198751 -38689 -236452
3595b36452l016g6703F8728j3144i4991j58009n0240M8560P0948M9150N8644C8759
$$ -236452 -239468 -76703 68728 55584 -94991 -253000 -303240 -254680 -183732 -134582 -75938 38759
3608A70886K8027C6692b34042j52396J44772A51568L59427K6027A76075c11006
$$ 170886 198913 36692 -234042 -386438 -241666 151568 510995 537022 176075 -311006
3619e45562J91902H3641K91492j24762b16192m56210j06798L01357b336C43587
$$ -545562 -353660 83641 375133 250371 -216192 -672402 -779200 -477843 -2336 343587
3630D17655j08654j13316k1071M3050K5173j5033m3043o5751c4526k86169l48277
$$ 417655 309001 195685 174614 217664 242837 227804 184761 119010 -34526 -320695 -668972
3641f68972k33824M8664L14667a65233A5405f8700j93896m1575g3071C04700K60475
$$ -668972 -902796 -854132 -539465 -165233 15405 -68700 -262596 -304171 -73071 304700 565175
3652E65175k2524k36173I0495j8500J38174P7625A27186b24951l12870n8087J86758
$$ 565175 542651 306478 90495 71995 210169 287794 127186 -224951 -537821 -595908 -409150
3663d09150b04099K998k08192j98043O0745a99162B22080K24446o3311A81059
$$ -409150 -204099 -201101 -409293 -607336 -546591 -199162 222080 446526 383215 181059
3674E7428M9172J23287O1242k9374l9984O139o343H7606a74981k09905M4479c5251
$$ 57428 106600 229887 291129 261755 221771 227910 221567 87606 -174981 -384886 -340407 -35251
3687B82625K1037d9659m72127k00048K62793H6782M32432M4146B66881f5049q4191
$$ 282625 303662 -49659 -521786 -721834 -459041 86782 519214 563360 266881 -65049 -149240
3698a49240D3141K69288R7689j49194a2244k15768o0385M5206M1151j6955m2935
$$ -149240 43141 312429 410118 260924 -12244 -228012 -288397 -243191 -202040 -218995 -261930
3709b61930j377N6641O0288L492l1715J3065c7975A38298R5292p6555d4510j58023
$$ -261930 -263307 -206666 -146378 -142886 -174601 -161536 -37975 138298 233590 157035 -44510 -202533
3721b02533J2802d6811D8345d4604k32516j72476N0389a71799A1043b6420k01023
$$ -202533 -189731 -46811 48345 -44604 -277120 -449596 -399207 -171799 11043 -26420 -227443
3732b27443j25415J58338A89252L34863J8837B30138a52700j44225i9678B55613
$$ -227443 -352858 -194520 189252 524115 542952 230138 -152700 -296925 -99678 255613
3743D72029q9978F6819b39899j05980J02143e7423G8526M0248k8486B7639g4738
$$ 472029 382051 66819 -239899 -345879 -243736 -57423 78526 118774 90288 27639 -74738
3755a99539p9691P5309E4650L10282J31894j79001f0311k71612Q1536A40882L75507
$$ -199539 -279230 -203921 54650 364932 496826 317825 -60311 -331923 -250387 140882 516389
3766E16389K3795A74295b84566j81536K12865A22613J89372j45457a43775j87168
$$ 516389 540184 174295 -284566 -466102 -253237 122613 311985 166528 -143775 -330943
3776c30943P1916e4711F6437B1303g8021J0077G6443J45206K331H1138g0030l4723
$$ -330943 -259027 -54711 66437 21303 -78021 -67944 76443 221649 223980 81138 -70030 -104753
3788a04753b5055E8729p179b5651m8119c0847F4537N8548l6994F0d5258g178E4987
$$ -104753 -25055 58729 51550 -25651 -73770 -30847 64537 123085 86091 60 -45258 -7178 54987
3802B6395a48308k51810j43424J04339a01931B62311J42114j67966h0052j58768
$$ 26395 -148308 -400118 -543542 -439203 -101931 262311 404425 236459 -80052 -238820
3812b38820e8207C48385K95924q3957A17757c92350k53903Q7354K59003a11305
$$ -238820 -58207 348385 644309 560352 117757 -392350 -646253 -558899 -299896 -111305
3823a07129j06801r1996j9992L6741Q0735d0785B26691K68001Q9022j84348D8731
$$ -107129 -213930 -305926 -325918 -289177 -208442 -40785 226691 494692 583714 399366 48731
3835a98326M8861A34740K33539p6368a01571m42501j76048K09149h1560B70534
$$ -198326 -149465 134740 368279 291911 -101571 -544072 -720120 -510971 -81560 270534
3846C61933j23030I8586R331J47168J38730k335j48879E4449e9697m4487p0104
$$ 361933 238903 98586 107917 255085 393815 391480 242601 54449 -59697 -104184 -174288
3857a74288j52762j81802n9905J54655a01685A92459J29176k8251o3263P161O6233
$$ -174288 -327050 -508852 -568757 -414102 -101685 192459 321635 293384 230121 237282 303515
3868C03515L5486l5857n5411n572K5913o2647d0008l48821k33906N2278K83395
$$ 303515 339001 303144 247733 242161 268074 205427 -40008 -388829 -622735 -570457 -287062
3879b87062b1862M052k50379k56338K5631a16421D17862L71555K1841k60642B41564
$$ -287062 -21862 -17810 -268189 -524527 -498896 -116421 417862 789417 811258 550616 241564
3891I0890M4862J20086J7846A01725b09211l05596j62012M2425K13512a27598
$$ 90890 135752 255838 273684 101725 -209211 -514807 -676819 -634394 -420882 -127598
3902A46589J79301M3168q4110j35449o6772R9006K26125J92069l8588B42792a93490
$$ 146589 325890 369058 284948 149499 82727 181733 407858 599927 561339 242792 -193490
3914d75036L1307b03401a8877o8765k62748k14350M2891b40845F5773J43816k2235
$$ -475036 -443729 -203401 -18877 -87642 -350390 -564740 -521849 -240845 65773 209589 187354
3925A87354k6019R9581J89190J09638r2881B13799c3111r9282L0582L6806o8440
$$ 187354 161335 260916 450106 559744 466863 213799 -33111 -132393 -101811 -65005 -133445
3936a33445j57435j41296k7326R1644J49001g7299C8407J03769P7179M678q5388
$$ -133445 -290880 -432176 -459502 -367858 -218857 -77299 38407 142176 219355 224033 138645
3947A38645A1293d7018D7180K05403J54923o2133E3205b92667j50239J63458F9769
$$ 138645 11293 -47018 47180 252583 407506 345373 53205 -292667 -442906 -279448 69769
3959C27815m5070c0880l33609q1755b15947A51984K44420k2790A53863g9884r0597
$$ 327815 282745 -30880 -364489 -446244 -215947 151984 396404 373614 153863 -79884 -170481
3970a70481O7979D3760J31603P1790N625n7299I7166b484k8441E8109J62184J19683
$$ -170481 -102502 43760 175363 247153 252778 195479 97166 -2484 -30925 58109 220293 339976
3982C39976l8360I7993a51555j26566P0555h831A57990K4747H8511F751L9084
$$ 339976 301616 97993 -151555 -278121 -207566 -8831 157990 182737 88511 6751 45835
3993D5835J45621J28902j7022A30687g3124p8801f5993H5694N4979C2647a49843
$$ 45835 191456 320358 303336 130687 -73124 -151925 -65993 85694 140673 32647 -149843
4005b43571Q7507D8186J57450j3385C2344a30435l8481f6294G9229Q3764o416
$$ -243571 -156064 48186 205636 192251 32344 -130435 -168916 -66294 79229 162993 156577
4016A56577o0478C7284a3457l7264j663B4018J45743J20152m6686c426l08739
$$ 156577 96099 37284 -13457 -50721 -52384 24018 169761 289913 243227 -3426 -312165
4027c12165j37138J71402A04340L08588j870I9640b69483j39383J81314A12705
$$ -312165 -449303 -277901 104340 412928 411058 99640 -269483 -408866 -227552 112705
4038C51024m912A56070c9791p1873N5181D2755O9495K0325j6142m2675B338g6192
$$ 351024 346112 156070 -39791 -111664 -56483 42755 112250 132575 116433 73758 2338 -76192
4051a22867K1951b9066B8555j3044f3933p4414m454f5635C7305N2821j7885B6498
$$ -122867 -100916 -29066 28555 15511 -63933 -138347 -142801 -65635 37305 90126 72241 26498
4064B0384P2842J18538Q4519j9105j11428D6556A0622O8374R2599j9406b2295
$$ 20384 93226 211764 296283 277178 165750 46556 10622 78996 171595 152189 -22295
4076b62323j32606J00243a0344B69860R5949j20162E3510b8277H2744K17503J68918
$$ -262323 -394929 -294686 -10344 269860 365809 245647 53510 -28277 82744 300247 469165
4087D69165R938j44626A23834f6090j07489p723Q6496C6436Q4281m4863a09410
$$ 469165 479103 334477 123834 -66090 -173579 -181302 -94806 36436 120717 75854 -109410
4099c20763o5141J79394A47230L08957P2497j83297G9008d1775G9276K46982J50351
$$ -320763 -385904 -206510 147230 456187 528684 345387 79008 -41775 79276 326258 476609
4110D76609r8041G5107b46624j65643L5195J39593a16984M9731J4766a6585E3985
$$ 476609 378568 75107 -246624 -412267 -377072 -237479 -116984 -67253 -52487 -16585 53985
4122A21049L7864K3350L1055L5758J666o9029E5378f1724m8906J4765K0254j7162
$$ 121049 158913 182263 213318 249076 250742 181713 55378 -61724 -110630 -95865 -75611 -92773
4134i2773l7924l320N9285A1497M6644k6622a1303A1300J30437J76519R5669p8410
$$ -92773 -130697 -134017 -74732 11497 58141 31519 -11303 11300 141737 318256 413925 335515
4146C35515A05658a46979j24875P0424a1934A32323l4671a14664k48489q7925
$$ 335515 105658 -146979 -271854 -201430 -11934 132323 97652 -114664 -363153 -451078
4156d51078J62172E0238L24094J29878j03345A74390i287l8000E7338J63470J18519
$$ -451078 -288906 50238 374332 504210 400865 174390 -9287 -47287 57338 220808 339327
4167C39327J3847j05096G2794h1717l0551B1611K29896J63632l5057A43408a40966
$$ 339327 353174 248078 72794 -81717 -112268 21611 251507 415139 380082 143408 -140966
4179b73551J05289H5284K07176J5221A46240d5777p1941c0656A28261J07583j1676
$$ -273551 -168262 85284 292460 307681 146240 -45777 -117718 -30656 128261 235844 224168
4190B24168r9171B1258a9849I538N9122M2229K0888K5806M1319L7039j1178p4394
$$ 224168 124997 21258 -19849 9538 68660 110889 131777 157583 198902 235941 224763 150369
4202A50369D4587c2934j2784e219D4715K3400O311k738l559k0971A5510K399P8893
$$ 150369 44587 -32934 -45718 -5219 44715 68115 74426 71688 68129 47158 15510 17909 96802
4215I6802J34446Q9752o1878D8321a72347m9022d3012B48489J85300o2798A11359
$$ 96802 231248 321000 259122 48321 -172347 -221369 -43012 248489 433789 370991 111359
4227a61157r7297J11748F9961J53608r700E6595a54320j27347L6986d7182B12339
$$ -161157 -258454 -146706 69961 223569 213869 56595 -154320 -281667 -244681 -47182 212339
4239C88272q825j84500d2490j32808M2929D2396J69683M5107j13641e6967j70979
$$ 388272 379447 194947 -42490 -175298 -132369 42396 212079 257186 143545 -56967 -227946
4250b27946m2619J07771C1265J58384K8150j06513d0589o6787b3864A54272J49254
$$ -227946 -270565 -162794 31265 189649 217799 111286 -40589 -107376 -23864 154272 303526
4261C03526K4182r1284j09392m0266K6777K4728m6127a2467q7707j0882d6022
$$ 303526 327708 236424 127032 86766 113543 138271 92144 -12467 -100174 -111056 -46022
4273B4895K8045k4591c678B435N6989Q1540O0332J1923m4549G9104a6595n6435
$$ 24895 52940 28349 -3678 2435 59424 140964 201296 213219 168670 79104 -16595 -73030
4285g3030K9429F8074J33809O5473p0837A9982a50937l9124e7603A61767J45653
$$ -73030 -43601 68074 201883 267356 196519 19982 -150937 -190061 -57603 161767 307420
4296C07420l9525F8492a32141m2650g183B72414K07169J2889j66399A07701b7986
$$ 307420 267895 68492 -132141 -174791 -7183 272414 479583 492472 326073 107701 -27986
4308b0173I0974J15330L5601p9921B075a47996m8492i1017A22155K10717R0320
$$ -20173 90974 206304 241905 161984 2075 -147996 -196488 -91017 122155 332872 423192
4319D23192o0511j38687q7275K7933J10687Q4446k5551j39331A9560a13470m9482
$$ 423192 362681 223994 136719 164652 275339 359785 334234 194903 19560 -113470 -162952
4330a62952J7258L9716K6482N493O23K1830A8850J06069R7720L9277l2692o2586
$$ -162952 -145694 -105978 -79496 -74003 -73380 -51550 18850 124919 222639 261916 229224 166638
4342A66638k6261L8293O2103Q12j07188c6977j29012M36c9860A16910P9639l9973
$$ 166638 140377 178670 240773 241585 134397 -36977 -165989 -165553 -39860 116910 196549 156576
4354A56576C4867g6684k7666b2041A27305J30451K9540j07157a0710j57219j3322
$$ 156576 34867 -76684 -104350 -22041 127305 257756 287296 180139 -10710 -167929 -181251
4365a81251b7193A96701J41427m1770A01949a08422p7441g5054A38263J70232
$$ -181251 -27193 196701 338128 296358 101949 -108422 -185863 -75054 138263 308495
4375C08495J9436j36264b477j25152K0220C6138J71712R0389l1523j20710C1071
$$ 308495 327931 191667 -2477 -127629 -107409 36138 207850 298239 266716 146006 31071
4387E521P9681J33649R9455N184q5949j13199E3422K961N6028N3321R683l3647
$$ 5521 85202 218851 318306 323490 237541 124342 53422 56383 112411 165732 175415 141768
4399A41768l6588P960N4278O5517K3403l5362o7216m9629l351K4771J0569m2287
$$ 141768 105180 113140 167418 232935 256338 220976 153760 104131 100780 125551 136120 93833
4411I3833A3622e9633q685G140J26561J05300J7535q6088B9231g6831M178D9916
$$ 93833 13622 -59633 -68318 7140 133701 239001 256536 170448 29231 -76831 -72653 49916
4424B03896O4998r6658c9633j95110l9157a24287A24638J90641O460A59796e8324
$$ 203896 268894 172236 -39633 -234743 -273900 -124287 124638 315279 321739 159796 -58324
4436a82787N3407F0720K06265R2277p5747I4695h8048o3014e8802A20207J41058
$$ -182787 -129380 60720 266985 359262 283515 94695 -88048 -151062 -58802 120207 261265
4447B61265O297j30996d4298j01296N3270H7484J97224R4847n7682j60647I70
$$ 261265 267562 136566 -44298 -145594 -92324 87484 284708 379555 321873 161226 970
4459f5867b2431G7355O8579r912F0336b4334k8634h171G9513Q6225M7008P130
$$ -65867 -22431 77355 145934 136022 60336 -24334 -52968 -8171 79513 165738 212746 219876
4471B19876q802q184r511l1644o3766B5234a1126B2626R2719Q7665J3546q5929
$$ 219876 211074 202890 193379 161735 97969 25234 -11126 22626 115345 203010 216556 130627
4483A30627c070r7506N378I173J41433R0407n792q5448E2981B0918P3256J55527
$$ 130627 -3070 -100576 -95198 9173 150606 241013 235221 149773 52981 20918 94174 249701
4495B49701J52986M5346j13962A04391a16607p9031i2665A10904J42713l0149
$$ 249701 402687 448033 334071 104391 -116607 -195638 -92665 110904 253617 223468
4505B23468D2899a46798m3673d1264B12559J90877R134j59856C1442a09689R076
$$ 223468 42899 -146798 -190471 -41264 212559 403436 412570 252714 31442 -109689 -100613
4516a00613B9960J56120Q2193l7396I6491e4955q3273L2879B2951J50889Q4042
$$ -100613 29960 186080 268273 230877 96491 -54955 -138228 -105349 22951 173840 257882
4527B57882k0727q7916G3579J4304J10047J41910Q4141k3053j07974j15412n8720
$$ 257882 237155 149239 73579 87883 197930 339840 423981 400928 292954 177542 118822
4538A18822j19J3190k2876D4482a5686o216B8301O5437K1853l3765C4190K628
$$ 118822 118703 131893 109017 44482 -15686 -21902 28301 93738 115591 81826 34190 36818
4550C6818Q4357J22966Q1773j5696j04301H5165C5305M3687J08881Q5329l778
$$ 36818 121175 244141 325914 310218 205917 85165 35305 78992 187873 273202 269424
4561B69424j10181i354j44420n1187O4108A755J40028N9510n5648B4268f9120
$$ 269424 159243 -9354 -153774 -204961 -140853 1755 141783 201293 145645 24268 -69120
4573c6521A26154K06305J06416q3626A16625a27467q6501i5603A34834J65881
$$ -36521 126154 332459 438875 355249 116625 -127467 -213968 -95603 134834 300715
4583C00715j8831A07185h4768n9248d1991A40866J33311J3790q8040H2012a545
$$ 300715 281884 107185 -84768 -144016 -41991 140866 274177 287967 199927 82012 -1545
4595b5132D253O0486P0535N1094l37n2814F2396k6946M5240Q6048O3306n163n1911
$$ -25132 4253 64739 135274 186368 186031 133217 62396 35450 80690 166738 230044 224881 172970
4608A72970l5346K7459O7050L1001o0910G8062b2243o31G2038J04735J9384q1251
$$ 172970 137624 165083 232133 263134 202224 78062 -22243 -22874 72038 176773 196157 114906
4620A14906C365b9815F8991J79259J44349J8620j11202A48532E9836K6885J00240
$$ 114906 3365 -29815 68991 248250 392599 411219 300017 148532 59836 86721 186961
4631A86961P6327k5112A08464f5315j20488j4103R3101C7907J13126K1693p7676
$$ 186961 263288 238176 108464 -65315 -185803 -199906 -106805 37907 151033 172726 95050
4642I5050c2379q6894K7964F3565K03369J28809l8374A66337e9602j13653O2225
$$ 95050 -32379 -119273 -91309 63565 266934 395743 357369 166337 -59602 -173255 -111030
4653a11030E3381J20960l2496b3282j69035m3951J13053E5825J23504J2140o0736
$$ -111030 53381 174341 141845 -23282 -192317 -236268 -123215 55825 179329 191469 130733
4664A30733m1301K4685P0101N3804k473m5498m1669j9190m408j0537j9685m358
$$ 130733 89432 114117 184218 238022 235549 190051 148382 129192 124784 114247 94562 90204
4676I0204J5686K3404l586k7632j9940K2310O4657N2233j1941p0469n6641L1149
$$ 90204 105890 129294 125708 98076 78136 100446 165103 217336 205395 134926 78285 109434
4688A09434J13791J07335n506j35532A6807e4245C7906J89472J32111l1874A49400
$$ 109434 223225 330560 325054 189522 16807 -54245 37906 227378 359489 327615 149400
4700c9326o3084b1A79780J27749r688j23901C0038d3750a2262I9634J22253Q0526
$$ -39326 -102410 -21 179780 307529 297841 173940 30038 -43750 -12262 99634 221887 302413
4712C02413j632q3485H6799b1973j5430F7986J63568J11197l1856A46959c1261
$$ 302413 300781 217296 86799 -21973 -37403 67986 231554 342751 310895 146959 -31261
4724h3406C4077K02787J28286m9774A24332f8779p2325f8211E6521O1495l7999
$$ -83406 34077 236864 365150 315376 124332 -68779 -141104 -68211 56521 118016 80017
4735H0017F215a5001E4859J14685Q1727O878l7886k0864J9202L2393j2192p1966
$$ 80017 6215 -15001 54859 169544 251271 258149 220263 199399 218601 250994 238802 166836
4747A66836F8750C457b273C0022K1095q727A9325p900R536P786k562K8185Q8293
$$ 166836 68750 3457 -2273 30022 51117 42390 19325 11425 20961 28747 26185 54370 142663
4760A42663J47467J18965n16j37451H8076A4385J02167K05939J21260r5243F3921
$$ 142663 290130 409095 408579 271128 88076 14385 116552 322491 443751 348508 63921
4772b24744j06274J37831G0297J96217J0021A32262c6225o7212d0074I3883J22613
$$ -224744 -331018 -193187 70297 266514 276535 132262 -36225 -103437 -40074 93883 216496
4783B16496N3930j6366o6199q6909B8448A2811O2132J14407Q3025k7491H8445
$$ 216496 270426 254060 187861 100952 28448 12811 74943 189350 272375 244884 88445
4795a04451j04586N6021G783J32660m937I610a17100r25B5277J86059J00048l9946
$$ -104451 -209037 -153016 7783 140443 135506 9610 -117100 -118025 25277 211336 311384 271438
4807B71438j13330p6494J3686O2949K5036n5937C4574a2745B8078Q3277M2034
$$ 271438 158108 81614 95300 158249 183285 127348 34574 -12745 28078 111355 153389
4818A53389n0174A363f9266K7528F2235J09603M9957j0658k9512j2653P808R076
$$ 153389 103215 1363 -69266 -41738 62235 171838 221795 211137 181625 168972 176780 185856
4830A85856Q304J8945L6699J9497n2752G8788g3862m9549f580B12208J65801j9146
$$ 185856 194160 213105 249804 269301 216549 78788 -73862 -123411 -6580 212208 378009 358863
4842C58863A75760b0267m2129I0622K26781J16907q7165A16352h6781l9957C575
$$ 358863 175760 -20267 -62396 90622 317403 434310 347145 116352 -86781 -126738 3575
4854B02446J27388p97j00684A07004B7869A1051K6779M8820M7771K0730l2638
$$ 202446 329834 329037 228353 107004 27869 11051 37830 86650 134421 155151 122513
4865A22513C7625e8136l1548a0981A44936J29792K646j33568b2543o7801a4962
$$ 122513 37625 -58136 -89684 -10981 144936 274728 277374 143806 -22543 -90344 -14962
4877A27181P7093n1826C4352b7628C2916J23167O4865n2633D8601a4715D4537
$$ 127181 204274 152448 34352 -27628 32916 156083 220948 168315 48601 -14715 44537
4889A69942P4990n0348F1680c6896a4325A14053J38255N3391m1890q4693n9937
$$ 169942 244932 194584 61680 -36896 -14325 114053 252308 305699 263809 179116 119179
4900A19179j0079K6084M0111M1881M7370K5406k8038r6824D9350e544E6068J33904
$$ 119179 109100 135184 175295 217176 264546 289952 261914 165090 49350 -5544 56068 189972
4912A89972R2110n4212D3115a42902k9116G225K69619J70050m3670k01075A1236
$$ 189972 282082 227870 43115 -142902 -172018 7225 276844 446894 403224 202149 11236
4924a9240A09157J52003L7950j11312A6505i7461L301a4106G1120N0410K2702
$$ -19240 109157 261160 299110 187798 16505 -97461 -94160 -14106 71120 121530 144232
4935A44232J8686O326l2272F4064b406o756E5354Q0985J1635o9814a5712j5930
$$ 144232 162918 169244 136972 64064 -2406 -9162 55354 136339 147974 78160 -15712 -31642
4947c1642E8622J33158O2541o2283G0283G040O0075J20897N4208q6329a6910j12034
$$ -31642 58622 191780 254321 192038 70283 7040 67115 188012 242220 155891 -16910 -128944
4959a28944M2738G2345J29837j7613C3127a12538p063B9060J96374J08848l0574
$$ -128944 -86206 72345 202182 184569 33127 -112538 -119601 29060 225434 334282 303708
4970C03708j11331r0573j7514L4200L9112Q473j6488k4656l6877B2514e1994k3202
$$ 303708 192377 101804 84290 118490 157602 166075 149587 124931 88054 22514 -51994 -75196
4982g5196a98A56857J43016J4302j38694a4440q4939h41B07729J48230l7804A23628
$$ -75196 -198 156857 299873 314175 175481 -14440 -99379 -841 207729 355959 318155 123628
4995f5400k7259F3387K09250R9718o3518j45673F7043J5961P4461K9637n8835
$$ -65400 -92659 63387 272637 372355 308837 163164 67043 83004 157465 187102 128267
5006A28267B5230c7845Q823A2746J3680D789g422E0227J09725R0954J2661n7229
$$ 128267 25230 -37845 -29022 12746 26426 4789 -7422 50227 159952 250906 263567 206338
5018B06338n5075M372M8684J7484o3649D4308b6893C590Q6851M1615E7064g9643
$$ 206338 151263 155635 204319 221803 158154 44308 -26893 3590 90441 132056 57064 -79643
5031a50560e8603A47408J62612p802A29353e0363l1576G1464K16222J00988q4286
$$ -150560 -58603 147408 310020 302218 129353 -50363 -81939 71464 287686 388674 304388
5042C04388A01989f8884l6878a2607A16226P7717J252n3803o7848A6663a8358
$$ 304388 101989 -68884 -105762 -12607 116226 193943 195195 141392 73544 16663 -18358
5054d294G6664J25911J05152N255j15689D4626a8791H0778K03331J58185k1615
$$ -4294 76664 202575 307727 312982 197293 44626 -18791 80778 284109 442294 420679
5065D20679j98166a4203j05192d0504A26872R5580n9444A1285i3390L0534F8171
$$ 420679 222513 -14203 -119395 -40504 126872 222452 163008 11285 -93390 -62856 68171
5077A80327J5700m6446k2738N4367Q6305K5714o9493A06839C6893J6048N0952
$$ 180327 196027 149581 126843 181210 267515 293229 223736 106839 36893 52941 103893
5088A03893k088B3209g6253l9632M1451c261C3560j051J8135P7493J01357L7129
$$ 103893 101805 23209 -76253 -115885 -74434 -3261 33560 32509 50644 128137 229494 266623
5100B66623q0605C8648d8688C415J49754J08792n7039H132a76789k1853b0792
$$ 266623 186018 38648 -48688 3415 153169 261961 204922 8132 -176789 -198642 -20792
5112B29860J46392m4768A58710I173a0659A04477J43289N9873n6953j24384A1000
$$ 229860 376252 331484 158710 9173 -10659 104477 247766 307639 250686 126302 11000
5124d5538P290F483O9857Q0808O3006Q242o8513E7714I398P2512J71268J46518
$$ -45538 -38248 6483 76340 157148 220154 228396 159883 57714 9398 81910 253178 399696
5136C99696L06j64348B6080g0701A1989J65921Q2073r2672b7023j39974K1938
$$ 399696 400002 235654 26080 -70701 11989 177910 259983 167311 -27023 -166997 -145059
$$ [...]
##END NTUPLES=NMR FID
##END=
