##TITLE=Estratto tot, 10mg/mL, +10% D2O, 25 °C
2D TOCSY
##JCAMPDX= 6.0         $$ Bruker NMR JCAMP-DX V2.0
##DATA TYPE= nD NMR FID
##DATA CLASS= NTUPLES
##NUM DIM= 2
##ORIGIN= Bruker BioSpin GmbH
##OWNER= nmrsu
##LONG DATE= 2020/01/31 23:55:39+0000
$$ 1.90.2.4 TopSpin 3.6.1
$$ 2020-04-07 17:15:08.967 +0200  nmrsu@CZC5192CCN
$$ Compression mode = diff/dup
##.OBSERVE FREQUENCY= 600.1328186
##.OBSERVE NUCLEUS= ^1H
##.DELAY= (20, 20)
##.ACQUISITION MODE= SIMULTANEOUS (DQD)
##.ACQUISITION SCHEME= States-TPPI
##.AVERAGES= 24
##.DIGITISER RES= 22
##SPECTROMETER/DATA SYSTEM= spect
##.PULSE SEQUENCE= dipsi2esgpphpp.rak
##.SOLVENT NAME= H2O+D2O
##.SHIFT REFERENCE= INTERNAL, H2O+D2O, 1, 10.71063
##AUDIT TRAIL= $$ (NUMBER, WHEN, WHO, WHERE, PROCESS, VERSION, WHAT)
$$ ##TITLE= Audit trail, TopSpin 3.6.1
$$ ##JCAMPDX= 5.01
$$ ##ORIGIN= Bruker BioSpin GmbH
$$ ##OWNER= nmrsu
$$ $$ C:/Bruker/TopSpin3.6.1/data/nmrsu/nmr/Estratti_Rego/2/audita.txt
$$ ##AUDIT TRAIL=  $$ (NUMBER, WHEN, WHO, WHERE, PROCESS, VERSION, WHAT)
(   1,<2020-02-01 09:13:44.863 +0100>,<nmrsu>,<CZC5192CCN>,<go4>,<TopSpin 3.6.1>,
      <created by zg
	started at 2020-02-01 00:53:56.462 +0100,
	POWCHK enabled, PULCHK disabled,
       configuration hash MD5:
       C8 E9 E3 2E 96 28 5A AD 8C 0A C3 D5 06 4A AF FD
       data hash MD5: 4K * 512
       31 17 E3 40 A9 CA C2 A3 8C 0B E9 EB B7 FD 04 46>)
$$ ##END=
$$ 
$$ $$ hash MD5
$$ $$ E6 FD A3 B0 01 85 B8 8C 5C 78 AD 69 00 1F 0A A6
##$RELAX= 
##$RELAX= 
##$RELAX= 
##$RELAX= 
##$RELAX= 
##$RELAX= 
##$RELAX= 
##$RELAX= 
##$RELAX= 
##$RELAX= 
##$RELAX= 
##$RELAX= 
$$ Bruker specific parameters
$$ --------------------------
##$DATPATH= <C:\Bruker\TopSpin3.6.1\data\nmrsu\nmr>
##$EXPNO= 2
##$NAME= <Estratti_Rego>
##$PROCNO= 1
##$ACQT0= 1000000
##$AMP= (0..31)
100 100 100 100 100 100 100 100 100 100 100 100 100 100 100 100 100 100
100 100 100 100 100 100 100 100 100 100 100 100 100 100
##$AMPCOIL= (0..19)
-1 0 0 0 0 0 0 0 0 0 0 0 0 0 0 0 0 0 0 0
##$ANAVPT= -1
##$AQSEQ= 0
##$AQ_mod= 3
##$AUNM= <au_zgp1>
##$AUTOPOS= <5 >
##$BF1= 600.13
##$BF2= 600.13
##$BF3= 600.13
##$BF4= 150.895265
##$BF5= 150.895265
##$BF6= 150.895265
##$BF7= 150.895265
##$BF8= 150.895265
##$BWFAC= (0..63)
0 0 0 0 0 0 0 0 0 0 0 0 0 0 0 0 0 0 0 0 0 0 0 0 0 0 0 0 0 0 0 0 0 0 0 0
0 0 0 0 0 0 0 0 0 0 0 0 0 0 0 0 0 0 0 0 0 0 0 0 0 0 0 0
##$BYTORDA= 0
##$CAGPARS= (0..11)
0 0 0 0 0 0 0 0 0 0 0 0
##$CHEMSTR= <none>
##$CNST= (0..63)
1 1 142 1 1 1 1 1 1 1 1 1 1 1 1 1 1 1 1 1 1 1 1 1 1 1 1 1 1 1 1 1 1 1 1
1 1 1 1 1 1 1 1 1 1 1 1 1 1 1 1 1 1 1 1 1 1 1 1 1 1 1 1 1
##$CPDPRG= (0..8)
<waltz16> <> <waltz16> <> <mlev> <mlev> <mlev> <mlev> <mlev>
##$D= (0..63)
5.967433e-005 2 0.00352 0 0 0 0 0 0 0.08 0 0.03 2e-005 4e-006 0 0.06 0.0002
0.000196 0 0.00015 0 0 0 0 0 0 0 0 0 0 0 0 0 0 0 0 0 0 0 0 0 0 0 0 0 0
0 0 0 0 0 0 0 0 0 0 0 0 0 0 0 0 0 0
##$DATE= 1580514939
##$DE= 20
##$DECBNUC= <off>
##$DECIM= 2773.33333333333
##$DECNUC= <off>
##$DECSTAT= 4
##$DIGMOD= 1
##$DIGTYP= 12
##$DQDMODE= 0
##$DR= 22
##$DS= 16
$$ [...]
##$NUC1= <1H>
##$NusJSP= 0
##$NusT2= 1
##$NusTD= 512
##$O1= 2818.59999995504
##$ProjAngle= 0
##$SFO1= 600.1328186
##$SW= 12.022350705363
##$SW_h= 7215.00721500722
##$TD= 512
##$ABSF1= 1000
##$ABSF2= -1000
##$ABSG= 5
##$ABSL= 3
##$ALPHA= 0
##$AQORDER= 0
##$ASSFAC= 0
##$ASSFACI= 0
##$ASSFACX= 0
##$ASSWID= 0
##$AUNMP= <        >
##$AXLEFT= 0
##$AXNAME= <F1>
##$AXNUC= <off>
##$AXRIGHT= 0
##$AXTYPE= 0
##$AXUNIT= <>
##$AZFE= 0.1
##$AZFW= 0.5
##$BCFW= 1
##$BC_mod= 0
##$BYTORDP= 0
##$COROFFS= 0
##$CY= 15
##$DATMOD= 1
##$DC= 1
##$DFILT= <        >
##$DTYPP= 0
##$ERETIC= no
##$F1P= 0
##$F2P= 0
##$FCOR= 0.5
##$FTSIZE= 2048
##$FT_mod= 0
##$GAMMA= 1
##$GB= 0.1
##$INTBC= 1
##$INTSCL= 1
##$ISEN= 128
##$LB= 0.3
##$LEV0= 0
##$LPBIN= 0
##$MAXI= 10000
##$MC2= 0
##$MEAN= 0
##$ME_mod= 2
##$MI= 1
##$MddCEXP= no
##$MddCT_SP= no
##$MddF180= no
##$MddLAMBDA= 0
##$MddMEMORY= 0
##$MddMERGE= 23
##$MddNCOMP= 0
##$MddNITER= 0
##$MddNOISE= 0.8
##$MddPHASE= 0
##$MddSEED= 0
##$MddSRSIZE= 0
##$Mdd_CsALG= 0
##$Mdd_CsLAMBDA= 1
##$Mdd_CsNITER= 0
##$Mdd_CsNORM= 0
##$Mdd_CsVE= yes
##$Mdd_CsZF= 0
##$Mdd_LrLAMBDA= 0
##$Mdd_LrNITER= 0
##$Mdd_LrRANK= 0
##$Mdd_LrZF= 0
##$Mdd_mod= 0
##$NCOEF= 32
##$NC_proc= 0
##$NLEV= 6
##$NOISF1= 0
##$NOISF2= 0
##$NSP= 1
##$NTH_PI= 0
##$NZP= 1
##$OFFSET= 5.006978e-008
##$PC= 4
##$PHC0= 88.92149
##$PHC1= -176.4
##$PH_mod= 1
##$PKNL= yes
##$PPARMOD= 1
##$PPDIAG= 0
##$PPIPTYP= 0
##$PPMPNUM= 2147483647
##$PPRESOL= 1
##$PSCAL= 1
##$PSIGN= 0
##$PYNMP= <proc.py>
##$RDF1= 0
##$RDF2= 0
##$RDFWHM= 0
##$RDINT= 0
##$RDPOS= 0
##$REVERSE= no
##$SF= 600.129969889999
##$SI= 2048
##$SIGF1= 0
##$SIGF2= 0
##$SINO= 16
##$SIOLD= 2048
##$SPECTYP= <>
##$SREF_mod= 1
##$SREGLST= <1H.MeOD>
##$SSB= 2
##$STSI= 0
##$STSR= 0
##$SW_p= 3.00777434503735e-005
##$SYMM= 0
##$S_DEV= 0
##$TDeff= 0
##$TDoff= 0
##$TI= <        >
##$TILT= no
##$TM1= 0.1
##$TM2= 0.9
##$TOPLEV= 0
##$USERP1= <user>
##$USERP2= <user>
##$USERP3= <user>
##$USERP4= <user>
##$USERP5= <user>
##$WDW= 3
##$XDIM= 64
##$YMAX_p= 0
##$YMIN_p= 0
$$ End of Bruker specific parameters
$$ ---------------------------------
##NTUPLES= nD NMR FID
##VAR_NAME=  TIME1,         TIME2,           FID/REAL,        FID/IMAG
##SYMBOL=    T1,            T2,              R,               I
##.NUCLEUS=  1H,            1H
##VAR_TYPE=  INDEPENDENT,   INDEPENDENT,     DEPENDENT,       DEPENDENT
##VAR_FORM=  AFFN,          AFFN,            ASDF,            ASDF
##VAR_DIM=   512,           2048,            2048,            2048
##UNITS=     SECONDS,       SECONDS,         ARBITRARY UNITS, ARBITRARY UNITS
##FACTOR=    0.0001386,     0.000138666666666667, 1,          1
##FIRST=     0,             0,               0,               0
##LAST=      0.0708245999999999, 0.283850666666667, 22094,    12966
##MIN=       0,             0,               -3290590,        -3290590
##MAX=       0.0708245999999999, 0.283850666666667, 2275936,  2275936
##PAGE= T1=0
##FIRST=     0,             0,               0,               0
##DATA TABLE= (T2++(R..R)), PROFILE
$$ [...]
##PAGE= T1=0.001386
##FIRST=     0,             0,               0,               0
##DATA TABLE= (T2++(I..I)), PROFILE
$$ plain form
1838 11777 7914 18564 19022 22284 38578 6701 -70413 -79892 -14272 8578 -13826 12992 62592
1851 62592 55578 30222 24327 -10386 -61762 -54530 -18097 -16407 -5762 37094 45857 15581 14468
1864 14468 21299 -15225 -42397 -24497 -19257 -26923 8684 43507 12699 -4903 42240 54854 -6172
1878 -34553 -4997 -1610 -30952 -33239 -20278 -11322 17095 36416 14314 11566 55993 51408 -24124
1892 -55036 -23528 -22588 -45186 -19476 21460 25080 34389 54946 27538 -20219 -19383 -11451 -44448
1905 -44448 -52162 -4153 23361 15812 28163 37012 13364 9360 18878 -24005 -62640 -11132 42121
1919 7417 -24771 12800 36098 8312 -9208 -12690 -27688 -21067 6878 6525 -305 30625 43374 2997
1934 -11979 18136 7960 -41234 -39056 608 4699 1109 23427 16711 -18224 -4128 27470 -2636 -36195
$$ packed form
1838A1777l863J0650M58L262J6294F701g0413r479a4272H578a3826A2992M9600
1851F2592p014k5356n895a0386n1376P232a8097J690e762C7094Q763A5581j113
1864A4468O831a5225k7172J7900N240p666H684L4823A2699d903D2240J2614f172
1878c4553d997a610k9342k287J2961Q956A7095J9321A4314k748M4427m585b4124
1892e5036b3528R40k2598a9476B1460L620R309K0557k7408b0219Q36P932l2997
1905d4448p714d153B3361p549J2351Q849A3364m004R518b4005l8635a1132D2121
1919G417b4771A2800K3298H312i208l482j4998O621F878l53c05C0625J2749B997
1934a1979A8136G960d1234K178F08M091A109K2318o716a8224d128B7470b636l3559
$$ plain form
1948 -36195 -2695 28049 14318 13840 19826 -10426 -19976 12761 -1680 -50943 -26020 23166 -5929
1962 -31001 27669 62090 18471 1680 26687 14082 -13274 -10610 -26298 -54624 -26264 13018
1975 -8583 -15381 45939 74769 29057 6847 17933 -16525 -60377 -42156 -20185 -34607 -6818 60853
1989 61404 12002 13452 26991 -13641 -47219 -32510 -24953 -18588 26182 42857 6508 8866 44678
2002 44678 7623 -58464 -36996 12372 -4359 -19251 25646 46131 20855 15154 8982 -34377 -42204
2015 -42204 1423 3142 -27558 441 41196 17967 -1174 23386 9857 -28927 -8070 18637 -20084
2029 -36449 12700 21130 -18883 -9754 28138 16624 -5366 7315 8676 -6693 -1239 -4604 -32672
2042 -32672 -20658 34839 36556 -11146 -3088
$$ packed form
1948c6195b695B8049j3731m78N986a0426r550A2761a680m9263K4923B3166e929
1962c1001B7669L4421A8471A680K5007j2605a3274K664j5688k8326b6264A3018
1975h583o798D5939K8830B9057F847J1086a6525m3852J8221b0185j4422f818F0853
1989F1404A2002J450J3539a3641l3578J4709P557O365B6182J6675F508K358L5812
2002D4678G623e8464K1468A2372d359j4892B5646K0485B0855n701o172c4377p827
2015d2204A423J719b7558D41M0755A7967a174B3386I857b8927h070A8637b0084
2029c6449A2700Q430a8883R129B8138j1514e366G315J361f693a239l365k8068
2042c2672J2014C4839J717a1146c088
##PAGE= T1=0.0015246
##FIRST=     0,             0,               0,               0
##DATA TABLE= (T2++(R..R)), PROFILE
$$ plain form
0 0 0 0 0 0 0 0 0 0 0 0 0 3 -4 18 -21 21 -24 24 -37 45 -51 65 -69 85 -95 115 -131 150 -173 198 -226 255 -288 324
35 -365 408 -458 513 -570 635 -707 780 -865 959 -1058 1169 -1288 1422 -1567 1730 -1909 2110 -2331
54 2584 -2871 3205 -3591 4047 -4598 5278 -6142 7276 -8840 11149 -14902 22036 -40378 222515
69 192984 -427134 -346555 -125421 -879627 -1370859 -458778 175584 89457 308946 560652
79 560652 517522 612715 333906 -237149 -198528 -9076 -291437 -319470 -104579 -123290 3654 209832
91 209832 78609 70044 183609 -27127 -129158 19314 -97803 -147862 120979 137690 -18638 34842
104 -15131 -118573 -20987 -48427 -121754 80308 130536 -46367 24009 112592 -13313 7634 67403
116 67403 -36587 -10101 24692 -145907 -130028 39653 -28133 -55564 113197 93117 -20267 42887
$$ packed form
0@@@@@@@@@@@@CdA8b1B1b4B4c7D5e1F5f9H5i5A15a31A50a73A98b26B55b88C24
35c65D08d58E13e70F35g07G80h65I59a058A169a288A422a567A730a909B110b331
54B584b871C205c591D047d598E278f142G276h840A1149a4902B2036d0378B22515
69A92984d27134Q0579a25421p54206m91232d58778A75584q6127K19489K51706
79E60652m3130R5193k78809b37149L8621i076k82361k8033a04579j8711C654K06178
91B09832G8609q565J13565b7127j02031A9314i7803n0059A20979J6711a8638C4842
104a5131j03442b0987k7440p3327H0308N0228d6367B4009Q8583a3313G634N9769
116F7403c6587a0101B4692a45907J5879C9653b8133k7431A13197k0080b0267D2887
$$ plain form
129 68915 13694 34112 7512 -60850 -38019 -73207 -173387 -122637 -12267 -4579 6378 80191
141 80191 162251 200015 126688 40631 75573 67485 -104938 -224764 -185504 -132141 -115555 -96874
153 -96874 -49754 73420 191875 161265 78691 85186 77193 -6064 -59146 -63110 -67480 -62230 -48298
166 -48298 -19009 26630 24215 6428 63697 80575 -18344 -45115 24599 5867 -54224 -31060 -2599
180 16486 48771 -5564 -63271 28155 56914 -88884 -118809 21781 87069 65528 52480 37950
192 37950 53623 52136 -59129 -118195 -28171 -6583 -73614 -43328 16978 21655 64128 97445 57500
205 57500 50731 41630 -58304 -114517 -89369 -92746 -51381 51004 51185 3006 56639 113044 78936
218 78936 23438 -12683 -14499 789 -61615 -145833 -90449 44104 88934 49173 27155 65068 82655
$$ packed form
129F8915A3694K0418G512f0850K2831l5188j00180N0750a2267d579F378P3813
141H0191Q2060L7764p3327D0631L4942q088a04938j19826L9260N3363J6586J8681
153i6874M7120G3420J18455l0610G8691O495p993f064n3082l964m370N250J3932
166d8298a9009B6630k415F428N7269J6878a8344k6771B4599E867e4224K3164b599
180A6486L2285e564n7707B8155K8759h8884k9925B1781O5288k1541j3048j4530
192C7950J5673j487e9129n9066b8171f583o7031L0286A6978M677M2473L3317l9945
205E7500o769r101e8304n6213K5148l377M1365E1004J81C006N3633N6405l4108
218G8936B3438a2683j816G89f1615q4218N5384D4104M4830l9761k2018L7913J7587
$$ plain form
231 82655 -24965 -135464 -76302 20019 998 -23995 5521 18264 24758 28922 8310 24089 59874
244 59874 26794 -17826 -21480 -44061 -54586 6461 46746 10796 -28209 -30835 -11813 -4193 -40573
257 -40573 -38196 68448 118892 13131 -65684 -8422 47449 15163 -37039 -38329 2452 7790 -62391
271 -101736 -13813 82163 54644 51 35959 75317 29658 -24710 -14034 21339 19696 -21079 -63266
284 -63266 -75158 -65443 -53146 -27103 17900 45067 45537 55042 68007 46039 7536 7498 28450 832
299 -75708 -107790 -58461 -20440 -37786 -21923 68749 128897 76907 -2599 2708 46535 23952
311 23952 -49339 -85532 -63813 -44664 -70778 -92079 -29628 66245 77489 40716 64973 87856
323 87856 31164 -9457 8404 -5393 -42872 -47539 -52353 -56286 -32584 -21646 -7297 47745 53143 -3887
$$ packed form
231H2655b4965j10499N9162B0019I98b3995E521J2743O494M164H310J5779L5785
244E9874B6794a7826l654k2581j0525F461M0285A0796b8209k626a1813d193l6380
257d0573K377F8448N0444A3131f5684h422D7449A5163c7039j290B452N338f2391
271a01736a3813H2163k7519E1L5908L9358B9658b4710J0676B1339j643b1079m2187
284f3266j1892R715J2297K6043A7900K7167M70R505J2965k1968G536l8K0952H32
299g5708l2082M9329b0440j7346J5863F8749O0148n1990b599B708M3827k2583
311B3952d9339l6193K1719J9149k6114k1301b9628F6245J1244l6773K4257K2883
323H7856C1164i457H404e393l7479m667m814l933K3702J0938g297D7745N398c887
$$ plain form
338 8776 75591 58546 -12177 -28454 -4144 -2131 -50198 -103138 -70603 12349 16114 -24636 7010
352 67966 71226 40284 23805 35160 42254 2956 -55460 -67856 -49867 -51347 -52970 -20687 17154
366 22767 22167 45376 50642 17281 11323 41919 12520 -66571 -78771 -29322 -5691 -12616 -21279
379 -21279 -1791 58744 66080 -20946 -43937 48814 79128 -3160 -51824 -21646 126 -21387 -50837
392 -50837 -37430 22967 41094 -18952 -46857 462 29455 16143 20193 37003 36297 19222 -10391
406 -34882 -30782 -11790 5548 15151 -6905 -52971 -43334 27841 46894 -6353 -8354 60174 77216
419 77216 4177 -54465 -26788 31232 25883 -44909 -71478 -10484 19254 -47959 -70033 33722
432 114229 63707 -7199 3104 41278 33358 -13721 -35885 -6707 12335 -30854 -80255 -66032 -18999
$$ packed form
338H776O6815j7045a2177j6277d144K013m8067n2940L2535A2349L765b4636G010
352F7966L260l0942j6479J1355P094B956e5460j2396J7989j480j623b0687A7154
366B2767o00K3209N266A7281n958L0596A2520f6571j2200b9322e691o925q663
379b1279a791E8744P336b0946k2991D8814L0314c160m8664b1646A26b1387k9450
392e0837J3407B2967J8127a8952k7905D62K8993j3312M050J6810p06j7075a0391
406c4882M100a1790E548R603f905m6066R637B7841J9053f353k001F0174J7042
419G7216D177e4465b6788C1232n349d4909k6569a0484A9254d7959k2074C3722
432A14229n0522g199C104L8174p920a3721k2164f707A2335c0854m9401J4223a8999
$$ plain form
446 10220 35660 57312 43674 18635 24691 35019 9289 -23642 -19081 9433 1253 -55488 -76940
459 -76940 -8428 56109 28086 -7209 36945 73553 18299 -52081 -40674 30429 56133 -12110
472 -70009 -19039 43099 4402 -46919 -2587 63436 50687 -10269 -39768 -21543 6213 15869 20786
485 20786 33427 30641 1913 -17027 -15579 -25271 -36411 -10208 29705 23268 -12764 -2278 47157
499 50592 1992 -17693 13036 14958 -48297 -87132 -23264 60013 44775 -22720 -18021 46086 54167
512 54167 -4525 -29701 16910 56624 21334 -39081 -36455 2178 -9324 -39527 -18686 7707 -7320
526 -19455 2746 31206 42413 39442 40042 44712 20576 -26195 -37905 -14692 -30785 -74504 -56375
539 -56375 8559 26559 -4408 5229 78109 122575 65498 -23790 -38882 -5512 -23129 -80015 -80675
$$ packed form
446A0220K5440K1652j3638A8635O056J0328I289b3642M561I433A253e5488k1452
459g6940h428E6109k8023g209C6945L6608A8299e2081J1407C0429K5704a2110
472g0009a9039D3099D402d6919b587F3436j2749a0269k9499J8225F213R656M917
485B0786J2641k786A913a7027J448r692j1140a0208B9705o437a2764b278D7157
499E0592A992a7693A3036J922d8297l8835b3264F0013j5238b2720M699D6086Q081
512E4167d525k5176A6910L9714B1334c9081K626B178i324l0203a8686G707g320
526a9455B746K8460J1207k971O00M670B0576b6195j1710a4692j6093m3719J8129
539e6375H559J8000d408E229P2880M4466n7077b3790j5092e512j7617n6886o60
$$ plain form
552 -80675 -14453 23888 1010 -14151 17172 50994 48425 27153 16281 4755 -20625 -35340 -21324
565 -21324 -2420 3692 6613 14481 -197 -38087 -39653 12190 39840 8325 -11267 24242 51632 8254
580 -50452 -29392 44531 44282 -47600 -91815 -27518 32770 11897 -13540 29902 85282 60377
592 60377 -22589 -55191 -14719 9334 -16943 -29166 -2787 12187 -7354 -21363 -2805 22697 31430
605 31430 28517 11339 -19045 -35070 -12679 28147 33921 4222 -487 30272 12537 -67280 -97999
618 -97999 -19257 64874 47097 -14702 -3412 58766 54147 -21392 -47505 11656 38421 -34134
631 -99743 -57660 26145 39921 9635 27484 76359 62690 -14274 -61208 -30095 12536 7169
643 7169 -12522 -12418 -14660 -21585 -6789 16596 24998 30950 44349 42885 657 -57803 -66032 -15841
$$ packed form
552h0675a4453B3888A010a4151A7172L3822k569k1272j0872D755b0625j4715J4016
565b1324b420C692K921P868a97l7890j566A2190K7650H325a1267B4242K7390H254
580e0452K1060D4531k49d7600m4215b7518C2770A1897a3540B9902N5380k4905
592F0377b2589l2602a4719I334a6943j2223b787A2187g354j4009b805B2697Q733
605C1430k913A1339a9045j6025a2679B8147N774D222d87C0272A2537f7280l0719
618i7999a9257F4874j7777a4702c412E8766m619b1392k6113A1656K6765c4134
631i9743M2083B6145J3776I635J7849M8875j3669a4274m6934c0095A2536n367
643G169a2522J04k242o925f789A6596Q402N952J3399j464F57e7803q229a5841
$$ plain form
658 15729 -14721 -34606 13087 56960 20531 -26055 11132 78918 60582 -32446 -74747 -31690
671 -4777 -39418 -50546 15773 79361 59669 -2091 -17875 16762 26621 -15138 -42087 -22184 -16693
684 -16693 -36085 -24399 9686 23584 38119 61648 53466 6958 -36043 -34246 -3138 -8186 -49480
697 -49480 -47565 8348 29330 -9752 -22260 40586 94873 53470 -29479 -34447 14164 -6397 -79884
710 -79884 -80372 -2911 37418 6410 -15348 19932 64254 56800 12914 -8044 -973 -16348 -54710 -57205
724 -57205 -24655 -9444 -5927 23149 47511 28599 4289 16796 29234 -10778 -62801 -49463 -3216
738 -6662 -35952 -10873 58909 86592 30201 -34301 -17710 28403 -5168 -75016 -58544 15127
751 26168 -18464 -18968 32737 53567 11146 -35442 -34102 -10213 -6072 -13230 -1772 22087 28099
$$ packed form
658A5729a4721j9885A3087M3873B0531b6055A1132O7786j8336c2446m2301c1690
671d777l4641j1128A5773O3588j9692b091j5784A6762R859a5138k6949J9903N491
684a6693j9392J1686I686J3898J4535K3529q182F958c6043J797c138n048m1294
697d9480J915H348K0982i752j2508D0586N4287m1403b9479m968A4164f397p3487
710g9884m88b911C7418F410a5348A9932M4322p454A2914h044i73j5375l8362k495
724e7205b4655i444L517B3149K4362j8912D289J2507J2438a0778n2023J3338c216
738f662k9290a0873E8909K7683C0201c4301J6591B8403e168o9848J6472A5127
751B6168a8464n04C2737K0830A1146c5442J340a0213M141p158a772B2087O012
$$ plain form
764 28099 9133 -15753 -30967 -29511 -4660 30206 35035 -7617 -40692 -9818 25478 -13639 -49363
777 -49363 10032 71218 25700 -52333 -53851 4036 34209 -557 -38624 -2303 53403 15595 -66529
791 -53167 31466 49140 -6766 -31047 -281 15527 -5314 -17905 -1127 16468 13429 -9542 -34690
804 -34690 -41416 -22505 13157 42919 38667 6224 -11413 -1567 -7267 -42109 -42599 21294 61420
817 61420 3942 -65922 -42857 18388 15906 -20783 1609 62398 53063 -27952 -68705 -23175 33151
831 26719 -22008 -24699 25246 18537 -58673 -64368 14931 46434 16873 3985 -1191 -15065 -4793
845 11873 9767 7542 3382 -11700 -17432 -26712 -44357 -22326 37493 55330 7757 -22566 6596
859 27756 -13646 -45654 1428 54622 11761 -75854 -74771 7796 47024 13150 2833 47776 68482
$$ packed form
764B8099I133a5753j5214J456d660C0206M829g617l3075i818B5478a3639l5724
777d9363A0032O1186B5700e2333j518D036L0173e57l8067b303E3403A5595f6529
791e3167C1466J7674f766k4281b81A5527e314j2591a127A6468l039i542k5148
804c4690o726J8911A3157K9762m252F224a1413a567n700l4842m90B1294M0126
817F1420C942f5922K3065A8388k482b0783A609O0789r335b7952m0753b3175C3151
831B6719b2008k691B5246o709e8673n695A4931L1503A6873C985a191j3874d793
845A1873k106k225C382a1700n732r280j7645K2031C7493J7837G757b2566F596
859B7756a3646l2008A428N3194A1761g5854J083G796L9228A3150B833M4943K0706
$$ plain form
872 68482 14088 -58733 -68209 -18202 9392 -19811 -29517 13188 30589 6123 14769 46999 29652
885 29652 -6219 -8142 -15886 -44696 -42230 -7105 17621 20418 428 -16327 4369 21539 -14293 -29981
899 -29981 28183 62671 7281 -51905 -30963 24182 23599 -20438 -15308 37151 37528 -18941 -46469
912 -46469 -25517 3938 11249 3750 13157 37586 29440 -8958 -15119 -1801 -22512 -49614 -33571 1507
927 6962 2488 32958 63356 31632 -15696 -6006 11641 -23472 -54126 -25272 19485 19502 -24589
941 -46044 6470 68009 39538 -25711 -6903 50788 21824 -52025 -46377 12078 22356 -13226 -31357
954 -31357 -13333 10327 8062 -7757 6525 37794 28655 -6956 -10966 5611 651 -8407 -3387 -10687
968 -10687 -41726 -52125 -13057 27455 18396 3379 42311 78343 25204 -58066 -55951 5452 16662
$$ packed form
872F8482A4088e8733r476a8202I392a9811r706A3188J7401F123Q646L2230j7347
885B9652f219j923p744k8810K466g105A7621K797D28a6327D369J7170a4293j5688
899b9981B8183L4488G281e1905K0942B4182n83b0438N130C7151L77a8941k7528
912d6469K0952C938P311C750R407K4429q146h958o161a801k0711k7102J6043A507
927F962B488L0470L0398C1632a5696f006A1641b3472l0654b5272A9485J7b4589
941d6044F470O1539k8471b5711f903E0788B1824e2025N648A2078J0278a3226j8131
954c1357a3333A0327k265g757F525L1269r139f956m010E611F51h407c387p300
968a0687l1039j0399a3057B7455r059C379L8932L6032B5204e8066K115E452J1210
$$ plain form
981 16662 -23213 -40310 -11610 21454 4909 -41279 -19042 64268 65518 -17570 -31368 19087
994 7362 -36368 -22225 12572 17188 4622 -25443 -49427 -25190 10788 12235 12625 20555 7621 -263
1009 19142 17411 -6000 3314 26338 1454 -65120 -102977 -59555 19737 34154 5884 41331 96787
1022 96787 52948 -34746 -48302 -11971 3538 -23569 -65742 -50039 16113 14777 -44250 -16207
1035 73233 71057 -949 -20702 283 505 -11534 -14138 -12863 -7310 -6132 -18257 -27491 -17456 -1853
1050 15139 38031 37382 -5818 -32928 -1064 23475 -10686 -31667 9126 33714 -23490 -86921 -59206
1063 -59206 14355 30684 -496 8703 64948 78209 14456 -45181 -31558 9100 -7453 -62976 -71039
1076 -71039 -17845 18992 8220 12390 48355 50726 11892 -6952 -7000 -27318 -32021 5526 24544 1003
$$ packed form
981A6662b3213j7097a1610B1454D909d1279a9042F4268J250a7570j3798A9087
994G362c6368J4143A2572M616D622b5443k3984K4237A0788J447L90P930G621b63
1009A9142j731f000C314K3024A454f5120l7857M3422A9737J4417E884L5447N5456
1022I6787m3839c4746j3556a1971C538b3569m2173J5703A6113j336d4250a6207
1035G3233k176i49j9753B83K22a1534k604J275N553J178j2125r234J0035a853
1050A5139K2892o49e818k7110a064B3475a0686k0981I126K4588b3490o3431K7715
1063e9206A4355J6329d96H703N6245J3261A4456d5181J3623I100g453n5523q063
1076g1039a7845A8992H220M170L5965K371A1892f952m8k0318m703E526J9018A003
$$ plain form
1091 -14323 -9754 -10474 -16081 -30118 -35017 4475 41550 8594 -21796 36458 88318 36745 -27807
1105 -18061 1969 -30950 -76800 -74144 -16337 32086 19401 -2561 30147 70790 52655 11127
1118 2020 1908 -28984 -64914 -62064 -30266 -3790 17747 48151 62371 31978 -8240 -1576 18892
1132 -14846 -54791 -20814 27720 4783 -32429 -11519 34311 49339 7243 -59415 -41003 41849
1145 30259 -38831 8016 98768 66690 -18276 -45174 -39298 -26034 -18768 -44046 -34075 34716 49024
1158 49024 5124 16274 53315 41055 20933 10209 -26261 -54864 -47187 -27691 -3148 11327
1171 14511 46312 67777 3969 -61110 -19905 39261 17040 -24939 -15754 25998 44048 2088
1184 -39550 7104 69709 24553 -67372 -66548 -166 17125 -19304 -12716 55141 80801 26513 -24266
$$ packed form
1091a4323M569p20n607j4037m899D475L7075H594b1796C6458N1860C6745b7807
1105a8061A969c0950m5850K656a6337C2086j2685b561C0147M0643j8135A1127
1118B020j12b8984l5930K850c0266c790A7747L0404J4220l0393h240a576A8892
1132a4846l9945b0814B7720D783c2429a1519C4311J5028G243e9415J8412D1849
1145C0259c8831H016R0752l2078a8276k6898N876J3264P266k5278R971C4716J4308
1158D9024E124J1150L7041j2260k0122A0209b6261k8603P677J9496c148A1327
1171A4511L1801K1465C969f1110a9905C9261A7040b4939R185B5998J8050B088
1184c9550G104O2605B4553f7372Q24a66A7125a9304O588E5141K5660B6513b4266
$$ plain form
1198 -28523 -18170 -7338 -8838 -25106 -12902 19724 19239 14741 38596 37116 16399 24615 3340
1212 -66248 -75086 -14460 14156 1064 3205 33049 59835 29701 -43010 -47035 24159 39496 -15365
1226 -31033 12123 44222 22957 -27170 -30147 22787 20246 -54182 -66591 422 31739 22182 35723
1239 35723 50339 35797 11966 -11558 -36348 -44512 -31751 -18183 -9712 -2689 -773 10997 42064
1252 42064 56766 17306 -21045 -935 10773 -43614 -74941 -14051 49218 38734 5810 9239 37025
1265 37025 34173 -24436 -71471 -40587 2580 -16349 -39751 -1718 50002 56663 29673 11075 10039
1278 10039 -6803 -47881 -53545 -12337 4868 304 28693 50773 18622 -11838 -4157 -6584 -28615
1291 -28615 -41835 -35334 -3259 25775 4709 -17221 38874 86861 21137 -58789 -37093 8688 -11816
$$ packed form
1198b8523J0353g338j500j6268J2204A9724m85m498K3855j480A6399Q216C340
1212f6248q838a4460A4156A064K141K9844K6786B9701d3010m025B4159J5337a5365
1226c1033A2123L2099k1265b7170k977B2787k541e4182j2409D22L1317r557J3541
1239C5723J4616j4542A1966a1558k4790q164J2761J3568Q471b689g73A0997L1067
1252D2064J4702A7306b1045i35A0773d3614l1327a4051D9218j0484E810L429K7786
1265C7025k852b4436m7035L0884B580a6349k3402a718E0002O661k6990A1075j036
1278A0039f803m1078n664a2337D868C04K8389K2080A8622a1838d157k427k2031
1291b8615j3220O501c259B5775D709a7221C8874M7987B1137e8789K1696H688a1816
$$ plain form
1305 -47285 -30263 19920 42688 7930 -30267 -5460 39738 27700 -10658 -8707 9035 -6106 -31997
1318 -31997 -23447 8349 22626 14202 6054 -1996 -23528 -36234 -13547 10997 -759 -14329 16473
1332 47866 17689 -26979 -9521 34101 21146 -36125 -64535 -25176 31481 20884 -24697 8609
1345 78536 43426 -51386 -55873 161 9777 -13986 -17131 2873 27423 16691 -30913 -29580 29355
1359 43351 6143 213 11479 -5820 -15461 -2349 -4948 -15891 -6577 7412 1428 -22600 -31386 12728
1374 65378 47139 -9444 -10449 22114 6521 -47299 -56510 -5175 33049 1675 -41398 -10927 56486
1388 55652 3017 3597 49284 33997 -43568 -73511 -32639 5395 9104 4339 9288 26270 30980
1401 30980 3315 -17088 275 9509 -4258 903 6229 -21146 -24660 21784 39248 5450 -11837 3864
$$ packed form
1305d7285J7022A9920K2768G930c0267e460C9738j2038a0658J951I035f106k5891
1318c1997Q550H349J4277q424F054a996k1532j2706a3547A0997g59j3570A6473
1332D7866A7689b6979i521C4101j2955c6125k8410b5176C1481j0597b4697H609
1345G8536l5110e1386m487A61R616a3986l145B873K4550j0732c0913J333B9355
1359D3351F143B13J1266e820r641b349k599j0943f577G412A428b2600q786A2728
1374F5378j8239i444j005B2114F521d7299r211e175C3049A675d1398a0927E6486
1388E5652C017N80M5687j5287d3568k9943c2639E395L709D339M949J6982M710
1401C0980C315a7088B75R234d258I03N326b1146l514B1784J7464E450a1837C864
$$ plain form
1416 11262 -4500 -22576 -1858 52670 58923 -2508 -31671 4750 13817 -30784 -49226 -11066 29029
1430 20469 -19622 -17898 33956 52817 13488 -8660 7656 3807 -20001 -18178 293 10156 13107 14845
1444 14845 9036 -3235 -11497 -7562 13840 26652 4468 -15098 10468 29931 -9968 -38567 2674
1458 34142 -3919 -38537 -12797 30910 36065 560 -21118 12691 40940 -3550 -46988 -8747 40569
1472 23777 -9248 -5503 10452 12809 451 -9789 2007 12425 -3435 -12022 59 -8636 -22875 2626 31824
1487 31824 16695 -5470 4988 22489 13395 -16007 -22487 16089 39851 -2647 -42202 -2451 46655
1501 14222 -41716 -25635 27084 24449 -23579 -37667 9107 50020 27045 -19984 -17442 13370
1514 777 -32933 -20885 16583 20968 5133 3024 6425 4298 6254 12614 13830 628 -15486 -11774
$$ packed form
1416A1262d500j8076a858E2670O253b508k9163D750R067c0784j8442a1066B9029
1430B0469a9622J724C3956J8861A3488h660G656C807b0001J823B93R863K951J738
1444A4845n809c235q262L935A3840J2812D468a5098A0468J9463i968k8599B674
1458C4142c919l4618a2797C0910N155E60b1118A2691K8249c550m3438h747D0569
1472B3777i248L745A0452K357D51i789B007J0418c435q587E9h636j4239B626K9198
1487C1824j5129e470D988J7501r094a6007o480A6089K3762b647l9555b451D6655
1501A4222d1716J6081B7084k635b3579j4088I107M0913k2975a9984K542A3370
1514G77c2933J2048A6583M385E133k109L401k127J956O360J216F28a5486L712
$$ plain form
1528 -11774 1206 -13177 -33349 -1661 46869 28921 -28122 -30786 17840 33557 -8697 -37151 1532
1542 44810 9551 -57191 -41666 32649 46827 -5162 -19298 21813 38898 1254 -32789 -15036
1555 23977 20310 -22794 -38275 -14163 -2706 -10941 2002 21637 18142 10763 9903 -3608 -19966 -14606
1569 -14606 6686 17110 -4505 -37479 -26569 20675 25786 -10559 -1127 49864 45965 -17965 -51514
1582 -51514 -17452 22624 6343 -34816 -25039 23527 21837 -27766 -31748 21016 40732 829 -30694
1596 -15662 7438 3668 -6397 8915 33524 30286 3149 -13331 -16865 -25008 -23781 -60 12746 -5258
1611 -14453 9796 28590 11424 -9182 3335 25825 5639 -47036 -57618 -7635 23191 -4107 -13100
1624 -13100 32713 57720 18702 -23492 -15427 16176 17168 -16320 -32386 -6613 12685 -6614 -15938
$$ packed form
1528a1774A206a3177k0172a661D6869j7948b8122k664A7840J5717h697k8454A532
1542D4810I551e7191J5525C2649J4178e162j4136B1813J7085A254c2789a5036
1555B3977l667b2794j5481a4163b706q235B002J9635l495p379q60c608j6358N360
1569a4606F686J0424d505l2974J0910B0675N111a0559a127D9864l899a7965l3549
1582e1514a7452B2624F343c4816R777B3527j690b7766l982B1016J9716H29c0694
1596a5662G438C668f397H915K4609l238C149a3331l534q143J227f0A2746e258
1611a4453I796J8794A1424i182C335K2490E639d7036j0582g635B3191d107q993
1624a3100C2713K5007A8702b3492Q065A6176R92a6320j6066f613A2685f614r324
$$ plain form
1637 -15938 10299 21058 -2947 -16670 -9479 -8974 -10376 7152 23999 17254 -4749 -11166 4974 12628
1651 12628 -8735 -18406 15496 37363 -1906 -43230 -19034 30109 27418 -10797 -14234 25242 36653
1664 36653 -13433 -48894 -14564 23388 1759 -28634 -11513 20206 23724 9758 6035 16848 18982
1677 18982 -3979 -25529 -19943 -7827 -7399 4974 25813 14625 -7583 6735 33189 18355 -10930
1691 -4229 21595 7445 -46884 -65998 -18841 27032 10529 -19084 11563 61955 45870 -18988
1704 -29298 24057 43152 -8466 -45124 -11961 24555 5384 -26151 -8834 29115 26301 -8529 -19766
1717 -19766 903 17459 14137 6380 3083 -541 -8606 -12262 -5712 -5382 -8882 15178 44029 18635
1732 -32273 -22804 28378 30443 -12127 -18897 22303 41734 -1156 -46660 -23600 33170 27879 -28316
$$ packed form
1637a5938A0299J0759b947j3723P191N05j402G152J6847o745d749o417D974P654
1651A2628h735r671A5496K1867a906m1324a9034C0109k691a0797l437B5242J1411
1664C6653a3433l5461a4564B3388A759b8634a1513B0206L518I758l723J0813K134
1677A8982c979k1550N586g827M28D974K0839j1188g583F735K6454j4834a0930
1691d229B1595G445d6884j9114a8841B7032A0529a9084A1563N0392j6085a8988
1704b9298B4057J9095h466l6658a1961B4555E384b6151h834B9115k814h529j1237
1717a9766I03J6556l322F380C083e41q065l656e712L30l500A5178K8851A8635
1732c2273R469B8378K065a2127o770B2303J9431a156m5504K3060C3170n291b8316
$$ plain form
1746 -36636 16022 34230 -8620 -28542 16893 54167 20731 -30374 -30304 -1700 2874 -10010 -7645
1759 -7645 10468 21753 17969 10366 13651 19642 18184 15530 5992 -26302 -57300 -41186 -2990 1030
1774 -10765 13597 55344 46099 -6777 -21850 16418 31101 -10936 -41030 -14239 18164 3578
1787 -29029 -16167 36346 50948 1396 -31859 683 26930 -37 -20004 3214 21501 8114 -6502 -7702
1801 -7702 -6298 -7646 -10459 -7482 -3169 -8715 -10850 13606 37354 25585 2949 8495 19384 -5607
1816 -47342 -39057 16765 34817 -5232 -18745 19875 32328 -10351 -38849 -12805 27692 26964 -10769
1830 -26205 42 14452 -10541 -28007 -8849 8492 1045 -2290 14730 25113 18349 20331 26728 2575
1845 -33289 -31161 -4262 -2310 -19163 -14641 12225 21720 -5380 -31439 -4643 42048 29899 -22972
$$ packed form
1746c6636A6022J8208h620j9922A6893L7274B0731c0374P0a700B874a0010K365
1759g645A0468J1285l784p603L285N991j458k654E992b6302l0998J6114b990A030
1774a0765A3597M1747r245f777j5073A6418J4683a0936l0094a4239A8164C578
1787b9029J2862C6346J4602A396c1859F83K6247c7j9967C214J8287H114f502j200
1801g702J404j348k813K977c169n546k135A3606K3748j1769B949N546J0889e607
1816d7342Q285A6765J8052e232j3513A9875J2453a0351k8498a2805B7692p28a0769
1830b6205D2J4410a0541j7466h849H492A045b290A4730J0383o764J982O397B575
1845c3289K128d262J952j6853M522A2225R495e380k6059d643D2048j2149b2972
$$ plain form
1859 -26049 19458 22517 -27198 -39019 13840 46572 9945 -32133 -19453 12551 10019 -14879
1872 -18122 6605 20761 3262 -12427 2503 19674 9240 -6895 -10968 -18648 -28962 -15949 7286
1886 6474 -1815 15670 32885 4153 -36579 -24797 21519 32552 -4679 -26542 4723 37103 4412
1900 -47520 -29373 36351 42107 -18796 -44397 1673 34753 -3206 -41271 -15440 18631 477 -28087
1914 -19924 8806 30254 28404 9798 6114 11523 -6167 -22529 -8986 -3772 -14481 557 18904 -7011
1929 -34163 -9806 27740 21226 -13595 -20356 15302 28194 -17588 -43462 -505 39441 16576 -26446
1943 -27105 8264 18899 -19615 -34974 15989 46597 -2169 -36906 -734 30399 11051 -5625 4316
1957 14253 5352 -17758 -35798 -25785 -2995 -82 -4645 4952 8208 -2080 8662 32272 20609 -10496
$$ packed form
1859b6049A9458L059b7198j1821A3840L2732I945c2133J2680A2551k532a4879
1872a8122F605J4156C262a2427B503J7171I240f895m073p680j0314J3013G286
1886F474a815A5670J7215D153c6579J1782B1519J1033d679k1863D723L2380D412
1900d7520J8147C6351N756a8796k5601A673L3080c206l8065a5440A8631D77b8087
1914a9924H806K1448j850I798l684N409f167j6362h986c772j0709E57J8347g011
1929c4163i806B7740o514a3595o761A5302J2892a7588k5874e05C9441A6576b6446
1943b7105H264J0635a9615j5359A5989L0608b169l4737g34C0399A1051e625D316
1957A4253E352a7758j8040J0013b995h2m563D952L256b080H662K3610j1663a0496
$$ plain form
1972 -6682 11602 -9049 -42795 -25816 24830 39706 3752 -21317 796 22161 -4669 -36672 -16570
1986 27433 28529 -14697 -33279 4325 31955 -123 -28596 -1735 21332 -1336 -16488 502 11032
1999 11032 7955 8295 3236 -7699 -13092 -10793 766 14005 3688 -11287 2994 22172 3142 -27933
2014 -16645 23724 23688 -24749 -38057 10552 29776 -9469 -21104 16579 36501 14947 -15313 -23875
2027 -23875 2425 20848 -8547 -26975 8877 27658 -1272 -11640 9371 11222 -5708 -11782 -8434 -8667
2041 -8667 -11194 -1899 22358 25326 -1875 -11731
2047 -11731
$$ packed form
1972f682A1602i049l3746J6979B4830J4876C752b1317G96K1365d669l2003a6570
1986B7433J096a4697j8582D325K7630a23k8473a735B1332a336j5152E02J0530
1999A1032l077L40C236g699n393K299G66J3239C688a1287B994J9178C142b7933
2014a6645B3724l6b4749j3308A0552J9224i469j1635A6579J9922A4947a5313q562
2027b3875B425J8423h547j8428H877J8781a272j0368I371J851e708o074L348k33
2041h667k527a899B2358K968a875r856
2047a1731
##PAGE= T1=0.0015246
##FIRST=     0,             0,               0,               0
##DATA TABLE= (T2++(I..I)), PROFILE
$$ plain form
0 0 0 0 0 0 0 0 0 0 0 0 0 -12 12 -18 18 -27 36 -36 42 -54 60 -75 84 -96 117 -133 154 -179 206 -232 269 -307 342
34 -383 435 -490 548 -607 682 -760 841 -933 1039 -1144 1268 -1400 1544 -1699 1875 -2066 2283 -2522
53 2789 -3088 3432 -3827 4290 -4833 5489 -6293 7319 -8665 10526 -13284 17820 -26669 50810
68 -311807 -870130 -760939 -307978 -353621 -628865 194657 943639 722116 499846 488915
78 488915 171402 4489 -175775 -579730 -515409 -134380 -182013 -143326 142599 133651 119815
89 119815 296325 167678 5620 30533 -130081 -186307 54624 -3237 -135001 111808 179508
100 179508 -46337 -56368 -59715 -138878 9277 65057 -65046 62446 166998 -24908 -50367 50776
113 -47942 -50446 42601 -62838 -89772 18703 -54358 -63241 115122 90370 13502 147007 124689
$$ packed form
0@@@@@@@@@@@@a2A2a8A8b7C6c6D2e4F0g5H4i6A17a33A54a79B06b32B69c07C42
34c83D35d90E48f07F82g60H41i33A039a144A268a400A544a699A875b066B283b522
53B789c088C432c827D290d833E489f293G319h665A0526a3284A7820b6669E0810
68c11807n58323J09191c07978m5643k75244A94657P48982k21523k22270j0931
78D88915A71402D489a75775m03955O4321a34380m7633L8687A42599q948j3836
89A19815J76510j28647E620K4913a30081n6226E4624c237j31764A11808O7700
100A79508d6337j0031l347p9163I277N5780f5046F2446J04552b4908k5459E0776
113d7942k504D2601f2838k6934A8703e4358q883A15122k4752A3502J33505k2318
$$ plain form
125 124689 -60586 -24859 48933 -41249 -73319 -65499 -112807 -85708 -60693 -109231 -31219 121669
138 126300 87709 127187 149511 110247 11907 -96605 -87773 -58507 -167267 -225031 -89631 33962
151 52353 72464 111176 167232 193570 82007 -56323 -60506 -50211 -115054 -130576 -75697 -33942
164 -4166 21234 41981 74492 67738 21564 31348 40381 -38587 -65179 6377 3965 -45922 -5123
178 37622 22196 24952 -2454 -49664 7615 44088 -65048 -79244 78458 123588 28627 -8087 -10952
191 -10952 -28169 -37912 -92891 -109677 9545 66185 -5079 19686 103597 84299 62306 64912 1465
205 -43677 -52585 -120456 -138441 -51439 -5532 19417 90791 77126 647 23204 60655 2211 -57687
219 -65854 -47091 -17304 -33842 -63201 16558 136855 137157 47157 -10129 -1031 -1582 -85836 -149383
$$ packed form
125A24689f0586b4859D8933d1249l2070P820m7308K7099K5015m8538c1219A21669
138A26300l8591L9478K2324l9264A1907i6605Q832K9266j08760n7764h9631C3962
151E2353K0111L8712N6056K6338H2007e6323m183J0295o4843j5522N4879c3942
164d166B1234K0747L2511o754B1564R784R033c8587k6592F377k412d5922e123
178C7622j5426K756b454m7210G615L6473f5048j4196G8458M5130B8627h087k865
191a0952j7217r743n4979j6786I545N6640e079A9686Q3911j9298k1993K606A465
205d3677q908o7871j7985e1439e532A9417P1374j3665F47K2557L7451B211e7687
219f5854J8763a7304j6538k9359A6558J20297L02D7157a0129a031n51q4254o3547
$$ plain form
232 -149383 -54175 63350 35451 -18252 10786 32556 17401 9172 -4178 -1787 21163 -6199 -55208
245 -55208 -44974 -26203 -16579 35372 58855 2685 -35173 -14236 11208 18361 2061 7536 79299
258 79299 92225 -34893 -111681 -23962 43347 -15817 -74324 -51566 3076 10163 -49495 -65896
270 -65896 43292 132331 65999 -25406 -535 49307 7591 -54570 -39501 10298 10898 -32077 -66979
283 -66979 -54824 -5817 30604 39271 48856 54318 38740 19534 57 -34658 -57768 -38440 -16844
297 -43699 -87742 -63226 27112 73440 45410 49006 118338 126089 18403 -75444 -52336 3402 -27119
311 -101567 -102132 -30639 10801 -8289 -15450 52976 134542 103267 7374 -2948 26741 -23471 -77436
324 -77436 -55952 -38269 -46099 -30451 -18416 -13520 26532 58324 54868 62323 51562 582 4699
$$ packed form
232a49383e4175F3350k7899a8252A0786K1770j5155q229d178a787B1163f199m9009
245e5208J0234J8771R624C5372K3483B685c5173a4236A1208P153B061N475P1763
258G9299J2926c4893p6788b3962D3347a5817n8507K2758C076P087d9495j6401
270f5896D3292Q9039F5999b5406e35D9307G591e4570J5069A0298O00c2077l4902
283f6979J2155e817C0604Q667R585N462j5578j9206E7c4658k3110J9328a6844
297d3699m4043K4516B7112M6328k8030L596O9332P751A8403g5444K3108C402b7119
311a01567n65c0639A0801h289p161E2976Q1566l1275G374b948B6741b3471n3965
324g7436K1484J7683p830J5648J2035M896B6532L1792l456P455j0761E82M117
$$ plain form
337 4699 44921 2786 -70299 -62250 -19989 -24113 -62640 -74965 -8060 73550 55680 -4786 23494
351 82283 55974 -10775 -27073 -4764 926 -36785 -77411 -56167 2008 21534 16911 42178 70099
364 70099 57003 27040 19154 11171 -23330 -37735 -16548 -36595 -87010 -65055 11573 41284
376 41284 26166 18381 33943 66610 54107 -26734 -46619 41817 63433 -34671 -78742 -24278
389 10464 -7200 -22672 -2537 45984 50835 -11994 -34775 21390 50091 21839 7274 14398 1738
403 -23721 -41474 -44270 -24421 4565 17808 18295 -1664 -28473 -5485 63856 73519 8027 -9420 47435
418 51180 -32944 -81683 -33604 28554 16144 -50722 -64581 9697 50429 -5372 -24090 67973
431 120693 40162 -45657 -30300 17262 9869 -30980 -41720 -10273 11163 -17245 -47641 -13724
$$ packed form
337D699M0222B786g0299Q049a9989m124l8527j2325h060G3550j7870d786B3494
351H2283k6309a0775j6298d764I26c6785m0626K1244B008J9526m623K5267K7921
364G0099j3096B7040p886p983b3330j4405a6548k0047n0415K1955A1573K9711
376D1284j5118p785J5562L2667j2503b6734j9885D1817K1616c4671m4071b4278
389A0464g200j5472b537D5984M851a1994k2781B1390K8701B1839G274P124A738
403b3721j7753k796J9849D565J3243M87a664k6809e485F3856R663H027i420D7435
418E1180c2944m8739c3604B8554j2410e0722j3859I697M0732e372j8718F7973
431A20693D0162d5657J5357A7262p393c0980j0740a0273A1163a7245l0396a3724
$$ plain form
444 43548 61707 58005 48369 13372 -24803 -20052 -3135 -23030 -50195 -31969 7395 7426 -31495 -32503
458 -32503 42732 97578 49791 -9915 13747 40655 -13285 -71226 -41921 32591 44865 -24010
471 -66985 -8098 57128 21739 -32817 7254 62791 29291 -36158 -48927 -13524 22453 27842 15507
484 15507 8387 -2824 -24848 -32107 -16445 -7841 -5089 24070 56226 37544 -6401 -653 40916 32245
498 32245 -30103 -53447 -14820 -2360 -48769 -64453 9838 83522 49465 -31772 -25858 40340 44069
511 44069 -16713 -38261 8751 43291 3601 -55576 -42003 9216 6386 -20824 -1922 25364 8386
525 -4889 20096 39453 28333 9701 -1379 -8757 -29266 -59917 -54041 -11999 -5586 -30682 -2242
539 64798 71105 22151 16128 63337 66954 -16881 -101170 -89904 -25985 -17386 -50702 -28221 44456
$$ packed form
444D3548J8159l702r636A3372b4803M751c135j9895k7165J8226G395L1c1495j008
458c2503D2732N4846m7787i915A3747K6908a3285n7941K9305C2591J2274b4010
471f6985h098E7128B1739c2817G254N5537B9291c6158j2769a3524B2453N389j2335
484A5507p120b824k2024p259J5662g841K752B4070L2156j8682f401f53D0916q671
498C2245c0103k3344a4820b360m6409j5684I838P3684l4057c1772N914D0340L729
511D4069a6713k1548H751L4540C601e5576J3573I216k830b0824a922B5364H386
525d889B0096J9357j1120I701a379p378k0509l0651N876a1999e586k5096b242
539F4798O307B2151o023M7209L617a6881q4289J1266b5985Q599l3316K2481D4456
$$ plain form
553 73752 35989 6104 26483 49085 24023 -15452 -29101 -32612 -39829 -36530 -12800 12896 17117
566 17117 10615 11043 -1170 -24506 -10228 43091 57508 9957 -18797 10860 28272 -19119 -65878
579 -65878 -33045 34059 22913 -60230 -77577 11164 77165 43330 1000 31564 66316 19730
592 -61540 -71755 -8039 30062 3106 -19436 5387 21753 -374 -13529 4792 23194 20366 2693 -16236
607 -29555 -26116 5737 40843 33251 -6047 -16055 5895 -6416 -59322 -57403 35373 102081 52783
620 52783 -27751 -19726 36608 23065 -49707 -63841 2215 31225 -31358 -71208 -2135 82588 74203
633 74203 18784 12285 35550 6378 -67951 -88654 -26455 27713 16071 -11474 -8810 4017 7771
646 7771 20977 39330 36674 18214 12472 -178 -39611 -72367 -52065 9167 41498 8387 -18096
$$ packed form
553G3752C5989F104K0379K2602B4023a5452j3649l511p217L299a2800A2896M221
566A7117o502M28a170k3336a0228D3091J4417I957a8797A0860J7412a9119m6759
579f5878L2833C4059j1146f0230j7347A1164O6001l3835A000L0564L4752A9730
592f1540j0215h039C0062C106a9436E387J6366c74j3155D792J8402k828B693a6236
607b9555L439E737L5106p592f047j0008E895f416n2906J919C5373O6708m9298
620E2783b7751Q025C6608j3543d9707j4134B215K9010c1358l9850b135H2588q385
633G4203A8784o499K3265F378f7951k0703b6455B7713j1642a1474K664D017L754
646G771J3206J8353k656A8214n742a78l9433l2756K0302I167L2331H387a8096
$$ plain form
660 21468 53439 11013 -34173 -497 49492 16545 -67433 -83743 -13071 34050 8451 -1136 51513
674 81375 32470 -35493 -46730 -10820 -752 -36154 -45279 -12060 1430 -8577 11799 48046 49822
687 49822 31952 26067 10717 -33999 -66400 -45375 -1154 6116 -23970 -20951 31977 53130 10695
701 -9351 34982 61109 5109 -70016 -66476 -10385 -7693 -52427 -32876 46540 70993 24127 -482
715 25316 43078 13423 -35656 -49647 -31183 -32932 -46018 -20008 24660 37008 31490 43405
727 43405 50164 14863 -27510 -19177 1566 -30918 -69976 -38418 23286 30775 643 11440 59379
740 59379 60904 -11625 -70545 -42816 11958 -3524 -53288 -27928 48774 57038 2586 -7249 30106
754 32336 -15810 -51614 -36626 -1877 10536 5242 14341 25839 12262 -10955 -23016 -23164 -8174
$$ packed form
660B1468L1971A1013c4173d97D9492A6545f7433j6310a3071C4050H451a136E1513
674H1375C2470c5493j1237a0820g52l5402r125a2060A430h577A1799L6247J776
687D9822j7870n885A0717c3999l2401K1025a154F116b3970L019C1977K1153A0695
701i351C4982K6127E109g0016L540a0385K692m4734J9551D6540K4453B4127d82
715B5316J7762A3423c5656j3991J8464j749j3086b0008B4660J2348n518J1915
727D3405O759A4863b7510Q333A566c0918l9058L1558B3286P489F43J0797M7939
740E9379J525a1625n8920K7729A1958c524m9764K5360D8774Q264B586g249C0106
754C2336a5810l5804J4988a877A0536E242R099J1498A2262a0955j2061j48h174
$$ plain form
768 16249 33802 26353 -15019 -42433 -5478 32648 518 -29606 18451 61354 7086 -64868 -44713
781 -44713 27150 47118 3292 -28378 5222 43711 3234 -64561 -33826 53743 52969 -21840 -40023
794 -40023 6430 22631 -5052 -18595 4778 26567 10855 -20795 -28755 -9422 20689 45833 46054
807 46054 20688 -12162 -28619 -20447 -12732 -25049 -14850 36405 48266 -16728 -63304 -19969
820 45022 36562 -6188 13062 57888 22453 -59397 -66726 6044 56186 27760 -27945 -22480 29547
834 18507 -50271 -37835 53238 70829 6082 -22213 -5104 -2967 -3284 6557 7029 1628 -1414 -16963
848 -16963 -26579 -11835 1998 19686 52638 48562 -4564 -27594 1687 15386 -14580 -29988 12681
862 47999 -3281 -70943 -35432 55871 71937 17592 -2012 29443 27680 -39318 -90134 -56119 16811
$$ packed form
768A6249J7553p449a5019k7414e478C2648E18b9606A8451M2903G086f4868K0155
781d4713B7150J9968C292b8378E222L8489C234f4561L0735E3743p74b1840j8183
794d0023F430J6201e052j3543D778K1789A0855b0795p960i422B0689K5144K21
807D6054B0688a2162j6457Q172P715j2317J0199C6405J1861a6728m6576a9969
820D5022q460f188A3062M4826B2453e9397p329F044N0142B7760b7945N465B9547
834A8507e0271J2436E3238J7591F082b2213e104K137l17F557M72A628a414j5549
848a6963r616a1835A998J7688L2952m076d564k3030A687J3699a4580j5408A2681
862D7999c281o7662c5432E5871J6066A7592b012B9443j763c9318n0816L4015A6811
$$ plain form
876 39569 5357 -5963 36050 53544 14397 593 25482 7674 -36710 -32489 -18309 -30793 -14369
890 28995 41138 24332 -216 -15287 4531 20950 -8036 -20825 27632 48616 -12655 -64935 -23986
904 45072 37122 -19616 -17477 33004 29067 -29849 -50123 -9564 31712 34398 13676 6934 18490
917 18490 9204 -26666 -37819 -16513 -14170 -25000 -2872 34082 35166 23428 36311 38001 -9967
931 -50616 -27217 1453 -27148 -49007 -404 51342 31638 -19690 -24122 33396 77346 25578 -53794
945 -29870 39690 7422 -70004 -50113 31058 44187 -10661 -37857 -2736 36517 27756 -5270 -4079
958 -4079 25483 21576 -19361 -34364 -11662 2692 -2549 -8052 -17355 -29222 -9021 35336 51352
971 51352 26103 6652 29880 39582 -28084 -97696 -55325 29449 27466 -27247 -31259 15193 42336
$$ packed form
876C9569E357e963C6050J7494A4397E93K4889G674c6710M221J4180j2484a4369
890B8995J2143j6806b16j5071D531J6419h036j2789B7632K0984a2655n2280b3986
904D5072p950a9616K139C3004l937b9849k0274i564C1712K686A3676o742J1556
917A8490I204b6666j1153a6513K343j0830b872C4082J084j1738J2883J690i967
931e0616K3399A453b7148k1859d04E1342j9704a9690m432C3396M3950B5578e3794
945b9870C9690G422g0004J9891C1058J3129a0661k7196b736C6517q761e270J191
958d079B5483l907a9361j5003a1662B692b549n503r303j1867i021C5336J6016
971E1352k5249F652K3228R702b8084o9612M2371B9449j983b7247m012A5193K7143
$$ plain form
984 42336 11634 -30111 1421 74201 51586 -48002 -60979 11857 16573 -35612 -23890 25047
997 25966 -4709 -30379 -33251 6946 46335 30944 5674 11083 5538 -8530 -279 -957 -21026 -11725
1011 -11725 3368 -26133 -66585 -56044 13247 83624 75945 23104 29906 56965 -3909 -86378 -70354
1024 -70354 -6219 9197 -19624 -38702 -7298 51740 45758 -13441 5472 79094 54892 -38388 -54594
1037 -54594 -9488 -1857 -15954 -12302 -3884 -698 1734 -2770 -1900 14758 27088 28697 32329 20708
1051 20708 -22572 -44359 -9169 23504 -1739 -30300 71 24372 -19844 -60214 -15732 59765 69033
1064 69033 25475 12324 40264 32468 -29994 -71218 -43137 2643 645 -31788 -23587 31037 61583
1077 61583 43060 30490 39704 20031 -24477 -32807 -16089 -22853 -23173 17069 36180 512 -26604
$$ packed form
984D2336A1634c0111A421P2780k2615d8002j2977A1857M716c5612J1722B5047
997B5966d709k5670k872F946L9389j5391E674N409E538h530b79o78k0069R301
1011a1725C368b6133m0452J0541A3247P0377p679B3104O802K7059c909q2469J6024
1024g0354f219I197a9624j9078g298E1740n982a3441E472P3622k4202c8388j6206
1037e4594i488a857j4097L652c884f98A734b770Q70A4758J2330J609L632j1621
1051B0708b2572k1787i169B3504a739k8561G1K4301a9844m0370a5732E9765R268
1064F9033B5475A2324K7940p796b9994m1224K8081B643F45c1788Q201C1037L0546
1077F1583j8523j2570R214j9673b4477q330a6089o764l20A7069J9111E12b6604
$$ plain form
1091 -12376 4274 4466 -3845 -4199 31420 66264 27450 -21354 20044 64121 2367 -70623 -51875
1104 -51875 -10189 -18960 -40229 -16875 42598 79197 53303 12575 21231 44392 15357 -34592
1117 -45487 -34892 -40667 -44876 -14998 27401 48395 54539 59550 45181 -2116 -41052 -25604 7015
1131 -12764 -44766 -5525 48365 22810 -21530 -618 38455 34568 -11450 -56123 -25848 56369 49586
1144 49586 -26170 176 74521 23255 -74939 -74736 -29276 -4369 10302 5631 14561 65152 65399 3408
1159 -914 34396 9505 -30310 -35029 -43960 -48064 -18139 13595 33226 43283 32024 26774 26295 -25065
1174 -70913 -18243 45426 17795 -24292 -5369 29853 29556 -9070 -34807 5329 47533 -4430 -76303
1187 -76303 -46749 33666 44464 2872 6497 53809 47742 -27843 -68651 -41106 -10728 -3407 296
$$ packed form
1091a2376D274J92c845l54C1420L4844B7450b1354B0044M4077B367g0623J8748
1104e1875a0189q771k1269a6875D2598L6599k5894A2575Q656K3161A5357c4592
1117d5487J0595n775m209a4998B7401K0994O144N011j4369b116l8936J5448G015
1131a2764l2002e525D8365B2810b1530f18C8455l887a1450m4673b5848E6369o783
1144D9586b6170A76P4345B3255g4939K03b9276d369A0302m671Q930N0591K47C408
1159i14C4396I505c0310m719q931m104a8139A3595J9631J0057j1259n250m79b5065
1174g0913a8243D5426A7795b4292e369B9853k97i070k5737E329M2204d430p1873
1187g6303K9554C3666J0798B872L625M7312o067b7843m0808K7545a0728c407B96
$$ plain form
1201 1327 14563 36090 25884 10262 25682 17165 -22992 -27257 -24222 -57649 -48979 20960 52033
1214 52033 29008 17785 25393 22830 -9077 -56018 -46363 21883 35237 -19636 -29446 14625 28810
1227 28810 -2934 -37719 -31100 13778 13050 -41784 -34626 43690 66009 28934 21506 26709 -4997
1241 -40075 -48428 -44784 -30754 -7502 9005 18122 22355 19215 16995 27702 25610 -16257 -53721 -30826
1255 -30826 -165 -28078 -40351 24692 78248 45674 -5560 -9752 7766 -1966 -46853 -68636 -20945
1269 32155 17297 -6730 24938 59894 38723 -7786 -31297 -29375 -31685 -44720 -28900 20887 40383
1282 40383 22915 28089 35160 -4925 -40596 -23574 -8638 -22356 -22945 -332 30007 47042 20844
1296 -9324 26735 53977 -19377 -91743 -46640 20721 5507 -28998 -4014 43857 48022 1176 -33222
$$ packed form
1201A327J3236K1527j0206A0262J5420q517b2992m265L035l3427Q670B0960L1073
1214E2033k3025j1223P608k563i077m6941R655B1883J3354a9636r810A4625J4185
1227B8810b934l4785O619A3778p28d1784P158D3690K2319B8934p428N203d997
1241d0075q353L644J4030g502I005R117M233l140k220J0707k092a6257l7464K2895
1255c0826a65k7913j2273B4692N3556l2574e560m192G766a966m4887k1783b0945
1269C2155j4858f730B4938L4956k1171g786k3511J922k310j3035J5820B0887J9496
1282D0383j7468N174P071d925l5671J7022h638j3718n89c32C0007J7035B0844
1296i324B6735K7242a9377p2366M5103B0721E507b8998d014D3857M165A176c3222
$$ plain form
1310 -3589 40295 21545 -26102 -23119 6981 1407 -19777 -5570 27662 33551 10537 -9495 -16770
1323 -16770 -22716 -19277 5595 24858 11669 -3021 19024 35556 -2818 -41654 -14796 28167 8989
1337 -42077 -44093 15656 63816 39585 -12095 8274 60418 14848 -78391 -62941 20692 32417
1349 32417 -4708 -9138 13842 28752 12355 -27309 -21362 39063 47900 -8235 -24775 -2049 -6875
1362 -6875 -15825 -46 3258 -4029 6901 19189 9928 -6448 -1607 36645 64128 24486 -36644 -34741
1376 -34741 4289 -5360 -47188 -36258 24146 51436 10504 -27985 6734 62852 44080 -22773
1389 -27663 17322 3758 -61109 -64612 5270 52099 41651 19800 17007 23513 17920 -11308 -30542
1402 -30542 -8276 8544 -7578 -11296 -1058 -14279 -14939 26424 37275 -5957 -23710 2293 14050 247
$$ packed form
1310c589D0295j8750b6102K983F981A407a9777e570B7662N889A0537i495p275
1323a6770n946L439E595J9263A1669c021A9024J6532b818l8836a4796B8167H989
1337d2077k016A5656M8160k4231a2095H274N2144A4848g8391J5450B0692J1725
1349C2417d708m430A3842J4910A2355b7309N947C9063Q837h235j6540b049m826
1362f875q950d6C258d029F901J2288r261f448a607C6645K7483B4486c6644J903
1376c4741D289e360m1828J0930B4146K7290A0504b7985F734N6118j8772b2773
1389b7663A7322C758f1109l503E270M6829j0448A9800k793O506n593a1308j9234
1402c0542h276H544g578l718a058j3221o60B6424J0851e957j7753B293J1757B47
$$ plain form
1417 -7752 14208 51043 38377 -28885 -53623 -6935 13466 -22658 -31653 13153 46897 25679
1429 25679 -15657 -12866 33387 40948 -10835 -37489 -13438 -4483 -20420 -13139 11781 18256 12228
1442 12228 8083 -107 -8583 -7864 2487 18796 24103 501 -19415 2859 21904 -11953 -36512 3877
1457 33473 -6418 -39290 -4569 35520 24121 -17964 -33441 -268 25402 -12404 -46917 -1190 50474
1471 23674 -18659 -9788 13793 12932 -767 -9415 834 9936 -6324 -17197 -3253 -2042 -13460 5240
1486 27693 5835 -20941 -8962 8794 -2118 -23796 -18609 17368 33551 -7552 -40224 2095 47583
1499 47583 9740 -44789 -19907 34992 26332 -23749 -29087 18792 46334 8195 -41304 -32876 5573
1513 678 -28384 -12872 27351 25984 -2490 -7530 -628 -1795 -1463 2499 -1272 -12228 -19425 -9385 7845
$$ packed form
1417g752A4208L6835j2666b8885k4738f935A3466b2658q995A3153L3744k1218
1429B5679a5657K791C3387P561a0835k6654a3438d483j5937P281A1781O475o028
1442A2228m145a07q476P19B487J6309N307E01a9415B859J9045a1953k4559C877
1457C3473f418l2872d569C5520j1399a7964j5477b68B5402a2404l4513a190E0474
1471B3674a8659Q871A3793q61g67q648H34R102f324j0873c253J211j1418E240
1486B7693E835b0941h962H794b118k1678N187A7368J6183g552l2672B095M5488
1499D7583I740d4789a9907C4992q660b3749n338A8792K7542H195d1304Q428E573
1513F78b8384a2872B7351j367b490n040f28j167L32B499a272j0956p197i385G845
$$ plain form
1529 2143 -10440 16315 49193 20305 -36734 -32342 19890 28103 -18514 -41293 -552 33284 -5455
1543 -59737 -29180 47472 49327 -14558 -29275 16795 31387 -9181 -35347 -6796 30825 20825
1555 20825 -23605 -31318 5585 22868 7544 8953 21063 8414 -9569 -13161 -20195 -28042 -13737 8992
1570 11307 -9097 -26862 -4081 40550 40685 -2054 -2208 38296 24663 -40120 -58503 -6822 34003
1584 12369 -27184 -14934 31021 26286 -23791 -26014 25551 37646 -10953 -39443 -13142 17431
1597 13479 -518 7637 21768 9725 -19857 -30525 -18303 -9362 542 23105 31820 11491 -410 20326
1612 31744 6882 -16557 -7132 7859 -13440 -51344 -41640 17659 45474 9795 -8438 27814 42079
1625 42079 -6178 -44533 -21219 19032 18826 -11894 -20058 11696 33674 12487 -4321 15538 22201
$$ packed form
1529B143a0440A6315L2878B0305c6734M392A9890Q213a8514k2779e52C3284e455
1543e9737b9180D7472J855a4558j4717A6795J4592i181k6166f796C0825j0000
1555B0825b3605p713E585J7283G544J409J2110H414i569l592p034p847a3737H992
1570A1307i097j7765d081D0550J35b054j54C8296j3633d0120j8383f822C4003
1584A2369b7184J2250C1021m735b3791k223B5551J2095a0953k8490a3142A7431
1597A3479e18G637J4131I725a9857j0668J2222Q941E42K2563Q715A1491d10B0326
1612C1744F882a6557g132G859a3440l7904R704A7659K7815I795h438B7814J4265
1625D2079f178l8355b1219A9032k06a1894q164A1696K1978A2487d321A5538O663
$$ plain form
1638 22201 -7083 -23830 -9127 578 -101 9954 17677 2645 -17098 -15578 3501 11555 -5589 -11655 18842
1654 34097 -5610 -37574 -2796 45753 34023 -12068 -16259 20075 25467 -22184 -46135 -2772 38180
1668 13496 -19725 875 33246 25209 -1146 -8984 -1187 -1728 -20909 -32760 -14892 9179 12756 18675
1682 18675 31236 17293 -6400 5201 28895 12523 -18565 -12890 10536 -1750 -39763 -39535 15671
1696 54274 25708 -11869 6864 41460 12727 -48881 -46760 14161 30859 -19481 -44407 136 41024
1709 41024 19472 -11869 6307 37383 24870 -12709 -18480 6255 18571 5487 -7923 -11501 -12877
1722 -12877 -16460 -12443 -527 4722 3130 16881 33527 5740 -38569 -21742 33138 32312 -16063 -23760
1736 -23760 16403 29828 -11295 -44887 -12797 42553 32523 -24009 -27796 25233 40018 -5795
$$ packed form
1638B2201g083j6747i127E78a01I954P723B645a7098J520C501Q054e589o066A8842
1654C4097e610l1964b796D5753j1730a2068m191B0075N392b2184k3951b772C8180
1668A3496a9725H75L2371q037a146p838a187n41j9181j1851a4892I179L577N919
1682A8675J2561j3943f400E201K3694A2523a8565N675A0536a750l8013K28A5671
1696E4274B5708a1869F864L4596A2727d8881K121A4161J6698a9481k4926A36M0888
1709D1024A9472a1869F307L1076j2513a2709n771F255J2316E487g923l578j376
1722a2877l583M017e27D722j592J3751J6646E740c8569J6827C3138q26a6063p697
1736b3760A6403J3425a1295l3592a2797D2553j0030b4009l787B5233J4785e795
$$ plain form
1749 -25463 14191 38085 -5144 -52410 -37867 2731 10292 -3426 -328 15185 19934 9934 1283 4076
1763 4076 8099 1483 -6533 -12302 -28792 -38226 -8203 34554 36302 12705 19651 40211 14741 -40048
1778 -47166 -4551 10174 -27659 -46829 -9162 27536 13087 -14751 2603 45819 46420 -9580 -38838
1791 -38838 -119 30945 -92 -24176 1191 19325 -1868 -19696 -15635 -6443 -3660 -3744 -1833 3716 3222
1806 3222 2768 19065 29456 7941 -19944 -17558 -4693 -19481 -41918 -18788 35969 44862 -1419
1820 -18754 18293 27469 -15318 -33819 3374 36900 19405 -23060 -31407 -1403 10992 -15927 -30099
1833 -30099 -1864 18396 6149 -2415 13914 21946 5444 -4822 -1315 -13629 -35934 -23284 12115
1847 20001 4733 5421 21275 20668 -5094 -22665 355 31578 11027 -38124 -34710 12255 14556 -28319
$$ packed form
1749b5463A4191K3894e144m7266J4543B731P561c426c28A5185M749I934A283K793
1763D076M023A483f533n769j6490r434h203C4554J748A2705O946K0560A4741d0048
1778d7166d551A0174b7659j9170i162B7536A3087a4751B603M3216O01i580k9258
1791c8838a19C0945i2k4084A191J8134a868j7828M061f443K783q4a833C716m94
1806C222m54J6297J0391G941a9944K386d693j4788k2437a8788C5969Q893a419
1820a8754A8293R176a5318j8501C374L3526j7495b3060q347a403A0992a5927j4172
1833c0099a864A8396F149b415A3914Q032E444d822a315j2314k2305J2650A2115
1847B0001D733O88J5854o07e094j7571C55L1223A1027c8124L414A2255K301b8319
$$ plain form
1862 -28823 24708 43871 -3447 -39256 -13393 22412 14961 -9795 -5576 19361 24653 1489 -12534
1876 4204 17612 -1943 -20935 -16080 -10108 -12662 -109 23434 20186 1985 4499 13012 -11879 -41125
1890 -41125 -20378 25728 28795 -9922 -26567 5011 31540 2438 -36018 -10533 46786 40143 -22912
1904 -40028 10448 36978 -4860 -39213 -8148 25889 4378 -24379 -7030 22741 29518 13703 -8316
1918 -13722 -5058 -12169 -20117 122 13547 2780 9222 24852 3350 -21574 4155 37315 20946 -17596
1933 -21650 11987 21086 -20842 -40170 6439 41601 7969 -36088 -25984 15562 25457 -9112 -22619
1946 -22619 22891 48366 -2597 -38952 2733 37970 12074 -12356 -3001 6507 -2728 -18897 -24937
1959 -24937 -7271 19239 22461 9115 8684 10167 1500 5407 18382 1334 -30399 -22218 4446 -7193
$$ packed form
1862b8823B4708J9163c447l5809a3393B2412p451i795M219A9361N292A489a2534
1876D204J3408a943j8992M855N972k554a09B3434l248A985K514Q513a1879k9246
1890d1125b0378B5728L067i922j6645E011K6529B438c6018a0533D6786o643b2912
1904d0028A0448K6530d860l4353h148B5889D378b4379g030B2741O777A3703h316
1918a3722e058p111p948A22J3425B780O442J5630C350b1574D155L3160j6369a7596
1933b1650A1987R099b0842j9328F439L5162G969c6088J0104A5562R895i112j3507
1946b2619B2891K5475b597l6355B733L5237A2074a2356c001F507b728j6169o040
1959b4937g271A9239L222I115m31J483A500L907J2975A334c0399Q181D446g193
$$ plain form
1974 -30079 -2815 48010 47471 -1297 -25884 3445 26765 448 -27239 -1767 38252 26644 -21909
1988 -34193 7636 33010 -2539 -34554 -5594 24605 2078 -18272 2103 16651 8234 2799 -867 -7949
2002 -7949 -5542 5768 14707 18304 6489 -7088 3775 17169 -3030 -27285 -9482 26350 19399 -26088
2017 -30992 20638 37891 -7926 -22467 17410 31327 -2309 -29072 -22802 6869 23648 -1936 -20856
2030 -20856 13462 34207 605 -16799 7115 13068 -6489 -10679 -603 4336 3301 9523 22496 16070
2044 16070 -15370 -25311 -4405
$$ packed form
1974c0079b815D8010n39a297k4587C445K3320D48b7239a767C8252j1608b1909
1988c4193G636K5374b539l2015e594B4605B078a8272B103J4548H234B799h67p082
2002g949K407E768Q939L597F489g088C775J3394c030k4255i482B6350o951b6088
2017c0992B0638J7253g926j4541A7410J3917b309k6763O270F869J6779a936j8920
2030b0856A3462K0745F05a6799G115N953f489m190f03D336j035O222J2973o426
2044A6070a5370r941d405
##PAGE= T1=0.0016632
##FIRST=     0,             0,               0,               0
##DATA TABLE= (T2++(R..R)), PROFILE
$$ plain form
0 0 0 0 0 0 0 0 0 0 0 -23 19 -24 24 -24 44 -45 55 -72 77 -96 118 -139 160 -190 223 -254 299 -341 392 -447 508
32 -576 652 -735 824 -928 1037 -1162 1294 -1438 1598 -1772 1962 -2169 2397 -2643 2919 -3217 3550
50 -3915 4320 -4769 5277 -5849 6499 -7247 8118 -9146 10386 -11910 13836 -16365 19846 -24964
65 33250 -48951 89381 -496936 -550066 703022 1240576 1183757 1489765 1643359 427400 -652843
77 -862158 -979791 -1060295 -751809 -490039 -21182 573761 678900 519100 513003 232550 -76038
89 -91481 -226318 -392076 -206765 -111618 -62997 237688 267645 -10045 62212 130162 -151085
101 -227723 -86283 -92534 -298 141395 100685 154765 228691 18515 -115116 -72098 -190125 -236051
113 -236051 -74026 -50770 -2325 212693 201022 95771 188114 98921 -151294 -107212 -34755 -173306
$$ packed form
0@@@@@@@@@@b3A9b4B4b4D4d5E5g2G7i6A18a39A60a90B23b54B99c41C92d47E08
32e76F52g35H24i28A037a162A294a438A598a772A962b169B397b643B919c217C550
50c915D320d769E277e849F499g247H118i146A0386a1910A3836a6365A9846b4964
65C3250d8951H9381d96936n3130G03022N37554n6819L06008J53594D27400f52843
77h62158j17633q0504L08486K61770b1182E73761J05139j59800o097B32550g6038
89i1481j34837j65758J85311R5147M8621B37688K9957a0045F2212O7950a51085
101b27723h6283o251b98A41395m0710N4080P3926A8515a15116M3018j18027m5926
113b36051g4026K3256b325B12693j1671I5771R2343q9193a51294M4082c4755j38551
$$ plain form
125 -173306 -109028 101515 55519 -50753 -15073 -23172 -63115 -45436 -32726 32430 164722 205941
137 205941 164071 135349 90862 -1248 -153541 -301093 -282797 -185844 -194437 -110793 182611 349498
149 349498 274198 210415 188709 100922 -14021 -156197 -298840 -288476 -165702 -104473 -51316
161 78485 183053 205922 195461 167865 103911 -27226 -163493 -171279 -115108 -129100 -95082 56647
174 121282 79103 101225 107704 2583 -65944 -74345 -99276 -45839 34220 -20813 -30507 136436
187 186900 31928 -64475 -67400 -92681 -111944 -112638 -70625 56917 135542 103201 126598 180400
199 180400 103761 -4699 -60458 -148517 -204618 -177590 -164767 -92725 96814 203629 203595 231543
211 231543 171627 -12870 -103584 -107583 -181111 -226793 -133108 4146 99974 139853 137837 148412
$$ packed form
125a73306O4278A01515m5996e0753a5073q099l9943J7679J2710C2430J32292M1219
137B05941m1870k8722m4487a248j52293j47552J8296R6953q593Q3644A82611J66887
149C49498p5300o3783k1706q7787a4021j42176j42643J0364J22774O1229e1316
161G8485J04568K2869j0461k7596o3954b7226j36267p786N6171j3992L4018E6647
174A21282m2179K2122O479B583f5944q401k4931d5839C4220b0813r694A36436
187A86900C1928f4475k925k5281j9263o94M2013E6917P8625l2341K3397N3802
199A80400p6639d699n5759q8059n6101K7028J2823P2042I6814J06815l4K7948
211B31543n9916a2870r0714l999p3528m5682R3685D146R5828L9879k016J0575
$$ plain form
223 148412 146472 50344 -93143 -162844 -128195 -73342 -87012 -93818 36425 169335 120080 38721
236 66254 56522 -31078 -69114 -69598 -72322 -43421 -20759 -21088 24911 80156 72298 51100 37663
249 37663 -16844 -72458 -61942 -17244 6063 -33 21983 101306 107654 -25190 -100614 -22641 11959
263 -69134 -106043 -43880 34156 72412 54611 36598 91293 124769 21374 -89390 -51451 17301
276 -34688 -97101 -44477 26891 16200 -20876 -18511 4561 31716 55090 50889 30739 30687 30636 6147
291 -19191 -43004 -78125 -90431 -59628 -36695 -43133 -2185 108169 160547 109141 86514 117250
303 117250 59809 -95845 -180806 -139597 -90267 -100939 -105920 -31800 95174 177985 157285 95589
315 95589 89708 90727 -13979 -141555 -133871 -68563 -83620 -85212 10030 67551 40331 38957 52032
$$ packed form
223A48412j940E0344i3143o9701L4649N4853j3670o806C6425J32910m9255C8721
236F6254r732c1078l8036m84k724K8901b0759l29B4911N5245p858k1198j3437
249C7663a6844n5614J0516a7244F063c3B1983P9323O348b5190p5424b2641A1959
263f9134l6909d3880C4156L8256j7801j8013N4695L3476B1374h9390L7939A7301
276c4688o2413d4477B6891j0691b0876K365D561K7155K3374m201k0150n2n1F147
291a9191k3813l5121j2306L0803K2933o438b185A08169N2378n1406k2627L0736
303A17250n7441i5845q4961M1209M9330j0672m981c1800I5174Q2811k0700o1696
315I5589n881J019a3979j27576P684O5308j5057j592A0030N7521k7220j374J3075
$$ plain form
328 52032 34705 40107 48050 8274 -12675 -702 -16709 -23382 8677 -13711 -81697 -73183 -1486 15757
343 -21187 -17117 60651 124948 81552 5399 14340 37269 -19891 -82533 -81992 -56794 -39520 -34238
356 -34238 -30335 19677 94369 98771 52214 48806 56318 -1596 -66127 -59855 -42545 -64619 -53939
369 -53939 3859 11293 -20106 12190 74628 67585 29536 22398 22546 26296 14929 -52259 -78544
382 -78544 3862 31008 -67240 -97492 2334 64397 39549 23647 43355 55024 32461 -19130
395 -42636 -12697 219 -24259 -18208 18627 22274 -11316 -35305 -24076 8122 19267 4300 1740
409 10702 10899 37225 83621 52489 -50603 -73826 639 14182 -60154 -85497 -19585 49246 54123
422 54123 4028 -24608 16469 48091 -2939 -31806 42202 78409 -12674 -68549 421 52609 -384
$$ packed form
328E2032j7327N402P943H274a2675g02j6007o673H677a3711o7986Q514a486A5757
343b1187M070F0651O4297m3396E399Q941K2929a9891o2642N41K5198J7274N282
356c4238L903A9677P4692M402m6557l408P512a596o4531O272J7310k2074J0680
369e3939C859P434b0106A2190O2438p043B9536p138J48L750j1367e2259k6285
382g8544C862K7146f7240l0252B334O2063k4848j5902J9708J1669k2563a9130
395d2636a2697B19b4259O051A8627L647a1316k3989J1229H122J1145D300A740
409A0702J97K6326M6396l1132e0603k3223F39J3543f0154k5343a9585D9246M877
422E4123D028b4608A6469L1622b939k8867D2202L6207a2674n5875D21N2188c84
$$ plain form
436 -65831 -65252 -23659 5499 -1027 -8072 35798 99232 105085 59443 17372 -29303 -83957 -91183
449 -91183 -57863 -52485 -60657 -13931 66809 95224 59066 37583 64548 58765 -26127 -91822 -61140
462 -61140 -12260 -26940 -41739 10636 75732 68347 -6683 -50915 -1516 45167 -8398 -62630 -3639
476 64184 24017 -39241 -25583 20819 31985 11968 -12588 -23456 -18819 -13062 -4674 9895 9939
489 9939 -1623 15930 51241 40903 -13154 -26589 15117 21905 -34484 -61040 -26545 -8904 -31066
502 -31066 -14130 63375 102848 39989 -32808 -8384 52596 28010 -63612 -94680 -28128 35839
515 18826 -20995 3104 54150 40701 -5631 -6331 -3768 -40931 -42209 24627 73449 57732 18854
529 -6962 -22236 -49572 -89733 -98861 -49926 3305 36641 96679 167211 149561 52080 -10682 -20040
$$ packed form
436f5831N79b3659E499a027p045C5798O3434N853m5642A7372b9303n4654p226
449i1183L3320N378q172a3931F6809K8415l6158k1483K6965n783b6127o5695L0682
462f1140a2260j4680j4799A0636O5096p385f683m4232a516D5167h398n4232c639
476F4184B4017c9241J3658B0819J1166A1968a2588j0868M637N757d674I895M4
489I939a623A5930L5311j0338a3154j3435A5117O788c4484k6556b6545h904k2162
502c1066a4130F3375L9473C9989c2808h384E2596k4586f3612l1068b8128C5839
515A8826b0995C104N1046j3449e631p00K563l7163j278B4627M8822j5717A8854
529f962j5274k7336m0161r128M8935C305L3336O0038P0532j7650E2080a0682r358
$$ plain form
542 -20040 -64823 -163004 -208464 -123402 13019 78643 84783 113267 153898 122172 19770 -58931
555 -71365 -67551 -82962 -80061 -32257 22141 45343 54948 65743 51049 2807 -40087 -47209 -39485
568 -39485 -35145 -4113 61376 92260 53159 13110 12744 -5508 -72577 -116895 -70877 9119 22251
581 22251 -12842 18456 121872 157542 61419 -44662 -58857 -43092 -79005 -120047 -76962 29737
594 95552 87365 72072 70779 29214 -46620 -82947 -60390 -33300 -24915 -8202 28289 59554 67372
607 67372 55749 25539 -24395 -73393 -75334 -31439 -10201 -29065 -5330 90113 142180 64893
620 -39651 -43949 4070 -16944 -83917 -83547 -10721 28546 -1096 -3783 71743 128579 81723 -2189
634 -21482 -6248 -49146 -124669 -120087 -25641 47887 49748 46893 74415 81257 47186 14470 -12329
$$ packed form
542b0040m4783r8181m5460Q5062A3019O5624O140K8484M0631l1726A9770e8931
555g1365L814j5411K901c2257B2141K3202R605J0795j4694B807d0087p122P724
568c9485M340d113F1376L0884l9101A3110l66e508o7069m4318M6018I119J3132
581B2251a2842A8456J03416L5670F1419d4662j4195J5765l5913m1042M3085B9737
594I5552q187j5293j293B9214d6620l6327K2557K7090Q385h202B8289L1265P818
607F7372j1623B5539b4395m8998j941c1439a0201j8864e330I0113N2067F4893
620c9651m298D070a6944o6973L70a0721B8546a096k687G1743N6836m6856b189
634b1482f248m2898p5523M582b5641D7887J861k855K7522O842l4071A4470a2329
$$ plain form
648 -51490 -78746 -64828 -34410 -17965 -6096 25416 70669 82391 34195 -14655 418 23105 -23437
662 -73699 -36452 23710 3986 -50878 -30897 45919 67704 18850 -824 36369 50129 1969 -48336
676 -39081 4414 3540 -44308 -52677 2271 30950 13865 29028 69301 56190 16217 8412 -3632
690 -54554 -87284 -62238 -20128 -9248 -15252 13572 80256 114088 76319 26383 20830 7814 -72376
704 -149620 -122106 -32006 -1825 -13161 48431 152962 161400 79836 21447 -287 -43381 -108493
716 -108493 -150271 -129171 -54787 17737 61602 108342 147786 114375 26835 -20860 -36829 -86150
728 -86150 -128581 -81948 -1432 19848 19452 69812 114593 76423 4680 -21257 -19507 -44416 -91851
741 -91851 -101115 -24621 73988 81048 17752 15700 67915 39731 -49339 -58738 -897 6330 -26105
$$ packed form
648e1490k7256J3918L0418J6445f096B5416M5253J1722C4195a4655D18K2687b3437
662g3699c6452B3710C986e0878J9981D5919K1785A8850h24C6369J3760A969d8336
676c9081D414q74d4308q369B271K8679A3865J5163M0273j3111A6217p805c632
690e4554l2730K5046b0128i248o004A3572O6684L3832l7769B6383n553G814g2376
704a49620K7514c2006a825j1336D8431J04531Q438G9836B1447b87m3094o5112
716a08493m1778K1100e4787A7737M3865M6740L9444l3411B6835b0860j5969m9321
728h6150m2431M6633a432A9848l96N0360M4781l8170D680b1257J750k4909m7435
741i1851r264b4621G3988P060A7752k052N2215k8184d9339r399h97F330b6105
$$ plain form
755 -18262 17142 30214 18248 4729 3511 5705 -5792 -30389 -39653 -13925 22450 38397 43719
768 43719 41691 7182 -29761 -9949 16368 -35246 -81181 -14789 59783 24526 -20350 24653 75225
781 75225 49047 -16808 -62470 -57174 -23385 -28275 -53889 6501 120189 117485 12368 -23871 8884
795 -21373 -90872 -85647 -18788 26437 40858 49995 45126 31199 26119 10357 -25185 -46355 -40837
808 -40837 -30482 -5462 26550 22343 4661 32971 50151 -13326 -68140 -14903 51504 21641 -28060
822 3759 46853 7926 -53248 -45026 2052 16942 -7772 -35398 -9428 58016 53183 -31053 -30223 63650
837 61938 -37808 -54495 2944 6033 -13556 1817 -1114 -20742 -1436 21200 15370 15464 20745 11676
851 11676 16258 25858 -6034 -45468 -27027 6837 -15944 -42245 1449 47527 4278 -42215 18801
$$ packed form
755a8262A7142J3072j1966D729j218K194e792k4597r264a3925B2450J5947N322
768D3719k028G182b9761i949A6368c5246m5935a4789E9783B4526b0350B4653N0572
781G5225k6178a6808m5662N296b3385m890k5614F501J13688k704A2368b3871H884
795b1373o9499N225a8788B6437J4421R137m869j3927n080A0357b5185k1170N518
808d0837J0355e462B6550m207D661K8310J7180a3326n4814a4903E1504B1641b8060
822C759M3094G926e3248Q222B052J4890g772k7626i428E8016m833c1053Q30F3650
837F1938c7808j6687B944L089a3556A817a114j9628a436B1200n830R4N281r069
851A1676M582R600f034l9434J8441F837a5944k6301A449M6078D278d2215A8801
$$ plain form
865 94497 53438 -32616 -40069 964 3803 -36349 -68759 -44750 25311 57383 18932 6407 64189
878 64189 79824 9909 -21215 -457 -46251 -111979 -70402 2389 10235 27608 78955 77901 33892
892 10306 -10187 -33813 -35690 -43041 -50155 -266 60684 37003 -11112 22901 72722 12827 -87220
906 -78200 812 11570 -19521 11653 66531 72577 42028 846 -35351 -36053 -25141 -48568 -57072 -10868
921 17857 7646 38871 94927 74582 12163 5053 9225 -53129 -104572 -63148 -11526 -21459 -9333
935 59758 86123 40602 833 3641 33334 47977 -14125 -102609 -70665 38165 31335 -55380 -25425
949 73949 63802 -14632 -26724 5057 7933 -951 1813 8687 19579 12392 -30521 -50692 -7445 19684
964 -14438 -32674 -4019 16611 22760 53189 68958 25268 -13819 11383 18548 -65681 -127203 -57750
$$ packed form
865I4497m1059c2616p453I64K839c6349l2410K4009B5311L2072A8932F407N7782
878F4189J5635I909b1215d57m5794o5728M1577B389P846J7373N1347j054C3892
892A0306a0187k3626j877p351p114b66F0684k3681a1112B2901M9821A2827h7220
906g8200H12J0758a9521A1653N4878O046l0549H46c5351p02J0912k3427q504a0868
921A7857G646L1225N6056k0345A2163E053M172e3129n1443M1424a1526r933i333
935E9758K6365D0602H33K808K9693J4643a4125q8484L1944C8165o830e5380b5425
949G3949j0147a4632j2092E057K876i51A813O874J0892p187c0521k0171g445A9684
964a4438j8236d019A6611O149L0429J5769B5268a3819A1383P165f5681o1522e7750
$$ plain form
978 38904 41339 11040 29172 61406 62710 27855 -29200 -36096 18972 4822 -86292 -69814 44629
992 47223 -32888 -12302 50771 21516 -28976 -25949 -13091 9434 51971 42695 -355 4359 17242
1005 17242 -15418 -34558 -21374 -25120 -30165 -6331 5915 -18655 -13939 59387 117820 71225 -6227
1019 1968 28176 -43734 -123793 -98352 -41133 -22470 -178 33540 74625 127931 112116 11482
1032 -20953 24825 -32215 -154995 -130756 -8219 26887 13148 47385 72971 48956 29688 12176
1045 -29062 -47747 -24401 -4498 7993 28654 22906 -9517 730 32158 -9870 -77216 -51114 10818
1059 -3687 -23255 49178 119274 78196 6374 -5058 222 -39045 -95833 -115041 -72419 6964 48729
1072 48729 36528 51198 116527 122025 35228 -29267 -36508 -73673 -121208 -80600 -3355 12416
$$ packed form
978C8904K435A1040J8132L2234J304B7855b9200o896A8972D822h6292J6478D4629
992D7223c2888a2302E0771B1516b8976L027J2858I434M2537r276c55D359J2883
1005A7242a5418j9140J3184l746n045f331E915a8655M716E9387N8433m6595f227
1019A968K6208d3734q0059K5441d1133J8663a78C3540M1085N3306j5815A1482
1032b0953B4825c2215j22780K4239h219B6887A3148L4237K5586k4015j9268A2176
1045b9062j8685K3346d498G993K0661n748i517G30L1428i870o7346K6102A0818
1059c687j9568D9178P0096m1078F374e058B22c9045n6788j9208M2622F964M1765
1072D8729j2201J4670O5329N498C5228b9267p241l7165m7535M0608c355A2416
$$ plain form
1085 22552 81015 97313 31228 -15958 -20336 -41741 -59299 -41928 -19610 23857 89415 83922
1097 83922 19178 22762 41783 -59480 -171227 -127269 -28075 -8417 12773 102766 175131 161716
1109 161716 87110 -2636 -67206 -97582 -128344 -156645 -118873 -14988 66429 98954 134684 157409
1121 157409 102924 2569 -55591 -85858 -136890 -148139 -58867 43847 59771 48881 89814 105484
1133 105484 29839 -44681 -48463 -37177 -40696 -43624 -42677 13050 115298 107914 -8878 -19543 45697
1147 -31451 -151276 -109659 -8786 19027 46582 87860 93967 97926 75028 -18467 -80516 -65087
1159 -65087 -79364 -119371 -83951 -3176 48496 81837 112571 115929 71039 -2745 -45184 -61704
1171 -61704 -114304 -136617 -34594 72530 65061 40034 71172 80555 34200 -30917 -85889 -81987
$$ packed form
1085B2552N8463J6298C1228a5958m378k1405j7558J7371a9610B3857O5558n493
1097H3922A9178L584J9021e9480j11747M3958b8075h417A2773Q9993P2365j3415
1109A61716p4606b636o4570l0376l0762k8301L7772a4988F6429L2525L5730K2725
1121A57409n4485B569e5591l0267n1032j1249e8867D3847J5924j0890M0933J5670
1133A05484B9839d4681l782J1286l519k928R47A3050J02248p384h878j0665D5697
1147c1451j19825M1617h786A9027K7555M1278O107L959k2898a8467o2049J5429
1159f5087j4277m0007L5420c176D8496L3341L0734L358m4890b745m2439j6520
1171f1704n2600k2313c4594G2530p469k5027L1138R383C4200c0917n4972L902
$$ plain form
1183 -81987 -26533 -25280 -54649 17314 132162 120699 25284 -803 19823 -35616 -127099 -123126
1195 -123126 -40306 18808 51408 79908 79178 66639 59214 8092 -63964 -72061 -63648 -88729 -58078
1208 -58078 24801 43891 40981 98558 117081 35530 -31198 -34294 -44275 -81022 -89119 -33097 46624
1222 66938 32550 26560 50724 40005 -18725 -79000 -82723 -23410 3492 -29133 8500 117138
1234 117138 126012 41142 8427 -4654 -78452 -130531 -101623 -56701 -14289 54236 106964 114061
1246 114061 102478 70593 103 -60658 -83725 -115901 -134658 -57890 54210 77069 67353 118930
1258 118930 132051 22422 -82660 -89289 -73056 -82187 -74115 -25507 53844 117554 104357 44057
1271 26772 33241 -17504 -95920 -108371 -58626 -23872 -8305 41308 102984 93063 36834 22505
$$ packed form
1183h1987b6533J253k9369A7314J14848j1463B5284h03A9823c5616r1483L973
1195a23126d0306A8808L2600K8500p30j2539p425H092f3964q097Q413k5081L0651
1208e8078B4801J9090k910N7577J8523C5530c1198l096r981l6747q097c3097D6624
1222F6938C2550n990K4164j0719a8725o0275l723b3410C492b9133H500J08638
1234A17138Q874D1142H427d654p3798n2079K8908M4922a4289E4236N2728P097
1246A14061j1583l1885A03f0658k3067l2176j8757e7890E4210K2859r716N1577
1258A18930J3121B2422h2660o629J6233r131Q072b5507E3844O3710j3197D4057
1271B6772O469a7504p8416j2451M9745b3872h305D1308O1676r921C6834j4329
$$ plain form
1283 22505 12336 -57860 -108155 -75389 -35184 -16164 26388 70572 85621 87142 50369 -19333
1296 -33328 -20492 -91342 -152297 -56017 73183 69152 27797 64710 97203 49330 -30946 -76932
1308 -76932 -68750 -31403 -18546 -24529 7527 64759 65688 19262 6552 21515 -9526 -67761 -69471
1321 -69471 -22426 6128 19877 53627 68847 30259 -5636 3119 -692 -50081 -74156 -28311 22769
1335 17591 -11067 -5965 42592 80525 41572 -34183 -24779 35367 -9083 -103311 -66556 37626
1348 37994 -7955 13178 49705 44070 19428 -17281 -33688 1682 8299 -46601 -47554 19115 32795
1361 32795 -3011 2883 20903 305 -12482 5485 11149 -4308 6129 45756 52231 -8855 -69374 -53700
1375 -53700 -6620 -7970 -35863 -17124 44868 81600 49124 -343 11423 44325 692 -80037 -72127
$$ packed form
1283B2505j0169e7860n0295L2766c5184a6164B6388M4184J5049J521l6773a9333
1296c3328J2836p0850o0955e6017G3183m031B7797L6913L2493m7873c0946m5986
1308g6932Q182c1403J2857n983G527N7232R29A9262F552J4963i526n8235j710
1321f9471b2426F128J3749L3750J5220C0259e636C119f92m9389k4075b8311B2769
1335A7591a1067N102D2592L7933l8953c4183R404C5367i083r4228L6755C7626
1348C7994g955A3178L6527n635A9428a7281j6407A682O617d6601r53A9115J3680
1361C2795c011B883J8020C05a2482E485N664d308F129L9627O475h855o0519J5674
1375e3700f620j350k7893a7124D4868L6732l2476c43A1423L2902F92h0037P910
$$ plain form
1388 -72127 -5526 -9503 -57650 -19856 74009 98170 49458 9765 -1048 -3102 -11368 -42144 -63160
1401 -63160 -30322 11515 5941 4960 31319 19010 -5516 26056 45713 -9744 -45320 -8675 15602
1415 -5409 -14958 7009 26696 10019 -29804 -33018 13534 29766 -14092 -33573 10526 47065 21687
1429 -21048 -6124 46314 37490 -32308 -56729 -20522 -11720 -30085 -8788 30915 38517 32239 33052
1442 33052 21265 1018 -11272 -22422 -28135 -22001 -28631 -33247 12672 63553 39985 -751 24006
1456 42031 -20156 -68849 -31585 9227 -6059 -25162 -5573 37819 56975 14982 -29887 -914 39989
1470 -1169 -56707 -31118 21742 24696 1850 -4183 3591 2454 -11973 -10104 11805 9566 -9610 4357
1485 30182 8450 -24438 -14155 10870 11229 -2819 -5362 11235 15666 -23342 -50611 -617 54747
$$ packed form
1388g2127e526l977m8147a9856G4009K4161m8712I765a048k054q266l0776k1016
1401f3160c0322A1515n574r81K6359j2309e516B6056J9657i744l5576h675A5602
1415e409r549G009J9687A0019b9804l214A3534J6232a4092j9481A0526L6539B1687
1429b1048f124D6314q824c2308k4421b0522Q802j8365h788C0915P602o278Q13
1442C3052j1787A018a1272j1150n713O134o630m616A2672N0881k3568g51B4006
1456D2031b0156m8693c1585I227f059j9103e573C7819J9156A4982b9887i14C9989
1470a169n5538K5589B1742K954A850d183C591j137a1973J869A1805k239i610D357
1485C0182H450b4438J0283A0870L59b819k543A1235M431b3342k7269f17E4747
$$ plain form
1499 17189 -35856 4163 63880 32704 -40168 -50387 -4484 16650 -14040 -40868 -10397 42157
1512 40795 1801 4186 30438 5980 -38877 -30950 4883 11974 6525 13910 13729 -6909 -24981 -21157
1526 -21157 -5389 -4056 -4835 27017 64814 40382 -20382 -28367 8371 857 -57142 -73709 -12568
1540 44589 23686 -14147 22128 83893 54485 -37408 -60620 -9739 5692 -31999 -40675 6513 46505
1553 46505 28340 -14207 -11522 27961 33355 342 -4872 10734 -6581 -37216 -35750 -21100 -15000
1566 -15000 4288 32024 38080 19702 2264 12222 36431 18693 -37079 -41715 7942 10542 -43040
1580 -48048 14380 50119 17541 -20909 -3472 39714 28102 -25841 -29034 20346 22928 -32517
1593 -49056 594 39542 24254 3130 14222 25249 -252 -40345 -49407 -32811 -19597 -1277 35287
$$ packed form
1499A7189c5856D163N9717l1176d0168j0219d484A6650a4040k6828a0397D2157
1512D0795A801K385K6252E980c8877P927D883P091n449P385j81f909j8072L824
1526b1157e389J333p79B7017L7797k4432b0382p985H371H57e7142j6567a2568
1540D4589k0903a4147B2128O1765k9408c7408k3212i739E692c1999q676F513L9992
1553D6505j8165a4207K685B7961N394C42d872A0734f581l0635J466J4650O100
1566a5000D288K7736O056j8378B264R958K4209j7738c7079m636G942K600d3040
1580d8048A4380L5739A7541b0909c472C9714j1612b5841l193B0346K582c2517
1593d9056E94L8948j5288C130J1092J1027b52m0093r062J6596J3214a277C5287
$$ plain form
1607 59606 45758 27987 30835 19761 -29288 -73447 -66567 -31071 -17535 -20726 11968 75708
1619 75708 88205 26942 -12017 12390 12038 -47553 -78085 -33672 18471 20779 -3028 527 36222
1632 36222 53230 17760 -16818 -6897 -4658 -39620 -49877 -10995 14595 10368 21962 43232
1644 43232 29739 -2738 -15325 -10394 -15958 -34312 -31073 9644 41280 23704 -565 24341 51884
1657 51884 13450 -53374 -59123 -6227 13592 -23583 -34191 22289 58561 17866 -19227 8065
1670 36291 13829 -16853 -22012 -15954 -19419 -33789 -35546 -72 38056 39025 31720 44298 30611 -14264
1685 -23218 -3833 -25046 -60671 -36921 16138 23919 -553 11423 54980 61793 6889 -43519 -27960
1698 -27960 12205 -194 -46992 -33972 36756 51265 -16266 -47468 7507 47103 10172 -22215
$$ packed form
1607E9606j3848j7771K848j1074b9288m4159O880c1071J3536l191A1968O3740
1619G5708J2497B6942a2017A2390l52d7553l0532c3672A8471K308c028E27L5695
1632C6222J7008A7760a6818f897K239l4962j0257a0995A4595m227J1594K1270
1644D3232j3493b738j2587M931n564j8354L239I644L1636j7576e65B4341K7543
1657E1884A3450e3374n749f227A3592b3583j0608B2289L6272A7866a9227H065
1670C6291A3829a6853n159O058l465j4370j757g2C8056R69p305J2578j3687a4264
1685b3218c833k1213l5625K3750A6138P781e53A1423M3557O813F889d3519J5559
1698b7960A2205a94m6798J3020C6756J4509a6266l1202G507L9596A0172b2215
$$ plain form
1711 6444 32630 7979 -23345 -16016 8969 10832 -9760 -23091 -14814 -2637 -6632 -8349 12641 29830
1725 29830 18713 15186 29025 3482 -47322 -30804 30997 22255 -37697 -33628 25901 41599 2
1739 -28960 -6805 28447 14125 -37514 -36293 30714 58601 10191 -12419 31498 37585 -41437
1752 -94984 -51758 8806 16670 14405 38047 58955 53733 29066 -8194 -37339 -45533 -50196 -51014 -27556
1766 -27556 447 13597 47154 93762 80917 14427 -17070 -10041 -42800 -99940 -85002 -9556 25789
1780 9290 20834 69516 84351 39276 -14904 -29623 -11405 -16806 -61186 -64897 14745 73542
1792 73542 36226 -536 27975 30480 -30250 -63280 -40904 -21737 -12131 12978 36092 39931 36270
1805 36270 26580 15808 5242 -19630 -51579 -50121 -15013 -3302 -22205 -4739 56842 67211 8715
$$ packed form
1711F444K6186G979b3345P329H969J863i760j3331Q277b637l995j717A2641J7189
1725B9830j1117l527J3839C482d7322J6518C0997q742c7697M069B5901J5698B
1739b8960f805B8447A4125c7514J221C0714K7887A0191a2419C1498O087d1437
1752i4984M3226H806P864k265K3642K0908n222k4667h194k9145q194m663q18K3458
1766b7556D47J3150L3557M6608j2845A4427a7070P029l2759n7140J4938i556B5789
1780I290J1544M8682J4835C9276a4904j4719a1405n401m4380l711A4745N8797
1792G3542C6226e36B7975K505c0250l3030K2376J9167R606A2978K3114L839l661
1805C6270r690j0772E242a9630l1949J458a5013c302j8903d739E6842J0369H715
$$ plain form
1819 -8749 32936 24517 -42939 -58017 -7792 18709 403 -18643 -7143 29264 43607 990 -39324
1833 -16990 15603 5 -10603 23950 39468 4500 -13280 3120 -16354 -59548 -44749 10504 26120
1846 26120 17934 33178 47992 31837 1445 -24814 -32458 -20241 -27615 -57598 -30355 51418 71467
1859 71467 11131 -6760 41726 36292 -42019 -74227 -23857 17641 9730 2450 17421 31850 31604
1872 31604 9030 -15813 -10037 3086 -22830 -49538 -24842 4663 -2822 5883 47037 48903 11107
1886 8220 25427 -9683 -55569 -36783 3692 -7067 -31801 -12815 35104 62001 37908 -7893 -9523
1899 -9523 26440 5459 -73479 -83933 3257 54656 10065 -16997 33291 56136 3634 -32924 -13607
1913 676 -7067 -8616 -11100 -4790 19115 16927 -9466 3380 24168 -7370 -27399 3087 6290 -19511
$$ packed form
1819h749C2936q419d2939j5078g792A8709D03a8643g143B9264J4343I90c9324
1833a6990A5603Ea0603B3950J5518D500a3280C120a6354m3194J4799A0504J5616
1846B6120q186J5244J4814j6155A445b4814p644J2217p374k9983K7243E1418K0049
1859G1467A1131f760D1726n434d2019l2208b3857A7641p911B450J4971J4429k46
1872C1604I030a5813N776C086b2830k6708K4696D663b822E883M1154J866A1107
1886H220J7207i683m5886J8786C692g067k4734a2815C5104K6897k4093g893j630
1899i523B6440E459g3479j0454C257N1399A0065a6997C3291K2845C634c2924a3607
1913F76g067j549k484d790A9115k188i466C380K0788g370k0029C087L203a9511
$$ plain form
1928 10318 58112 28497 -33537 -31645 9680 5539 -40944 -46102 8343 44359 20362 -13932 -10500
1941 -10500 21597 31657 -11344 -38732 11159 46133 -11831 -44764 21872 55096 -7878 -41196
1953 -41196 -10394 -1101 -19022 -16165 -5733 8296 39507 46425 14629 4366 15309 -4685 -26682
1966 -26682 -12551 -15804 -54543 -45069 12514 20225 -8393 24018 83183 61289 -11970 -33961 -8924
1980 -9947 -43082 -55058 -20150 29133 42347 12301 -733 39321 53850 -17217 -72955 -29071
1993 14600 -18258 -27747 30601 53348 22454 11381 8658 -19527 -31585 -12932 -5823 -4662 7490
2007 11500 14318 27397 15446 -29260 -36321 5309 9833 -37410 -31135 44645 59958 -4261 -19384
2020 -19384 28261 23397 -27474 -38283 -18093 2664 19337 2514 -25441 7742 46656 6495 -29618
$$ packed form
1928A0318M7794B8497c3537J892I680m141d0944n158H343L6016B0362a3932L432
1941a0500B1597J0060a1344k7388A1159L4974a1831l2933B1872L3224g878l3318
1953d1196a0394a101j7921K857e733H296L1211O918A4629D366J0943d685k1997
1966b6682a2551l253l8739R474A2514P711h393B4018N9165k1894a1970k1991h924
1980i947l3135j1976b0150B9133J3214A2301g33C9321J4529a7217n5738b9071
1993A4600a8258r489C0601K2747B2454j1073k723a9527j2058a2932e823J161G490
2007A1500K818J3079j1951b9260p061E309M524c7410O275D4645J5313d261j5123
2020a9384B8261m864b7474j0809a8093B664J6673B514b5441G742L8914F495b9618
$$ plain form
2034 10289 27999 -15782 -29212 1908 3516 -17543 -2834 27806 19490 -12356 -11433 9902 1674
$$ packed form
2034A0289J7710a5782j3430A908J608a7543b834B7806q316a2356R23I902A674
##PAGE= T1=0.0016632
##FIRST=     0,             0,               0,               0
##DATA TABLE= (T2++(I..I)), PROFILE
$$ plain form
0 0 0 0 0 0 0 0 0 0 -7 24 -12 24 -24 36 -47 57 -65 82 -103 119 -142 167 -197 228 -267 308 -359 412 -473 538 -613
32 693 -787 887 -1001 1122 -1254 1402 -1566 1739 -1931 2144 -2372 2623 -2899 3202 -3532 3894
49 -4296 4734 -5224 5770 -6384 7074 -7863 8769 -9822 11071 -12572 14423 -16765 19852 -24109
64 30412 -40738 60753 -114666 686183 1788305 1584743 894553 414026 133236 -1186669
75 -1928396 -1308976 -658826 -459086 75713 516634 804403 1029886 734780 116091 -36040
86 -158348 -429503 -405561 -276335 -252426 15652 185967 122409 240884 259524 -82184 -147024
97 -147024 -28993 -197027 -208957 60677 80006 51879 185394 154497 58566 27951 -167895
109 -265446 -105321 -93157 -129535 67956 166066 137285 225840 160470 -39980 -12883 -49703 -269409
$$ packed form
0@@@@@@@@@gB4a2B4b4C6d7E7f5H2a03A19a42A67a97B28b67C08c59D12d73E38f13
32F93g87H87a001A122a254A402a566A739a931B144b372B623b899C202c532C894
49d296D734e224E770f384G074g863H769i822A1071a2572A4423a6765A9852b4109
64C0412d0738F0753a14666F86183J102122k03562o90190D14026A33236a186669
75a928396O19420O50150J99740G5713M40921K87769K25483k95106A16091c6040
86a58348k71155K3942J29226K3909A5652J70315o3558J18475J8640h2184o4840
97a47024b8993j68034j1930F0677J9329k8127J33515l0897E8566B7951a67895
109b65446a05321J2164l6378F7956R8110k8781Q8555o5370c9980a2883l6820k19706
$$ plain form
121 -269409 -184173 28662 -43112 -33787 157705 102268 -56714 -22257 4789 -35493 3088 52698
133 52698 87663 144056 110284 -6645 -82886 -135986 -195297 -239874 -240407 -111530 77760 140514
145 140514 193654 369737 389093 137561 -56246 -99506 -172524 -257543 -290472 -281286 -150267
156 -150267 56942 153225 166998 215097 228509 150557 55980 -22930 -110974 -197510 -229421 -144283
168 -144283 -14489 20461 45095 159833 178659 49366 -2855 3571 -81453 -135157 -84647 -47701
180 -47701 14906 99512 47170 -9319 99667 115984 -79947 -185629 -118330 -66198 -44625 -3172
193 53421 147146 183076 84145 20415 30889 -52038 -157414 -162917 -159974 -134677 -20535 68015
206 124061 233348 251841 122975 24360 -65375 -223317 -260989 -154818 -113763 -90394 53938
$$ packed form
121b69409Q5236B8662d3112R325A57705n5437e6714b2257D789c5493C088M9610
133E2698L4965N6393l3772f645p6241n3100n9311m4577n33a11530G7760O2754
145A40514N3140J76083J9356A37561e6246m3260p3018q5019l2929R186J31019
156a50267E6942R6283J3773M8099J3412p7952E5980b2930q8044q6536l1911Q5138
168a44283a4489B0461K4634J14738J8826D9366b855C571h1453n3704N0510L6946
180d7701A4906Q4606D7170i319I9667J6317g9947j05682O7299N2132K1573c172
193E3421R3725L5930H4145B0415J0474e2038j05376n503K943K5297b0535F8015
206A24061J09287J8493A22975B4360f5375j57942l7672J06171M1055K3369E3938
$$ plain form
218 195755 215630 157568 80723 28461 -11560 -104379 -198141 -180324 -70116 26861 40509 34728
230 34728 118985 186783 75523 -60370 -47636 -33696 -104954 -115531 -56047 -21239 13553 45760
242 45760 39881 57191 83678 38620 -16445 -30949 -62950 -86250 -40517 26568 49414 32255
254 32255 26273 56518 35212 -81938 -132879 -33462 30659 -29004 -49106 30436 94466 90638
266 90638 44912 1789 10113 14814 -71638 -145254 -76648 13233 -16871 -54500 15769 81985 46678
279 46678 759 18630 45271 44401 35860 16690 -10762 -27830 -42985 -59852 -65215 -61755 -67418 -54005
293 -54005 9396 62398 56817 66596 129481 136301 37425 -42940 -47774 -87516 -181009 -189391 -81180
307 15062 37992 51633 106892 169556 169268 81475 -28050 -71802 -77017 -130922 -183603 -117286 -3804
$$ packed form
218A95755J9875n8062p6845B8461a1560r2819r3762J7817g0116B6861J3648n781
230C4728Q4257O7798G5523f0370J2734J3940p1258j0577e6047b1239A3553L2207
242D5760n879J7310K6487C8620a6445j4504l2001k3300d0517B6568K2846j7159
254C2255n982L0245k1306h1938n0941c3462C0659b9004k0102C0436O4030l828
266I0638D4912A789Q324M701g1638p3616O8606A3233a6871l7629A5769O6216l5307
279D6678G59J7871K6641q70q541A6690a0762j7068j5155j6867n363L460n663J3413
293e4005I396N3002n581R779O2885O820C7425d2940m834l9742r3493q382h1180
307A5062K2930J3641N5259O2664k88H1475b8050m3752n215n3905n2681O6317c804
$$ plain form
321 15747 21763 101420 124356 45925 10170 31046 13590 -13616 -16203 -36429 -47114 -22554
334 -29056 -40212 422 3482 -52728 -36375 50423 73122 26338 11649 59137 86111 17322 -73893
348 -74405 -36767 -60334 -90522 -58497 -7292 24892 43325 50380 71558 99350 68490 -4766 -30366
361 -30366 -28998 -72154 -105209 -64309 -15604 -16934 -6110 48563 55724 8641 19154 68335 40443
374 40443 -21694 -31439 -20761 -20282 -28524 -63415 -68467 12667 50486 -32417 -55962 54143 108711
387 108711 43551 -2596 8777 9709 -23113 -61614 -61089 -15153 10182 -8967 -9089 21831 20832 -15060
402 -31890 -9002 25891 29862 4302 -5663 9528 13497 16163 30507 -7542 -88724 -84730 6835 30400
416 30400 -32831 -39872 38879 86602 51224 -9689 -32111 1428 26646 -17924 -47492 13307 38606
$$ packed form
321A5747O016P9657K2936D5925A0170K0876A3590a3616k587k0226j0685b2554
334b9056j1156D22L060e2728J6353E0423K2699B6338A1649M7488K6974A7322g3893
348g4405c6767k3567l0188L2025g292B4892J8433P055K1178K7792l0860d766k5600
361c0366J368m3156l3055M0900a5604j330f110D8563P161H641J0513M9181k7892
374D0443b1694r745J0678M79q242l4891n052A2667L7819c2417k3545E4143N4568
387A08711D3551b596H777R32b3113l8501N25a5153A0182h967j22B1831r99a5060
402c1890i002B5891L971D302e663I528L969K666J4344g542q1182L994F835K3565
416C0400c2831p041C8879M7723l5378i689k2422A428K5218a7924k9568A3307K5299
$$ plain form
429 38606 -49541 -93364 -7976 49763 -13457 -71430 -32298 34129 57469 39355 25513 52437
441 52437 79899 38830 -42339 -85909 -95845 -100011 -70622 -10393 21069 25453 57632 102700 88585
454 88585 21399 -19511 -11184 -20872 -82526 -109694 -40402 29531 17756 1177 44760 78437 35220
468 -44677 -65718 -4798 39944 -9014 -55690 6286 68540 13018 -57528 -29067 28433 24576 -14581
482 -36351 -28888 -11511 -2072 6074 17800 17366 5479 10025 29054 13528 -34901 -42117 987 9783
496 9783 -34112 -46699 -2000 26171 11763 19537 66270 64212 -18880 -82290 -44302 19617 -7807
510 -82244 -71941 22505 76364 39318 -8172 11945 50070 21056 -35032 -35059 -10769 -22390 -19722
523 -19722 36033 64027 16310 -42847 -61341 -54573 -48809 -48206 -20551 47963 100577 101604 101264
$$ packed form
429C8606d9541m3823g976D9763a3457n7973c2298C4129K3340j8114j3842K6924
441E2437K7462C8830d2339m3570r936m166K9389a0393B1069M384L2179M5068j4115
454H8585B1399a9511Q327r688o1654k7168d0402B9531j1775A177M3583L3677C5220
468d4677k1041d798C9944i014m6676F286O2254A3018e7528K8461B8433l857a4581
482c6351P463a1511b072F074J1726m34E479M546J9029A3528c4901p216I87Q796
496I783c4112j2587b000B6171A1763P774M6733k058a8880o3410L7988A9617g807
510h2244J0303B2505N3859l7046h172A1945L8125B1056c5032k7a0769j1621K668
523a9722C6033K7994A6310d2847j8494O768N764O03b0551D7963N2614J027l40
$$ plain form
536 101264 97271 23440 -92915 -142899 -117200 -106393 -127369 -90252 41775 167440 179579 112440
548 112440 71595 56522 -9985 -111899 -149878 -103440 -50179 -31331 -7059 47116 81990 68780
560 68780 39265 18325 -10406 -53727 -74531 -46660 -5553 16994 40778 73048 67151 4439 -49560
574 -49463 -46066 -75063 -73838 1083 79481 75597 24420 32074 91164 70508 -55536 -144038 -112836
587 -112836 -47885 -37539 -38338 26280 118956 134899 66759 5262 -16371 -52868 -103164 -95339 -29582
601 17718 25465 32857 52398 56651 32080 -5810 -40377 -68818 -77686 -42957 19212 46487 27232
614 27232 32741 84985 83835 -23592 -119792 -94702 -18220 -15309 -58987 -34374 51020 83745 40100
628 21702 66855 82102 1816 -89995 -91941 -49072 -56596 -85690 -39259 68112 120030 78015 31911
$$ packed form
536A01264l993B3440i2915m9984K5699J0807k0976L7117D1775J25665J2139o7139
548A12440m0845j5073i985j01914l7979M6438e0179J8848g059D7116L4874j3210
560F8780k9515A8325a0406m3321k0804K7871e553A6994K3784L2270n897D439d9560
574d9463L397k8997J225A083P8398l884B4420P654N9090k0656e5536q8502L1202
587a12836d7885J0346p99B6280R2676J5943F6759E262a6371l6497n0296P825b9582
601A7718P747P392J9541M253k4571e810l4567k8441q868L4729A9212K7275j9255
614B7232N509N2244j150b3592r6200K5090a8220K911m3678K4613E1020L2725D0100
628B1702M5153J5247A816h9995j946M2869p524k9094c9259F8112N1918m2015C1911
$$ plain form
642 30118 17329 -31005 -65985 -69269 -68934 -58044 -16136 28718 43439 47015 57615 64159 38730
655 38730 -23917 -64608 -40016 -9640 -40261 -68742 -14612 50105 25784 -29246 -903 71590 68717
668 68717 -3335 -32161 2976 13806 -37335 -75034 -41453 14287 16334 -26636 -28540 33677 64493
681 64493 29155 13103 32355 10626 -39352 -49488 -45066 -64545 -60274 -4869 43177 45332 33519
694 33519 48917 78050 63680 -9182 -67751 -66030 -61414 -99163 -114437 -30617 85031 105179 61839
707 61839 83378 134980 78836 -52932 -118614 -103349 -97341 -112131 -92986 -18648 78697 134808
719 134808 122266 92155 71574 7219 -88706 -122830 -91778 -75230 -64163 4254 82526 85499
731 85499 55602 62051 59550 -9993 -82178 -82905 -50384 -49251 -58003 -22723 61053 122012 84265
$$ packed form
642C0118j2789c1005l4980l284L35J0890a6136B8718J4721L576J0600O544k5429
655C8730b3917m0691K4592i640l0621k8481a4612E0105k4321b9246i03G1590k873
668F8717c335k8826B976J0830c7335l7699L3581A4287K047b6636j904C3677L0816
681F4493B9155A3103J9252A0626c9352j0136M422j9479M271d869D3177K155j1813
694C3519J5398K9133j4370i182n8569J721M616l7749j5274c0617H5031K0148m3340
707F1839K1539N1602n6144e2932o5682J5265O008j4790J9145a8648G8697N6111
719A34808j2542l0111k0581G219h8706l4124L1052J6548J1067D254P8272K973
731H5499k9897O449k501i993p2185p27L2521J133q752b2723F1053O0959l7747
$$ plain form
744 84265 -7747 -23794 22262 -5478 -84202 -69472 14528 28358 -15270 -12474 27071 30336 -300
758 -18868 -16306 -8517 -10668 -22649 -18586 17330 50423 43491 17719 -2131 -29883 -52191 -26680
771 -26680 8388 -22968 -52529 16544 84225 32925 -31686 4252 45131 -2459 -69156 -81440 -40691
785 13545 25713 6365 44986 114350 69612 -61215 -97291 -37790 -29406 -69207 -36526 48680
798 79687 59694 38763 13071 -17166 -25799 -30349 -48253 -50926 -23487 7421 30130 44419 24949
811 24949 -6623 6319 20717 -33078 -75016 -11071 64211 27549 -39675 -16961 30386 -1403 -54940
824 -54940 -37433 17789 33949 7523 -16117 2380 49085 39642 -35494 -45655 33688 35438 -58175
838 -68067 5898 18054 -5599 10362 11561 -12362 4432 34288 22977 975 -3666 -8109 -5117 -3099
$$ packed form
744H4265g747j6047B2262e478p8724J4730A4528J3830a5270K796B7071L265c00
758a8868K562P789k151j1981M063A7330L3093o932A7719b131k7752k2308K5511
771b6680H388b2968k9561A6544O7681C2925c1686D252M0879b459o6697j2284d0691
785A3545J2168F365L8621O9364m4738f1215l6076c7790Q384l9801L2681D8680
798G9687j9993k0931A3071a7166q633m550j7904k673b3487G421K2709J4289j9470
811B4949f623F319J4398c3078m1938a1071F4211B7549c9675a6961C0386a403n3537
824e4940J7507A7789J6160G523a6117B380M6705r443c5494j0161C3688J750e8175
838f8067E898J2156e599A0362J199a2362D432K9856j1311I75c666m443K992K018
$$ plain form
852 -3099 -33659 -57743 -20733 25023 5911 -23537 14759 58560 15141 -37582 10167 70580
864 70580 16004 -76993 -71948 -5289 12023 -22633 -35544 3666 65053 77420 20650 -13793 23738
878 29732 -44288 -77747 -39889 -43711 -72453 -9834 75989 69791 43165 59144 36272 -28053 -53142
891 -53142 -50547 -50705 -30590 -10907 -5422 32380 73266 34984 -27744 -8592 28860 -23704 -95511
904 -95511 -55096 41368 53547 10746 23739 58082 30023 -26023 -56285 -64657 -47407 -18102
917 -14870 -7195 39977 60037 32080 35819 63671 20013 -61722 -69235 -34672 -55184 -79808 -18106
931 55305 51764 38117 66926 61703 -1028 -38408 -28194 -8188 -4733 -44152 -91629 -43151 60487
945 54639 -27525 -9328 70903 43509 -42115 -41316 4659 3174 -9503 4085 8778 -2099 -17284 -37512
$$ packed form
852c099l0560k4084b0733B5023E911b3537A4759M3801A5141c7582A0167O0413
864G0580A6004g6993N045e289A2023b2633j2911C666O1387J2367B0650a3793B3738
878B9732d4288l3459L7858l822k8742i834G5989o198k6626J5979k2872b8053k5089
891e3142K595j58K0115a0907e422C2380M0886C4984b7744h592B8860b3704p1807
904i5511M0415D1368J2179A0746J2993L4343k8059b6023l0262q372J7250a8102
917a4870g195C9977K0060k7957L739K7852B0013f1722p513L4563k0512k4624a8106
931E5305l541j3647K8809n223a028l7380J0214h188L455l9419m7477d3151F0487
945E4639b7525i328G0903k7394d2115P99D659j485i503D085M693b099j5185k0228
$$ plain form
959 -37512 -30386 14842 29330 -6042 -12608 27506 39076 17833 25275 33052 -19410 -70117 -43598
972 -43598 -11589 -53736 -82198 2409 99874 86585 24828 13476 23649 10159 -22024 -61701
984 -61701 -62772 -5963 7123 -53652 -37635 65716 65131 -26365 -18601 42262 7085 -45309 -17790
998 12936 19507 37300 23194 -25547 -31224 -11609 -27906 -37163 -8927 1452 -4035 20856 39212
1011 39212 14892 10680 59016 80765 5131 -86033 -75678 -26442 -63692 -109236 -43561 48805
1024 69363 67711 77970 75513 68787 22810 -79638 -112530 -45615 -50278 -121231 -59648 87708 112891
1037 112891 52262 45709 48180 3216 -31881 -38355 -53976 -51421 -6286 25377 22727 20236 8906
1051 -19824 -16580 6704 -22628 -63323 -16770 56007 40347 7865 57931 92636 10541 -82138
$$ packed form
959c7512P126A4842J4488f042o566B7506J1570A7833P442P777a9410n0707K6519
972d3598a1589m2147k8462B409R7465j3289B4828j1352J0173A0159b2024l9677
984f1701j071e963G123e3652J6017F5716n85b6365P764D2262G085d5309a7790
998A2936O571J7793j4106b5547n677a1609j6297r257h927A452d035B0856J8356
1011C9212A4892m212M8336K1749E131h6033J0355b6442l7250m5544d3561D8805
1024F9363j652J0259k457o726B2810g9638l2892d5615m663p0953e9648H7708K5183
1037A12891E2262o553K471C216c1881o474j5621K555f286B5377k650k491H906
1051a9824L244F704b2628m0695a6770E6007j5660G865N0066L4705A0541h2138
$$ plain form
1064 -74869 -38055 -56603 -82292 -50246 31312 102189 105676 54407 35168 62653 30654 -80153
1077 -132390 -87794 -61425 -68277 -11371 79649 90738 58594 62489 44316 -30887 -70329 -50175
1089 -50175 -42411 -36052 8836 44377 56454 69390 37740 -39952 -57556 -36034 -92826 -140041
1101 -140041 -35655 95742 104471 82989 124625 129896 35080 -80842 -145295 -150353 -116793 -82675
1113 -82675 -47793 30530 130531 165920 123303 79748 44761 -37967 -135288 -154713 -111396 -81221
1125 -81221 -39841 60218 139823 113669 50964 40997 26749 -52713 -106255 -70423 -23209 -11501
1138 -310 19975 57336 104685 59127 -69312 -86817 -4845 -39947 -123579 -40871 94447 103907 74027
1151 74027 73170 40583 -2043 -39495 -109852 -137579 -72941 -29508 -31934 20156 102879 123338 100910
$$ packed form
1064g4869L6814j8548k5689L2046C1312P0877L487n1269j9239K7485C0654h0153
1077a32390M4596K6369o852a1371G9649J1089l2144L895j8173c0887l9442K0154
1089e0175P764O359H836L5541J2077J2936l1650c9952j7604K1522n6792m7215
1101a40041c5655I5742Q729k1482M1636N271C5080h0842o4453n058L3560L4118
1113h2675L4882C0530J00001L5389m2617m3555l4987c7967r7321j9425M3317L0175
1125h1221c9841F0218P9605k6154E0964r967j4248e2713n3542L5832b3209a1501
1138c10A9975L7361M7349m5558f9312j7505d845l5102q3632d0871I4447R460k9880
1151G4027q57l2587b043l7452p0357k7727O4638b9508k426B0156Q2723K0459k2428
$$ plain form
1164 100910 73508 26775 -43352 -102393 -108447 -77313 -69232 -46575 62051 148554 91402 8504
1177 12265 13048 -42831 -93497 -100966 -50989 30480 47758 12916 54404 129621 75148 -58973
1190 -94375 -46423 -56233 -100820 -57241 52175 107610 96323 70452 29044 -13321 -28592 -59753
1202 -59753 -107522 -85114 -23067 -3808 24989 88358 88069 47285 57046 39603 -61069 -115885 -72794
1215 -72794 -38748 -47770 -28051 43335 104723 85179 11817 -15491 6321 -5926 -60983 -90061
1227 -90061 -50751 32299 63584 21579 27948 98473 72548 -50867 -98912 -75204 -88527 -89274
1239 -89274 -14923 56264 87783 117179 116300 58626 -4190 -48742 -98153 -124764 -98669 -63223
1251 -63223 -26676 59286 142472 118302 47319 42286 23582 -88560 -162232 -102897 -23565 -2937
$$ packed form
1164A00910k7402B6775d3352n9041o054L1134Q081K2657F2051Q6503n7152H504
1177A2265P83d2831n0666p469M9977C0480J7278A2916M1488P5217n4473e8973
1190i4375d6423r810m4587M3579E2175N5435j1287k5871B9044a3321j5271l1161
1202e9753m7769K2408b3067c808B4989O3369k89m0784R761j7443f1069n4816M3091
1215g2794L4046r022J9719D3335O1388j9544A1817a5491F321e926n5057k9078
1227i0061L9310C2299L1285B1579O369P0525k5925e0867m8045K3708j3323p47
1239h9274a4923E6264L1519K9396q79n7674d190m4552m9411k6611K6095L5446
1251f3223b6676E9286Q3186k4170D7319n033j8704h8560p3672N9335b3565b937
$$ plain form
1264 17333 67520 113735 116041 49051 -40416 -64143 -42854 -66257 -106824 -71065 18543 65730
1276 65730 61988 72625 90224 44233 -38545 -62756 -50825 -78945 -89008 -19333 46030 56758
1288 56758 69460 79499 48329 6651 -35703 -86535 -85852 -40468 -52148 -66476 39987 153392
1300 153392 108251 14864 16089 29834 -33632 -99913 -98789 -47794 8436 29710 22385 37027
1312 37027 63466 38654 -21065 -37490 -17601 -31251 -61869 -34324 32635 57022 43503 44112
1324 44112 36401 -15111 -56784 -39708 -21726 -44848 -48022 9826 58914 41961 3492 4921 37771
1337 37771 49046 -889 -68029 -54664 11595 -7652 -77247 -28831 80292 69065 -3999 2927 34699
1350 34699 10067 -25059 -43235 -41955 -6186 11142 -25271 -23006 40065 47751 -2670 -7523 14429
$$ packed form
1264A7333N0187M6215K306D9051d0416k3727K1289k3403m0567L5759A8543M7187
1276F5730l742J0637J7599D4233c8545k4211J1931k8120j0063a9333D6030J0728
1288E6758J2702J0039l1170F651c5703n0832O83d0468j1680j4328C9987J13405
1300A53392m5141A4864J225J3745c3632o6281J124d7794H436K1274p325J4642
1312C7027K6439k4812b1065j6425a7601j3650l0618K7545C2635K4387j3519O09
1324D4112p711a5111m1673J7076J7982k3122l174I826M9088j6953C492J429L2850
1337C7771J1275h89o7140J3365A1595g652o9595b8831H0292j1227c999B927L1772
1350C4699A0067b5059j8176J280f186A1142b5271K265D0065P686b670m853A4429
$$ plain form
1364 -4745 -21441 281 12499 -3157 -3065 19684 13789 -42594 -80182 -37775 29309 34138 4314 17922
1378 17922 63815 68584 11248 -46433 -37929 -4195 -33093 -87743 -56620 28306 37087 -5092 24263
1392 95223 81219 -4373 -50881 -43021 -30759 -28893 -35845 -33766 7208 47331 32107 11205 23357
1405 23357 11708 -18556 -260 17923 -28959 -57351 -8127 27086 3500 -10942 9104 21039 1020
1419 -29552 -22382 22332 33074 -12335 -28867 17020 43222 4724 -36347 -18303 25083 9921
1432 -53207 -61058 -2585 23567 4763 17888 49911 39991 8868 -3638 -15125 -32560 -36154 -30080
1445 -30080 -21559 -5718 3203 6838 37966 65877 26830 -28724 -13235 8461 -39801 -71539 -15375
1459 37079 17505 -6684 12552 40581 35698 -12282 -49794 -17257 25280 -9965 -54480 -14353
$$ packed form
1364d745j6696B81J2218c157R2A9684n895d2594l7588c7775B9309M829D314J3608
1378A7922M5893M769A1248d6433Q504d195k8898n4650L1123B8306Q781e092B4263
1392I5223j4004d373m6508P860J2262J866o952K079G208M0123j5224A1205J2152
1405B3357j1649a8556b60A7923b8959k8392h127B7086C500a0942I104J1935A020
1419b9552P170B2332J0742a2335j6532A7020K6202D724c6347J8044B5083I921
1432e3207p851b585B3567D763J3125L2023r920H868c638j1487j7435l594O074
1445c0080Q521e718C203L635L1128K7911B6830b8724a3235H461c9801l1738a5375
1459C7079A7505f684A2552K8029m883a2282l7512a7257B5280i965m4515a4353
$$ plain form
1472 42991 33585 -3157 -10653 805 2283 -8021 -6893 12184 11526 -11220 -5336 15708 -4253 -35618
1486 -35618 -18245 14463 10980 -7443 -9031 4070 7754 -18325 -30787 18160 60918 16565 -40354
1500 -5782 46200 4903 -65976 -55764 8102 29240 -3134 -22850 10498 52707 36385 -14178 -19838
1513 -19838 6892 -8342 -42346 -22812 21887 25343 4754 1328 -757 -17721 -26816 -11437 12380
1527 17590 12465 27825 42369 5063 -53009 -50275 -2121 447 -41181 -36804 30604 73949 37249
1540 37249 -12966 6609 46276 4145 -80454 -79990 -4435 23810 -10722 -13921 34228 57778 21846
1554 -21530 -14657 21728 20163 -18555 -29183 -8829 -16415 -37112 -22445 8208 18555 26508 37349
1567 37349 27669 -460 -18191 -8363 9662 -6545 -48674 -40886 16442 23452 -23670 -22303 38934 58773
$$ packed form
1472D2991r406c157p496H05J478h021J128A2184o58a1220e336A5708d253l1365
1486c5618J7373A4463l483g443j588D070L684a8325j2462A8160M2758A6565d0354
1500e782D6200D903f5976J0212H102K1138c134j9716A0498M2209j6322a4178n660
1513a9838F892h342l4004J9534B1887L456D754A328g57j6964r095a1437A2380
1527A7590n125J5360J4544E063e3009K734b121D47d1181M377C0604M3345l6700
1540C7249a2966F609L9667D145h0454M64d435B3810a0722l199C4228K3550B1846
1554b1530O873B1728j565a8555j0628h829p586k0697J4667H208J0347P953J0841
1567C7349r680d60j7731h363I662f545m2129P788A6442P010b3670J367C8934J9839
$$ plain form
1581 58773 9066 -32035 -10600 28440 12261 -37843 -35278 16907 20727 -30322 -35082 23228 53449
1594 53449 18556 -15028 -8125 1155 -22473 -49864 -34954 3719 25129 34188 49499 50136 16378
1608 -18187 -22650 -27350 -55940 -68802 -31842 21678 40963 31360 41914 69433 47534 -28863
1621 -68263 -34819 -17619 -54886 -57362 7770 58658 43427 9353 8155 32192 33185 -9548 -43176
1634 -43176 -24569 -6748 -26336 -25988 18889 42161 21688 12822 19357 -1908 -34834 -36876 -15890
1648 -7735 -11437 1522 36814 52588 20802 -12853 1100 18422 -21072 -70783 -50505 15936 35475
1661 35475 -2467 -13965 33696 55198 2732 -38035 -7195 22184 -5559 -36959 -28596 -10027 -5346
1674 -5346 -7819 689 30812 54223 34451 3656 -829 -11635 -45842 -46863 -12824 -11498 -29831 2067
$$ packed form
1581E8773I066c2035a0600B8440A2261c7843K565A6907L820c0322m760B3228L0221
1594E3449A8556a5028O903A155b2473k7391J4910C719K1410R059J5311O37A6378
1608a8187m463m700k8590j2862c1842B1678J9285r603J0554K7519k1899b8863
1621f8263L3444J7200l7267k476G770N0888j5231I353j198K4037R93i548l3628
1634d3176J8607f748j9588L48A8889K3272k0473q866O535a908l2926k042a5890
1648g735l702A522L5292J5774B0802a2853A100J7322b1072m9711K0278A5936J9539
1661C5475b467j1498C3696K1502B732c8035g195B2184e559l1400Q363a0027M681
1674e346k473F89L0123K3411j9772C656h29j0806l4207j021a2824J326j8333B067
$$ plain form
1689 55155 51649 12728 10830 37411 23519 -37370 -71230 -36565 10938 1581 -35788 -16799
1702 46158 47721 -22936 -46378 17541 55728 8630 -30329 957 29273 -293 -32515 -17604 11641
1716 9733 -14240 -23333 -7868 10043 9453 2684 14423 25983 9920 -6720 -2539 -15816 -44861 -19776
1731 38897 26650 -33285 -24923 35433 37279 -16558 -37963 -5390 26218 7598 -33055 -19601 42886
1745 54907 -6917 -37669 1865 9510 -54819 -80767 -7031 65255 54833 23015 26785 29218 1925
1759 -34342 -59081 -62856 -41936 -16576 1844 30475 56974 59142 58051 60931 19711 -56099 -80854
1772 -80854 -50922 -49195 -69475 -26503 57880 80508 39026 25120 50135 37823 -25520 -70780
1784 -70780 -59227 -19647 -7225 -27055 -14678 55998 90970 25477 -34949 -14627 -4113 -51972
$$ packed form
1689E5155l506A2728j898K6581j3892c7370l3860L4665A0938A581c5788a6799
1702D6158J563b2936k3442A7541L8187H630c0329I57K8316b93l2222J4911A1641
1716I733a4240r093g868A0043n90B684J1739J1560I920f720b539j3277k9045a9776
1731C8897j2247c3285Q362C5433J846a6558k1405e390B6218G598c3055J3454D2886
1745E4907f917l0752A865P645e4819k5948g031F5255j0422B3015L770K433A925
1759c4342k4739l775K0920a6576A844K8631K6499K168j091K880A9711e6099k4755
1772h0854K9932J727k0280b6503E7880K2628C9026j3906K5015j2312b5520m5260
1784g0780J1553a9647g225j9830J2377E5998L4972B5477c4949a4627d113m7859
$$ plain form
1796 -51972 -66283 -15465 22677 28208 39426 45160 27236 4762 -11476 -23565 -30638 -40433 -47288
1809 -47288 -24591 19002 33267 12559 17796 57010 47276 -21105 -45608 -1636 2134 -50570 -49325
1822 -49325 15647 43797 14499 -7163 4778 28652 26732 -16944 -50181 -20254 20753 9173 -9934
1836 11335 20541 -15811 -33845 -12010 -13855 -35304 -4473 54417 56787 22890 19223 23574 -6006
1850 -42331 -51964 -37736 -11945 -7010 -20955 8960 74763 69894 -12689 -43146 7185 11495 -55615
1864 -69264 4688 54972 32691 6006 10141 18297 8059 -18060 -38871 -27001 -3112 -13164 -31357
1877 -31357 -1267 37042 29284 20290 39202 28088 -18200 -27743 -7400 -28770 -59262 -24492 26760
1891 17158 -10617 9812 49648 49715 5634 -38882 -33821 4634 -6771 -62102 -47115 49402 88433
$$ packed form
1796e1972j4311a5465B2677N531J1218N734j7924D762a1476j2089p073r795o855
1809d7288K2697A9002J4265A2559N237L9214r734b1105k4503a636B134e0570J245
1822d9325A5647K8150A4499g163D778K3874j920a6944l3237b0254B0753I173i934
1836A1335R206a5811j8034a2010j845k1449d473E4417K370B2890l667M351f006
1850d2331r633J4228a1945M935j3945H960O5803m869a2689l0457G185M310e5615
1864f9264D688N0284k2281F006M135Q156H059a8060k0811J1870c112j0052j8193
1877c1357a267C7042p758q994J8912j1114a8200r543g400k1370l0492b4492B6760
1891A7158a0617I812L9836O7E634c8882N061D634f771n5331J4987D9402L9031
$$ plain form
1904 88433 20739 -24209 17472 37031 -22508 -58585 -23413 5817 -2380 -8047 -4055 2194 20621
1917 20621 17587 -11430 -5744 17903 -4910 -26997 5041 19856 -5085 8230 39120 1759 -56893
1931 -41476 11035 9319 -29733 -22717 34170 55173 11784 -24632 -12061 18482 18995 -18059 -35185
1944 -35185 10697 40709 -13049 -46343 16730 46557 -23508 -56314 -4083 20446 -1737 -71 20576
1958 29064 36318 24630 -15000 -29301 -12929 -22935 -40862 -19956 -3621 -25087 -12835 44883
1971 52363 11706 18481 51704 16255 -57398 -64968 -20249 -4811 -22557 -16431 24358 57936 48300
1984 48300 5679 -15248 8849 13670 -45481 -79240 -17905 38579 9467 -8634 38843 50407 -2493
1998 -25534 -16691 -27873 -29471 318 16043 12919 17529 15203 5892 6837 -6040 -38869 -34979 12240
$$ packed form
1904H8433B0739b4209A7472J9559b2508l6077b3413E817b380n667L992B194J8427
1917B0621l034a1430N686A7903d910k2087E041J4815e085H230L0890A759e6893
1931d1476A1035j716b9733P016C4170K1003A1784b4632a2061A8482N13a8059j7126
1944c5185A0697L0012a3049l3294A6730K9827b3508l2806d083B0446a737g1B0576
1958B9064P254j1688a5000j4301a2929j0006j7927a9956c621k1466J2252D4883
1971E2363A1706O775L3223A6255e7398p570b0249d811j7746O126B4358L3578r636
1984D8300E679a5248H849M821d5481l3759a7905C8579I467h634C8843J1564b493
1998b5534Q843j1182j598C18J5725l124M610k326E892R45f040l2829L890A2240
$$ plain form
2013 23014 -15230 -10443 50774 53727 -20823 -43170 7732 9133 -38481 -37316 2511 21590 24175
2026 24175 7138 -16422 6865 38661 -625 -39667 -493 23829 -18059 -31032 9024 17741 -5228 3031
2041 26663 11830 -22166 -20548 5091 1116 -17881
$$ packed form
2013B3014a5230M787E0774K953b0823k2347G732J401c8481J165B511J9079K585
2026B4175G138a6422F865L1796f25l9042d93B3829a8059j2973I024Q717e228C031
2041B6663A1830b2166J618E091A116a7881
##PAGE= T1=0.0018018
##FIRST=     0,             0,               0,               0
##DATA TABLE= (T2++(R..R)), PROFILE
$$ plain form
0 0 0 0 0 0 0 0 0 0 0 0 0 0 0 0 -6 7 -10 12 -12 12 -18 18 -20 27 -29 39 -41 49 -52 61 -69 81 -92 104 -116 132 -144 161
39 -184 202 -225 248 -277 305 -334 374 -410 455 -501 551 -609 671 -742 825 -914 1019 -1140 1282 -1456
60 1663 -1927 2270 -2741 3418 -4494 6495 -11471 61161 42309 -83087 -219423 -426432 -252811
73 -252811 457836 834439 360130 38248 235391 90797 -344651 -359440 -261046 -319754 -214904
84 -214904 -77220 -43998 197423 393485 194064 946 38325 23774 -58433 -119670 -159409 -77188
97 52094 75921 90577 54666 -87195 -55717 106246 47703 -33997 52343 -18012 -161818 -38438
110 59643 -49282 -3601 151407 96654 -29276 -65562 -111528 -145705 -82227 48506 157384 144840
122 144840 60631 25091 -15449 -83469 -68967 -42276 -72804 -32726 22337 -21755 27507 185903
$$ packed form
0@@@@@@@@@@@@@@@fGa0A2a2A2a8A8b0B7b9C9d1D9e2F1f9H1i2A04a16A32a44A61
39a84B02b25B48b77C05c34C74d10D55e01E51f09F71g42H25i14A019a140A282a456
60A663a927B270b741C418d494F495a1471F1161j8852h3087j36336k07009J73621
73b52811D57836L76603C60130C8248J97143I0797c44651j4789R8394n8708J04850
84b14904g7220L3222A97423J96062A94064I46L7379j4551e8433o1237l9739g7188
97E2094K3827J4656l5911h7195L1478A06246D7703c3997E2343a8012j43806c8438
110E9643d9282c601A51407n4753b9276l6286m5966l4177O3478D8506J08878j2544
122A44840F0631B5091a5449o8020J4502K6691l0528c2726B2337b1755B7507J58396
$$ plain form
134 185903 156286 8606 -4815 -11659 -95373 -83452 -35940 -92034 -107887 6471 84186 31464 -34031
148 -5609 55022 62027 60866 77659 40661 -15569 2641 16771 -42295 -50200 311 -31203 -70158
161 -70158 4626 30656 -70051 -104001 -22305 56833 115967 121183 20343 -56024 -6265 25503 -46897
175 -88140 -43544 -8722 675 34587 59574 37461 14744 27074 24791 -15939 -23831 2534 -26357
189 -65492 -23710 17057 -3998 233 38316 42683 35501 27135 -37021 -90412 -35254 39798 15621
203 -21899 21478 65023 39716 7115 18290 26296 -13047 -53568 -58279 -45446 10146 85882 64416
216 64416 -17800 -10679 11637 -75105 -124573 -33685 42906 42940 57149 54926 -2313 -11645 16453
230 -17052 -49268 2058 52929 34348 -15489 -42181 -21126 23194 40233 12958 -21089 -4350
$$ packed form
134A85903k9617H606d815o844q3714J1921c5940n6094j5853F471P7715C1464c4031
148e609E5022P005j161J6793l6998a5569B641J4130d2295p905C11c1203l8955
161g0158D626K6030g0051l3950b2305E6833N9134N216B0343e6024f265B5503d6897
175h8140d3544h722F75L3912K4987k2113A4744J2330k283a5939p892B534b6357
189f5492b3710A7057c998B33L8083M367p182q366c7021n3391c5254C9798A5621
203b1899B1478M3545k5307G115J1175Q006a3047m0521m711J2833A0146P5736k1466
216F4416a7800P121A1637g5105m9468c3685D2906L4J4209k223b313r332A6453
230a7052l2216B058N0871j8581a5489k6692K1055B3194J7039A2958b1089d350
$$ plain form
243 29498 -13691 -86564 -59592 25252 39258 2803 -4342 5024 12963 37273 43883 20545 19392
256 19392 18118 -42972 -97352 -55991 18513 34025 22758 36947 35855 -1152 -9139 1294 -18494
270 -5343 53002 33968 -54229 -66500 -13790 -5428 -20164 -2251 639 -15762 4732 18062 -5811
284 23887 92370 69846 -7070 -8600 16280 -39261 -99998 -64789 1435 16883 10661 3592 -7147
298 11813 50283 37602 -19295 -31678 -2846 -17912 -57032 -33394 14549 17928 28379 53830
310 53830 18492 -37877 -24730 3066 -9496 16221 81398 66275 -7470 -20681 -3477 -24838 -43738
323 -43738 -51877 -74120 -50864 28659 53888 4267 6178 73623 75418 7307 -20437 -17864 -40852
336 -40852 -40838 -7850 -9450 -29131 -5664 19070 4830 13022 51457 40209 -2731 -5442 8175 -2105
$$ packed form
243B9498a3691p2873K6972B5252J4006B803d342E024P939K4310O610B0545j153
256A9392j274d2972n4380M1361A8513J5512j1267J4189j092a152p987A294a8494
270e343E3002j9034e4229j2271a3790e428j4736b251F39a5762D732J3330e811
284B3887O8483k2524g070j530A6280c9261o0737L5209A435J5448o222C592g147
298A1813L8470j2681a9295j2383b846j5066l9120K3638A4549L379J0451K5451
310E3830A8492c7877J3147C066i496A6221O5177j5123g470j3211c477k1361j8900
323d3738q139k2243K3256B8659K5229D267J911O7445J795G307b0437K573k2988
336d0852J4g850j600j9681e664A9070D830Q192L8435j1248b731k711H175b105
$$ plain form
351 -14240 -19247 -33289 -39833 -14351 7219 -24152 -52656 -911 58501 38183 9088 27909 39054
364 39054 23397 10893 -13775 -36604 -16103 -4746 -52210 -60475 17150 58110 24660 11451
377 25482 9123 -14569 -12924 -14613 -23597 -2808 18689 -8836 -27589 4340 13679 -14917 -8637 25682
392 28811 10732 -399 -11363 408 52852 65028 -18413 -90285 -56254 5079 1457 -27136 -12338
406 28364 43878 28734 10 -26799 -20308 9283 10226 2326 25168 17952 -47878 -68109 2821 50133
420 50133 10146 -33800 -32467 -5863 40912 72156 32510 -16769 8864 44948 1238 -72850 -89724
433 -89724 -54560 -6425 33577 33628 1443 3985 32862 19385 -1530 28944 48092 -2039 -51593 -30530
447 -30530 14847 16661 -10536 -16244 6088 24629 4216 -42470 -54470 -5044 49857 46424 11593
$$ packed form
351a4240n007j4042o544a4351G219b4152k8504i11E8501k0318I088J8821J1145
364C9054j5657A0893a3775k2829a6103d746m7464q265A7150M0960B4660A1451
377B5482I123a4569J645j689q984b808A8689h836j8753D340R339a4917O280B5682
392B8811A0732c99j0964D08N2444J2176a8413p1872L4031E079A457b7136a2338
406B8364J5514j5144A0b6799O491I283R43B326K2842p216d7878k0231B821M7312
420E0133A0146c3800J333e863D0912L1244C2510a6769H864L6084A238g2850j6874
433h9724L5164f425C3577N1A443K542K8877j3477a530B8944J9148b039m9554K1063
447c0530A4847J814a0536n708F088J8541D216d2470j2000e044D9857l433A1593
$$ plain form
461 10051 20220 -8012 -39225 -32525 -13958 -2307 3996 -8547 -22798 3107 51864 55165 11550
475 -10994 -2086 -6427 -23563 -32804 -25593 8740 42972 27794 -13933 -19404 -4996 -22690 -37549
488 -37549 11549 68086 47590 -15677 -40429 -8738 29819 18992 -33924 -58183 -17927 36806
501 41065 5576 -7794 11522 27820 21908 -3414 -34966 -46933 -19453 26072 38939 14191 -10393
515 -31533 -47373 -23269 20617 27538 4410 1118 35405 75115 62332 -8196 -68858 -58496 -9601
529 -7546 -48844 -49339 7799 59212 66984 41483 9565 -12721 -24086 -30664 -25501 -3536 13150 5347
544 -4152 4640 12446 8233 -6190 -24765 -27768 -3442 24798 27147 12097 17603 46613 48780 581
559 -54139 -62628 -30669 -14090 -21728 -7924 36831 56109 27935 -7910 -228 34991 30021 -24051
$$ packed form
461A0051J0169h012l1213O700a3958b307C996h547j4251C107M8757L301A1550
475a0994b086m341j7136r241P211H740L4232j5178a3933n471d996j7694j4859
488c7549A1549N6537k0496a5677k4752h738B9819j0827c3924k4259a7927C6806
501D1065E576g794A1522J6298n912c414l1552j1967a9453B6072J2867A4191a0393
515c1533j5840b3269B0617O921D410A118L4287L9710j2783h196o0662J0362i601
529g546m1298m95G799N1413P772k5501I565a2721j1365o578N163c536A3150E347
544d152D640P806m213f190j8575l003c442B4798K349A2097N506K9010K167E81
559e4139q489c0669a4090p638g924C6831J9278B7935g910b28C4991m970b4051
$$ plain form
573 -61383 -47089 -9236 10912 10598 17771 37589 41352 15061 -20311 -36307 -30417 -15671 1967
587 18965 29997 27311 4720 -20132 -18014 8360 18738 -19294 -68968 -55295 18367 69486 56230
600 56230 18173 16284 43696 24509 -54378 -98657 -57964 8419 33752 24325 20230 20504 1845
614 -16207 -6744 21532 35514 8056 -35025 -36320 1566 15364 -8835 -22333 3614 34973 33652
627 33652 1269 -27395 -18179 22532 41910 6205 -42362 -41424 -1904 12875 5061 18405 35431
640 35431 17786 -27199 -61158 -46364 9194 41261 28547 22415 44988 39695 -27407 -82571 -52110
653 -52110 10705 28106 13663 6299 9457 19738 19969 -410 -11364 5537 12318 -24841 -56269 -34783
667 -34783 5385 28014 39438 38208 15209 866 -1743 -31674 -64245 -31316 31243 32467 492 5886
$$ packed form
573f1383J4294i236A0912l14P173J9818L763A5061b0311j5996N890J4746A967
587A8965J1032k686D720b0132K118H360J0378a9294m9674J3673A8367N1119j3256
600E6230A8173j889K7412j9187e4378m4279M0693H419K5333r427m095K74A845
614a6207f744B1532J3982H056c5025j295A566J3798h835j3498C614L1359j321
627C3652A269b7395R216B2532J9378F205d2362R38a904A2875E061J3344J7026
640C5431j7645b7199l3959J4794I194L2067j2714o132K2573n293b7407n5164L0461
653e2110A0705J7401A3663F299L158J0281K31d10j0954E537O781b4841l1428K1486
667c4783E385K2629J1424j230A5209H66a743k9931l2571c1316C1243J224D92N394
$$ plain form
681 5886 30661 30476 10338 -5212 -7476 -7966 -21183 -51230 -62094 -8975 60122 51968 7799 21855
695 21855 43463 4493 -43349 -47190 -29984 -7705 13468 7590 -12734 1706 38733 38158 7931 -4410
710 -4168 -20559 -35146 -28829 -15769 7443 43824 43596 -513 -11489 13772 -5982 -58938 -53070 6539
725 38304 26208 13901 14951 22801 29305 -846 -59740 -59722 -5239 6390 -12690 12175 47343 37501
739 37501 16447 11395 -7719 -39943 -41882 -26651 -27765 -8394 42899 52943 13603 4027 21180
752 21180 3964 -31297 -40316 -34555 -5637 48934 50663 -15714 -37794 14109 29137 -21681 -33638
765 -33638 16983 31718 -9003 -32250 -32221 -27549 9084 40819 23477 25525 57546 17334 -73186
779 -81957 -13863 15160 2740 12771 24867 19299 36119 44400 -13245 -56457 -14343 9945 -44943
$$ packed form
681E886K4775j85A0338e212k264m90j3217l0047j0864h975F0122q154G799J4056
695B1855K1608D493d3349l841J7206g705A3468n878a2734A706L7027n75G931d410
710d168j6391j4587O317J3060G443L6381k28e13j0976A3772e982n2956N868F539
725C8304j2096j2307J050P850O504h46n8894J8e239F390a2690A2175L5168r842
739C7501A6447n052g719l2224j939J5231j114h394D2899J0044A3603D027J7153
752B1180C964c1297r019N761e637D8934J729a5714k2080A4109J5028b1681j1957
765c3638A6983J4735i003k3247K9M672I084L1735j7342K048L2021A7334g3186
779h1957a3863A5160B740J0031J2096n568J6820Q281a3245m3212a4343I945d4943
$$ plain form
793 -63755 -832 48089 54974 54713 21610 -31539 -37211 -24985 -50822 -42884 44474 89172 22631
807 -30616 -4246 797 -36109 -29557 8227 19248 17604 10673 -20790 -30887 18694 54504 16878
821 -15232 10466 3433 -55904 -58025 -7198 21365 47078 65556 6409 -64536 -35367 18158 -464
835 -15048 26483 43978 9307 -16447 -22495 -24495 912 33380 14882 -20865 -1732 9561 -43787
849 -48588 43044 81851 16129 -34965 -33972 -20046 7241 27083 2284 -18274 15245 35947 -14588
863 -50974 -11164 29112 28596 33205 24160 -31751 -62447 -28436 -6307 -9139 36535 80203 27907
877 -36102 -10185 15200 -27473 -47110 -11272 7902 14245 33042 5487 -42822 -2563 60863 14163
891 -55911 -26293 18618 1571 2008 45296 40604 -6694 -18304 -29982 -69640 -45832 34236 45615
$$ packed form
793f3755h32D8089O885k61B1610c1539n672J2226k5837P938D4474M4698B2631
807c0616d246G97c6109O552H227J1021j644o931b0790j0097A8694L5810A6878
821a5232A0466C433e5904k121g198B1365K5713J8478F409f4536K9169A8158d64
835a5048B6483J7495I307a6447o048k000I12L2468A4882b0865a732I561d3787
849d8588D3044L8807A6129c4965R93J3926G241J9842B284a8274A5245K0702a4588
863e0974a1164B9112n16M609r045c1751l0696b8436f307k832C6535M3668B7907
877c6102a0185A5200b7473j9637a1272G902O343J8797E487d2822b563F0863A4163
891e5911b6293A8618A571M37M3288m692f694j1610j1678l9658K3808C4236J1379
$$ plain form
904 45615 15376 35553 40937 -15294 -42959 -23452 -22808 -18530 25821 41072 -3226 -16977 19382
918 10068 -35885 -14288 44648 30273 -18398 -12940 5671 -2698 508 -10424 -48700 -23149 50786
932 42599 -23912 -18896 23794 8734 -13842 8917 8137 -23533 -4135 30991 2470 -21070 2814 -7477
947 -42803 -7322 44752 16552 -24235 -219 26083 20420 24902 9838 -50200 -53873 22485 36874
960 36874 -32524 -43660 16021 31801 2575 898 10451 4945 16214 28960 -1076 -29662 -17568
973 -17568 -23417 -54556 -17948 64982 57841 -11436 -17334 -278 -22421 -11977 23207 790 -13555
987 40539 47160 -34021 -65196 -12637 9592 -8219 2508 12964 -4363 5362 28044 874 -15304 38139
1002 46329 -39493 -67394 4087 26431 -16668 -10039 18600 -4936 -22333 -4816 -9081 -3450 55308
$$ packed form
904D5615A5376K0177N384a5294k7665J9507O44M278B5821J5251c226j3751A9382
918A0068c5885a4288D4648j4375a8398N458E671b698E08a0424l8276b3149E0786
932D2599b3912N016B3794H734a3842H917p80b3533d135C0991B470b1070B814g477
947d2803g322D4752A6552b4235b19B6083n663M482I838e0200l673B2485J4389
960C6874c2524j1136A6021J5780B575H98R553D945J1269J2746a076k8586J2094
973a7568n849l1139a7948F4982p141a1436n898b78k2143J0444B3207G90a3555
987D0539O621c4021l1175a2637I592h219B508J0456d363E362K2682H74a5304C8139
1002D6329c9493k7901D087K2344a6668O629A8600d936j7397d816m265c450E5308
$$ plain form
1016 73727 3557 -31787 -1747 -29645 -92680 -53978 40541 61466 38720 31184 -4880 -52225 -20913
1030 31168 -5607 -41195 21494 62003 9835 -14837 7240 -13027 -31223 -2878 -11408 -48729 -9639
1044 42802 18691 15766 78539 63796 -46429 -87973 -36666 -9313 -14644 2112 14056 9493 35529
1057 35529 48296 -12702 -50690 6783 46525 7780 -15485 -4541 -21678 -38635 -5954 19234 5333
1071 12411 32636 -3809 -47105 -9954 37872 10101 -20296 12135 35749 13729 -1032 -14613
1083 -14613 -37580 -9656 29762 -22169 -78498 -17459 52392 29098 18999 66137 56115 -5098
1096 -22208 -29210 -62719 -48698 1162 -20 -15174 30013 60181 20439 -6839 7978 -8567 -42390
1109 -42390 -19716 9849 -3093 15975 67020 44787 -23379 -28094 -10478 -49602 -75501 -23128
$$ packed form
1016G3727C557c1787a747k7898o3035L8702D0541K0925k2746p536d880m7345b0913
1030C1168e607l5588B1494M0509I835a4837G240a3027j8196b878q530l7321i639
1044D2802A8691k925O2773j4743d6429m1544c6666i313n331B112J1944m563K6036
1057C5529J2767a2702l7988F783L9742G780a5485d541j7137j6957e954A9234E333
1071A2411K0225c809m3296i954C7872A0101b0296A2135K3614A3729a032j3581
1083a4613k2967i656B9762b2169n6329a7459E2392k3294j0099M7138j0022e098
1096b2208p002l3509J4021A162b0j5154C0013L0168B0439f839G978h567l3823
1109d2390a9716I849c093A5975N1045k2233b3379m715a0478l9124k5899b3128
$$ plain form
1122 36298 45755 41666 35186 13205 12721 27655 -16456 -84718 -57615 16841 5060 -34291 15722
1136 66768 38549 20279 24990 -18243 -41777 1977 7511 -40876 -24746 28642 5965 -37914 -7593
1150 34515 29342 24936 17657 -27811 -40538 14865 24081 -35302 -23503 58033 51708 -27312 -41475
1163 -41475 -10496 -9905 -8968 5036 -2755 -880 27922 23582 -5738 15768 57265 22957 -50179 -54827
1177 -54827 -17293 -22721 -37692 -4500 33912 41711 49027 32783 -37557 -62969 3213 31173 -17611
1191 -20764 24019 22503 4843 9499 -8764 -21885 16634 21010 -45921 -53129 23135 41116 -6321
1205 1269 45555 27699 -27424 -47964 -39980 -17913 23822 36816 -3849 -11073 38304 37575 -19321
1219 -19529 25782 17870 -16617 -20801 -27017 -43172 -18232 19820 11186 4547 44377 54324 -348
$$ packed form
1122C6298R457m089o480A3205m84J4934a6456o8262K7103A6841E060c4291A5722
1136F6768k8219j8270M711a8243k3534A977N534d0876J6130B8642E965c7914g593
1150C4515n173m406p279b7811j2727A4865R216c5302J1799E8033o325b7312j4163
1163d1475a0496N91R37E036b755h80B7922m340e738A5768M1497B2957e0179m648
1177e4827a7293n428j4971d500C3912P799P316j6244c7557k5412C213K7960a7611
1191b0764B4019j516D843M656h764j3121A6634M376d5921p208B3135J7981f321
1205A269M4286j7856b7424k0540P984a7913B3822J2994c849p224C8304p29a9321
1219a9529B5782p912a6617m184o216j6155a8232A9820q634D547L9830R947c48
$$ plain form
1233 -25864 4765 7303 -28646 -37287 -25246 -17408 19177 51084 13152 -13841 33890 37874 -47649
1247 -72371 -4327 27102 11227 26026 38523 12661 3898 1926 -44490 -65725 -7207 28520 -6556
1261 -14895 26742 31591 6359 11269 8970 -26962 -25208 18021 12868 -18019 8830 39215 3472
1275 -27279 -610 11272 -16227 -17854 4585 5265 4883 9423 -22979 -48154 10004 66524 21279 -32286
1290 510 28772 -6463 -21092 -3048 -10590 -10482 21262 16621 -15080 152 24764 -4659 -26524 1979
1305 9736 -17629 -10290 21272 26362 32045 39104 -12565 -77113 -54071 8471 4009 -23560 6953
1319 50964 47668 16541 -13328 -29803 -13934 15210 7659 -19181 -4181 27889 7469 -26249 698
1333 32110 -968 -32968 -12796 5661 8235 26118 21236 -18131 -19442 9500 -12151 -43383 -1353
$$ packed form
1233b5864D765K538b8646q641J2041P838A9177L1907A3152a3841C3890L984d7649
1247g2371d327B7102A1227J4799J2497A2661C898A926d4490k1235g207B8520f556
1261a4895B6742M849F359M910k299b6962J754A8021n153a8019H830L0385C472
1275b7279f10A1272a6227j627D585O80l82M540b2979k5175A0004N6520B1279c2286
1290E10K8262f463j4629c048p542J08B1262m641a5080A52K4612d659k1865A979
1305I736a7629P339B1272N090N683P059a2565o4548K3042H471D009b3560F953
1319E0964l296A6541a3328j6475a3934A5210p551a9181d181B7889G469b6249F98
1333C2110i68l2000a2796E661K574J7883m882a8131j311I500a2151l1232a353
$$ plain form
1347 47920 36418 14712 6131 -21132 -33444 -4424 -144 -21547 12012 66426 31115 -50115 -52298
1360 -52298 -2020 8405 -8299 -6162 3516 18262 33927 15643 -17544 -2948 27253 504 -40580
1374 -24403 5786 -4703 -15906 10903 40616 34450 8535 -16095 -33284 -15589 29457 31011 -20908
1388 -36623 -2153 5722 -12651 -11198 -1510 7032 31325 32196 -14787 -34160 5753 17212 -10244
1402 2897 35706 12043 -33725 -30250 2409 19891 17996 -4066 -26209 -6874 29324 16032 -23446
1416 -11768 26171 18134 -20207 -35481 -30928 -21251 6119 33759 28583 16196 22950 19004 -10135
1430 -22837 -4440 6518 -11235 -23301 -9576 11000 22215 19639 -1749 -16012 191 434 -37924 -40439
1444 -40439 16448 46550 21653 8882 18733 7902 -13747 -28186 -40134 -24478 16475 23116 -3901
$$ packed form
1347D7920j1502A4712F131b1132j2312d424a44k1403A2012N4414C1115e0115k183
1360e2298b020H405h299K137C516J4746J5665A5643a7544b948B7253E04d0580
1374b4403E786d703j1203A0903K9713o166H535a6095j7189a5589B9457J554b0908
1388c6623b153E722a2651J453a510G032K4293Q71a4787j9373E753J1459a0244
1402B897L2809A2043c3725L475B409J7482j895d066k2143f874B9324j3292b3446
1416a1768B6171q037b0207j5274M553R677F119K7640n176j2387O754l946a0135
1430b2837d440F518a1235j2066i576A1000J1215k576a749j4263A91K43c7924k515
1444d0439A6448L0102B1653H882R851G902a3747j4439j1948J5656A6475O641c901
$$ plain form
1458 5089 43314 44782 11891 -10880 -25581 -34495 -18773 1 -7075 -10529 14475 29627 7054 -15204
1473 -7606 3958 -3061 -10906 -3518 11139 15423 -3422 -24602 -7350 37433 44633 -999 -32105 -7824
1488 20286 -506 -34802 -30021 -933 16528 18040 8345 -2882 2475 10266 -6099 -22824 -10516 391
1503 -5410 4734 27316 32019 24324 8132 -23406 -39813 -13813 12550 -1475 -17085 8905 41020
1516 41020 32286 -5457 -27049 -16140 3071 -5567 -33687 -28770 11978 33495 16777 6467 24248
1529 24248 28871 -8470 -49521 -44560 -4225 22934 20388 14075 22425 28106 12746 -18197 -38868
1542 -38868 -24768 5855 11714 -6293 -11199 5183 19373 12143 -10138 -20545 -2123 14215 -7887
1556 -33905 -8742 39302 46239 11515 -16423 -6334 15800 7001 -21485 -19158 11387 17806 -11028
$$ packed form
1458E089L8225J468A1891a0880j4701q914J5722Ag075l454A4475J5152G054a5204
1473g606C958c061p845c518A1139M284c422k1180g350C7433P200i99l1106g824
1488B0286e06l4296M781i33A6528J512H345b882B475P791f099j6725a0516C91
1503e410D734K2582M703p695H132b3406j6407a3813A2550a475j5610H905L2115
1516D1020q734e457k1592J0909C071e567k8120M917A1978K1517j6718F467J7781
1529B4248M623h470m1051M961d225B2934k546o313Q350N681A2746a8197k0671
1542c8868J4100E855N859f293m906E183J4190p230a0138j0407b123A4215g887
1556c3905h742C9302O937A1515a6423f334A5800G001b1485K327A1387O419a1028
$$ plain form
1570 -27790 -9075 16248 18554 8077 5228 9047 -570 -27281 -39619 -15429 18420 25527 11922
1584 1270 -983 5731 11998 1502 -11749 1673 22976 14508 -10470 -14873 2540 15519 4032 -21427
1599 -29199 -14399 -3693 -8949 -1691 32837 51487 17593 -31777 -39261 -10858 -135 -13892 -7215
1612 -7215 25611 41901 24025 -7057 -25572 -16458 11939 19396 1290 -6713 3285 2378 -7617 -7308
1626 -7308 -6661 -7604 827 1412 -14912 -14581 13737 22352 -1541 -6707 18279 26160 5032 -8671 589 17849
1642 17849 19164 -11213 -45941 -34356 8468 23498 7385 7939 27078 17248 -19911 -39035 -28269
1655 -28269 -9824 6168 16958 13684 7307 9586 4303 -16258 -20658 4944 24932 16860 1985 -3740
1670 583 9025 3716 -24374 -33781 2111 30728 7928 -13353 11822 30495 3132 -30691 -33907 -15880
$$ packed form
1570b7790i075A6248K306H077k849L819e70k6711j2338a5429A8420P107A1922
1584A270i83E731O267A502a1749A673K1303q468a0470m403B540J2979D032b1427
1599b9199a4399c693n256a691C2837J8650A7593c1777p484a0858a35j3757O677
1612g215B5611J6290j7876g057j8515R114A1939P457A290f713C285r07g617L09
1626g308O47r43H27N85a4912L31A3737Q615a541n166A8279P881E032h671E89J7260
1642A7849J315a1213l4728J1585H468J5030G385N54J9139r830a9911j9124J0766
1655b8269i824F168J0790l274o377K279D303a6258m400D944J9988q072A985c740
1670E83Q442C716b4374r407B111K8617G928a3353A1822J8673C132c0691l216a5880
$$ plain form
1685 6418 12740 47 1344 23680 16969 -28772 -40109 3600 35212 27354 21279 24162 13819 -2374
1700 -14327 -31764 -36953 -13446 4977 -6590 -12086 12697 30052 13836 -5485 -6571 845 6932 2222
1715 -19613 -23065 20212 47393 2151 -43391 -14809 28193 18919 -4599 -57 10182 7770 -2461 -20937
1729 -20937 -26357 3929 24443 -2156 -19018 10123 17604 -24815 -41621 -7555 20397 25288 25399
1742 25399 7885 -14302 2361 27778 -2087 -43640 -26242 13275 14503 4350 12852 20016 22008
1755 22008 20828 -5720 -42151 -32580 -1630 -11421 -24918 15301 50334 12095 -37255 -25086 10989
1769 15525 6567 3803 4486 17163 28935 1806 -26373 -1899 26003 -1854 -34503 -24658 -14774 -18373
1783 -18373 -928 19714 15345 20210 37172 14966 -29217 -26666 1135 -7760 -31423 -23245 146 13732
$$ packed form
1685F418O322D7J297K2336o711b8772j1337C600L1612p858o075K883j0343b374
1700a4327j7437n189a3446D977f590n496A2697J7355A3836e485j086H45O087B222
1715a9613l452B0212K7181B151d3391a4809B8193r274d599e7A0182k412b461j8476
1729b0937n420C929K0514b156j6862A0123P481b4815j6806g555B0397M891J11
1742B5399G885a4302B361K5417b087m1553J7398A3275J228D350Q502P164J992
1755B2008j180e720l6431R571a630r791j3497A5301L5033A2095c7255J2169A0989
1769A5525F567k764O83J2677J1772A806b6373a899B6003a854l2649R845R884l599
1783a8373i28A9714m369M865J6962A4966b9217K551A135g760k3663Q178A46J3586
$$ plain form
1797 13732 26063 25631 7424 9539 26202 2490 -37072 -17281 23885 7823 -23644 -7599 13900
1811 -929 -15306 -11431 -4433 17171 40199 13173 -37558 -36020 -1274 4082 -3959 13621 25500
1824 25500 14813 12778 8004 -27266 -42750 -723 25584 2304 5132 42040 31214 -15571 -23754
1837 -23754 -9324 -14811 -24393 -30321 -38210 -7222 55103 58098 -3970 -21258 14825 10412 -29349 -23866
1851 -23866 11517 21654 26097 34399 6798 -30156 -21332 -5628 -25248 -22466 16987 21338 -7663
1865 -1368 20459 11004 2256 6348 -14509 -30777 857 18686 -21425 -34020 20197 41163 -4019
1879 -21061 13874 30020 17976 7705 -7851 -18213 -2339 -3501 -39713 -30121 40596 63986 10853
1893 -18404 -395 -5384 -33143 -31751 -17381 -11090 15418 41102 15572 -11718 15362 31222 -12377
$$ packed form
1797A3732J2331m32G424K115J6663B490c7072a7281B3885G823b3644g599A3900
1811i29j4377L875d433A7171K3028A3173c7558J538a274D082c959A3621J1879
1824B5500j0687k035m774b7266j5484g23B5584B304K828L6908j0826a5571q183
1837b3754i324n487r582n928p889g222E5103K995c970j7288A4825m413b9349N483
1851b3866A1517J0137M443Q302F798c0156Q824e628j9620K782A6987M351g663
1865a368B0459r455B256M092a4509j6268H57J7829b1425j2595B0197K0966d019
1879b1061A3874J6146j2044G705g851j0362b339j162l6212R592D0596K3390A0853
1893a8404c95m989k7759J392J4370O291A5418K5684A5572a1718A5362J5860a2377
$$ plain form
1907 -35963 -8390 5371 360 11938 14916 7755 29009 35323 -26826 -74256 -31273 16990 -4513
1921 -24947 7787 35774 26263 12094 615 -13084 -4074 12978 -7518 -27353 4156 24779 -8438
1935 -14433 28897 32175 -9105 -18768 -10694 -17795 -2941 27736 11552 -17389 6948 30169 -4838
1949 -36628 -14012 8147 3254 5600 4554 -19406 -13456 22817 12553 -19463 13275 46298 -638
1963 -39951 -308 26316 -4010 -15249 573 -3597 -2399 14883 -2017 -25847 4177 28564 -18580 -52385
1977 -52385 -10096 22566 7408 15390 42708 24363 -4440 1943 -15081 -55267 -32948 26932 24225
1990 24225 -5845 13887 37720 15962 -8706 -14948 -29022 -29273 559 3292 -23375 2112 55869 34610
2004 34610 -25616 -18196 12360 -13879 -34809 -4261 12753 11427 32555 27781 -18820 -18892 22202
$$ packed form
1907c5963h390E371C60J1578K978p161K1254O314b6826m7430c1273A6990d513
1921b4947G787K7987r511A2094F15a3084d074A2978g518j9835D156K0623h438
1935a4433B8897L278i105r663Q074p101b941B7736A1552a7389F948K3221d838
1949c6628a4012H147C254K346j046a9406N950B2817j0264a9463A3275L3023f38
1963c9951c08B6316d010j1239E73c597J198A4883b017k3830D177K4387a8580l3805
1977e2385a0096B2566G408P982K7318j8345d440A943a5081m0186K2319B6932k707
1990B4225e845A3887K3833A5962h706o242j4074k51E59K733b3375B112N3757k1259
2004C4610b5616P420A2360a3879k0930d261A2753j326K1128m774a8820p2B2202
$$ plain form
2018 9738 -26764 -9238 13761 -5148 -10898 7809 -2513 -15578 13149 27183 -11238 -24289 13352
2032 15324 -25143 -22414 11268 6834 -7156 6899 13952 12156 28519 16087 -37208 -40404 10930
2046 12060 -23137
$$ packed form
2018I738b6764i238A3761e148n750G809b513j3065A3149J4034a1238j3051A3352
2032A5324b5143K729A1268m434g156F899P053j796J6363j2432c7208l196A0930
2046A2060b3137
##PAGE= T1=0.0018018
##FIRST=     0,             0,               0,               0
##DATA TABLE= (T2++(I..I)), PROFILE
$$ plain form
0 0 0 0 0 0 0 0 0 0 0 0 0 0 3 -3 5 -6 3 -10 18 -18 21 -24 25 -26 44 -48 51 -57 69 -76 84 -99 111 -126 142 -157 175 -199
39 220 -244 272 -299 335 -370 406 -451 497 -550 606 -666 734 -814 900 -994 1109 -1238 1386 -1562
59 1774 -2039 2375 -2814 3425 -4328 5811 -8671 16253 -92271 -187524 -53409 -26320 34265 474096
73 474096 798105 217140 -417170 -271128 -158243 -443179 -348984 -47730 -24828 72002 267258
84 267258 231923 243741 297849 51863 -188759 -148557 -143184 -184421 -99350 -23683 21979 91705
96 91705 86031 65891 45146 -73266 -76711 80619 46258 -65740 13619 1833 -120698 -9389 116442
110 21175 30976 152419 39436 -152132 -136780 -51225 -22691 26023 100624 131108 68500 -48279
123 -106590 -115808 -125736 -69338 8940 8792 37805 109172 77984 63459 154045 105967 -70341 -101683
$$ packed form
0@@@@@@@@@@@@@CcEfCa0A8a8B1b4B5b6D4d8E1e7F9g6H4i9A11a26A42a57A75a99
39B20b44B72b99C35c70D06d51D97e50F06f66G34h14I00i94A109a238A386a562
59A774b039B375b814C425d328E811h671A6253i2271r5253e3409b6320C4265M39831
73D74096L24009B17140d17170J46042J12885k84936R4195d7730K2902G2002J95256
84B67258l5335J1818N4108E1863a88759M0202N373m1237Q5071b3683B1979O9726
96I1705n674k0140k0745g3266l445H0619l4361f5740A3619A833a20698i389A16442
110B1175R801J21443C9436a52132J5352e1225b2691B6023P4601L0484o2608d8279
123a06590r218r928N6398H940j48K9013P1367l1188j4525R0586m8078g0341l1342
$$ plain form
136 -101683 -62821 -106368 -83290 10577 -5278 -38556 46095 97030 21703 -39391 -6774 42549
149 35994 7457 11274 -334 -48212 -36616 3289 -29758 -33041 32284 18328 -29999 24227 52429
162 52429 -30652 -45327 54917 108323 85188 32344 -61916 -115630 -51262 -1025 -53227 -70914
174 -70914 3962 52813 40978 41898 49079 12316 -26026 -13063 -2769 -28950 -31857 -6539 -11798 -18443
188 -18443 26657 58157 24228 7480 41968 32740 -13895 -36917 -74195 -96546 -15648 63707
201 18919 -33518 7676 47003 14355 -21661 -6923 6401 -21355 -33887 1295 39063 70701 97713
214 97713 48788 -52159 -57571 -10681 -59449 -91228 15000 89050 44250 13896 827 -52536 -62967
227 -62967 -15290 -8804 -22206 18645 56207 23260 -24547 -20901 14155 40968 36835 -1341 -27552
$$ packed form
136a01683L8862m3547K3078A0577e278l3278D6095N0935B1703c9391f774D2549
149C5994G457L817c34m7878J1596C289b9758l283C2284j3956b9999B4227K8202
162E2429c0652j4675E4917N3406k3135C2344f1916n3714e1262a025n2202j7687
174g0914C962M8851j1835R20P181A2316b6026J2963b769k6181k907f539n259o645
188a8443B6657L1500B4228G480L4488r228a3895k3022l7278k2351a5648F3707
201A8919c3518G676L9327A4355b1661f923F401b1355j2532A295L7768L1638K7012
214I7713D8788e2159n412a0681m8768l1779A5000P4050D4250A3896H27e2536j0431
227f2967a5290O486j3402A8645L7562B3260b4547L646A4155K6813m133a341k6211
$$ plain form
240 -27552 -6244 14861 -26908 -74446 -26465 64939 61870 -7273 -22618 554 8756 16790 8728 -25765
255 -38161 -32054 -61346 -79726 -7237 81885 72794 22063 21045 25951 -4614 -17132 -1838 -2089 9656
270 48072 18849 -74382 -73599 14778 28869 -14305 -8658 3889 -10045 1277 16843 1615 16971
283 16971 57844 21637 -62220 -56195 1669 -22855 -64796 -4891 79523 80652 36153 7382 -1571
297 9407 27700 -2251 -67091 -70599 -18817 -18139 -48773 -16219 41076 37455 13778 19279 -1586 -44363
311 -44363 -20719 28684 21061 27687 71558 33070 -60469 -64643 -11189 -12538 -39905 -30243 -7766
325 24875 77549 76075 7528 -7036 43826 25727 -61337 -85993 -43442 -30158 -34311 -2583 18428
339 10949 24709 38505 17897 23374 52492 28076 -25478 -27107 3359 5528 -14255 -23163 -24630
$$ packed form
240b7552f244A4861b6908m7538b6465F4939l069g273j5345E54Q202Q034q062b5765
255c8161O107k9292j8380g237H1885r091B2063j018M906d614j2518a838k51I656
270D8072A8849g4382P83A4778J4091a4305N647C889a0045A277J5566A615J5356
283A6971M0873B1637f2220O025A669b2855m1941d891G9523J129C6153G382a571
297I407J8293b251o4840l508a8817O78l0634a6219D1076l621A3778N501a586m2777
311d4363b0719B8684p623O626M3871C3070f0469m174a1189j349k7367R662g766
325B4875N2674j474G528g036D3826j8099f1337k4656M2551J3284m153b583A8428
339A0949J3760J3796A7897N477K9118k4416b5478j629C359K169a4255q908j467
$$ plain form
352 -24630 -18903 8235 20428 -13416 -32319 19736 64680 23573 -28618 -12347 7017 -17978 -33757
365 -33757 -33363 -33510 -2787 21399 -8292 -8747 63115 90051 26108 -17297 -2191 -7910 -33214 -25912
379 -25912 -14810 -18477 -1482 14046 -9254 -24268 4221 20965 -891 -1777 28500 26560 -3942 -13043
393 -13043 -11432 894 35181 25838 -54631 -93988 -26175 50876 42626 3263 13390 46231 43712
406 43712 10120 -24453 -39204 -18215 14285 11422 -10182 -5831 -8746 -53133 -54594 23818 61830
419 61830 8240 -31973 -9856 29543 59610 60352 7418 -44606 -23141 17028 -22443 -83585 -64744
432 -64744 3515 51806 64709 33127 -14076 -13190 15566 6190 -20136 -1975 17296 -20891 -54024
445 -54024 -16420 34062 33845 5336 -5926 10761 24395 3608 -33338 -29663 25884 65007 33070
$$ packed form
352b4630N727H235J2193a3416j8903A9736M4944B3573b8618a2347G017a7978j5779
365c3757L94j47b787B1399h292m55F3115K6936B6108a7297b191n719k5304P302
379b5912J1102l667a482A4046i254j5014D221J6744h91q86B8500j940c942r101
393a3043J611H94L4287r343e4631l9357b6175E0876q250C263J0127L2841k519
406D3712A0120b4453j4751a8215A4285k863a0182M351k915m4387j461B3818L8012
419F1830H240c1973i856B9543L0067P42G418d4606K1465A7028b2443o1142J8841
432f4744C515M8291J2903l1582a4076Q86A5566F190b0136a975A7296b0891l3133
445e4024a6420C4062k17E336e926A0761J3634C608c3338L675B5884L9123l1937
$$ plain form
458 33070 -19981 -27367 -17137 -31229 -41891 -20036 6194 14635 18733 12391 -3811 14107 52252
471 52252 34535 -23929 -42425 -22454 -12613 -17725 -13998 4335 29251 44500 20948 -26685 -30270
484 -30270 2925 2142 -10410 24797 56901 16147 -51554 -62222 -16463 19773 4261 -39583 -45534
497 -45534 9412 62010 47431 -735 -13969 10314 24112 8533 -17612 -34813 -28067 13260 47716
510 47716 27345 -16099 -34429 -37409 -32088 -882 40115 40455 6035 -991 25962 36422 6241 -51453
525 -89019 -49048 23994 33974 -7394 -5936 50544 80001 44483 -8472 -39979 -49989 -40528 -21057
538 -21057 -3788 12633 22876 13076 -1680 -1052 6361 1248 -12974 -20230 -11595 13465 35076 25084
552 25084 762 -1140 9875 221 -39676 -71205 -47166 8379 31015 23511 31011 52865 49246 1585
$$ packed form
458C3070a9981p386J0230j4092j0662b0036F194Q441M098o342c811A4107L8145
471E2252j7717b3929j8496J9971R841n112L727D335K4916J5249B0948b6685l585
484c0270B925p83a0410B4797L2104A6147e1554j0668a6463A9773D261c9583n951
497d5534I412N2598j4579g35j3234A0314J3798H533a7612j7201O746A3260L4456
510D7716k0371a6099j8330k980N321h82D0115L40F035i91B5962J0460F241e1453
525h9019L9971B3994R980g394J458E0544K9457l5518h472l1507j0010R461J9471
538b1057c788A2633J0243r800a680O28F361A248a2974p256Q635A3465K1611r992
552B5084G62a140I875B21c9676l1529K4039H379K2636p504P500K1854l619A585
$$ plain form
567 -38513 -23333 9315 -5270 -54428 -68503 -21526 30672 39090 24063 21765 25821 15500 -12672
581 -36509 -32370 -6929 17350 26387 25368 20663 3844 -25827 -43260 -28888 3015 8188 -28618 -51453
595 -51453 -10666 61296 89498 43275 -17060 -22382 1276 -14286 -66592 -77166 -8077 65309 64256
608 64256 23864 4415 -4542 -19114 -26111 -9741 15925 17375 -16737 -44773 -26973 15482 28905
621 28905 3299 -10404 11436 31395 16318 -18247 -34961 -17762 16777 24504 -13614 -48680
633 -48680 -26734 18925 31637 20019 17657 18855 -4693 -43278 -48600 -6182 44956 56973 20677
647 -12150 -2463 -8391 -64318 -83953 -20754 47252 51699 18744 2605 7879 10837 5532 -8937 -19248
661 -19248 -5552 3985 -25069 -45209 -6911 40643 43839 22937 2679 -24429 -36444 -23920 -28855
$$ packed form
567c8513J5180I315e270m9158j4075b1526C0672Q418j5027k298M056j0321a2672
581c6509M139f929A7350R037j019m705C844b5827j7433J4372C015N173b8618k2835
595e1453a0666F1296K8202D3275a7060n322A276a4286n2306j0574h077F5309j053
608F4256B3864D415d542j4572o997i741A5925J450a6737k8036J7800A5482J3423
621B8905C299a0404A1436J9959j5077a8247j6714J7199A6777P727a3614l5066
633d8680K1946A8925J2712j1618k362J198d693l8585n322f182D4956J2017B0677
647a2150b463n928n5927j9635b0754D7252M447A8744B605N274K958n305h937j0311
661a9248e552C985b5069k0140f911D0643L196k0902B679b4429j2015J2524m935
$$ plain form
674 -28855 -39612 347 58331 57235 9018 -8446 13522 13553 -13787 -26000 -25176 -26357 -23811 -24844 -15609
689 -15609 33805 74235 43900 -10515 -15241 833 -26408 -59107 -37766 2427 20484 30227 23443
702 23443 -847 937 25941 17138 -18256 -31175 -26369 -28429 -22045 1157 19712 31999 40891 23632
716 23632 -17538 -32919 -9423 -11154 -45155 -26383 41761 58629 18233 -7755 -11934 -7076 -3216
730 -30078 -63423 -36265 28124 46934 22172 22750 41903 20434 -16681 -22633 -30533 -48897 -29397
743 -29397 5259 9087 18161 49373 41120 -12809 -33212 -13734 -15367 -33950 -26781 -2988 24894
757 55725 44116 -24200 -53537 4133 34020 -16543 -31618 16524 23129 -19872 -32236 -13484
770 5132 29565 44381 23445 -1832 2030 -23422 -83464 -66403 26287 57189 22323 15678 23521
$$ packed form
674b8855j0757C47N7984j096I018h446A3522L1a3787j2213Q24j181K546j033R235
689a5609C3805M0430l0335a0515m726H33b6408l2699K1341B427J8057R743o784
702B3443h47I37K5004q803a8256j2919M806k060O384A157J8555J2287Q892j7259
716B3632a7538j5381i423j731l4001J8772D1761J6868A8233g755m179M858c216
730c0078l3345K7158B8124J8810B2172N78J9153B0434a6681n952p900j8364J9500
743b9397E259L828R074L1212q253a2809k0403a3734j633j8583P169b988B4894
757E5725j1609b4200k9337D133K9887a6543j5075A6524O605a9872j2364a3484
770E132K4433J4816k0936a832B030b3422o0042J7061B6287L0902B2323o645P843
$$ plain form
783 23521 7662 3293 356 -39821 -61478 -13719 17871 -16940 -20833 45256 77989 40429 3207
797 -22836 -55972 -51810 -17212 -15322 707 70203 78686 -18089 -69332 -22594 3189 -21500 -14995
810 -14995 27725 37936 13967 -1234 -13372 -14650 26508 49697 -3811 -43201 -10177 -4739 -49419
823 -49419 -36436 30760 55204 41084 22144 -31287 -76879 -29855 39814 23560 -8256 20921
836 31802 -13838 -34749 -15341 -8203 5234 32203 13685 -24586 -11674 2889 -27919 -15601 62150
850 71686 -21241 -73559 -29665 10179 15790 21369 2329 -21064 6560 25342 -24730 -47153 8900
864 46923 21596 -395 -5531 -38066 -56650 -9372 38855 35455 42916 53695 -10485 -74079 -30895
878 19314 -21291 -44961 6160 35961 24020 17570 -9254 -42582 -3799 51785 9110 -61061 -26906
$$ packed form
783B3521G662C293C56c9821k1657a3719A7871a6940l893D5256L2733l7560C207
797b2836l3136M162a7212J890G07O9496Q483a8089n1243b2594C189b1500O505
810a4995B7725J0211A3967a234j2138j278B6508K3189c811l9390a0177d739m4680
823d9419J2983C0760K4444j4120j8940c1287m5592b9855C9814j6254h256B0921
836C1802a3838k0911a5341P138E234K6969A3685b4586a1674B889b7919J2318F2150
850G1686b1241n2318b9665A0179N611N579B329b1064F560J8782b4730k2423H900
864D6923B1596c95n136l2535j8584i372C8855l400P461J0779a0485o3594c0895
878A9314b1291k3670F160K9801j1941o450i254l3328c799E1785I110f1061b6906
$$ plain form
892 40237 24703 699 28629 16398 -40234 -42478 -25174 -35639 660 72830 62493 40 -4078 6928
907 -35460 -57954 -19205 4379 6009 37479 42875 -15435 -36965 10809 16613 -29888 -11422 45204
921 21937 -38323 -26641 9395 1231 -10631 -10922 -21378 1585 61556 42862 -40906 -38281 28405
935 17439 -25124 -5882 8058 -15254 -4483 21279 -3185 -26856 -2319 2012 -25381 4373 59203
948 59203 24397 -38168 -13569 32174 18486 -4966 -24457 -57730 -36207 44715 49295 -33601
961 -42574 34731 54029 -969 -21637 1701 8242 2340 1177 -21511 -43184 -17119 2254 -18601
975 10279 79786 54749 -37437 -49273 -2354 2333 -937 20549 9427 -11481 20905 24726 -49944
989 -69865 6200 41732 8354 3579 18535 4298 491 16187 -383 -16635 16568 15899 -53086 -60400
$$ packed form
892D0237j5534F99K7930j2231d0234k244J7304j0465F60P2170j0337D0d078F928
907c5460k2494a9205D379J630L1470N396a5435k1530A0809N804b9888a1422D5204
921B1937c8323J1682I395A231a0631k91j0456A585N9971j8694d0906K625B8405
935A7439b5124e882H058a5254d483B1279c185k3671b319B012b5381D373N4830
948E9203B4397c8168a3569C2174j3688d966j9491l3273K1523D4715M580c3601
961d2574C4731J9298i69k0668A701O541B340j163b1511k1673a7119B254a8601
975A0279O9507k5037c7437j1836b354B333i37B0549I427a1481B0905L821d9944
989f9865F200L5532H354C579J4956D298D91J5696c83j6252A6568o69e3086p314
$$ plain form
1003 -60400 22680 45691 -11213 -15617 24297 7635 -20494 1472 14510 14298 46886 40170 -42278
1017 -70638 -18811 -15442 -53023 -4787 88070 83130 10505 -18063 -28119 -50215 -15763 39648
1030 10067 -29743 21949 57329 -7126 -44829 -10738 -6747 -23698 4043 11145 -17357 13702 65508
1043 65508 34496 -3858 23427 8171 -81526 -96181 -12517 31438 18741 27346 33520 13836 16998
1056 16998 21780 -24441 -50734 5739 44891 465 -33625 -14064 -13191 -20268 18311 41545 8737
1070 -2553 17681 -5786 -42492 -7503 42241 16686 -20885 3567 23190 -6842 -24079 -19080 -27127
1083 -27127 -7607 31388 -2108 -49582 12229 87896 47930 -1015 21206 7636 -52052 -58178 -35714
1096 -35714 -41967 -16144 43052 45224 9767 26181 48250 2191 -37290 -19237 -16747 -33944 -3177
$$ packed form
1003f0400B2680K3011a1213m404B4297G635b0494A472J3038k12L2588o716d2278
1017g0638a8811L369l7581d787H8070m940A0505a8063j0056k2096a5763C9648
1030A0067b9743B1949L5380g126l7703a0738L991j6951D043P102a7357A3702N1806
1043F5508l1012c858B3427H171h1526j4655a2517C1438j2697Q605O174A3836L162
1056A6998M782b4441k6293E739L9152D65c3625a4064Q73p077A8311K3234H737
1070b553A7681e786l6706g503D2241A6686b0885C567J9623f842j7237M999q047
1083b7127g607C1388b108m7474A2229P5667l9966a015B1206G636e2052o126K2464
1096c5714o253a6144D3052K172I767J6414K2069B191c7290J8053K490j7197c177
$$ plain form
1110 32227 15340 14456 46544 14685 -61136 -58440 -7032 -13055 -27173 25635 75751 61083 27227
1124 3472 -25381 -33092 -13934 -31243 -73822 -35747 51366 46195 -5292 25465 65896 19728 -23950
1138 -15789 -32699 -49069 -1677 21866 -21819 -16101 39567 22639 -24174 3112 44722 22451
1150 22451 -4535 -8301 -31719 -38316 11922 31078 -17966 -15606 48406 31053 -51639 -53591 4000
1164 12915 991 15308 16343 8242 24151 20013 -12290 -2433 26433 -10354 -70782 -53308 6613
1178 14850 -1863 26461 57501 33838 4609 -13634 -56395 -61958 10554 45073 -5305 -17081 29109
1192 26456 -7339 -3817 -5140 -19517 8024 21345 -27847 -33064 37903 53428 -4515 -13590 20670
1206 -3441 -56364 -49105 -7387 17084 37697 38487 1404 -12567 21998 18222 -31851 -28727 18733
$$ packed form
1110C2227A5340q84L2088A4685f1136K696g032o023j4118B5635N0116j4668B7227
1124C472b5381p711a3934j7309m2579c5747E1366n171e292B5465M0431A9728b3950
1138a5789j6910j6370a677B1866b1819N718C9567j6928b4174C112M1610k2271
1150B2451d535l766k3418o597A1922J9156a7966K360D8406j7353e1639j952D000
1164A2915I91J4317J035q101J5909m138a2290b433B6433a0354o0428J7474F613
1178A4850a863B6461L1040k3663D609a3634m2761n563A0554L4519e305j1776B9109
1192B6456g339L522j323j4377H024J3321b7847n217C7903J5525d515r075B0670
1206c441n2923P259g387A7084K0613P90A404a2567B1998l776c1851L124A8733
$$ plain form
1220 9761 -31500 -24514 -4460 -9937 9403 47228 37007 10897 24614 23766 -27059 -48529 -10449
1234 492 -31345 -28145 4832 16406 29448 42814 5945 -30310 2190 14388 -50104 -58445 27358
1248 62669 23771 15869 22027 -9629 -27833 -18940 -35360 -38910 18323 51161 10237 -11982 21472
1262 23193 -13451 -14461 -6261 -28684 -20898 25848 24319 -12057 3536 32620 -1415 -34457 -3875
1276 17504 -8003 -13301 12982 11573 -1532 126 -13557 -26654 21008 64908 10527 -50597 -14893
1290 25173 -10340 -30165 -1836 6637 70 18755 17364 -15307 -7884 19394 -3454 -26177 4990 21928
1304 21928 -2954 -1525 28683 26359 8067 -3063 -41428 -75528 -29710 42023 34126 -4680 15593
1318 47791 22938 -23516 -42673 -34247 -5207 23095 12473 -14000 2913 33497 9796 -24426 1190
$$ packed form
1220I761c1500O986d460n477I403L7825j0221A0897J3717q48b7059k1470a0449
1234D92c1345L200D832J1574J3042J3366E945c0310B190J2198e0104q341B7358
1248F2669B3771p902O158i629j8204Q893j6420l550A8323L2838A0237a1982B1472
1262B3193a3451j010f261k2423P786B5848j529a2057C536K9084a415l3042c875
1276A7504h003n298A2982j409a532A26a3557j3097B1008M3900A0527e0597a4893
1290B5173a0340j9825a836F637G0J8685j391a5307P423A9394c454k2723D990J6938
1304B1928b954J429B8683k324H067c063l8365l4100b9710D2023p897d680A5593
1318D7791B2938b3516j9157Q426e207B3095j0622a4000B913L0584I796b4426A190
$$ plain form
1332 33231 -646 -35695 -8074 22134 13781 9746 292 -32884 -29417 8777 -1334 -27411 14630 58668
1346 58668 27447 -17540 -21734 -25097 -23360 9078 21345 -596 16260 51117 5276 -70782 -51502
1359 -51502 21563 32916 2897 301 13145 18485 19911 -3208 -34657 -16704 15635 -9258 -45736
1372 -45736 -17964 24502 14222 -4279 18451 37882 14570 -17657 -30062 -26244 1324 38093
1384 38093 27631 -27144 -36380 10168 23453 -5850 -6956 11473 12097 14648 8669 -32079 -44092
1397 -44092 4451 24491 -7713 -5933 25501 5262 -36699 -19063 27444 37169 17075 -7401 -19225
1410 -19225 3029 31604 12080 -30240 -20201 18453 6696 -35582 -38958 -12643 9066 30802 41620
1423 41620 20402 -3317 -2389 -3472 -24983 -28649 -295 13811 -4192 -11515 8642 25038 22974 9010
$$ packed form
1332C3231f46l5049h074B2134q353m035B92c2884L467H777a334k6077A4630M4038
1346E8668B7447a7540m194l363J737I078J2267e96A6260L4857E276g0782J9280
1359e1502B1563J1353B897C01J2844N340J426c208l1449a6704A5635i258l6478
1372d5736a7964B4502j0280d279A8451J9431A4570a7657j2405L818A324L6769
1384C8093j0462b7144r236A0168J3285e850j106A1473O24K551n979c2079j2013
1397d4092D451K0040g713J780B5501E262c6699J7636B7444R725A7075g401j1824
1410a9225C029K8575A2080c0240J0039A8453F696c5582l376a2643I066K1736J0818
1423D1620B0402c317R28j083k1511l666b95A3811d192p323H642J6396k064I010
$$ plain form
1438 -13864 -23920 -4943 6382 -19721 -19760 35312 55888 8855 -20834 -11289 -17141 -33767 -30490 -18615
1452 -18615 1378 34515 37243 4956 3441 32920 23426 -18535 -34923 -27132 -16360 4310 23181
1465 23181 15851 5535 18532 23028 -6161 -30071 -17136 -1233 -6835 -12864 -3579 7148 7101 -6852
1480 -16371 4505 38906 32576 -17245 -38434 -2372 27704 3835 -26092 -10305 24637 30914 14810
1494 -4310 -16391 -10935 -688 -13174 -26484 -8292 12390 8611 8788 22220 17360 -3964 -19081 -32359
1508 -32359 -31876 3540 33208 16524 -4249 15479 36551 15076 -26368 -39129 -13514 12300 4907
1522 -17356 -6960 32262 42631 9486 -13526 -3286 -4105 -33786 -51630 -24602 22860 42507 26549
1535 26549 7641 7291 7743 -8450 -29797 -28708 795 30849 27002 2589 -3106 10217 13499 -2113 -22898
$$ packed form
1438a3864j0056d943F382a9721l9C5312K0576H855b0834R545n852j6626L277J1875
1452a8615A378L3137K728D956j515K9479r494a8535j6388P791J0772D310J8871
1465B3181p330E535J2997M496f161k3910J2935a233n602o029c579G148m7f852
1480a6371D505L4401o330a7245k1189b372B7704C835b6092a0305B4637O277A4810
1494d310j2081N456f88j2486j3310h292A2390l779J77J3432m860c964j5117j3278
1508c2359M83C540K9668A6524d249A5479K1072A5076b6368j2761a3514A2300D907
1522a7356f960C2262J0369I486a3526c286q19k9681j7844b4602B2860J9647j5958
1535B6549G641l50M52h450k1347J089G95L0054l847B589c106A0217L282b113k0785
$$ plain form
1550 -22898 -28591 -7229 8492 -10676 -28397 1289 40539 30145 -15185 -34223 -9762 15341 6680
1564 -15526 -6354 25824 27338 -7547 -20924 7433 29983 17957 -6326 -14685 -11387 -15069 -29350
1577 -29350 -29084 1807 32512 28880 2354 -11446 -7344 2623 7079 -942 -8892 2879 19741 8899
1592 -16903 -16937 6881 17225 799 -20887 -18740 6663 21809 12048 10539 27900 24455 -16999 -55986
1606 -55986 -45633 -4940 11137 -715 2589 25469 26369 -4328 -29336 -25369 183 25635 25419 3664
1621 -3425 8093 7329 -5413 -5965 131 -1507 -865 -2022 -15220 -14114 9912 13950 -13468 -18368 7413
1637 14127 -8386 -17973 -764 16600 9956 -16545 -30536 -2526 41232 43442 9736 -2522 10668 -1293
1652 -36440 -43860 -15706 12261 23321 19486 4753 -7888 -5924 -6025 -16424 -13994 11143 24020
$$ packed form
1550b2898n693g229H492a0676j7721A289L9250j0394a5185j9038i762A5341F680
1564a5526f354B5824J514g547j3377G433K2550j2026f326q359L298l682j4281
1577b9350K66A807L0705l632B354a1446M102B623M456i42p950B879J6862H899
1592a6903l4F881J0344G99b0887K147F663J5146r761j509J7361l445a6999l8987
1606e5986J0353d940A1137g15B589K2880R00d328k5008L967A83K5452k16C664
1621c425H093p64e413n52A31a507O42j157j3198J106I912M038a3468m900G413
1637A4127h386r587g64A6600o644a6545j3991b526D1232K210I736b522A0668a293
1652c6440p420a5706A2261J1060l835D753g888J964j01j0399K430A1143J2877
$$ plain form
1665 24020 7631 -10562 -12263 -5758 963 -159 -16262 -14980 21801 42824 11984 -14722 5745 20708
1679 20708 -9264 -38489 -26348 1399 17150 15484 -2508 -11785 -979 -5803 -35505 -31106 19486 43783
1693 43783 20866 3475 3228 -5423 -18766 -20212 -18069 -7712 18717 33049 14967 1060 16426
1706 16426 22836 -3754 -27395 -23392 -12211 -5605 -7885 -18729 -14772 21963 37872 -8086 -43257
1719 -43257 -2864 44083 25310 -9888 -4484 9262 3418 -8248 -18745 -17149 12630 28779 -2222
1733 -25526 -997 11540 -20326 -29258 10786 33957 19813 5956 -10322 -29125 -14754 11171 -9518
1747 -41424 -13539 33685 31160 9223 11170 14618 8378 1760 -17753 -39280 -18989 21398 17929
1760 17929 -3436 17089 34772 -11055 -54030 -27333 14909 12158 -4080 -3813 -373 6009 11080 -10207
$$ packed form
1665B4020G631a0562j701e758I63a59j6103J282B1801K1023A1984a4722E745J4963
1679B0708i264k9225J2141A399J5751j666b508r277i79m824k9702M399A9486K4297
1693D3783B0866C475k47e423j3343j446K143g712A8717J4332A4967A060J5366
1706A6426O410c754k3641M003J1181e605k280j0844L957B1963J5909h086l5171
1719d3257b864D4083j8773i888d484I262C418h248j0497J596A2630J6149b222
1733b5526i97A1540b0326q932A0786K3171j4144E956a0322j8803J4371A1171i518
1747d1424a3539C3685k525I223J947L448o240A760a7753k1527a8989B1398l469
1760A7929c436A7089J7683a1055m2975K6697A4909k751d080K67c73F009N071a0207
$$ plain form
1775 -27477 2554 31957 1936 -29568 -6937 18951 14849 19434 30443 15223 838 5073 -17734
1789 -54407 -41019 -131 -513 -22009 -6801 23957 30392 24248 14306 -4050 -7029 6406 -10163 -39176
1803 -39176 -13332 31750 14282 -23540 -7057 20755 5655 -10228 687 10227 17802 23099 -6214
1817 -47981 -35496 11089 17533 458 9683 15395 -7654 -18060 -12251 -26417 -29257 16460 46437
1830 46437 19790 7284 31447 15540 -32282 -32706 -1880 -2925 -14828 -6795 915 20206 52525
1843 52525 34883 -33791 -51263 -6356 381 -32441 -17954 27819 30851 11291 8329 -8795 -35383
1856 -35383 -19615 9420 2444 1460 33225 30762 -7744 -8655 14464 1863 -18059 -12953 -18011 -28492
1870 -28492 -1228 20123 -11392 -23489 24220 40089 -9625 -27262 12692 25028 -1372 -14979
$$ packed form
1775b7477B554K9403A936b9568f937A8951m102M585J1009j5220H38M235a7734
1789e4407J3388a31l82k1496f801B3957O435o144r942d050k979F406a0163k9013
1803c9176a3332C1750A4282b3540g057B0755E655a0228F87R540P575N297f214
1817d7981J2485A1089O444D58R225N712g654j0406N809j4166k840A6460K9977
1830D6437A9790G284K4163A5540c2282m24a880j045j1903f795I15J9291L2319
1843E2525j7642c3791j7472f356C81c2441J4487B7819L032A1291k962h795k6588
1856c5383J5768I420B444r84L1765k463g744r11A4464A863a8059N106n058j0481
1870b8492a228B0123a1392j2097B4220J5869i625j7637A2692J2336a372j3607
$$ plain form
1882 -14979 -17110 -19413 -1907 10417 -9180 -339 54404 60365 -7898 -44601 -18006 -8796 -28794 -16362
1896 -16362 10735 13667 19187 29148 2980 -30224 -11513 7999 -23778 -38250 2580 26244 13820
1909 13820 16240 20398 6395 9659 9652 -37182 -63630 -6651 47239 20906 -11283 13906 32234 6278
1924 -18355 -23043 -25685 -15081 4412 -7306 -21772 9515 31910 -1811 -15870 24428 27978 -17734
1938 -28775 -3738 1749 11180 32556 12679 -23712 -5137 21500 -11443 -42296 -10511 20661 7990
1952 -2089 -740 -14930 -11164 20633 13266 -20668 862 33348 -9992 -48771 -1684 36303 2383 -17248
1967 5354 8940 3962 14288 2429 -21564 150 24122 -16234 -45596 2545 40642 12927 -2575
1981 15168 -3575 -37077 -27155 -20076 -36758 -4641 56361 43698 -4119 5661 30457 1705 -30057
$$ packed form
1882a4979k131k303a907A0417i180c39E4404N961g898l6703a8006h796j9998J2432
1896a6362A0735K932N520R961B980c0224a1513G999b3778j4472B580K3664j2424
1909A3820K420M158F395L264pc7182k6448f651D7239B0906a1283A3906J8328F278
1924a8355m688k642J0604D412g306j4466I515K2395a811j4059B4428L550a7734
1938b8775c738A749R431K1376A2679b3712e137B1500a1443l0853a0511B0661G990
1952b089g40j4190L766B0633p367b0668H62L2486i992l8779a684C6303B383a7248
1967E354L586C962J0326B429b1564A50K3972a6234k9362B545L8097A2927b575
1981A5168c575l3502R922P079j6682d641E6361j2663d119E661K4796A705c0057
$$ plain form
1995 -24484 -17409 -10275 16105 20591 -7628 3837 43118 13518 -51812 -39452 10047 -4330 -28346
2008 -28346 7145 32718 18059 16100 9352 -28778 -26601 20208 14691 -27257 -10318 23353 5539
2022 -10907 8284 7282 -8534 10179 21335 -15023 -30319 7425 15025 -24230 -23229 16996 15120
2035 15120 -8803 2613 12835 1375 2902 -2941 -39637 -33734 26470 35474 -5473 5879
$$ packed form
1995b4484P075P134A6105M486g628C837L9281A3518e1812J2360A0047d330k4016
2008b8346G145K5573j4659j959o748b8778K177B0208n517b7257a0318B3353E539
2022a0907H284j002h534A0179J1156a5023j5296G425P600b4230J001A6996j876
2035A5120h803B613J0222A375J527b941l6696N903B6470R004e473E879
##PAGE= T1=0.0019404
##FIRST=     0,             0,               0,               0
##DATA TABLE= (T2++(R..R)), PROFILE
$$ plain form
0 0 0 0 0 0 0 0 0 0 0 14 -4 24 -24 24 -35 41 -52 63 -74 92 -105 129 -152 175 -205 238 -274 313 -363 415 -471 535
33 -605 684 -770 864 -967 1082 -1208 1345 -1492 1656 -1836 2028 -2240 2477 -2733 3012 -3322 3663
51 -4041 4462 -4938 5467 -6069 6766 -7569 8518 -9656 11047 -12801 15080 -18192 22707 -29902
66 43237 -76592 410144 363408 -361511 -797367 -1129366 -979008 -1122362 -1060129 -18837 987516
78 840875 765247 957535 540766 -32134 -170086 -448618 -597168 -345107 -296483 -340639 35196
90 265390 202841 265009 244816 15234 -52844 -92310 -165366 -83486 -42299 -33439 190935 220527
102 220527 -29673 -31956 237 -220011 -177106 48718 -33686 -36430 214356 161534 -44200 38213
115 110472 -4058 -52601 -69262 -125284 -132952 -136932 -94807 56251 125435 92484 105327 59548
$$ packed form
0@@@@@@@@@@A4dB4b4B4c5D1e2F3g4I2a05A29a52A75b05B38b74C13c63D15d71E35
33f05F84g70H64i67A082a208A345a492A656a836B028b240B477b733C012c322C663
51d041D462d938E467f069F766g569H518i656A1047a2801A5080a8192B2707b9902
66D3237g6592D10144m6736c61511m35856l31999J50358j43354O2233a8837I87516
78H40875p5628J92288m16769c2134j37952k78532j48550K52061M8624m4156C5196
90B65390o2549O2168k0193A5234e2844l9466p3056Q1880M1187Q860A90935K9592
102B20527b9673k283B37b20011M2905D8718c3686k744B14356n2822d4200C8213
115A10472d058m8543j6661n6022p668l980M2125E6251O9184l2951J2843m5779
$$ plain form
127 59548 -26605 27893 71115 25278 77552 80106 -107665 -180133 -108297 -157166 -187437 -67666
140 -22579 -12975 156247 290782 233305 164790 149472 59768 -116236 -262748 -287559 -238144
151 -238144 -194998 -96164 69141 161921 204293 267718 214209 58428 2253 -34612 -177905 -233545
163 -233545 -130480 -63652 -47846 1171 26157 56057 151672 163716 33209 -57603 -50434 -55666
175 -55666 -71591 -45255 1193 35343 41098 32372 33868 15360 -31317 -49718 -62517 -96313 -48494
188 -48494 66919 87765 66701 117398 108831 -8321 -74418 -111442 -167027 -116146 -22901 -55884
200 -55884 -67077 66922 164030 154482 145087 122425 37430 -71487 -167678 -201795 -148671 -66715
213 2344 47623 64417 114624 180466 114999 -18183 -31452 -30051 -135581 -187003 -124493 -64042
$$ packed form
127E9548b6605B7893M3222B5278N2274K554a07665p2468P1836m8869l0271f7666
140b2579R604A56247J34535n7477o8515j5318E9768a16236j46512k4811M9415
151b38144M3146i6164F9141R2780M2372O3425n3509E8428B253c4612j43293n5640
163b33545J03065f3652J5806A171K4986K9900R5615J2044C3209e7603P169n232
175e5666j5925K6336A193L4150N755q726J496A5360c1317j8401j2799l3796M7819
188d8494F6919K0846k1064N0697q567h321o6097l7024n5585N0881b2901l2983
200e5884j1193F6922R7108r548r395k2662C7430g1487r6191l4117N3124f6715
213B344M5279J6794N0207O5842o5467a8183j3269J401j05530n1422O2510O0451
$$ plain form
225 -64042 16042 125695 147768 104860 100807 75125 -28300 -120733 -130334 -83047 -33668 -20014
237 -20014 -14880 24441 74147 86553 45670 -10638 -3241 41239 -9064 -112693 -100636 -11339
250 28169 46239 55603 12517 -20794 -17756 -61795 -98212 -14601 86001 68294 13933 23850 48652
263 48652 35572 7621 -18606 -46198 -54988 -48404 -71890 -107063 -52721 67372 95297 30526 14531
277 42678 30236 5122 5702 1994 3108 16884 -23979 -100183 -84477 -5324 -9921 -55047 1047 95122
291 95122 93564 43143 35826 46900 45027 27634 -38736 -130483 -148045 -93873 -79942 -88268 -5253
305 116653 146432 115871 109210 85571 21887 -10749 -35931 -107222 -136055 -89966 -86392 -103837
317 -103837 -21262 98946 125791 90315 66256 49295 34674 18513 -23867 -78050 -78039 -29572
$$ packed form
225f4042A6042J09653K2073m2908m053k5682b8300r2433r601M7287c3668J3654
237b0014N134B4441M9706J2406m0883a0638c241D1239i064j03629J2057a1339
250B8169J8070R364A2517b0794L038m4039l6417a4601H6001j7707A3933R917K4802
263D8652j3080G621a8606k7592q790O584k3486l5173e2721F7372K7925C0526A4531
277D2678j2442E122N80A994J114J3776b3979p6204J5706e324m597m5126A047R4075
291I5122j558D3143p317J1074j873j7393c8736r1747j7562N4172J3931q326e253
305A16653K9779l0561o661k3639B1887a0749k5182p1291k8833M6089L574j7445
317a03837b1262I8946K6845l5476k4059j6961j4621j6161b3867n4183J1b9572
$$ plain form
330 -24134 -77716 -77134 7117 45674 12138 14929 47010 39100 39900 58916 28809 264 20678 -9384
345 -94731 -104510 -49481 -34310 -39200 -13418 19580 49724 85175 90055 42055 7536 26895 22022
358 22022 -61615 -126420 -92924 -42784 -38181 -19783 25187 53393 76999 80583 29373 4797 46465
371 46465 38602 -51375 -97840 -64894 -38330 -41691 -32575 -7367 17504 37979 41064 20509 9214
385 35906 55429 14853 -34903 -31034 -27605 -60128 -60371 -17514 14051 35952 35639 -22251 -53727
398 -53727 14671 72025 26113 -24725 3256 38375 16033 -22918 -38995 -31828 -5679 4485 -32214
412 -62910 -27926 13486 375 4246 70038 94851 29505 -29245 -25919 79 14352 3107 -37997 -61821
426 -61821 -24322 14301 -19065 -63496 -23193 51752 64169 26916 -3656 -7178 16390 41438
$$ packed form
330b4134n3582N82G117L8557A2138K791L2081p910Q00J9016B8809B64K0414i384
345i4731r779d9481J5171m890a3418A9580L0144L5451M880D2055G536J9359m873
358B2022f1615o4805L3496d2784M603J8398B5187K8206K3606L584B9373D797M1668
371D6465p863e1375m6465L2946K6564l361R116g367A7504K0475L085B0509I214
385C5906J9523A4853c4903L869L429l2523k43a7514A4051K1901l13b2251l1476
398e3727A4671N7354B6113b4725C256L5119A6033b2918j6077P167e679D485c2214
412f2910b7926A3486C75L871O5792K4813B9505b9245L326G9J4273C107c7997k3824
426f1821b4322A4301a9065m4431b3193E1752J2417B6916c656l522A6390K5048
$$ plain form
438 41438 22789 -17344 -22883 -25584 -81011 -120784 -60404 32596 57506 43249 52048 74244 70245
$$ packed form
438D1438j8649a7344n539k701n5427l9773O0380C2596K4910j4257Q799K2196l999
$$ [...]
##END NTUPLES=nD NMR FID
##END=
