##TITLE=Estratto tot, 10mg/mL, +10% D2O, 25 °C
edited HSQC
##JCAMPDX= 6.0         $$ Bruker NMR JCAMP-DX V2.0
##DATA TYPE= nD NMR FID
##DATA CLASS= NTUPLES
##NUM DIM= 2
##ORIGIN= Bruker BioSpin GmbH
##OWNER= nmrsu
##LONG DATE= 2020/01/31 18:14:33+0000
$$ 1.90.2.4 TopSpin 3.6.1
$$ 2020-04-07 17:12:29.614 +0200  nmrsu@CZC5192CCN
$$ Compression mode = diff/dup
##.OBSERVE FREQUENCY= 600.1328186
##.OBSERVE NUCLEUS= ^1H
##.DELAY= (20, 20)
##.ACQUISITION MODE= SIMULTANEOUS (DQD)
##.ACQUISITION SCHEME= Echo-Antiecho
##.AVERAGES= 48
##.DIGITISER RES= 22
##SPECTROMETER/DATA SYSTEM= spect
##.PULSE SEQUENCE= hsqcedetgp
##.SOLVENT NAME= H2O+D2O
##.SHIFT REFERENCE= INTERNAL, H2O+D2O, 1, 10.7753
##AUDIT TRAIL= $$ (NUMBER, WHEN, WHO, WHERE, PROCESS, VERSION, WHAT)
$$ ##TITLE= Audit trail, TopSpin 3.6.1
$$ ##JCAMPDX= 5.01
$$ ##ORIGIN= Bruker BioSpin GmbH
$$ ##OWNER= nmrsu
$$ $$ C:/Bruker/TopSpin3.6.1/data/nmrsu/nmr/Estratti_Rego/3/audita.txt
$$ ##AUDIT TRAIL=  $$ (NUMBER, WHEN, WHO, WHERE, PROCESS, VERSION, WHAT)
(   1,<2020-02-01 00:53:56.165 +0100>,<nmrsu>,<CZC5192CCN>,<go4>,<TopSpin 3.6.1>,
      <created by zg
	started at 2020-01-31 19:12:41.461 +0100,
	POWCHK enabled, PULCHK disabled,
       configuration hash MD5:
       C8 E9 E3 2E 96 28 5A AD 8C 0A C3 D5 06 4A AF FD
       data hash MD5: 2K * 256
       D9 5E A8 DD 90 22 77 28 A5 40 92 C9 93 C7 B7 63>)
$$ ##END=
$$ 
$$ $$ hash MD5
$$ $$ 71 E3 39 55 37 C1 4F 74 15 65 49 E2 09 1B 05 E6
##$RELAX= 
##$RELAX= 
##$RELAX= 
##$RELAX= 
##$RELAX= 
##$RELAX= 
##$RELAX= 
##$RELAX= 
##$RELAX= 
##$RELAX= 
##$RELAX= 
##$RELAX= 
$$ Bruker specific parameters
$$ --------------------------
##$DATPATH= <C:\Bruker\TopSpin3.6.1\data\nmrsu\nmr>
##$EXPNO= 3
##$NAME= <Estratti_Rego>
##$PROCNO= 1
##$ACQT0= 1000000
##$AMP= (0..31)
100 100 100 100 100 100 100 100 100 100 100 100 100 100 100 100 100 100
100 100 100 100 100 100 100 100 100 100 100 100 100 100
##$AMPCOIL= (0..19)
-1 0 0 0 0 0 0 0 0 0 0 0 0 0 0 0 0 0 0 0
##$ANAVPT= -1
##$AQSEQ= 0
##$AQ_mod= 3
##$AUNM= <au_getlinv>
##$AUTOPOS= <5 >
##$BF1= 600.13
##$BF2= 150.902809
##$BF3= 600.13
##$BF4= 600.13
##$BF5= 600.13
##$BF6= 600.13
##$BF7= 600.13
##$BF8= 600.13
##$BWFAC= (0..63)
0 0 0 0 0 0 0 0 0 0 0 0 0 0 0 0 0 0 0 0 0 0 0 0 0 0 0 0 0 0 0 0 0 0 0 0
0 0 0 0 0 0 0 0 0 0 0 0 0 0 0 0 0 0 0 0 0 0 0 0 0 0 0 0
##$BYTORDA= 0
##$CAGPARS= (0..11)
0 0 0 0 0 0 0 0 0 0 0 0
##$CHEMSTR= <none>
##$CNST= (0..63)
1 1 145 1 1 1 1 1 1 1 1 1 1 1 1 1 1 1 1 1 1 80 30 20 1 1 1 1 1 1 1 1 1
1 1 1 1 1 1 1 1 1 1 1 1 1 1 1 1 1 1 1 1 1 1 1 1 1 1 1 1 1 1 1
##$CPDPRG= (0..8)
<garp> <> <garp> <> <mlev> <mlev> <mlev> <mlev> <mlev>
##$D= (0..63)
3e-006 1.5 0.00345 0.0023 0.001724138 0 0 0.484 0 0.06 0 0.03 2e-005 4e-006
0 0 0.0002 0 0 0 0 0.00345 0 0 0.00345 0 0 0 0 0 0 0 0 0 0 0 0 0 0 0 0
0 0 0 0 0 0 0 0 0 0 0 0 0 0 0 0 0 0 0 0 0 0 0
##$DATE= 1580494473
##$DE= 20
##$DECBNUC= <off>
##$DECIM= 2773.33333333333
##$DECNUC= <off>
##$DECSTAT= 4
##$DIGMOD= 1
##$DIGTYP= 12
##$DQDMODE= 0
##$DR= 22
##$DS= 16
$$ [...]
##$NusJSP= 0
##$NusT2= 1
##$NusTD= 512
##$O1= 12072.22472
##$ProjAngle= 0
##$SFO1= 150.91488122472
##$SW= 180.06118961201
##$SW_h= 27173.9130434783
##$TD= 256
##$ABSF1= 1000
##$ABSF2= -1000
##$ABSG= 5
##$ABSL= 3
##$ALPHA= 0
##$AQORDER= 0
##$ASSFAC= 0
##$ASSFACI= 0
##$ASSFACX= 0
##$ASSWID= 0
##$AUNMP= <        >
##$AXLEFT= 0
##$AXNAME= <F1>
##$AXNUC= <off>
##$AXRIGHT= 0
##$AXTYPE= 0
##$AXUNIT= <>
##$AZFE= 0.1
##$AZFW= 0.5
##$BCFW= 1
##$BC_mod= 0
##$BYTORDP= 0
##$COROFFS= 0
##$CY= -3
##$DATMOD= 1
##$DC= 1
##$DFILT= <        >
##$DTYPP= 0
##$ERETIC= no
##$F1P= 172.686798095703
##$F2P= -7.3892733535269
##$FCOR= 0.5
##$FTSIZE= 1024
##$FT_mod= 0
##$GAMMA= 1
##$GB= 0.1
##$INTBC= 1
##$INTSCL= 1
##$ISEN= 128
##$LB= 0.3
##$LEV0= 0
##$LPBIN= 256
##$MAXI= 10000
##$MC2= 5
##$MEAN= 0
##$ME_mod= 1
##$MI= 1
##$MddCEXP= no
##$MddCT_SP= no
##$MddF180= no
##$MddLAMBDA= 0
##$MddMEMORY= 0
##$MddMERGE= 23
##$MddNCOMP= 0
##$MddNITER= 0
##$MddNOISE= 0.8
##$MddPHASE= 0
##$MddSEED= 0
##$MddSRSIZE= 0
##$Mdd_CsALG= 0
##$Mdd_CsLAMBDA= 1
##$Mdd_CsNITER= 0
##$Mdd_CsNORM= 0
##$Mdd_CsVE= yes
##$Mdd_CsZF= 0
##$Mdd_LrLAMBDA= 0
##$Mdd_LrNITER= 0
##$Mdd_LrRANK= 0
##$Mdd_LrZF= 0
##$Mdd_mod= 0
##$NCOEF= 32
##$NC_proc= 0
##$NLEV= 6
##$NOISF1= 0
##$NOISF2= 0
##$NSP= 1
##$NTH_PI= 0
##$NZP= 1
##$OFFSET= 172.6868
##$PC= 4
##$PHC0= -18.35654
##$PHC1= 39.7
##$PH_mod= 1
##$PKNL= yes
##$PPARMOD= 1
##$PPDIAG= 0
##$PPIPTYP= 0
##$PPMPNUM= 2147483647
##$PPRESOL= 1
##$PSCAL= 1
##$PSIGN= 0
##$PYNMP= <proc.py>
##$RDF1= 0
##$RDF2= 0
##$RDFWHM= 0
##$RDINT= 0
##$RDPOS= 0
##$REVERSE= no
##$SF= 150.902409325048
##$SI= 1024
##$SIGF1= 0
##$SIGF2= 0
##$SINO= 16
##$SIOLD= 1024
##$SPECTYP= <>
##$SREF_mod= 1
##$SREGLST= <1H.DMSO>
##$SSB= 2
##$STSI= 0
##$STSR= 0
##$SW_p= 27173.9130434783
##$SYMM= 0
##$S_DEV= 0
##$TDeff= 256
##$TDoff= 0
##$TI= <        >
##$TILT= no
##$TM1= 0.1
##$TM2= 0.9
##$TOPLEV= 0
##$USERP1= <user>
##$USERP2= <user>
##$USERP3= <user>
##$USERP4= <user>
##$USERP5= <user>
##$WDW= 4
##$XDIM= 64
##$YMAX_p= 0
##$YMIN_p= 0
$$ End of Bruker specific parameters
$$ ---------------------------------
##NTUPLES= nD NMR FID
##VAR_NAME=  TIME1,         TIME2,           FID/REAL,        FID/IMAG
##SYMBOL=    T1,            T2,              R,               I
##.NUCLEUS=  13C,           1H
##VAR_TYPE=  INDEPENDENT,   INDEPENDENT,     DEPENDENT,       DEPENDENT
##VAR_FORM=  AFFN,          AFFN,            ASDF,            ASDF
##VAR_DIM=   256,           1024,            1024,            1024
##UNITS=     SECONDS,       SECONDS,         ARBITRARY UNITS, ARBITRARY UNITS
##FACTOR=    3.67999999999999e-005, 0.000138666666666667, 1,  1
##FIRST=     0,             0,               0,               0
##LAST=      0.00938399999999999, 0.141856,  5360,            1818
##MIN=       0,             0,               -105748,         -105748
##MAX=       0.00938399999999999, 0.141856,  78212,           78212
##PAGE= T1=0
##FIRST=     0,             0,               0,               0
##DATA TABLE= (T2++(R..R)), PROFILE
$$ [...]
##PAGE= T1=0.0027968
##FIRST=     0,             0,               0,               0
##DATA TABLE= (T2++(I..I)), PROFILE
440 -1828 -2415 -2475 -2193 -3654 -4551 -4388 -4124 -4535 -4334 -3387 -4037 -2736 -3620 -4363 -4354 -4831 -5770 -7036 -6306 -4780
460 -4780 -4589 -3932 -3286 -2484 -3313 -3889 -4177 -5281 -5774 -5783 -5739 -6886 -5457 -5682 -4378 -4548 -4432 -4711 -5249 -5242
480 -5242 -5338 -5347 -5548 -5075 -5091 -5296 -5866 -5832 -6147 -6386 -5993 -6764 -5530 -4838 -5244 -5057 -4504 -5037 -5523 -6916 -7027
501 -7027 -7646 -8048 -7655 -7184 -5482 -4788 -5088 -4676 -4996 -5160 -5961 -6683 -6947 -7929 -6842 -6440 -5767 -5435 -5104
520 -5104 -3795 -3277 -3442 -4156 -5111 -6184 -6199 -5783 -5303 -4598 -3475 -3848 -3272 -3807 -2867 -3480 -4331 -4461 -4159
539 -4159 -3977 -3717 -2837 -2093 -2655 -2686 -2521 -3212 -2579 -3131 -2133 -2838 -1967 -1938 -1930 -1628 -2069 -2865 -2290 -1856 -362
561 -850 -1034 -231 -268 -748 -918 -1222 -1678 -1419 -1336 -564 269 419 519 559 373 564 -375 -164 -990 -649 415
583 -377 302 -82 739 926 704 1087 1008 809 662 1121 -186 -358 181 480 921 1633 1444 1308 1532 462 424
604 424 629 731 145 -198 1018 733 1398 1066 1385 664 859 1417 367 514 895 1395 1584 1990 1365 881
624 881 683 219 910 1254 1175 2215 2407 1795 1890 926 535 -394 70 -284 -601 -898 -798 280 1024 1645 741
646 796 476 -372 -638 -2084 -1954 -1903 -2326 -2052 -2193 -678 -419 672 469 -566 -1550 -2175 -2717 -3053 -3757 -3356
666 -3356 -3053 -1807 -2034 -1702 -1521 -2862 -3166 -3631 -4023 -3998 -3663 -2936 -3270 -2788 -3019 -2720 -3852 -4515 -3443
685 -3443 -4447 -5009 -4574 -4718 -4383 -5107 -5119 -4531 -5220 -4650 -5584 -5434 -5705 -6246 -5869 -5502 -5652 -5041 -5874 -5910
705 -5910 -6065 -5987 -5984 -6143 -5757 -4725 -5641 -6813 -5962 -6710 -6694 -7187 -6084 -6332 -6410 -5898 -5577 -5578 -6097 -5208 -6131
726 -6131 -7446 -7771 -8125 -8609 -7400 -7039 -6355 -6771 -7865 -7194 -7339 -7155 -6676 -6773 -6883 -7673 -8573 -9711 -9533
745 -9533 -8255 -8458 -7938 -7169 -7419 -7201 -8082 -8346 -8871 -9058 -8181 -7715 -7907 -7906 -7982 -7769 -7907 -8404 -8428 -8098 -8340
766 -8340 -8398 -7984 -7667 -8272 -7303 -8964 -8882 -9056 -9121 -9096 -8370 -7058 -7010 -7562 -8550 -8797 -9848 -9431 -9425 -9005 -7330
787 -7330 -7613 -7580 -8515 -8768 -8915 -8429 -7830 -8060 -7910 -8025 -8646 -8618 -8273 -7949 -7646 -7251 -6962 -7409 -6532 -7722
807 -7722 -7448 -7822 -7637 -6803 -7550 -7510 -7429 -6523 -5433 -6057 -6224 -6629 -5767 -6882 -7407 -7350 -7031 -6421 -6287 -6338 -5420
828 -5420 -6157 -7091 -6220 -7030 -6760 -6230 -6839 -5655 -6629 -6451 -5328 -5750 -5297 -5108 -5298 -5697 -4939 -6378 -6267
847 -6267 -5239 -3448 -3421 -2521 -2361 -3142 -4125 -4785 -4926 -5080 -4916 -3831 -3294 -3117 -2286 -2095 -2650 -3816 -4193
866 -4193 -4049 -5226 -4671 -4428 -3273 -2527 -1907 -1910 -1518 -2137 -2152 -3254 -3606 -3407 -2830 -2129 -1749 -890 -1242 -656
886 -656 -752 -294 -1093 -837 -599 -1145 -2146 -1577 -556 17 693 772 379 23 -676 -1344 -1432 -1209 -567 -300 304 1011
908 1011 445 -673 -686 -616 -618 -966 580 372 -248 60 734 463 54 -870 -1183 -1605 -1258 -132 261 1120 1404 1428
930 1428 393 233 -547 -176 -879 -294 -580 -554 -1225 -923 -744 663 1146 1070 420 -304 -1431 -1993 -2388 -1935
950 -1935 -1248 -880 -32 -57 -1055 -1460 -2190 -1918 -2363 -2122 -1637 -2379 -1981 -1873 -1214 -1306 -2025 -2587 -2792 -4025 -3552
971 -3552 -2837 -3161 -2244 -1009 -1768 -2917 -2551 -2592 -3041 -3457 -4044 -3710 -3158 -3888 -2194 -2988 -3202 -2329 -3017
990 -3017 -4140 -4069 -3823 -4772 -5133 -3847 -3698 -3422 -3958 -3141 -5143 -5100 -5549 -6366 -5901 -5550 -4453 -4693 -4167
1009 -4167 -3674 -4066 -4151 -4731 -5160 -5235 -5694 -5185 -5019 -4473 -4540 -3819 -3894 -4174
1023 -4174
##PAGE= T1=0.0028336
##FIRST=     0,             0,               0,               0
##DATA TABLE= (T2++(R..R)), PROFILE
0 0 0 0 0 0 0 0 0 0 0 0 0 0 0 0 0 0 0 0 0 0 0 0 0 0 -2 0 1 -1 1 -1 1 0 -1 -3 1 -1 -1 -4 5 1 0 -3 0 -3 5 -1 1 -5 4 -5 2 -3 3 -6 6 -10 11 -13 12 -16
61 15 -21 22 -30 38 -57 104 -699 -1662 -809 -389 873 2279 3092 4453 5028 4773 2552 881 -616 -666 -104 564
84 2278 4182 6848 7476 5236 3500 3665 2673 -1039 -3642 -1748 -777 -783 871 3767 6056 6184 3738 1887
102 1887 633 1163 1017 2281 2655 2124 1359 1276 -82 -1358 -1662 -647 357 -93 -556 -1647 -1440 -1577 -2339 -2085
122 -2085 -1457 -1421 -1417 -87 406 887 984 1238 668 -1117 -1769 -2873 -3468 -2450 -1471 -274 -762 -565 404 -259 -1607
143 -1607 -61 177 1108 -340 -1310 -3023 -3404 -1674 -814 1085 1724 951 563 -376 -1980 -3601 -4017 -2097
161 -2097 -1973 -339 482 641 901 246 -345 -1545 -2557 -3703 -4547 -4632 -3792 -4169 -3220 -2951 -2794 -963 -410
181 6 633 1029 4 -430 -1088 -2787 -2879 -1925 -1021 940 2910 2459 2158 -188 -2100 -2690 -2589 -496 1823 2870
201 2870 3920 3809 3985 3071 2634 3437 3367 2519 2932 3060 3793 3963 5041 5128 6187 6072 5704 5836 5376 5567
221 5567 5246 4555 4648 4992 4314 5354 6277 6150 6099 6175 6349 6133 5118 5573 6383 6886 8365 8248 7639 7579
241 7579 6239 3863 4374 5416 6555 7549 8034 10442 9922 8674 7791 6795 5254 4705 3735 3821 4949 5753
259 5753 7418 8205 8681 9275 8563 7848 6917 5772 3800 3169 2610 1729 1750 3249 3950 4853 4511 4277 4504
278 4504 3066 2436 1334 522 685 266 -195 -737 -782 -407 -1844 -1726 -995 -900 -1242 -1147 271 -1350 -1337 -2778
298 -2778 -3156 -4550 -5272 -4700 -5095 -4816 -4753 -4034 -3822 -4203 -4066 -4897 -4777 -5195 -4767 -5622 -4177 -4142 -3925 -4241
318 -4241 -3092 -3616 -3858 -4381 -4669 -4572 -4529 -3940 -3566 -3151 -2015 -2280 -2902 -3362 -3841 -3831 -3922 -4234 -4078 -2552
338 -2552 -2169 -395 74 133 -1456 -1963 -2940 -3937 -4837 -3774 -2868 -1985 -1373 -499 -423 -313 -645 -1760 -1611 -1122
358 -1122 -2772 -3945 -2313 -1334 -755 -918 525 832 1203 460 819 546 1357 948 2093 2546 3334 4698
376 4698 4892 4422 4533 4579 3686 4584 4509 5027 6499 7680 8783 9334 9654 9623 9103 8800 8534 8484 9387 9542
396 9542 10628 11217 11558 12639 12955 11840 11951 11726 11196 10959 11508 12082 12532 13630 13552 12809 12652 12248 11725
415 11725 11112 11485 11978 11596 13804 13312 12872 12851 13293 12629 11555 11238 10654 10709 11242 11753 12681 12610 12970 11572
435 11572 10588 9085 9182 9283 9663 9762 10808 11119 11193 10761 11579 11506 9648 9070 8642 8862 8291 8849 9474 10107
455 10107 11175 10431 9482 10128 9837 9163 8607 8513 8264 7489 7113 7347 7372 6768 7204 7413 6849 6112 5931 5589
475 5589 5523 4424 4435 3652 3135 2259 1240 1067 355 -484 -396 -102 170 26 -604 -1345 -2135 -2674 -4412 -4917
495 -4917 -5776 -5578 -5843 -5659 -4076 -4384 -3847 -4192 -5462 -7135 -7233 -6674 -7367 -7166 -7197 -7646 -6789 -6524 -6898 -7077
515 -7077 -6708 -6637 -7694 -7872 -7932 -7480 -7325 -7248 -7856 -7174 -7304 -7674 -7710 -7916 -7707 -7715 -7735 -7973 -8364 -7739 -8167 -7676
537 -7676 -7780 -8465 -9657 -10037 -10619 -10619 -11074 -10720 -10622 -9992 -9387 -9486 -9238 -9028 -10151 -10172 -9848 -10317 -10430 -11958 -10800
558 -10800 -10782 -9854 -10115 -10102 -9793 -9354 -8743 -8637 -8518 -8019 -8378 -8436 -7566 -7146 -7267 -7058 -5557 -5231 -5400 -4858
578 -4858 -4522 -4454 -3641 -3908 -2466 -2621 -2402 -2427 -2151 -1568 -1588 -1752 -1533 -750 -715 264 -456 -43 663 145 172 240
600 240 -61 -77 226 1377 2461 3115 2611 3024 2271 2775 2704 2097 2816 4007 4686 5771 6392 7276 7220 6663
620 6663 7303 6987 6899 6275 7632 8261 10171 10335 11539 11547 11592 11440 10733 11484 10649 11664 12990 12934 13587 13628
640 13628 13498 13881 12888 13314 12407 12543 13944 14004 14327 14800 14040 14297 13497 12549 12993 12688 12243 13561 14079
659 14079 14849 14840 15309 14866 14122 13460 13180 12958 13023 13138 13347 13858 13790 14900 14826 14599 13861 14415 13662 13659 14950
680 14950 15619 15392 15869 16306 16061 15776 15644 15548 15183 15233 15087 15596 16681 16507 16447 16240 15590 15590 14072 13626 13593
701 13593 14048 12834 13828 13880 13840 13043 12300 12320 11560 10772 10635 9318 10580 10522 10104 10025 10410 9131 7760 7153
721 7153 6867 6613 6947 7448 7789 7629 6536 6142 5656 5891 5158 5753 6323 5415 5250 4848 3912 3413 4810
740 4810 4246 4369 4179 3760 3245 3007 2187 1270 1204 526 1167 676 451 661 326 -358 -827 -2526 -2764 -2440
760 -2440 -3254 -2975 -3280 -2651 -3790 -4403 -5397 -6102 -6556 -6636 -6006 -6284 -6170 -6795 -7731 -8729 -8260 -8820 -8917 -9350
780 -9350 -9414 -9289 -9755 -10083 -9467 -9238 -9870 -8722 -10566 -10714 -11110 -11593 -11273 -11847 -11475 -11478 -10688 -11455 -11851 -12095
800 -12095 -12303 -12527 -13069 -13226 -14362 -13749 -14219 -13834 -13343 -12369 -13501 -14468 -15041 -14723 -15001 -14962 -14230 -14196 -13857 -13461
820 -13461 -14590 -15062 -14617 -15306 -15375 -14760 -14969 -14424 -14667 -13909 -14417 -14256 -14867 -15190 -15050 -14800 -16303 -15860 -14728
839 -14728 -14247 -14622 -13818 -13766 -13228 -14134 -15921 -15798 -16514 -15583 -15333 -14092 -13144 -12809 -12821 -12871 -13008 -13355 -14744 -14556
859 -14556 -13747 -14242 -13469 -12252 -11918 -11892 -12193 -12211 -12016 -12804 -12486 -12842 -11540 -10506 -10235 -10557 -11150 -10008 -10970
878 -10970 -10978 -9976 -9471 -10012 -8841 -9084 -8442 -8787 -8214 -8190 -7245 -6932 -6806 -6925 -7028 -6987 -8117 -7829 -7230 -5759
898 -5759 -5188 -4723 -3127 -3950 -3468 -3293 -4309 -3559 -3274 -3452 -2154 -1634 -774 281 -529 -218 -322 -642 -1494
917 -1494 -205 1011 2045 2418 3232 3132 2356 2362 2898 3552 3094 4446 3790 4193 4047 4611 4665 5033 6451 7477
937 7477 6684 6552 6509 6084 6729 7324 8007 8133 8710 10362 10066 10195 9073 10175 10091 10305 11106 11281 12368
956 12368 12610 13621 13066 13666 13952 13153 12836 13264 14053 15220 14844 15424 15075 14980 14541 15417 15528 16023 16971
975 16971 17255 17595 16951 17504 16430 16758 17407 18177 17877 18345 18437 18403 18597 18775 19761 19083 19849 19791 19636 19158
995 19158 19600 21178 20259 20700 20621 20786 20190 20906 21572 20960 20345 21426 21472 20615 21598 21483 22251 22428 22238 21590
1015 21590 21499 21179 22065 21467 21169 22858 22509 21903
1023 21903
##PAGE= T1=0.0028336
##FIRST=     0,             0,               0,               0
##DATA TABLE= (T2++(I..I)), PROFILE
0 0 0 0 0 0 0 0 0 0 0 0 0 0 0 0 0 0 0 0 0 -3 0 0 0 0 1 -5 0 -2 3 0 0 0 2 -4 8 -3 7 -3 5 -5 9 -8 5 -11 7 -15 18 -17 17 -18 24 -20 23 -29
55 33 -39 41 -43 52 -57 67 -78 87 -106 133 -181 282 -1001 -1346 -509 90 1244 823 750 740 -1199 -3037 -4517
78 -4517 -3552 -2560 -157 1593 2458 3249 3325 2409 -1104 -3545 -3976 -4499 -5831 -5654 -2379 4 312 1509 3767
97 3767 3014 37 -1747 -2099 -2203 -1215 245 1149 2007 622 -780 -1059 -1483 -1872 -1467 -151 -140 -715 -1488 -2349 -2439
118 -2439 -2973 -3132 -2523 -2110 -2376 -2770 -2162 -2459 -1696 -2736 -3747 -4900 -5403 -5800 -5625 -4572 -3086 -1707
136 -1707 -1006 -900 -1252 -1005 -1712 -2396 -1091 -557 -689 -2113 -3374 -3243 -1942 342 1229 2161 2017 -224 -1756
155 -1756 -1392 -1217 -1859 302 2683 3476 4123 4015 4565 2664 1713 1148 459 -542 -840 -490 361 1789 1854
174 1854 2556 1664 2752 3721 3092 3082 2841 2282 1161 -156 250 366 988 2308 3906 5253 5071 4174 1909
194 790 448 238 2791 4656 5845 6166 5447 4417 3810 1974 870 2583 2544 1940 2106 2569 3314 4079 4313
213 4313 5045 4300 4434 3816 2881 3126 3487 2586 2739 2569 2893 2836 4359 3885 3195 2242 1702 1889 1247 750
233 750 1645 2955 2497 1997 1383 -221 -804 -1166 -2273 -1217 549 946 836 1021 1 -1106 -3425 -5871 -5881
252 -5881 -6453 -7136 -6221 -5439 -4246 -2888 -2718 -2617 -3500 -4191 -4785 -6825 -7127 -8753 -7848 -7880 -7093 -6104 -5069
271 -5069 -3468 -2761 -3303 -4073 -4070 -4702 -6198 -6714 -6621 -7284 -6633 -6743 -6188 -6068 -6499 -5157 -5209 -5526 -3942 -2772
291 -2772 -3578 -3662 -3465 -3367 -5019 -5372 -5544 -5743 -4614 -4252 -3783 -3177 -2085 -1804 -1500 -2277 -2111 -3320 -3454
310 -3454 -2866 -2718 -1935 -1334 259 -233 -427 583 263 -4 49 225 852 1379 2743 2839 2924 3506 2953 1737 2342
331 2342 2374 2791 2365 4273 4391 5685 6579 6471 6207 5311 5257 3483 4039 4024 5480 6586 7890 8669 9132
350 9132 8953 8307 8078 7193 7242 7133 7165 7548 7317 8320 9468 10676 9232 10411 9273 8746 9021 8136 9273
369 9273 9228 9293 10451 10241 11374 11783 9761 10043 9895 9418 9484 9804 10561 10550 10872 10830 11080 10571 8931 8527
389 8527 8183 7595 7822 7502 8423 8728 9087 8871 8755 8574 7795 6873 6618 6933 6162 6454 6270 6572 6792 6297
409 6297 4902 4226 3045 1992 1904 1774 1795 3126 2940 2559 1732 910 343 -1035 -1302 -1542 -2678 -1482
427 -1482 -1007 -940 -1256 -721 -955 -2635 -3440 -4200 -4131 -3743 -3425 -3019 -1956 -1639 -2567 -3188 -4104 -4207 -4941 -5994
447 -5994 -5610 -5511 -5501 -5028 -3970 -3741 -3271 -4145 -4730 -5041 -6189 -6205 -6362 -6882 -7061 -7634 -7613 -7110 -7118 -7326 -7598
468 -7598 -7214 -7703 -8548 -9892 -8896 -9323 -9387 -9962 -9328 -9860 -10454 -11671 -10932 -11066 -10203 -9946 -9233 -9496 -9210 -9704
488 -9704 -10506 -9997 -10726 -10914 -11339 -10565 -10171 -8694 -8262 -7086 -6089 -6748 -6134 -7081 -7968 -6824 -7339 -6589 -5881
507 -5881 -4847 -4430 -3857 -2951 -2461 -3004 -2908 -2416 -1990 -2009 -2192 -1666 -1515 -1544 -1263 -777 -389 -258 -551 -723 272
529 948 968 1514 1322 1484 2197 2837 1269 1326 1829 1616 1165 1551 2674 3142 3192 4475 4494 5005 4907 4889 5287
550 5287 4534 5091 5118 5381 5769 6810 7577 9064 9845 9162 10602 11075 11702 11229 11178 11616 12464 12654 12301 13200
570 13200 13383 14853 14359 14916 15256 15128 14947 15990 15110 14642 15682 15805 15541 15188 15597 15736 15721 15815 14926
589 14926 15530 16131 16051 16738 16470 16633 16209 16075 15777 16014 16010 16232 16354 17756 17637 17911 16909 16082 16620 16108
609 16108 16800 17085 17764 17730 18609 19267 18512 18697 17965 17400 16911 16609 16523 17176 17589 17636 18355 18107 17575 16723 16720
630 16720 14692 15020 16067 15026 15365 15486 16184 14201 14462 13776 12587 12645 12158 12946 12413 11822 12602 12212
648 12212 10310 10602 9781 8536 7595 7975 8437 9110 9207 9812 9041 8978 7940 6736 5788 5692 5376 5848 6330
667 6330 5904 6602 6778 6793 6233 5422 4659 4698 4078 3374 4250 4788 4152 3785 3591 3126 2107 1880 1480 1136
687 1136 1289 1442 1311 690 1176 501 -354 -2008 -2251 -2444 -3172 -3290 -3814 -3270 -3228 -3006 -4163 -4883 -5486 -5542
707 -5542 -6474 -5581 -6568 -6335 -6489 -6478 -5556 -6911 -6153 -7580 -6888 -7730 -8327 -7002 -6868 -6626 -6416 -6599 -7155
726 -7155 -7145 -8674 -7785 -7917 -7564 -6214 -7342 -7491 -7565 -8009 -8314 -8018 -7118 -7988 -7459 -7905 -8659 -8940 -9333 -9304
746 -9304 -9290 -9715 -8981 -9248 -9415 -9021 -9531 -9256 -9731 -10113 -10493 -10037 -10271 -9412 -9745 -9031 -8792 -9519 -10557 -10806
766 -10806 -10235 -9186 -8927 -8150 -8070 -7669 -8264 -8029 -8307 -8113 -7652 -7052 -7875 -6114 -6124 -6772 -6583 -5458 -5024
785 -5024 -5116 -5622 -4722 -5869 -6468 -5433 -4209 -4149 -3503 -2763 -3394 -2606 -2520 -2237 -3689 -2430 -2411 -1994 -2341 -248
806 -8 559 464 889 346 -219 -731 108 1592 2402 3367 3942 2775 3399 3373 2889 2896 4200 4446 5504 6853 6493
827 6493 6346 6576 6669 6179 5827 6108 7647 6870 6946 8085 9095 9864 9659 8870 9891 9904 8834 9039 10014
846 10014 10579 11738 12265 12423 13744 14110 12965 13060 13302 12982 13392 13193 14384 15107 15240 16217 17000 15488
864 15488 15764 15721 15703 16075 16498 16976 18340 19347 19131 18837 18256 18566 18385 18769 19005 19809 19659 20885 20934 20505
884 20505 20392 20917 20908 20826 21935 21484 20412 20380 21043 21299 21569 22175 23742 23508 23705 24272 23145 23121 22337 22525
904 22525 23048 22790 24124 24449 24517 23745 24338 23881 23607 23537 23294 23810 24597 25470 25239 24871 24782 24645 23820 23086
924 23086 23808 24452 23705 23991 23504 23588 23899 23861 24194 24969 24327 24441 24237 23590 22341 22733 22584 24024 24711 24768
944 24768 23269 24294 23686 23011 22195 22652 22635 22977 22612 22827 22790 22893 23436 22729 21051 21157 20593 20600 20842 21379
964 21379 21331 20666 20558 19327 19486 19057 19101 18978 19346 19409 18707 17935 17547 17136 17016 16678 17297 17429 16548 15826
984 15826 16300 15048 15151 15807 16250 15145 14049 13502 14186 13247 12979 12602 12442 12342 12343 11300 10964 11032 10894
1003 10894 10033 9422 10047 9761 8498 8193 9148 8615 8310 6919 6134 6033 5988 6339 6116 6189 5492 4294 3304
1022 3304 3442
1023 3442
##PAGE= T1=0.0028704
##FIRST=     0,             0,               0,               0
##DATA TABLE= (T2++(R..R)), PROFILE
0 0 0 0 0 0 0 0 0 0 0 0 0 0 0 0 0 0 0 0 0 0 -2 0 -2 0 2 -1 0 0 -1 1 -2 -2 1 -1 -3 -1 0 -1 -1 -1 2 -2 0 0 5 0 2 0 2 -4 1 -1 3 3 1 -3 2 -1 7 -3 3 -9 10
64 -10 10 -18 33 -153 -1430 -4061 -6188 -6579 -4694 -2934 1521 4218 4933 6459 7186 5422 496 -2814 -5486
83 -5486 -6743 -6440 -4637 -935 2078 4435 3860 2586 1852 -1198 -2920 -4036 -5974 -6077 -6296 -5621 -4361
100 -4361 -1560 -163 706 749 -62 -2475 -2247 -3705 -4805 -5226 -4537 -3630 -2763 -699 725 602 -339 78 185 -1563
121 -1708 -930 143 352 -426 2113 1812 1445 242 -1754 -3120 -3713 -3950 -4107 -3196 -1408 48 2380 3196 3629
140 3629 3498 3222 780 -2230 -5580 -5171 -4804 -3092 -1687 -54 991 1130 751 -59 -464 264 15 -33 -342 -356
160 -356 -755 -1053 -1965 -2346 -754 -718 -767 -1092 -832 -4 -598 -766 -795 104 -563 -406 -938 -1579 -1468 -1758 -1178 -1397
182 -1397 -1526 -1176 -1528 -1320 -937 -1515 -978 -1380 -2257 -1678 -491 244 278 1363 -12 -1862 -3188 -4547 -5219
201 -5219 -4690 -3261 -3068 -3481 -3347 -4453 -5748 -7179 -7073 -6835 -6726 -6610 -6885 -7148 -6827 -6386 -7657 -8227
219 -8227 -8811 -8709 -9961 -9819 -9533 -9632 -10025 -9024 -9043 -10110 -10301 -11292 -11333 -11570 -11617 -11430 -11533 -10871 -10071 -9372
239 -9372 -8686 -8712 -8710 -9039 -10603 -11522 -11799 -12532 -11092 -8623 -6939 -6144 -5193 -5425 -6640 -7813 -8815 -9740 -9610
258 -9610 -10324 -11266 -9996 -8614 -7667 -6532 -6090 -5234 -6375 -6301 -7037 -6494 -7015 -7262 -6732 -5366 -5714 -5241 -4887
277 -4887 -4420 -4913 -5204 -5013 -4949 -4438 -4084 -4005 -3021 -923 -1072 -1689 -1928 -2502 -3490 -4014 -3966 -3778 -2893 -1191 -212
299 743 787 844 1019 369 -682 -1331 -1270 -1018 -683 -217 -62 760 1100 777 559 667 916 112 -60 657 729 255
322 523 287 -214 -514 -623 -1383 -1030 -818 -482 156 95 946 58 -754 -2141 -3350 -4039 -4447 -4613 -4399 -4671
342 -4671 -2983 -2472 -2366 -2756 -3523 -4470 -6096 -7469 -7372 -6940 -6028 -6225 -5519 -6184 -6148 -5916 -7093 -8790 -7728
361 -7728 -8754 -8962 -8242 -7796 -7663 -9083 -8979 -10152 -10689 -11200 -12157 -12274 -11955 -11920 -9934 -10928 -9960 -10778 -11826
380 -11826 -13029 -13441 -13970 -14262 -14851 -14496 -14368 -14348 -13009 -13569 -13616 -14288 -15352 -16386 -17009 -18401 -18403 -17995 -17623
399 -17623 -16164 -16088 -16449 -16653 -16399 -17566 -17899 -17802 -18121 -18427 -18004 -17372 -16630 -16252 -16133 -16422 -16542 -16933 -17394 -17880
419 -17880 -18517 -17622 -16937 -16064 -15563 -15143 -15384 -15737 -15814 -15266 -15781 -15596 -15856 -14493 -14207 -13944 -13401 -13590 -13853 -14500
439 -14500 -15909 -15278 -15184 -14002 -13423 -11979 -11460 -11027 -11154 -12128 -11903 -12545 -12588 -13181 -12931 -12181 -11817 -11405 -10263
458 -10263 -9424 -9188 -8744 -9055 -8859 -9276 -10079 -9444 -8957 -9163 -8683 -8345 -8079 -7855 -7878 -7221 -6733 -6446 -6416 -5957
478 -5957 -5803 -5340 -5108 -5396 -4598 -4576 -4185 -4272 -3232 -2646 -2357 -2048 -1154 -1211 -1368 -2242 -1898 -1640 -1187 -1057 -1452
499 -1452 -1341 -612 -176 298 264 1125 1107 1542 1446 797 1178 1192 1518 1485 1344 1720 868 2409 2518 1707 2345
520 2345 2855 2761 2580 2243 2575 2898 2548 2659 2661 3038 2941 2197 2380 2195 1600 1453 1370 1308 2219 2800 3411 3490
542 3490 3483 2421 2248 1386 88 -16 228 111 955 1187 1370 1619 1437 601 295 -784 -1246 -1925 -2030 -1654 -1705
563 -1705 -1274 -1596 -1402 -1974 -2058 -3161 -3343 -3712 -3406 -4118 -4535 -5529 -6460 -7182 -7342 -7353 -7080 -7284 -8138 -7637
583 -7637 -7753 -8294 -9312 -9119 -9754 -11144 -11917 -11859 -11963 -13190 -12966 -13182 -12747 -13767 -14317 -14732 -14411 -14923 -14846
602 -14846 -16483 -16959 -17142 -16918 -17908 -17509 -18254 -18450 -18597 -18816 -19582 -19827 -20730 -20556 -20183 -20131 -19727 -21412 -20657
621 -20657 -22106 -22431 -23489 -23809 -23003 -22860 -23183 -23024 -22118 -23038 -23283 -24326 -25137 -24819 -25788 -26459 -25755 -24673
639 -24673 -25106 -23539 -23740 -23944 -24688 -25462 -26032 -26613 -26343 -25000 -25296 -25166 -24449 -23961 -25301 -24412 -25059 -24577 -25114
658 -25114 -24760 -25047 -25076 -24018 -24816 -24143 -23952 -24091 -24500 -24962 -24723 -24776 -23838 -22655 -22290 -21934 -21982 -21612 -22895 -23626
678 -23626 -23422 -22925 -22322 -21907 -20554 -20575 -19200 -19307 -19417 -19991 -20134 -19120 -20464 -19797 -18713 -18127 -17934 -17595
696 -17595 -16405 -17321 -16994 -16716 -16604 -16815 -16370 -16319 -15875 -15655 -15690 -14610 -13997 -14434 -13968 -13236 -13833 -13449 -14152 -13809
716 -13809 -13047 -11429 -11448 -11622 -10535 -10102 -10448 -11265 -10705 -10154 -9732 -9107 -8387 -7549 -6999 -7356 -7588 -7965 -7450
735 -7450 -7466 -6674 -5708 -4793 -4555 -4921 -5699 -5748 -4837 -4722 -4787 -3609 -3138 -2881 -1820 -2380 -2088 -2855 -1990 -1276
755 -1276 -2247 -1428 -1424 -510 513 499 43 -243 743 895 916 1541 1756 2420 2366 1798 1844 2224 3004 4712 4600 4846
777 4846 5448 4162 4027 3605 4434 4794 5218 6285 5907 6020 6527 6955 6691 6255 6544 6731 6065 5814 6731
796 6731 6452 8324 8756 8549 8323 8072 6645 5475 7281 7101 7316 7337 7210 7748 7447 8158 8503 8619 7651
815 7651 7495 7507 6994 6280 7332 8554 8892 9086 8708 7655 7062 6453 6575 6100 6797 8134 7841 7312 8449
834 8449 7980 6616 6684 5270 4784 4959 4664 5263 5334 6225 6177 5779 5174 4405 3299 2573 1153 2403 2150
853 2150 2874 3590 3292 2158 2263 2421 548 -28 -185 129 -569 -602 -638 -528 -326 -387 -1322 -2469 -2995 -3442 -5229
874 -5229 -5043 -4758 -4175 -4732 -5110 -5922 -5432 -6185 -7891 -8147 -8251 -9641 -9368 -10268 -10210 -9865 -10563 -11021 -11059 -12460
894 -12460 -12808 -13573 -13436 -14120 -14073 -13962 -13935 -14347 -15906 -15953 -16655 -17669 -17857 -18196 -17704 -18037 -18566 -18720 -19669 -19800
914 -19800 -20030 -21115 -20926 -21375 -21686 -22722 -23390 -22416 -22795 -22428 -23202 -23209 -24360 -24703 -24805 -24848 -25947 -25871 -25512 -26386
934 -26386 -26294 -26936 -25996 -27113 -26713 -26394 -26519 -27976 -28358 -28256 -28560 -28934 -28223 -27980 -28212 -28342 -28141 -29119 -29232
953 -29232 -29593 -28628 -29084 -28586 -28178 -29155 -29442 -29459 -30017 -30010 -29192 -29890 -30290 -30250 -29227 -29878 -30278 -30237 -29546 -31146 -30819
974 -30819 -30803 -30803 -30204 -30700 -30325 -31395 -30322 -30964 -31097 -31228 -29717 -29521 -29712 -30446 -30137 -29940 -31096 -30023 -29532
993 -29532 -28753 -28843 -28870 -28335 -28662 -29047 -28807 -29483 -28552 -28158 -27918 -27971 -28065 -28035 -27861 -28135 -28051 -27314 -26886 -27019 -27119 -27146
1015 -27146 -27249 -26945 -26593 -26866 -26129 -25770 -25741 -25338
1023 -25338
##PAGE= T1=0.0028704
##FIRST=     0,             0,               0,               0
##DATA TABLE= (T2++(I..I)), PROFILE
0 0 0 0 0 0 0 0 0 0 0 0 0 0 0 0 0 0 3 -1 0 0 0 0 -2 -2 0 -3 4 0 -1 -3 -2 -4 6 0 1 -5 4 -3 7 -3 7 -5 5 -6 7 -12 7 -13 12 -12 12 -14 19 -19 17
56 -23 25 -29 35 -40 48 -57 69 -94 131 -202 391 -2433 -4819 -2586 -106 3755 5471 8202 9012 7442 5392
77 5392 3708 47 -3718 -4121 -3981 347 3797 6391 8828 10273 9502 7092 4083 2436 899 1407 1146 1890
95 1890 2485 2966 6082 7330 8053 8532 7797 5535 3818 1674 956 91 -26 203 2517 3539 4539 5120
113 5120 6192 4991 4101 3305 3456 2721 2492 4114 4787 5371 4158 5310 3722 2389 1071 1018 1177 1032
131 1032 2243 3671 6013 7607 7347 7588 7117 6895 5541 3804 2662 897 1578 2702 5627 7425 9672
148 9672 9676 8915 7061 6438 5639 4934 4426 5233 4860 4142 3190 2385 2413 2334 3483 3435 2633 3493 3281 2710 1860
169 1860 2832 2750 1990 2166 1581 1137 563 626 502 635 716 681 -108 -1255 -556 -710 -1450 -910 -834 -1082 -830
190 -830 -416 -158 1112 831 877 -401 -1768 -2156 -1586 -603 629 3154 2534 2310 1447 -226 367 39 -57 1099
211 1239 1416 1175 918 815 1181 523 733 620 492 545 1504 2157 2038 2148 2317 2819 1954 690 1267 1534
231 1534 2074 2686 3899 4133 4088 4675 3682 3539 3827 3156 1997 1369 1681 3197 4329 6277 8255 9022
249 9022 8524 8117 7115 5644 5064 5802 6117 5879 6680 7853 8520 9586 10758 10693 10060 10251 9142 8299
267 8299 7868 7366 8514 9391 9265 10484 10486 9662 10553 10527 9490 9800 10063 9202 10151 10547 9954 9500 9817 9692
287 9692 7663 6328 6102 5149 4675 5260 6659 7380 7975 7660 6371 5910 4804 3720 3673 2481 1853 3086
305 3086 3433 3450 3851 3482 4265 3828 3344 2408 2713 2261 2379 1174 799 1197 -430 -221 253 -853 -954 -841
325 -841 -1036 -1163 -268 32 -487 -995 -949 -923 -3451 -4235 -4272 -4052 -4012 -3383 -3212 -2383 -2048 -2929 -4738 -5088 -6530
346 -6530 -7680 -8025 -8210 -7873 -6689 -6267 -5887 -6362 -5819 -7086 -7405 -8042 -8119 -7453 -7862 -6974 -7733 -6698 -7287
365 -7287 -6777 -7465 -7465 -8020 -8537 -7128 -7276 -6518 -5369 -5405 -6466 -6392 -6249 -7318 -7650 -8251 -6561 -6197 -5483 -4836
385 -4836 -4411 -3903 -2720 -2741 -3240 -3964 -4669 -4427 -4465 -4712 -3584 -2639 -1486 -708 -917 -1607 -1880 -2359 -1714 -1824
405 -1824 -1619 -834 -321 623 1202 1364 2313 2081 1042 943 -185 462 236 1189 1876 2760 3523 2861 3361 2902
425 2902 2494 2732 3104 2771 3155 4076 4411 5408 5184 5066 5240 4493 4628 4359 5932 6394 7446 8171 9088
444 9088 8225 7611 7190 6204 6760 6357 6726 7372 7792 8821 8899 10178 9188 9087 8828 8670 8162 7858 7728 8213
464 8213 8570 8800 8983 8984 9487 9179 8926 9115 9725 9121 9247 8499 8012 7430 7819 7012 7283 7136 7524 7435 7934
485 7934 8163 8324 7506 6949 7207 7550 6341 6045 5865 5674 5751 5686 5158 4608 5844 4628 5199 5333 4645 4538
505 4538 4536 3822 3112 2211 1638 1992 2268 1623 1617 916 1102 725 763 -159 18 -712 -1562 -1571 -1854 -1875 -2518 -2659 -2315
528 -2315 -3282 -3378 -4535 -5200 -5196 -5558 -6044 -5648 -6281 -6083 -6373 -6768 -7558 -8584 -10215 -10624 -10611 -11423 -11086 -10635
548 -10635 -9984 -10030 -10275 -10517 -11187 -12393 -13589 -14196 -15027 -15001 -15340 -14912 -13813 -14527 -14294 -14918 -15441 -15640 -16330
567 -16330 -16410 -17556 -16494 -16699 -16982 -18244 -18617 -18721 -18476 -18102 -18129 -18224 -18102 -17988 -17612 -18462 -19062 -19067 -19308 -19947
587 -19947 -20152 -20518 -19591 -19259 -19639 -19211 -19091 -18494 -19605 -18969 -19461 -19638 -18667 -19418 -18816 -19176 -18810 -18521 -17564
606 -17564 -18355 -17580 -17127 -17520 -17370 -17698 -17151 -16620 -16439 -15110 -15548 -15135 -15686 -16287 -15988 -16979 -15656 -15294 -14129
625 -14129 -13102 -12566 -11906 -11254 -12759 -12626 -12247 -12329 -12004 -12655 -10965 -9112 -9921 -8672 -7825 -8764 -8739 -9047 -9025
644 -9025 -9193 -7981 -6850 -7129 -6105 -5120 -4598 -4991 -4867 -4942 -4682 -5126 -4456 -4106 -3812 -3148 -2846 -2878 -2601 -2766
664 -2766 -1991 -1820 -1533 -1374 -237 674 1326 1792 134 515 676 450 166 413 1677 3211 3660 3786 4133
683 4133 4272 3659 3921 3147 3622 3592 4352 4152 4566 5721 6163 5966 6342 5998 5224 5130 5867 5564 6131 5950
703 5950 6469 6684 6135 6085 6913 6197 5991 6990 6847 6634 6617 6823 7162 7673 7313 7947 7006 7506 6434 6155
723 6155 6504 6803 7708 8244 8358 7802 6329 5817 5924 5194 5974 7302 7152 6499 6999 6615 5468 5134 5232
742 5232 4904 5463 6021 5678 5935 5721 5299 5499 4190 3615 3902 3466 3737 3852 3875 3915 4400 3626 2507 2637
762 2637 2785 2046 1649 2814 2858 1540 648 921 803 1075 1250 1798 1170 747 155 -645 -1890 -1273 -1512
781 -1512 -1193 -1431 -1326 -1343 -2353 -2033 -2546 -3630 -4660 -4633 -5354 -5077 -5453 -4353 -4869 -4434 -5138 -5831 -7049
800 -7049 -7924 -8643 -9256 -8610 -7950 -8454 -8459 -9483 -9587 -9341 -9973 -10641 -11289 -11584 -13040 -13366 -13086 -12625 -11909 -11854
820 -11854 -12211 -12654 -14766 -15853 -16984 -16687 -16303 -16361 -16327 -15320 -16234 -17602 -18285 -18461 -20063 -20175 -20215 -21043 -20624
839 -20624 -20612 -20261 -19917 -20006 -21126 -21656 -22594 -23803 -24876 -24770 -24616 -23374 -24015 -24224 -24439 -24443 -25115 -26765 -26789 -27448
859 -27448 -27095 -27593 -26678 -26668 -27739 -27371 -26993 -27909 -27924 -29444 -30331 -30329 -30355 -30157 -30469 -29601 -29742 -29902 -29926 -30239 -30790
880 -30790 -31193 -32003 -31457 -31739 -31776 -31433 -30987 -30554 -30948 -31099 -31005 -31428 -31262 -31951 -31471 -31432 -30017 -30122 -29961 -30235
900 -30235 -30403 -30979 -31397 -30030 -30486 -30364 -29439 -28870 -28477 -28829 -28209 -28489 -28371 -28674 -28558 -28268 -28212 -27576 -28056 -27655
920 -27655 -26110 -26234 -25660 -26599 -25729 -26273 -26465 -26239 -26812 -25870 -24421 -23382 -23766 -23596 -23160 -22464 -22193 -21920 -21985
939 -21985 -21510 -21970 -21479 -20605 -20597 -20340 -18851 -18249 -18742 -18956 -18613 -18116 -17857 -17924 -17137 -16588 -15622 -15666 -16768 -16785 -15125
960 -15125 -15150 -15053 -14301 -13633 -13386 -14232 -13960 -13236 -13154 -12194 -12497 -12626 -11675 -11398 -11099 -10761 -9498 -8618 -8667 -9408 -8924
981 -8924 -8139 -7579 -6748 -6598 -6262 -7278 -6396 -5454 -5653 -5108 -3986 -3092 -3561 -4034 -4155 -4117 -3746 -3147 -2515 -2345
1001 -2345 -1010 -1691 -1561 -1540 -1307 -744 -656 -235 259 49 137 636 873 818 1408 1723 1733 2264 2631 3123 3135 3006
1023 3006
##PAGE= T1=0.0029072
##FIRST=     0,             0,               0,               0
##DATA TABLE= (T2++(R..R)), PROFILE
0 0 0 0 0 0 0 0 0 0 0 0 0 0 0 0 0 0 0 0 0 0 0 0 0 -1 2 -2 2 -1 3 -4 4 -6 7 -7 6 -5 7 -4 7 -7 6 -12 13 -17 13 -17 14 -20 21 -25 26 -29 27
54 -34 40 -42 48 -53 62 -69 80 -100 120 -149 209 -308 578 -3378 -5084 -837 372 2711 2960 2892 451 -2087
77 -4738 -6656 -6311 -4627 -3556 -2670 -546 -1235 -3035 -4774 -5321 -4478 -4640 -4353 -2845 -1708 -459 1020 2673
95 2673 1946 60 -1210 -3372 -5462 -5537 -5113 -4627 -2713 -1408 -1872 -1399 -3118 -4241 -4630 -4766 -2976 -1418
114 993 2108 1825 820 398 -1864 -3478 -3713 -3807 -2050 -1924 -854 1221 813 -63 -186 -2326 -5084 -6082 -5229
133 -5229 -4470 -2003 -1457 -603 -1478 -1557 -2110 -2414 -3298 -2596 -2398 -3013 -3295 -2491 -1875 -881 412 1650 634 -44
154 516 -765 -1192 -1165 28 584 -448 244 -379 -1824 -2896 -3045 -3200 -2101 -299 629 86 680 2179 2282 2011
174 2011 1509 1512 -372 -1910 -2474 -3460 -3820 -2592 -430 115 469 606 328 6 -59 -1132 -2614 -4100 -4852 -5044
194 -5044 -3924 -2751 -486 -837 -1649 -1800 -2036 -3582 -4044 -4235 -4153 -3243 -2687 -2295 -2030 -2422 -2616 -3558 -4710
213 -4710 -5571 -4521 -5680 -5323 -4543 -3399 -3081 -1280 -650 -1771 -2667 -4088 -5251 -5546 -5322 -4033 -2522
230 -2522 -1035 -279 -924 -1727 -2922 -3673 -5075 -4557 -4775 -5029 -2754 -1483 -1057 -879 -2082 -3249 -4366
247 -4366 -4923 -5587 -5768 -4933 -3948 -2823 -2053 -1796 -2223 -2505 -4243 -4564 -5475 -5188 -5718 -5262 -4695 -4438 -4904
266 -4904 -4287 -4072 -3066 -2465 -1870 -2063 -3137 -3397 -3392 -3005 -2680 -1839 -1398 -1727 -1167 -555 -194 -451 1399 845
286 845 633 1272 2007 1055 1105 741 1456 963 404 863 398 822 1939 2621 2128 2993 2633 2058 1601 1655 1505
307 1505 1469 1577 2007 1795 1886 3037 3363 2265 2853 3054 2087 258 571 -146 22 487 1085 1128 1773 1466 1024
328 1024 1107 1244 2515 1414 1345 1766 2309 1847 1268 1054 371 391 -401 -1085 -343 985 2017 2862 2777 2463
348 2463 3116 1632 970 490 142 -4 271 722 1551 2192 2375 2683 1684 1321 948 1258 5 -239 -369 811 1058
369 1058 920 683 -47 583 -1053 -1904 -1859 -2077 -2898 -1884 -2173 -1658 -186 -414 -1667 -2206 -2292 -3233 -3843 -4618
389 -4618 -3451 -3306 -3174 -2643 -3261 -4272 -3399 -4128 -3998 -5517 -5186 -5414 -4561 -4585 -4780 -4343 -4421 -4256 -4629 -5663
409 -5663 -5416 -4943 -5570 -5509 -4458 -4059 -4281 -4238 -4246 -4278 -4956 -5162 -5271 -5448 -5099 -4840 -3652 -4777 -3891 -3206 -3690
430 -3690 -3685 -5470 -5471 -6076 -6033 -5276 -5512 -5151 -4593 -3174 -3339 -2966 -2462 -2449 -3976 -4340 -4329 -5256 -4630 -3905 -3072
451 -3072 -2677 -1872 -2503 -2660 -3620 -3815 -3861 -3610 -3112 -2949 -2938 -2162 -2165 -1710 -1938 -2462 -2325 -2581 -3230 -2296 -1641
472 -1641 -1846 -959 129 -1059 -1268 -1002 -1733 -1726 -1007 -95 -935 -598 666 319 -326 102 792 1158 478 126 -15
494 1664 2196 2743 2769 2241 2263 1999 1308 591 1107 691 1944 2477 4010 2996 4073 4348 3927 3489 2050
513 2050 1774 907 1113 1460 2188 3262 4663 4165 4424 4355 3954 2781 2754 2903 2511 2722 2968 3649 2721 3200
533 3200 3153 2201 2489 2314 2353 3145 2662 3552 4105 3182 2961 2703 3039 2411 2906 2788 3061 3488 3747 3245 3592
554 3592 2900 2984 3679 2529 2602 3155 2909 2873 2825 1946 2389 3296 2021 2486 2910 3119 2406 2953 2118 2227 1113
576 1328 898 984 767 1601 2088 1165 867 1330 112 365 125 266 -118 105 177 350 95 -215 -282 -423 -504 -225
599 140 -213 -130 -65 -37 -353 -713 -1509 -975 -1223 -1143 -1986 -1334 -1410 -2094 -1618 -2043 -1364 -1682 -986 -2399 -2120 -1930
621 -1930 -3508 -4196 -3753 -3910 -2942 -2766 -3858 -3694 -3823 -3255 -3445 -4118 -5054 -5518 -5169 -5047 -5544 -5193 -6114
640 -6114 -5540 -6423 -5821 -5260 -5120 -3872 -5018 -5961 -4513 -5779 -6562 -5473 -6112 -6381 -5795 -5072 -4014 -4191
658 -4191 -4636 -5241 -5219 -6193 -6169 -6794 -6791 -6659 -4966 -4222 -3819 -4377 -4782 -5453 -6228 -5560 -5832 -6214 -5285 -5276 -5454 -5526
680 -5526 -4975 -5367 -5058 -4937 -4352 -4566 -3637 -5652 -6330 -6265 -5922 -5401 -5190 -5175 -4574 -4045 -4118 -4800 -3765 -4542
700 -4542 -4626 -4884 -4423 -5415 -4690 -4249 -3627 -3058 -3443 -3009 -2399 -2982 -2789 -2763 -3330 -3184 -3922 -4430 -3431 -2467 -2267
721 -2267 -1120 -482 -622 -739 -1939 -2911 -2609 -2063 -2066 -1683 -1402 -406 -492 -869 -907 124 261 -342 -1042 -823 -1316
742 -1316 -1401 -1098 -693 -281 329 -376 510 -244 757 475 1055 360 360 21 -532 650 254 1527 1555 1653 1255 1676
764 1676 2133 2064 2517 2384 2498 2378 2459 3355 2431 2332 3518 3963 3433 4410 4378 3966 4412 3469 4184 4235 4361
785 4361 5397 5063 4991 5196 5269 5137 5217 5873 5183 5394 5283 5577 5688 5024 5655 5586 6022 5102 6544 6018 6189
806 6189 6886 6070 6429 6373 6475 6259 6743 7125 6517 6605 7817 8136 7198 6987 7529 6782 7151 6569 8149 8163
826 8163 7220 6897 7188 6581 6570 6862 6858 7086 7826 7444 6981 7507 7531 7763 6802 7317 6918 5825 4821 5607 6221
847 6221 7006 7903 7880 7290 7575 6885 5696 5060 4976 5088 5008 6247 6515 6396 6385 7317 7391 6894 5733 5210 4816
868 4816 4617 4629 6067 6716 7148 7083 5674 4792 4054 4755 4462 3811 4578 5262 5677 6042 5555 5072 4825 5031
888 5031 4124 3251 3175 4234 4103 5214 4586 5456 4779 3562 3561 2892 3116 3938 3680 3298 4565 3637 3658 3509
908 3509 3248 3351 2951 3203 2089 1845 1653 2774 2943 2261 2380 2286 2368 1037 819 224 17 1065 1272 1091
928 1091 1355 2279 1485 1407 690 349 -408 -894 -1194 -367 -32 0 1512 899 646 -32 -769 -1665 -1660 -991 -1211 -405
951 -765 96 -503 -580 -935 -1948 -2353 -2488 -2178 -2905 -2972 -2348 -1855 -2537 -2206 -2811 -3009 -2878 -3742 -4362 -4192 -3574
972 -3574 -3954 -3786 -3467 -2831 -3006 -3586 -4248 -4379 -4968 -4917 -4407 -4453 -4379 -2839 -2717 -3332 -2978 -4081 -4319 -5201
992 -5201 -4643 -5266 -4936 -4389 -3622 -3831 -4207 -4419 -4330 -5407 -5566 -6309 -5123 -6329 -5365 -5026 -4425 -4421 -4806 -5344
1012 -5344 -6270 -5063 -5486 -5891 -5829 -4535 -5105 -5844 -4682 -4405 -4502
1023 -4502
##PAGE= T1=0.0029072
##FIRST=     0,             0,               0,               0
##DATA TABLE= (T2++(I..I)), PROFILE
0 0 0 0 0 0 0 0 0 0 0 0 0 0 0 0 0 0 0 0 0 0 0 0 -2 1 -2 3 -3 2 -4 5 -5 5 -6 5 -3 5 -6 5 -7 8 -7 12 -13 13 -15 15 -19 21 -23 27 -32 32 -36
54 37 -37 47 -48 58 -66 75 -85 106 -128 165 -219 330 -627 3814 8825 7926 7461 5812 3297 -547 -847 -1633
76 -1633 -1907 374 3168 3577 3909 3059 1021 -301 -1434 -1235 -387 -188 1024 2195 3726 2652 2235 3364
94 3364 2481 -727 -1721 -3488 -2147 -644 828 1822 4252 4352 2605 1409 95 480 676 2294 3169 4060 5701
113 5701 5154 1869 996 -681 -1014 -516 -257 1226 4132 3855 4728 5833 5134 3366 2190 774 92 1050
131 1050 3462 5093 5933 5243 4724 4305 2834 1274 847 742 602 751 1361 586 1277 2571 3258 3441
149 3441 2928 1130 259 651 791 -28 565 2031 732 -190 -155 -886 -2203 -1831 -1935 -551 313 1200 1990 1433
169 1433 827 584 785 -191 -668 -629 -1922 -2425 -1499 276 1104 2895 4100 4117 4391 3228 2190 734 949
188 949 -1263 -2089 -1807 -806 399 1344 1723 1635 1264 531 -376 -1197 -1900 -2389 -810 -393 143 410 1121 616
208 616 -228 -917 -1563 -2526 -1745 -1581 -2094 -1001 269 575 1151 699 -15 -587 -2214 -3370 -2904 -1812 -215
228 1980 2955 3338 2421 1149 -346 -404 19 -574 82 1926 3043 2397 3472 4093 1769 1001 270 497 158
248 143 1539 2357 3596 4788 4752 3649 2439 2897 574 1570 1558 3032 3270 4184 4078 4558 3617 4882 4961
267 4961 5204 4367 3896 3150 2908 2570 2563 3032 3979 3556 3085 3667 3535 3659 3528 4893 4998 3923 3705 3724
287 3724 3725 3496 3253 4058 3622 3528 3303 3317 3518 4480 4583 3666 3783 3443 3057 2466 1366 2375 2788 2659 2926
308 2926 3803 3691 3436 4168 4078 3409 2691 2055 1177 418 680 720 1283 1190 1948 1596 1197 1663 -501 -701 55
330 503 232 -483 -489 -301 -741 -1755 -1354 -1984 -2554 -2278 -738 -712 813 1299 1224 245 -125 -1416 -2566 -2427 -2683
351 -2683 -3290 -1704 -1001 -626 743 30 -434 -425 -907 -1953 -1934 -1931 -1611 -1865 -1301 -241 8 -342 -1250 -1611 -1339 -2370
373 -2370 -2636 -3054 -2366 -1656 -2060 -1823 -1523 -1424 -2679 -3305 -3771 -3296 -3660 -4048 -3586 -3092 -1719 -1628 -2260 -1701
393 -1701 -2362 -1946 -1832 -2370 -2645 -2141 -1248 -1654 -1486 -1277 -1091 -1303 -1542 -1427 -1570 -1603 -333 595 1091 966
413 966 1496 994 833 616 759 2078 800 1587 2122 2443 4299 3827 4481 4169 4354 3495 2800 2835 2869 3375
433 3375 3405 4525 4766 5656 5632 5692 5245 4835 4434 3892 3646 3650 3657 4294 4545 5286 5801 5775 5661 4518 4025 4006
455 4006 4455 4128 3994 4831 5289 5217 5137 5272 4841 4678 4162 3888 4503 5119 4721 5799 6335 6318 6249 6238 5374
476 5374 5953 4880 5811 6418 6890 6107 6258 6656 7055 7416 6743 7016 6533 6297 6577 7390 7902 7495 7287 6951
496 6951 5977 5774 5306 4590 5248 5167 5748 6343 7046 6683 5521 6087 5064 3780 2847 2338 1445 1932 3299
515 3299 3497 4011 4277 4614 3577 2679 2114 1286 741 1001 1545 2516 1559 2180 1487 2386 1823 1555 1268 901
535 901 927 1406 906 1447 1789 976 811 747 303 717 423 953 1335 778 1460 1032 1047 391 486 96 210 264
557 264 -335 335 -336 227 -237 -548 -553 -1381 -845 -770 -999 -866 -1114 -2796 -3154 -2600 -2646 -2566 -2950 -2085 -1873 -1782
579 -1782 -1925 -2856 -2366 -3827 -2326 -2907 -3453 -3354 -3001 -2485 -2450 -1931 -2648 -2361 -3410 -3449 -3165 -2827 -3471 -2460
599 -2460 -2405 -2555 -3197 -3424 -3654 -3375 -3425 -3145 -3455 -3561 -3581 -3515 -3233 -4277 -3641 -4392 -3691 -4628 -4409 -4380 -3910
620 -3910 -5345 -5298 -4274 -4025 -4387 -4259 -4458 -3835 -3150 -4454 -4723 -5038 -4948 -5358 -3715 -4108 -4715 -3957 -3624
639 -3624 -3768 -4397 -4117 -3458 -3888 -2580 -3844 -4047 -4027 -3620 -3270 -3193 -2559 -1119 -1999 -1782 -1155 -1297 -2056 -2821
659 -2821 -3147 -2908 -2636 -2328 -1015 -964 555 614 360 -143 -982 -2162 -1595 -1606 -949 -601 -489 157 563 -682
680 -430 441 934 660 874 609 622 228 106 360 818 2005 1485 2245 2323 2210 2687 2318 2358 1974 1948 2460
701 2460 2116 3018 3244 4102 4143 4112 4837 4488 3887 3997 4214 4003 4208 4118 4395 4847 4708 5531 6283 6185 5805
722 5805 5792 4305 3449 3981 4110 5242 5287 5352 5525 5945 5527 5165 4693 5381 5468 4772 3502 4053 4156 4201 4893
743 4893 5844 5655 5733 5326 4310 5229 5223 5010 4386 4531 4153 4464 4641 5258 5147 5876 5804 6776 5216 5153 5502
764 5502 5516 5106 5743 5216 4881 5754 5248 5039 4247 5735 5576 4738 5350 4497 4727 4354 3514 4266 4556 4042
784 4042 3920 4097 3479 3703 3950 3072 2580 3125 3444 3076 2406 2515 2071 1831 2885 2504 2294 2433 2532 2259
804 2259 1556 2531 1780 1554 1373 1263 1105 1345 1116 1360 1277 1309 1162 -613 501 305 -34 -521 30 396 -49 -1043
826 -1043 -1252 -1279 -1688 -1855 -809 -1375 -1761 -1579 -1615 -2005 -1958 -1568 -2131 -2480 -2266 -2876 -3871 -3319 -2321 -2282 -1660
847 -1660 -2651 -1977 -3314 -4194 -4135 -4530 -4291 -4104 -3449 -3645 -2669 -2979 -3080 -4188 -3908 -4374 -5356 -6123 -5941 -5579
867 -5579 -5106 -4082 -4077 -3686 -4720 -5147 -5770 -7632 -7431 -6537 -6367 -5449 -5530 -5640 -6273 -5698 -5800 -6751 -6751 -7183 -7025
888 -7025 -7751 -7142 -6162 -5801 -5590 -6625 -7125 -7617 -8117 -8280 -8382 -8335 -7327 -7756 -7362 -7634 -7736 -7984 -7632 -7722
908 -7722 -8256 -8507 -9314 -8569 -8802 -8370 -7912 -7414 -8856 -9221 -8953 -9633 -10414 -10472 -9782 -8341 -7938 -7671 -7921 -8435
928 -8435 -7948 -8249 -10312 -9559 -8836 -9990 -10400 -9059 -7797 -7165 -6610 -7064 -7579 -8377 -8866 -9650 -9836 -9206 -7516
947 -7516 -7023 -6948 -6484 -6539 -7980 -7879 -8309 -8387 -8504 -8536 -6982 -8215 -8051 -7012 -7135 -7384 -7529 -7193 -8150 -7491
967 -7491 -6908 -7197 -7002 -6906 -6444 -7143 -6089 -6104 -5818 -6891 -6649 -6540 -6791 -6228 -5873 -4954 -5368 -4161 -4132 -5155
987 -5155 -5858 -5515 -6735 -6705 -5650 -4967 -4116 -3540 -3531 -4225 -4876 -4691 -5552 -5647 -5514 -4329 -4024 -3525 -5053 -3568
1007 -3568 -3222 -3939 -3726 -4327 -2944 -3023 -2633 -2771 -2722 -1976 -2875 -3114 -1894 -1519 -1365 -2363
1023 -2363
##PAGE= T1=0.002944
##FIRST=     0,             0,               0,               0
##DATA TABLE= (T2++(R..R)), PROFILE
0 0 0 0 0 0 0 0 0 0 0 0 0 0 0 0 0 0 0 0 0 0 0 1 6 -5 1 -1 0 0 -1 1 6 -6 2 1 7 -3 5 -7 6 -7 4 -11 9 -11 13 -11 15 -21 17 -20 23 -24 27
54 -29 32 -38 40 -46 52 -63 69 -83 101 -126 172 -256 478 -2743 -4398 -2354 -261 -168 -828 -442 -306 67 -1665
78 -1540 -1149 -2734 -3516 -3365 -2345 -1698 1205 1380 1222 567 -784 -2813 -4163 -5726 -4310 -1894 -329 761
97 203 -133 -1599 -2637 -2148 -693 -857 -860 -760 -477 -1212 -3259 -4027 -3513 -4340 -5357 -4572 -1887 -219 1675
117 2556 2455 345 -2358 -3350 -3685 -3606 -2298 -1302 -1426 -835 -797 -820 -1786 -1854 -1632 -407 -616 298 -487 -1257 -1129
138 -1129 -921 -2041 -1296 -977 -883 -897 -920 -2489 -2329 -1706 -1125 -109 929 2262 2570 2115 1044 449 -1433
158 -2550 -4066 -4108 -3996 -1861 360 1410 1763 1360 342 -1162 -3301 -4470 -4337 -4101 -2789 -2391 -1474 -543
177 420 1239 17 -194 -433 -1466 -3524 -4506 -5503 -5829 -5274 -3073 -1527 -361 -398 -858 -2450 -2670 -3411 -3892
196 -3892 -3871 -3095 -1256 -872 -1338 -344 -149 -1036 -1593 -1955 -1479 -2028 -575 -867 -365 -481 -407 -1250 -1942 -2652
216 -2652 -2691 -2408 -268 -406 -573 231 162 165 -782 -996 -1223 -1729 -1727 -2040 -2193 -1302 -836 -700 250 851 -798 -1197
238 -1197 -2933 -3429 -3197 -3150 -3147 -1672 -1298 -2654 -1591 -2245 -2893 -2273 -1280 -1581 -911 -1169 -1750 -1812 -2101 -2358
258 -2358 -2358 -1978 -1576 -2324 -2330 -1590 -764 -950 -1653 -1892 -1748 -1695 -2244 -2313 -2187 -1749 -1190 -1868 -1760 -1490 -544 -729
280 -729 -767 77 -369 -1305 -1688 -1622 -2327 -2270 -2036 -1228 -1043 -1595 -880 -1220 -2302 -1849 -2596 -1552 -1612 -676 -1524
301 -1524 -1559 -1100 -2647 -3468 -2751 -3258 -2846 -3424 -2707 -425 -52 -267 -651 -846 -958 -1635 -2667 -3374 -3795 -3910
321 -3910 -3391 -2999 -1411 -451 -215 135 230 44 193 -447 -367 -1372 -2345 -1264 -1230 -576 -1120 -57 66 198 -348
343 -1062 -695 -826 297 -771 -274 -1025 -1908 -2067 -2209 -2415 -1884 -2422 -1624 -1073 -1292 -1132 -1407 -921 -2080 -1562
363 -1562 -1532 -2655 -2575 -3123 -2999 -2474 -2045 -1141 -1189 -265 817 569 -35 -1003 -1691 -2952 -2046 -2408 -2226 -1650 -719
385 187 699 842 1813 768 -297 539 403 -211 -522 112 -445 -534 -651 -997 -329 173 384 590 1006 166 675
406 675 -69 837 334 -501 -1026 -1297 -1863 -1648 -20 -543 178 -177 578 -81 -537 -1067 -1670 -1641 -1729 -2208 -2280 -1907
428 -1907 -1735 -1185 -1415 -912 -1330 -1821 -2157 -2669 -2698 -2879 -2729 -2975 -1796 -2203 -2170 -1540 -1239 -2171 -1733 -2251
448 -2251 -2424 -2471 -2664 -2945 -1872 -2580 -2050 -2553 -2108 -1766 -1614 -1538 -1661 -1558 -1809 -3071 -3545 -3355 -3051 -3399
468 -3399 -3180 -2472 -2455 -2068 -1825 -2174 -1685 -2362 -3462 -3797 -4198 -4410 -4544 -4097 -2831 -2067 -2164 -2116 -1841 -2443
488 -2443 -3050 -3088 -3583 -3659 -4069 -3831 -3558 -3539 -2952 -2315 -2522 -1736 -2814 -2406 -2375 -1959 -2192 -2166 -1855 -2106 -2696
509 -2696 -2596 -2335 -2771 -2222 -1872 -1460 -1894 -261 -1314 -1130 -1224 -1337 -1111 -2561 -2884 -2065 -2460 -2126 -1986 -1580
529 -1580 -1010 -1394 -1221 -2558 -2253 -2206 -1737 -1481 -1098 -1067 -1281 -1151 -575 -1284 -2300 -2028 -2666 -2301 -2534 -2215
549 -2215 -547 -208 302 -314 -725 -1423 -2097 -3745 -2389 -1921 -541 -623 -288 228 -96 -480 -835 -1297 -1316 -801
569 -801 -658 -776 659 497 368 440 -353 -777 -973 -701 -70 -103 986 1590 1238 1160 389 367 165 -489 -685 -341
592 77 675 728 1041 1909 1467 1259 427 -204 -34 -95 -435 254 925 1120 1734 1360 821 759 1143 620 371 616
614 616 1084 1314 1600 2512 1692 2017 1281 430 -31 -253 791 651 1613 1893 2714 2238 895 478 369 -563 313
636 5 870 1295 724 945 1199 327 -55 -316 -478 -375 -790 -229 -180 60 181 360 -424 -719 -1155 -1036 -233 456
659 504 84 -310 95 -675 -1321 -1188 -897 -786 -735 -637 -390 -156 -648 -799 -1593 -1032 -1970 -1483 -1861 -1084 -1176 -465
682 -679 -1299 -2017 -2176 -2109 -2720 -2481 -3004 -1901 -2084 -2126 -1886 -2406 -2106 -2041 -2376 -3136 -2829 -2787 -2297 -2099 -2153 -1935
704 -1935 -2059 -1933 -3426 -3755 -3175 -3448 -3886 -3792 -2489 -2381 -2072 -2911 -2215 -2585 -3818 -3672 -3668 -4443 -3815 -3255
724 -3255 -3056 -2795 -2000 -2198 -2109 -2649 -2316 -2788 -3549 -3673 -3608 -3269 -2885 -2752 -3225 -3084 -2379 -2474 -2990 -2536 -1968
745 -1968 -2118 -2605 -2201 -2493 -3211 -2807 -3135 -2738 -3195 -2130 -1310 -1482 -1949 -2268 -2324 -2543 -3572 -3685 -3738 -3405
765 -3405 -3148 -2849 -1657 -1328 -2261 -3153 -3095 -2517 -2703 -2362 -805 -1042 -1508 -2204 -1565 -2273 -2368 -1586 -231 -444
785 -444 -64 -1170 -563 -1743 -1146 -1266 -1191 -1196 -622 -379 -713 275 186 438 -489 -369 -172 -299 -251 -42 324 228
807 228 81 184 -984 -305 1160 1190 1893 1140 1515 842 234 -209 -39 807 1921 2470 2386 2300 2757 2865 1898
828 1898 2405 2870 2624 2687 2928 2776 2684 1669 2649 2443 3500 3764 3394 3200 3571 4297 3331 2748 2992 2725
848 2725 2699 4346 4083 4231 3863 4822 3628 2535 3404 3000 4062 5181 5663 5255 4516 4169 4302 3265
866 3265 3376 4295 4790 5498 5926 6008 5192 4988 5166 5584 5346 5870 5658 5503 5295 6268 5598 5053 5309 5911
886 5911 5471 5658 6330 6520 6356 5826 6166 5672 5795 5998 6093 5505 5695 6577 6251 5991 6031 6000 6291 7049 6915
907 6915 6843 6520 6801 6356 5277 5410 6357 7417 7112 7447 6736 6658 6407 6414 6084 6208 6882 6124 6274 6310 5170
928 5170 4339 4672 4040 5278 4577 5595 7063 6233 6288 5235 4907 4241 3496 3550 3860 3892 4802 5232 5165 5096
948 5096 4895 4322 3631 4403 4029 3716 4511 4572 4795 4450 3879 3902 3838 3904 4455 4323 3436 3347 3763 3292 3344 3826
970 3826 3860 3925 3623 3320 1784 1408 3346 2054 2834 3001 4154 3389 2275 1646 1947 1239 729 774 1543
989 1543 1725 1487 2122 1520 1999 2221 1364 211 1519 1150 601 1176 1238 1085 936 1151 45 229 229 528 1241
1010 1241 307 290 -31 -1142 -605 15 -30 -200 -97 -664 -1823 -2029 -1972
1023 -1972
##PAGE= T1=0.002944
##FIRST=     0,             0,               0,               0
##DATA TABLE= (T2++(I..I)), PROFILE
0 0 0 0 0 0 0 0 0 0 0 0 0 0 0 0 0 0 2 -1 0 0 0 0 1 -3 0 1 3 0 0 0 0 0 2 -1 -1 -4 4 -4 4 -5 3 -3 3 -6 5 -6 7 -3 7 -8 11 -8 9 -11 11 -10 17 -18
59 20 -24 30 -35 43 -54 76 -117 230 -1390 -2828 -999 -1009 -2537 -4216 -3716 -4494 -5116 -4234 -4184 -4320 -4677 -3457
81 -3457 -2008 -2439 -1491 -1282 -1674 -5235 -7022 -7543 -6797 -5309 -2562 -556 845 218 97 -776 -1748 -1726 -548
101 1389 811 382 -139 -869 -1485 -1811 -2476 -1564 -762 -974 -17 2872 2997 2352 1246 -1007 -4187 -6081 -5615
120 -5615 -4937 -3616 -2394 -1741 -1873 -2043 -3337 -3988 -4317 -4464 -3915 -3360 -3264 -3248 -4443 -4634 -5157 -5697 -5344
139 -5344 -5637 -5314 -5073 -4766 -4647 -5377 -5636 -4049 -2793 -1993 -2418 -1454 -2674 -2746 -4456 -4885 -5775 -5685 -4044
158 -4044 -3163 -1180 -197 1359 577 -810 -3331 -4882 -5931 -6664 -6013 -5192 -3942 -2898 -1620 -2220 -1598
175 -1598 -1121 -2073 -3357 -4809 -4997 -6309 -7316 -6672 -5855 -4986 -2665 -1547 -678 -916 -3218 -3822 -6284
192 -6284 -5924 -5643 -5613 -4222 -3789 -3801 -3907 -3940 -3590 -4113 -5636 -4332 -4765 -4763 -4007 -2713 -3260 -3233 -3445 -4008 -4264
213 -4264 -3946 -3866 -3380 -2547 -1411 -2083 -2438 -2884 -3005 -3584 -4652 -4287 -3912 -3886 -3006 -3385 -2511 -1500 -1372 -779
233 -779 -1471 -1504 -2977 -3138 -3997 -4605 -3083 -3346 -2366 -1954 -3650 -3702 -4838 -4192 -4743 -4361 -4319 -4156 -4786 -5241
253 -5241 -5637 -5707 -6080 -5634 -5142 -5671 -4582 -5455 -5048 -4736 -4283 -5272 -6469 -6240 -5904 -6225 -5993 -6606 -4531
272 -4531 -5582 -4999 -5220 -5137 -5167 -4302 -4799 -4800 -4689 -4456 -5421 -5491 -4632 -4546 -3847 -3522 -2838 -3430 -3687 -3288 -4302
293 -4302 -4107 -4526 -4051 -3084 -4362 -4491 -4667 -4881 -5240 -5344 -6347 -5512 -5276 -4323 -4375 -2997 -2880 -2936 -3698 -4428
313 -4428 -4432 -5591 -5655 -6488 -5895 -5512 -4927 -4817 -3375 -2849 -2599 -2761 -4057 -4493 -4664 -6075 -6002 -5764 -5313 -5526
333 -5526 -4667 -4320 -3793 -3704 -2875 -3701 -3606 -3605 -3955 -4120 -3582 -4236 -4202 -3370 -3916 -4096 -4525 -4350 -3678 -3935 -3695 -3368
355 -3368 -3272 -2758 -3614 -3081 -4330 -4691 -4425 -4824 -5681 -5966 -4625 -4094 -2993 -2775 -2955 -3139 -3008 -3451 -4786
374 -4786 -5132 -6258 -6474 -6313 -6543 -5772 -5177 -4528 -4461 -3814 -3951 -4252 -5081 -5689 -5994 -6100 -6133 -5368 -6028 -5281
394 -5281 -5409 -5528 -5439 -4865 -5514 -4523 -4312 -4851 -5348 -5167 -5216 -5870 -5286 -5769 -6565 -6422 -5161 -6363 -4728 -5115
414 -5115 -5016 -4875 -5442 -5873 -5831 -6083 -6417 -6015 -6073 -6300 -6494 -6196 -6233 -5497 -5462 -5917 -6519 -6241 -6531 -7028 -7481 -7264
436 -7264 -6676 -7426 -7143 -5941 -6528 -6449 -6139 -6383 -6205 -6823 -6696 -7551 -7349 -6777 -6811 -7124 -6793 -5936 -6409 -5868
456 -5868 -5738 -6184 -6092 -6637 -6377 -7099 -7322 -6918 -6588 -6557 -6383 -4944 -4556 -4525 -5093 -5210 -5845 -6002 -6069 -7040 -7006
477 -7006 -6528 -6242 -6090 -4837 -4145 -4532 -4293 -4864 -4942 -6237 -6253 -6610 -6583 -6740 -5672 -6058 -5340 -5418 -5098 -4974
497 -4974 -4801 -4915 -5992 -6315 -5511 -5681 -5960 -5548 -5335 -5171 -5832 -5813 -5294 -5007 -5093 -5274 -5413 -4841 -4463 -4922
517 -4922 -4816 -4670 -4285 -5533 -5220 -5736 -5160 -4569 -4389 -4405 -4016 -4259 -4600 -4601 -5283 -5004 -5396 -3818 -3955 -4523
537 -4523 -4693 -4111 -4372 -3740 -5948 -5225 -5634 -5666 -5069 -5221 -3226 -3436 -3130 -3756 -5156 -5572 -6168 -6999 -5495
556 -5495 -4724 -4274 -3582 -3993 -4020 -4364 -4453 -4863 -5196 -4733 -5006 -5247 -4160 -3949 -4445 -4299 -5150 -5422 -5871 -5443
576 -5443 -5495 -5385 -4254 -4055 -3976 -4034 -4896 -5700 -6539 -5796 -5903 -5349 -6153 -5209 -4705 -4713 -5385 -5473 -5709 -5760 -6682 -7451
598 -7451 -7756 -7418 -6703 -5853 -6108 -6287 -5519 -6090 -6878 -6752 -7498 -7585 -7659 -7616 -7510 -6180 -6320 -6756 -6998 -7102 -7811
619 -7811 -8832 -8530 -9904 -7775 -7699 -6864 -7733 -7159 -7592 -8345 -8864 -9424 -9420 -8878 -8874 -8305 -8597 -7932 -8172 -9194
639 -9194 -8724 -9366 -9887 -9099 -9201 -9107 -8614 -8303 -8589 -8955 -9427 -9873 -9966 -9921 -9553 -10120 -8985 -8199 -9560 -10200
659 -10200 -9850 -9230 -9685 -9818 -9845 -9662 -9531 -9948 -10606 -10384 -9579 -10244 -9932 -10281 -9318 -9776 -9987 -9879 -9103 -8904
679 -8904 -9039 -8877 -9817 -9723 -10420 -9388 -10118 -9019 -9074 -9038 -9097 -9018 -8635 -9796 -9755 -9388 -9593 -10172 -9389 -8323 -9318
700 -9318 -8581 -9145 -8697 -9108 -9571 -9652 -10022 -9272 -8648 -8915 -8871 -8481 -7781 -8501 -8761 -9341 -9442 -10488 -9053 -9570
720 -9570 -8349 -8397 -7836 -7131 -7777 -7422 -7351 -7139 -8892 -8540 -8448 -8507 -8337 -7943 -7457 -6745 -6738 -7298 -7518 -6219 -6467
741 -6467 -6509 -6631 -7001 -6812 -7152 -7519 -7992 -7212 -6756 -6898 -6015 -6291 -6012 -5461 -6582 -7086 -6816 -7108 -6655 -6935
761 -6935 -6180 -6269 -6039 -4766 -5157 -5327 -5811 -6197 -5788 -6417 -5949 -4974 -4281 -4302 -5060 -5081 -5649 -4930 -5080 -4399 -4567
782 -4567 -3618 -3640 -4942 -4638 -5023 -5553 -5080 -4168 -4401 -4122 -3596 -3875 -4773 -4702 -4191 -4785 -4611 -5471 -4679 -4760 -4764
803 -4764 -3986 -4019 -4083 -4575 -4248 -4524 -5062 -4106 -3019 -2653 -3508 -4322 -5159 -5334 -4365 -3838 -3932 -2722 -2536 -4212
823 -4212 -4421 -4498 -4787 -5082 -4634 -4432 -4633 -4601 -4595 -5621 -5970 -4378 -5046 -4400 -3794 -4254 -3657 -4936 -4672 -4913
843 -4913 -5567 -4980 -4663 -5712 -5130 -4826 -4034 -5143 -5307 -5010 -5812 -5636 -5925 -5138 -5385 -4654 -4559 -5424 -6277 -5646
863 -5646 -6408 -6119 -6191 -4613 -4272 -5047 -5072 -6525 -6255 -6809 -6458 -6455 -6911 -6324 -6825 -6849 -6966 -7240 -7250 -7220 -6987 -7073
885 -7073 -6857 -7069 -6870 -7289 -7759 -7995 -8321 -9112 -8173 -8292 -7542 -7698 -8854 -7985 -7445 -8526 -9465 -8086 -8263
904 -8263 -7906 -8188 -8601 -9505 -9193 -9466 -9448 -9760 -8441 -8914 -9572 -9736 -9420 -10159 -11054 -10608 -10500 -10706 -10193 -10591
924 -10591 -11348 -12186 -12665 -12156 -12133 -11084 -11506 -10466 -9975 -10258 -11627 -12932 -12761 -12638 -13020 -13371 -11699 -10982
942 -10982 -11503 -11962 -11817 -11621 -12219 -12167 -12744 -12547 -12008 -11568 -11773 -11601 -12491 -11528 -12331 -12739 -12844 -13032 -12358 -12358 -12893
963 -12893 -13420 -14077 -12770 -13685 -13038 -12621 -12467 -13244 -13773 -13747 -14720 -14174 -13628 -13038 -13137 -12387 -12221 -12895 -14984 -14630
983 -14630 -14642 -14948 -14046 -14049 -12676 -12641 -12925 -12767 -13392 -13435 -13437 -14503 -14419 -13503 -13538 -13712 -13011 -12973 -13738 -13892 -13984 -13698 -13986
1006 -13986 -13039 -12563 -13153 -13277 -13630 -14141 -13474 -13671 -12921 -13081 -13252 -13494 -13349 -14791 -13971 -13290 -12935
1023 -12935
##PAGE= T1=0.0029808
##FIRST=     0,             0,               0,               0
##DATA TABLE= (T2++(R..R)), PROFILE
0 0 0 0 0 0 0 0 0 0 0 0 0 0 0 0 0 0 0 0 0 0 0 0 0 0 0 -2 1 -2 0 3 -1 0 0 -1 0 -1 0 5 -4 5 -1 2 -6 5 -7 8 -8 9 -11 8 -11 10 -11 11 -18 17 -23
58 19 -20 26 -26 34 -42 42 -59 70 -85 -6 -1853 -4403 -4034 -1192 817 2475 3237 1810 1248 679 378 843 941
81 941 1381 1891 2228 3700 4113 4200 3388 1834 87 -2834 -2406 48 2220 4858 8520 10267 8308 7353 5868
100 5868 3632 1422 1206 1372 772 1889 3510 4919 5941 7050 7277 6705 4879 3933 2523 1592 3335
117 3335 4915 6075 5808 4697 3691 603 -944 -1570 -745 846 2520 2809 3019 3813 5082 4211 4290 5743
135 5743 4140 3147 2401 3273 2532 3993 5314 6793 6367 5242 5312 5441 3759 3476 2599 1815 2054 3603
153 3603 4231 4695 6999 8330 6693 6222 5421 3425 1318 974 1569 1967 2299 3519 4252 3626 4810 3777
171 3777 3183 3948 4075 3394 2818 2015 1627 802 2130 2833 3017 2352 2192 2397 2253 2697 3553 4898 4737
190 4737 5092 4850 5081 5470 5346 5412 6148 7854 9031 8782 8797 8506 8411 6569 6559 6763 7446 8318 10226 12020
210 12020 13548 14711 15476 15761 15728 14213 13212 12738 12659 13743 13607 16167 17471 18133 16567 16558 16480 17067 16520
229 16520 17723 19056 18586 20067 20037 19977 19202 17273 16597 16153 15488 16522 16735 18404 21218 22952 22741 23127
247 23127 21292 19274 16467 15325 13635 12634 15002 16820 17548 19192 20280 21139 20338 19488 17308 15205
263 15205 13927 13276 12252 13161 14530 16444 16177 15879 17528 16498 15473 14625 13577 12850 11617 10818 10410
280 10410 9563 10602 10884 10667 10295 10847 10239 9041 8557 9928 9034 9151 8793 8720 8040 7708 8398 7823 7290
299 7290 7437 7962 8717 8011 8588 8300 9816 9824 9994 8674 8561 8843 7716 7369 8013 8499 8900 8571 9917
318 9917 9580 9830 10335 10653 10718 10303 9891 8988 8089 8537 9228 8844 8439 8473 7935 8520 9253 9539 9450 9305 10156
339 10156 9212 8051 7849 7024 7234 7476 8021 8012 8234 9605 9358 9997 10741 10777 11099 10131 10174 10482 10812 10905 11394
360 11394 12879 13181 13524 13652 14326 14532 16261 16650 18554 18701 19723 20311 20216 21694 21865 22519 23031 24070
378 24070 25109 25591 27446 28559 29102 29952 29832 30880 30378 30415 31210 31992 32742 32647 32810 34152 35509 35222
396 35222 35844 35514 35761 36195 35544 35852 35375 35177 35243 35328 35174 35304 34823 35078 35288 35136 35173 34768 34293 33604 32856
417 32856 32099 31822 32301 31868 31458 32574 31373 31145 31664 31424 32010 30989 31808 30510 31034 31033 31427 30672 31333
436 31333 31530 30852 30692 30611 31102 31623 31840 32058 31708 31334 31821 30853 30998 30438 30427 29758 30267 29802 29912 30697
456 30697 30061 29321 28428 27159 26334 25712 24422 23716 23986 24113 22749 21621 21835 21822 20341 19018 18117 16941
474 16941 15457 14689 13484 12308 12118 12110 11302 10574 9993 10415 9350 8602 8219 6881 5976 5250 4488 3792 3313
493 3313 3668 4119 4242 4459 4652 5298 4078 3788 4297 4622 3402 3594 2959 3128 4253 3946 4199 5043 5447
512 5447 5024 5113 5046 4248 4367 3875 3476 3425 3209 2930 2562 1929 2217 2545 1991 1959 1178 50 836 208 -63 -1294
534 -1294 -2121 -1253 -2263 -2414 -2935 -2410 -1781 -2397 -2661 -3283 -3177 -3890 -4084 -3617 -3253 -2239 -1726 -1847 -653
554 -52 -240 -84 -106 803 1909 2227 3987 4454 6445 6767 7285 7740 7700 8350 9392 9778 10203 10860 11828 12799
574 12799 11883 13404 13651 14354 14423 14397 14595 16022 15817 15533 16372 16488 15794 16540 16181 16691 16966 17003 16944 18168
594 18168 17825 18600 18654 19188 18671 18935 19360 19375 20166 19719 20933 22096 22834 23525 24342 25291 25472 25945 26586 26761
614 26761 27140 27941 29052 29816 31050 31442 33908 33162 33631 33662 33930 32717 33198 34641 34777 36285 36544 36825
632 36825 36355 36565 36027 34853 34823 33831 34624 35080 35172 34929 35183 35760 34814 35283 34108 33393 32740 33324 32724 33782
652 33782 34796 34385 33112 33062 33018 32911 33585 33942 35181 35081 35882 35414 35480 35518 35559 35044 36258 37120 37286 37771
672 37771 37694 37946 38048 38694 38768 37894 38733 36775 36948 36410 36226 36112 35890 36428 36212 36727 35832 36303 34450 33289
692 33289 31470 30092 28994 29015 29073 28698 29704 28890 27322 25999 24464 23598 21859 22609 22008 22078 21206 20749
710 20749 19914 19999 19072 18149 17864 17033 17392 17058 16246 16744 16595 16421 15531 15804 15714 15233 14966 14804 13579 12477
730 12477 11797 10606 10497 9925 10943 10486 10581 9895 8969 7005 6191 5374 4723 4389 4489 3209 3019 1746
748 1746 570 -576 -998 -1387 -2672 -2570 -2054 -2953 -3310 -4893 -6111 -6460 -7503 -7896 -8654 -8670 -8799 -9239 -8771
767 -8771 -9340 -10276 -10057 -10210 -11625 -13032 -13268 -13076 -13008 -13836 -13132 -13077 -12667 -13324 -13642 -13885 -14696 -15792 -17000
786 -17000 -16667 -16314 -16012 -16464 -16210 -16290 -15610 -16666 -17444 -18499 -18315 -18721 -17860 -18516 -17589 -16966 -17540 -18643 -19182
805 -19182 -20207 -19776 -19551 -19189 -17601 -17891 -18058 -18509 -19939 -19987 -19048 -19424 -19052 -18245 -18114 -17728 -17781 -18282 -18670
824 -18670 -17948 -18096 -17627 -18122 -17699 -16745 -17017 -16365 -16640 -15213 -15893 -15305 -15233 -15130 -14835 -14162 -13608 -13543 -13594 -12922
844 -12922 -13349 -12227 -10944 -11134 -10521 -9907 -10382 -10900 -10618 -8767 -7641 -7796 -7326 -6573 -7115 -7678 -7975 -6768
862 -6768 -6204 -6012 -4234 -3295 -3228 -2122 -2220 -2319 -1753 -1616 -1560 -2068 -1063 -596 161 516 2112 3301 3465 3842
882 3842 3285 4420 4703 5403 6161 6034 6168 7018 7303 8240 10142 10923 11121 11625 10594 11347 10919 12025 13199
901 13199 14529 15007 16068 16229 16093 16038 15782 16194 17767 18397 19022 19824 20654 21241 20462 21135 21738 22114 21618
920 21618 22067 22662 23604 24573 24649 24967 25913 25726 26149 27195 26649 28132 28623 28706 29222 29073 29881 30262 31246 31873
940 31873 31157 32013 33128 32654 32668 33215 33497 33970 35021 34937 35029 34830 34539 34338 34460 35632 36597 36532 37037 37768
960 37768 37417 37263 36895 37516 36340 37460 36828 38385 37849 38085 39469 38762 39865 39188 38764 38728 38086 38829
978 38829 38290 38957 39218 40085 39941 39727 40002 39242 39620 39511 40113 39560 40080 40146 39675 39425 39539 38803 38393 39240
998 39240 38843 38575 38338 38260 38861 37675 38532 38476 38175 37479 37190 36213 35929 35331 35414 35606 34945 35693 34894 34861 34338
1019 34338 34553 33434 32417 32570
1023 32570
##PAGE= T1=0.0029808
##FIRST=     0,             0,               0,               0
##DATA TABLE= (T2++(I..I)), PROFILE
0 0 0 0 0 0 0 0 0 0 0 0 0 0 0 0 0 0 0 0 0 -2 0 0 3 0 4 1 2 -3 2 -1 1 -2 6 -4 3 -4 3 -7 7 -9 7 -9 13 -14 16 -14 15 -15 16 -20 24 -26 26
54 -29 33 -37 45 -51 55 -67 81 -102 121 -156 222 -343 687 -4551 -9807 -6103 -3573 -2564 -3293 -4207 -5276
75 -5276 -6601 -7729 -6566 -5765 -5434 -4606 -5097 -4554 -4730 -4454 -5844 -6710 -7390 -8502 -8495 -6471 -2798 221 728
94 728 1136 -313 -3705 -6468 -7816 -9216 -9466 -9028 -6535 -5222 -4499 -3739 -2410 -3443 -3550 -5734 -6597 -7662
112 -7662 -8451 -8436 -8334 -6451 -4075 -4092 -6637 -7488 -9807 -11483 -10255 -9865 -8351 -6509 -5845 -6808 -8109 -7482
130 -7482 -7938 -9084 -8786 -9779 -10781 -11443 -11106 -9723 -9231 -8389 -6428 -6381 -7642 -9127 -9446 -8893 -9922 -10503
148 -10503 -10508 -9434 -8230 -6022 -5418 -5420 -5535 -5941 -7218 -9080 -10012 -11066 -11047 -9928 -7823 -6318 -5243 -4464
166 -4464 -4848 -4369 -4495 -4385 -4710 -5326 -5493 -5085 -5796 -6241 -5904 -5471 -4947 -2965 -3456 -4864 -5022 -4289 -3645
185 -3645 -3979 -3689 -2532 -2755 -3704 -3772 -3852 -2476 -3046 -2160 -2006 -200 -344 -1668 -2219 -2569 -3624 -3612 -3661 -2782
205 -2782 -1635 -572 1454 1297 832 514 -203 -598 -2506 -3244 -3336 -2090 -1409 0 683 1855 2310 703 -948
225 -909 -625 -1128 -1048 -392 -784 -1410 -2361 -3314 -3999 -5540 -5842 -7187 -7073 -5965 -4551 -3516 -2721 -1871 -3549
244 -3549 -5219 -7545 -9418 -12152 -13597 -13018 -12258 -10525 -8404 -7100 -6425 -7034 -6952 -8931 -11040 -13283 -14418
261 -14418 -16064 -15488 -14762 -13724 -12445 -10291 -8912 -9797 -10425 -11034 -12290 -12061 -12761 -12268 -11744 -12759 -12321
278 -12321 -11132 -10655 -8677 -7173 -7657 -7750 -7805 -7828 -8219 -7434 -6869 -6691 -6732 -5857 -5828 -6756 -6490 -5683 -4816 -4315
298 -4315 -4590 -3554 -2934 -2276 -2124 -1990 -1608 -1518 -1408 -2585 -3476 -2866 -2471 -2592 -1058 -24 -346 107 708 1026
318 1026 228 1623 953 -108 -576 181 68 264 480 1467 1980 2554 2384 3062 4078 4897 5389 4569 4993 4971
338 4971 5045 5204 5089 5705 7209 7979 9249 10019 10054 12188 12084 12454 12928 12843 13419 14016 14892 15043 15827 16388
358 16388 17838 17753 17844 19066 18625 19749 19963 20435 21528 20580 20533 20958 20887 20746 20496 20314 21252 20937 21915 21747
378 21747 21422 22372 21696 20825 20488 20143 19205 18500 17787 17935 17880 17739 16997 16813 16375 16352 15705 15209 13603 13378
398 13378 12328 11608 10850 9987 9840 9619 10127 8924 9669 9433 9396 9409 8211 8449 7363 6988 6517 6253 6281
417 6281 5887 6669 6217 6118 5541 6426 5285 5834 5958 5939 5782 5278 5092 6124 5426 5752 5132 5617 5529 4774
437 4774 5155 4949 5465 4711 3970 3696 3519 3042 2050 1390 1321 642 598 -344 -227 -376 -295 -617 -1611 -3298 -4081
458 -4081 -4089 -4667 -4655 -4616 -4764 -4692 -4599 -4729 -5681 -5776 -6059 -6161 -7302 -7405 -7290 -7678 -6887 -6855 -5618 -4973 -4546 -4357
480 -4357 -3820 -4331 -3673 -3075 -2474 -2134 -1602 -1786 -1484 -55 978 1587 2657 4003 4951 5493 5645 5743 5746 5931 7280
501 7280 6905 6818 7547 8328 8405 10193 9931 11520 11625 12254 12318 11604 11421 11540 11776 11302 12665 12162 12504 12840
521 12840 13318 13796 14409 14991 14584 15038 14765 14726 15405 15757 15580 15338 16796 18110 18493 18890 20233 21702 22493
540 22493 22886 23297 23997 24423 26232 26632 28323 29828 30733 30805 32155 32253 33527 34114 34114 34936 36122 36901 37999
559 37999 38571 39092 40210 39766 40041 40155 39735 40181 40762 41202 41158 41217 41856 42141 41419 41421 41417 41018 41095 40263 40604 40765
581 40765 40622 40483 40437 40325 40874 40519 40407 41487 41822 41953 42192 41641 42665 42650 42414 42145 42799 43241 43883 43885
601 43885 44200 44787 44521 45362 45572 46232 46180 45815 46407 45454 44516 44109 44734 44593 44558 44971 44827 43840 43519 43355
621 43355 41427 40212 39287 39168 39340 39042 39509 39299 38361 36480 36142 35352 33327 31720 32231 32064 31899 30962
639 30962 31308 30971 31207 30426 29442 28848 28293 28456 28773 28741 28990 28891 29174 28039 27212 26998 26605 27599 28069 27841
659 27841 27652 27398 26642 25499 24756 25328 25152 24577 24956 24916 24725 23554 22694 22408 21631 21423 20971 19178 17922
678 17922 17250 16414 16318 15974 15482 14238 14677 12953 12807 12249 11152 10225 8634 7244 7008 7202 7478 8021
696 8021 8142 8821 7870 6440 5135 5181 4884 6013 5971 6395 7225 8110 7870 6977 7287 7051 7631 6693 6880 7927
716 7927 7710 7301 7406 8471 8614 9263 9500 8483 8057 7961 8040 7583 6875 7485 7384 7820 8229 8276 8073 8119 7902
737 7902 6714 6369 6250 6021 7113 7313 7989 8010 7772 6575 6770 7881 8189 9108 9337 9602 9956 10615 10568
756 10568 9832 10558 10940 11494 11620 12625 13806 14241 14995 14689 14892 15372 15596 15558 16261 16803 17072 17121 18670
775 18670 19875 20090 20417 20702 21015 20900 21058 21487 21302 22018 22317 24475 25123 25623 25988 26280 26233 25630 25375
794 25375 26533 27655 28167 29882 29971 31743 31543 31726 31237 31268 32559 33511 34352 36180 37233 36862 37467 37412
812 37412 36795 37875 38854 40382 41834 42070 43539 42818 43162 43252 44116 44591 45237 46126 46119 46851 48051 48892 48663
831 48663 49962 50680 49983 50340 51258 52150 52776 53546 53992 54555 54484 54895 55668 56609 57421 58635 57397 57230 57408
850 57408 58316 58777 60891 61331 61433 61209 61051 59943 59961 60940 62044 62974 64214 64831 64450 64208 63905 64515 64017
869 64017 64194 63681 63659 64279 64780 65930 65138 66114 67459 66910 66799 66099 65711 65572 65515 66150 66938 66636 66305 66392
889 66392 67534 67707 68311 66909 67279 65937 65400 64330 64375 65949 67080 66817 66019 66114 65291 64638 63671 63582 64014
908 64014 64763 64508 63830 63797 63038 63425 62767 62883 62705 62520 62221 61471 62044 61377 61180 61697 60865 60714 60246 60226
928 60226 59001 59558 59850 59188 58278 58512 57346 56069 56564 56928 56739 55291 55374 54445 53298 53746 53374 52803
946 52803 52639 52107 51906 50406 49588 48475 48670 48155 48667 49280 48346 47521 47150 45939 44772 43978 43611 42472
964 42472 42364 43349 42173 41979 41405 41784 40797 39788 38635 38417 37102 36745 36338 36424 35549 35209 34047 33862
982 33862 33331 32635 31725 30944 30752 29810 29461 28599 27680 27104 26491 26664 24830 24596 24271 23063 22615 21692 21689 21828
1002 21828 21406 20401 19594 18752 18022 16663 16133 15303 15466 16032 15413 13539 13723 13010 12042 11471 10786 10240
1020 10240 8911 8605 8658
1023 8658
##PAGE= T1=0.0030176
##FIRST=     0,             0,               0,               0
##DATA TABLE= (T2++(R..R)), PROFILE
0 0 0 0 0 0 0 0 0 0 0 0 0 0 0 0 0 0 0 0 0 0 2 -1 3 -3 2 -1 0 0 1 -4 3 -3 4 -6 6 -5 8 -8 9 -11 12 -12 14 -14 18 -20 21 -25 25 -30 31 -37
53 39 -39 46 -53 58 -68 75 -86 102 -120 145 -179 239 -351 638 -3668 -6217 -2862 264 2845 5631 8095
74 8095 8162 5896 1227 -1932 -5164 -7311 -7971 -7620 -3018 656 4316 6983 7755 7040 2153 -3004 -5820
91 -5820 -8515 -7729 -6539 -3784 -1521 -62 1227 488 840 -710 -298 -556 -1365 -2365 -1854 -1826 -2465 -1985 -707
111 -87 -225 -226 509 30 -203 -525 -756 -2155 -1675 -342 1438 2090 1797 1291 1329 -453 360 -1009 -1007 143 1493
132 1493 2519 3412 4334 5015 4693 3722 3464 2259 1983 1462 674 1029 1529 1378 2348 3870 5162 5705 5897
151 5897 4067 3916 4746 5272 5211 4823 3870 3912 4494 4448 5548 6766 7518 7720 7853 6410 5116 4381 4216
170 4216 4312 3287 4226 4606 5492 6045 6097 5409 4422 3182 2209 -364 -792 -788 -2042 -1186 -1639 -1137 -1933 -2224
190 -2224 -3013 -3901 -4769 -6758 -7681 -9433 -9746 -10505 -11552 -12046 -11695 -11629 -12498 -14430 -15489 -16869 -16791 -17564 -17642
209 -17642 -15287 -15041 -15673 -16621 -17537 -18520 -20040 -21561 -22717 -22680 -23357 -22690 -21134 -20520 -20554 -21256 -21274 -23274 -25658
228 -25658 -25769 -25990 -26198 -26590 -24584 -24270 -23312 -22884 -23035 -25234 -25779 -26687 -27938 -28359 -28375 -27398 -27394 -26676 -24856
247 -24856 -23873 -24121 -24211 -24225 -25763 -26835 -27067 -27999 -27878 -26204 -24939 -24069 -24193 -22998 -22663 -22407 -21299 -22019
265 -22019 -21664 -20422 -19244 -19664 -19036 -17855 -17917 -16745 -18158 -16626 -15749 -15121 -14816 -14018 -12954 -11560 -10128
282 -10128 -8835 -9354 -8682 -7666 -8536 -8066 -7086 -6373 -5607 -4426 -4058 -3492 -2217 -1214 -879 -1055 -1124 -890
300 -890 -1541 -1214 -1043 -486 -419 183 190 286 -202 -184 1470 1090 1136 2068 1708 610 1344 169 -162 -114 -1181 -1691
322 -1691 -702 -872 -580 -521 -333 1288 31 -1554 -2342 -3509 -4752 -6119 -6461 -6088 -6420 -5667 -4579 -5464 -4118
341 -4118 -5763 -6439 -7961 -9433 -10163 -11458 -11223 -12185 -12005 -12154 -12770 -14074 -15659 -16797 -17511 -17609 -18745 -19916
359 -19916 -19400 -20530 -21543 -22395 -23535 -24646 -26730 -28079 -29813 -30272 -30671 -30001 -30004 -30359 -30805 -32069 -34195
376 -34195 -35863 -37433 -38560 -39847 -39804 -40282 -40684 -40016 -40623 -41471 -41975 -42597 -43752 -45489 -46462 -47588 -47854 -47870
394 -47870 -47548 -47160 -47217 -47260 -48429 -49205 -50454 -50399 -51127 -51568 -51804 -52149 -52509 -52408 -51833 -53039 -52999 -53078 -53932 -54414
414 -54414 -54992 -54214 -54377 -54479 -54115 -53612 -54609 -55052 -54699 -55041 -54522 -55134 -54584 -53418 -53287 -53030 -52294 -52104 -52934
433 -52934 -52375 -53443 -53537 -53638 -53280 -52157 -49846 -49182 -48232 -47998 -47696 -47424 -48179 -47527 -46665 -46255 -45903 -44383 -43794
452 -43794 -42089 -41131 -40039 -39959 -38778 -38822 -38836 -37701 -36776 -36540 -35469 -34246 -33649 -32782 -32901 -32183 -31018 -30161
470 -30161 -28992 -27539 -27251 -26222 -26165 -25207 -24369 -23578 -24096 -22964 -22553 -21823 -20229 -19313 -17487 -16671 -15359 -15249
488 -15249 -14818 -14911 -14539 -13428 -12853 -12073 -11012 -10589 -9900 -8370 -7878 -7032 -6810 -5558 -4942 -4609 -3784 -3005 -2870
507 -2870 -1529 -1047 289 76 791 408 488 1943 3010 2575 2737 3849 3925 4941 4146 4538 5324 5635 5388
526 5388 6402 6962 6759 6650 6626 6995 7260 6449 6523 6830 7767 8167 8115 7317 6866 6396 5876 4868 5428 5514 4321
547 4321 4547 4900 4710 5327 3995 3335 3411 1369 158 213 -728 -1130 -377 -1130 -1464 -2182 -3995 -4660 -5054 -6042
567 -6042 -7387 -7860 -8042 -10009 -10810 -11486 -11730 -13773 -13552 -14225 -15370 -16150 -17094 -18532 -19182 -20822 -22378 -23996
585 -23996 -25135 -25543 -26317 -27390 -27356 -28257 -29577 -31341 -33231 -33565 -34483 -35637 -36761 -37158 -38444 -39362 -40603
602 -40603 -41991 -43130 -43606 -45289 -46105 -46370 -46871 -48086 -49666 -50255 -51866 -52208 -53085 -54617 -54743 -55654 -55620 -57575
620 -57575 -58269 -58898 -60084 -60632 -61369 -61329 -61966 -62263 -63433 -64852 -65645 -67047 -67908 -68209 -67888 -67767 -67738 -67196 -68209
639 -68209 -69393 -70617 -70805 -71991 -72589 -72521 -72258 -72349 -73330 -73235 -73197 -72723 -73261 -73868 -73385 -73198 -72818 -73452 -73422 -73714
659 -73714 -73196 -73149 -74043 -73815 -73226 -72682 -72371 -71592 -71257 -70024 -70213 -69751 -69413 -69112 -68645 -69039 -69239 -69512 -67691
678 -67691 -67121 -65699 -64978 -63635 -62603 -62430 -62388 -63559 -62263 -62684 -62208 -60705 -60237 -58699 -57952 -57614 -56523
695 -56523 -56237 -55431 -55126 -54264 -53463 -52882 -51624 -50690 -49544 -48548 -48661 -48303 -48002 -46681 -45908 -44326 -43361 -42750
713 -42750 -42282 -41146 -40497 -39561 -38976 -38838 -38263 -36324 -35917 -35355 -34414 -33086 -31410 -30506 -29710 -29341 -28345 -27944
731 -27944 -28214 -27466 -25460 -23886 -22922 -22035 -21631 -20628 -20570 -21636 -19740 -19694 -18308 -16873 -15501 -14174 -12730
748 -12730 -12211 -11755 -11978 -12207 -11587 -11693 -9398 -7797 -5823 -4674 -3928 -3939 -4104 -2992 -2177 -1569 -770 -210
767 1240 2110 1769 2090 3849 3911 4657 6106 6274 7415 7943 8352 8368 8996 9763 10922 12649 12923 13794 13539
786 13539 13959 14285 14233 14390 15938 16589 17456 18432 20217 20424 21134 20705 20214 20019 20154 20951 21101 22183 24016
805 24016 24614 24192 24819 24539 24938 25087 24848 24978 25039 25616 26119 26721 26115 26835 26500 26852 26578 26950 25650 25745
825 25745 25820 25463 26528 26573 27280 27140 26478 25878 24990 24331 23742 23367 24372 24082 24678 24546 24437 23939 22861
844 22861 21350 20773 19308 20074 19033 18969 19024 18752 18207 17198 16113 14531 13557 13492 12074 11717 12089 11440
862 11440 10473 9292 9206 8297 7001 5539 5007 4195 2829 2151 1152 1098 509 392 -1259 -2704 -3914 -5290
880 -5290 -5836 -7846 -8404 -9830 -9419 -10989 -11363 -12883 -13246 -15274 -16653 -17479 -17780 -18983 -21257 -21687 -22745
897 -22745 -22971 -24179 -25546 -27145 -28637 -30524 -31140 -32280 -33371 -33730 -34352 -34740 -36460 -38634 -40029 -40257
913 -40257 -40837 -41814 -43143 -44069 -44696 -46099 -46994 -47581 -47804 -48909 -50212 -50813 -52310 -54031 -54289 -54973 -55796 -56230
931 -56230 -56321 -58259 -59517 -59212 -60492 -61405 -61806 -61858 -62824 -64132 -63786 -65026 -65583 -65775 -65982 -67507 -68272 -68485
949 -68485 -69147 -69649 -69146 -70511 -70570 -71077 -70920 -71543 -72792 -72686 -73158 -73181 -73705 -74086 -73682 -74391 -73530 -74196 -75040 -75243
969 -75243 -76012 -76347 -77298 -77221 -76458 -75898 -75771 -76088 -76629 -76954 -77487 -77531 -77888 -78301 -77319 -77570 -77582 -78240 -77162 -77286
989 -77286 -77573 -77613 -77576 -77477 -77654 -77785 -77964 -77753 -76425 -76861 -76981 -76435 -75693 -76237 -76247 -74781 -75360 -75693 -75355 -75213
1009 -75213 -74585 -73924 -74145 -73139 -73792 -73521 -73160 -72453 -72357 -72265 -71062 -70841 -70763 -70585
1023 -70585
##PAGE= T1=0.0030176
##FIRST=     0,             0,               0,               0
##DATA TABLE= (T2++(I..I)), PROFILE
0 0 0 0 0 0 0 0 0 0 0 0 0 0 0 0 0 0 -3 1 0 0 0 0 0 2 0 1 -2 2 0 3 0 2 -3 2 -3 4 -2 3 -4 2 -6 2 -9 7 -5 8 -11 11 -11 13 -13 11 -15 17 -19
56 23 -23 25 -31 34 -38 41 -51 62 -79 106 -172 782 3136 6532 7877 6640 5381 2262 -1499 -5510 -7589
77 -7589 -5987 -4738 -2154 2250 6175 10055 10817 8912 5773 2014 -2643 -4918 -5411 -4262 -1178 4228
94 8185 8801 8165 7222 5897 4707 3227 3737 5118 4493 3168 4160 6940 7827 8475 9359 9553 9521 10127 9887
113 9887 9949 9180 9804 9588 9053 10029 11179 11981 11013 10274 9460 8533 8094 8250 9193 10603 11744 12706 13044
132 13044 12215 11919 11148 9723 10202 9107 8421 7291 8267 7613 7898 9831 10363 9874 10808 10705 10129 7331
150 7331 6080 5760 5759 5532 5112 5288 3626 4257 4573 4900 4856 5128 4712 4471 2648 1804 521 336 79 429
170 429 452 1619 1028 902 930 699 -1533 -3740 -4984 -4486 -5141 -4845 -4185 -3923 -3687 -3112 -2649 -3591 -3222 -4261
190 -4261 -5451 -5827 -6462 -6296 -6441 -6511 -5865 -6248 -6415 -6282 -5944 -7117 -7905 -8469 -8026 -7616 -7047 -4759 -4086
209 -4086 -4199 -5348 -5987 -6800 -7605 -6897 -6882 -5656 -3271 -2520 -1249 -132 527 -652 -1819 -1549 -1306 -1831 -1215
228 -1215 841 1925 3293 4007 5259 5012 4957 4752 4010 4379 4881 6131 7413 9600 10974 13306 13397 14924
246 14924 14996 15120 14640 14147 13726 14006 13825 14473 15763 17517 18726 19507 19166 19544 19588 19246 19432 19030 20008
265 20008 20085 20613 21231 20662 19738 20224 20196 20256 19929 20525 20978 21023 21025 21652 20610 21145 21402 19710 20014 19321 18916
286 18916 17889 18179 18645 19293 18584 18501 17433 17625 17395 16200 15840 14509 14426 13503 12907 13236 12467 11854 11439
305 11439 10977 10178 9070 8520 8166 6843 6951 5533 3821 2654 919 393 -561 -1804 -2195 -2712 -2946 -2886
323 -2886 -4158 -4884 -4874 -6658 -8237 -10336 -11796 -12457 -14233 -14026 -14619 -13717 -12912 -14653 -15052 -15358 -16958 -17960
341 -17960 -19262 -20234 -22092 -21845 -21601 -21846 -21394 -21778 -22248 -22553 -23647 -24065 -25247 -24303 -24299 -24475 -24120 -24325 -24381
360 -24381 -25267 -25546 -26250 -27222 -27815 -27958 -27951 -26241 -25158 -24432 -24113 -25055 -25204 -26543 -27917 -27700 -27291 -26991 -25945
379 -25945 -25099 -23982 -22630 -21951 -21981 -22222 -23118 -23137 -23132 -23942 -23747 -22653 -21692 -20487 -19070 -18597 -18901 -18607 -18274
398 -18274 -18072 -18056 -17381 -15892 -15313 -15426 -13484 -12732 -12814 -11477 -11173 -10836 -10331 -9968 -9339 -8567 -7187 -5381 -5005
417 -5005 -4865 -4049 -3873 -3338 -2659 -1685 -1194 -601 1027 2424 3149 3121 4418 4081 4198 4410 4320 5580 6178
436 6178 7491 8787 10150 11378 10287 10452 9938 10265 9824 9707 10809 11734 12860 13627 14419 14393 15604 15322
454 15322 14423 14630 14939 14746 15387 16747 16670 16772 17331 17199 16545 16969 17321 17114 17791 17600 17710 17395 17496 17143
474 17143 16436 16128 16906 16458 16365 16437 16663 17115 16525 16101 16476 16739 15474 14110 12932 13562 13334 12424 12660
493 12660 12490 11288 11604 10604 10457 10112 8028 8065 7133 6988 5858 4405 4454 3296 3018 1810 1188 -134
512 -954 -1359 -2052 -2780 -4125 -5449 -5970 -7107 -8090 -9856 -10629 -10794 -12603 -13268 -14822 -15650 -16901 -17130 -19225
530 -19225 -20512 -21848 -22347 -23449 -23928 -24414 -25549 -26978 -28960 -30427 -31098 -33043 -33520 -34643 -35077 -35566 -36334
547 -36334 -37404 -38546 -39694 -41190 -42381 -44466 -45492 -45796 -46409 -47430 -47912 -48521 -49590 -50484 -51096 -52921
563 -52921 -53829 -54752 -55512 -56073 -56657 -56898 -58292 -58721 -60073 -60500 -60979 -60735 -62041 -61894 -62865 -63526 -63988 -66068
581 -66068 -65550 -66549 -67204 -66405 -67000 -67645 -67191 -67630 -67423 -67826 -69258 -69810 -69246 -68985 -69295 -68860 -68007 -69353 -69610
600 -69610 -69980 -69886 -69029 -68239 -68401 -68267 -67183 -66974 -67460 -67029 -66375 -66082 -65176 -65112 -64233 -64303 -63995 -62510 -63010 -61711
620 -61711 -61835 -60548 -59664 -58649 -57588 -57994 -56825 -56921 -56351 -55842 -55516 -54223 -52477 -51847 -50233 -49873 -49418 -49516
638 -49516 -48611 -48353 -47896 -46605 -45458 -43840 -42924 -41178 -41608 -40117 -39449 -38770 -37975 -36908 -35225 -34483 -33742
655 -33742 -33334 -32641 -32091 -30578 -30291 -29088 -28161 -26614 -24853 -23217 -22630 -21855 -21458 -20272 -20472 -19764 -19130 -18839
673 -18839 -17619 -17087 -16372 -14686 -13523 -11821 -11228 -10677 -10866 -11088 -11071 -11027 -9268 -8713 -7929 -6532 -6271 -4989
691 -4989 -4454 -4557 -4469 -3814 -3582 -2565 -2506 -1767 -1200 -1201 -236 385 552 -348 214 400 1844 2697 3007 3151 3582
712 3582 3535 3122 3303 3981 3529 4021 4443 4997 4179 4704 4843 5136 5916 6026 5108 5125 4564 4800 4157 5265
732 5265 5958 6875 6034 4868 4781 3582 3097 3557 3746 4101 4591 4950 5196 3926 3585 2276 791 -32 770
752 183 188 1459 941 1092 560 -575 -1489 -2829 -2702 -3248 -3473 -3926 -3336 -5031 -5219 -5838 -7151 -6270 -7292
771 -7292 -7499 -7612 -8935 -10128 -10146 -11161 -12264 -11664 -11972 -12775 -13328 -13621 -15160 -16571 -17274 -18661 -19940 -19484
789 -19484 -19228 -20477 -20152 -21163 -22128 -23534 -24611 -26561 -27636 -28670 -28929 -29592 -30259 -30839 -32037 -32430 -34559
806 -34559 -35744 -37027 -37580 -38992 -39922 -40383 -41466 -42334 -42573 -43955 -44674 -46305 -47062 -48124 -49735 -50633 -52307
823 -52307 -52815 -54208 -53868 -54791 -54954 -56183 -58130 -60270 -61546 -63086 -64017 -64765 -65270 -64727 -65050 -66825 -68197
840 -68197 -69405 -71490 -72261 -74078 -75443 -76070 -76195 -77167 -77156 -77353 -78955 -80171 -81952 -83606 -84714 -85320 -86748
857 -86748 -87205 -87169 -87598 -88890 -89560 -90502 -92402 -92920 -94144 -94808 -95248 -95524 -95746 -96977 -96508 -97925 -97312 -97939
875 -97939 -99249 -100264 -100586 -101723 -102292 -101942 -102147 -101963 -102530 -102585 -103103 -103780 -104371 -103948 -104796 -104866 -104437 -104694 -104784 -104595
895 -104595 -104147 -103793 -104544 -104877 -105182 -105748 -105748 -105178 -103729 -103562 -103179 -103129 -103141 -103016 -103094 -103831 -102693 -102219 -101642 -101623 -101479
916 -101479 -100346 -100788 -100179 -99443 -98740 -98035 -98938 -98422 -98230 -98443 -96869 -95837 -95654 -94174 -94386 -93881 -93360 -91905
934 -91905 -91988 -91344 -90745 -90305 -89472 -88501 -87536 -87051 -85957 -84914 -83338 -83474 -83331 -81547 -81172 -79824 -78463 -77882
952 -77882 -77400 -76334 -75734 -74663 -74609 -73085 -71393 -70626 -70280 -68531 -68330 -67728 -66986 -66080 -65352 -64714 -64229 -63509
970 -63509 -62948 -61317 -59347 -58862 -58057 -57724 -57526 -57323 -56478 -54880 -54343 -53629 -52050 -50401 -49909 -49213 -48212 -47222
988 -47222 -47088 -45866 -45185 -44320 -44038 -41863 -41850 -41042 -39392 -38384 -37579 -36957 -35216 -35001 -34935 -33837 -32275 -31344
1006 -31344 -30720 -29794 -29032 -27791 -27284 -26726 -26010 -25105 -23934 -23094 -22686 -21655 -20723 -19721 -19307 -18471 -18103
1023 -18103
##PAGE= T1=0.0030544
##FIRST=     0,             0,               0,               0
##DATA TABLE= (T2++(R..R)), PROFILE
0 0 0 0 0 0 0 0 0 0 0 0 0 0 0 0 0 0 0 0 0 0 0 0 0 1 0 2 -1 2 -3 2 -3 3 -2 1 -3 1 0 4 -3 8 -9 4 -7 3 -6 11 -8 11 -14 12 -14 16 -15 18 -21
56 21 -23 26 -30 36 -43 48 -54 67 -92 128 -225 1101 53 -2737 -1967 -767 2443 6426 10324 12242 11754 10413
78 10413 9105 6786 4447 2390 2867 4543 5989 6736 8274 8755 9067 5424 1701 110 313 -393 2107
96 5188 5975 6922 8521 8322 6633 4554 3763 3020 3386 5250 5449 6430 6405 4579 3251 2232 1550 1953
114 1953 3619 5232 6102 6447 7187 7739 6379 5470 4639 4722 4087 4310 6374 7607 8858 9552 9643 9309 7190
133 7190 6867 7025 6412 6247 7086 7053 7653 7898 9413 9193 8351 8495 8814 5615 4884 5355 4209 4277 4854 5500
153 5500 5767 6722 6649 4470 5312 6050 6509 6216 5718 5240 4053 2658 2496 2911 2704 3566 3530 2030 2046 1837
173 1837 2913 3333 4845 6819 7148 6689 6239 5518 4346 4526 3426 3525 3188 4051 5138 6400 6445 6824
191 6824 6029 4368 2645 2144 2044 2036 3285 3654 4473 5489 5398 4387 3044 3148 3352 1996 1882 1481 819
210 819 1250 2372 2698 2708 3493 3388 1513 497 -282 -489 -779 293 1043 2466 1983 1748 1091 -204 -1089 -392
231 -1249 -1559 -881 800 839 2362 2146 1780 926 352 -302 -962 437 843 1344 1569 1971 1857 1150 135 101
251 101 1062 2021 1086 2361 2706 3109 4369 4255 4525 4770 5062 4564 3075 3460 2416 1632 1999 2809 3362
270 3362 3795 4305 4521 5241 5011 4735 3758 2717 2442 1713 1830 2936 3510 3526 3920 4600 4792 4365 5044 4684
290 4684 5026 5063 4751 5293 4611 4134 4400 4761 3949 3792 3407 4366 4516 4677 5389 5255 6377 6053 5748 5237
310 5237 5282 4553 4144 4593 4979 5447 5313 6539 6954 6387 4980 4912 3787 3166 2704 2837 2418 3366 2644 2594
330 2594 2386 2729 2824 1383 1836 2145 2111 2120 1662 1859 1607 1257 593 286 219 137 133 288 608 979 994 839 802
353 802 269 -599 -1038 -1268 -1710 -1735 -1916 -1697 -1859 -1122 -726 -1003 -947 -1219 -1789 -1835 -2606 -2823 -2892 -2750 -2914 -3278
375 -3278 -3075 -3874 -3878 -4050 -4907 -5951 -6350 -6230 -6215 -6230 -5675 -5238 -4264 -5473 -6298 -7206 -7448 -8474 -8447 -8839 -8443
396 -8443 -7907 -7638 -7867 -7433 -7180 -7266 -6926 -8039 -8752 -8805 -8894 -8843 -8500 -8130 -8353 -6769 -8123 -7179 -7665 -7469
416 -7469 -5584 -5723 -6562 -4612 -4590 -4561 -4217 -4463 -4710 -4921 -4582 -4906 -4063 -3790 -3541 -2438 -1851 -718 -729 -1673
436 -1673 -1961 -2522 -2293 -2370 -2227 -3039 -2123 -1354 -699 457 -1361 -1164 -890 -1759 -2705 -2899 -2624 -2149 -871 -277
457 -656 607 -608 -991 -1080 -1717 -1845 -1533 -1833 -567 466 193 1037 2055 1907 2300 1646 1214 1702 1913 2561
477 2561 3169 4236 4654 4134 4992 4167 4756 4213 4288 5344 5252 5437 6546 6186 6081 6001 6727 7197 6466 6413
497 6413 6044 7226 6779 7508 7371 7073 6690 6334 5215 4495 4466 4757 4638 5539 6801 6710 6184 6428 5374
516 5374 4339 2682 1553 1327 1142 1922 2078 3347 3859 3441 3205 3416 2514 1582 1593 1051 1034 2172 869
536 386 1296 1555 1369 586 477 1002 1113 756 1088 652 552 93 234 -324 157 -299 -39 523 -1327 -1818 -1445
557 -1445 -1954 -2215 -3166 -2102 -2974 -3028 -3616 -4347 -4874 -5538 -6780 -7490 -6996 -7345 -7397 -6858 -7005 -6641 -7711 -8939
577 -8939 -10671 -11123 -11083 -10873 -10856 -10345 -9320 -9511 -10235 -12400 -11812 -12255 -13189 -13205 -13074 -12233 -11847 -12108 -11157 -11637
597 -11637 -12074 -12623 -13771 -13933 -14271 -13788 -13287 -13427 -13445 -12785 -12701 -12870 -14249 -14667 -15056 -14582 -15087 -15573 -15480 -15733
617 -15733 -16194 -15948 -16148 -15194 -15633 -15994 -17181 -16996 -17550 -17577 -17412 -17703 -16777 -17775 -17081 -17536 -17039 -16284 -17656
636 -17656 -16504 -16771 -16275 -16466 -15705 -15514 -15889 -16124 -16346 -15189 -16055 -15135 -15186 -13300 -13293 -13196 -13685 -13725 -13824 -14247 -13473
657 -13473 -13268 -12032 -10884 -10992 -10760 -10739 -11275 -11031 -12333 -12753 -12475 -12478 -11779 -11421 -10269 -9303 -9785 -9759 -9852 -11157
677 -11157 -10596 -10838 -11015 -10509 -10107 -9948 -9761 -8681 -9770 -8226 -7193 -7293 -7120 -8212 -8121 -7410 -7959 -7716
695 -7716 -7410 -6662 -6518 -5806 -4485 -4341 -3897 -2809 -3087 -3908 -3945 -3295 -3078 -2918 -1869 -1272 -832 -688 -167
715 -290 552 823 343 295 -1009 588 677 522 1078 901 2319 2332 1350 1144 1867 1152 1585 1322 1749 1678 550
737 814 1407 1699 2540 3093 3292 2869 2943 2212 2066 1932 2305 2770 3136 3825 4120 4363 4451 5289 4956 5323 4474
758 4474 3852 3084 3747 3818 4426 4828 5106 5702 5258 5424 5665 4563 4403 4560 3609 3421 3354 3765 4535 4824
778 4824 4635 5290 4063 3079 1898 2173 3061 2556 3110 3238 2847 2453 1450 2160 1187 1776 1509 1896 1407
797 1407 804 -60 1004 992 299 -31 -1780 -765 -1973 -2536 -1412 -1017 -918 -749 -1479 -2046 -3483 -3412 -3974 -4107
817 -4107 -3659 -3722 -3916 -4482 -5357 -5061 -5805 -5827 -5065 -6151 -7360 -7251 -6882 -7640 -7461 -6702 -7081 -8938 -8723 -8771
837 -8771 -9738 -9400 -10061 -9445 -9126 -9103 -8973 -9851 -10761 -10834 -11495 -12129 -13059 -12863 -13008 -12963 -12382 -11947 -12850 -13346 -13873
858 -13873 -15586 -15670 -16442 -16507 -16970 -16130 -15158 -15123 -15807 -16907 -17317 -18234 -19225 -20170 -19881 -20066 -19491 -18791 -18871 -19301
878 -19301 -19575 -19449 -20560 -22405 -22470 -22304 -21397 -22088 -21196 -21093 -20573 -21162 -22915 -23562 -23000 -24012 -24057 -23697 -23752
897 -23752 -23773 -23803 -24181 -24178 -24742 -24786 -25090 -25461 -25861 -26501 -26553 -27894 -27128 -26522 -26575 -26135 -25667 -26136 -27107 -27548 -27763 -27983
919 -27983 -28095 -27696 -27158 -26631 -26634 -26746 -27646 -27518 -27440 -28237 -28320 -27922 -26923 -27310 -27160 -25897 -25374 -26495 -27708 -28161
939 -28161 -28675 -27805 -27840 -27013 -27041 -26774 -26865 -26685 -27698 -27586 -28169 -27536 -27167 -26881 -27821 -27458 -26411 -26769 -25640 -24995
959 -24995 -24954 -25211 -25851 -26220 -25839 -26288 -26111 -25355 -24030 -23797 -24150 -23423 -24488 -23436 -23915 -24511 -23846 -24173 -22573
978 -22573 -22603 -22311 -21285 -21166 -22400 -22319 -21650 -23343 -22517 -21366 -21122 -21140 -20112 -19698 -20013 -20555 -20110 -19868 -20222
997 -20222 -19859 -19250 -19476 -19812 -19007 -18843 -17964 -17092 -16085 -16683 -17028 -17412 -17519 -17229 -17297 -16100 -15532 -14903 -13918
1016 -13918 -14796 -13471 -13703 -13563 -13859 -13041 -12698
1023 -12698
##PAGE= T1=0.0030544
##FIRST=     0,             0,               0,               0
##DATA TABLE= (T2++(I..I)), PROFILE
0 0 0 0 0 0 0 0 0 0 0 0 0 0 0 0 0 0 0 0 0 -4 0 0 3 -7 6 -5 3 -8 3 -2 3 -7 8 -12 8 -15 14 -15 17 -20 20 -24 27 -31 34 -33 37 -44 48
50 -52 60 -67 73 -79 85 -96 111 -121 140 -156 185 -214 259 -321 418 -597 1059 -5443 -10052 -3881 -30 3917
73 5419 6233 5512 3278 -310 -2161 -3685 -3041 -2218 315 2815 4117 4894 3843 2514 488 -1796 -3597
90 -3597 -2731 -875 317 3289 6301 5221 3106 2623 1882 -617 -2168 -2567 -2385 301 1628 1731 1469 757
108 757 -1134 -1516 -1624 -615 537 3339 2647 2043 1276 1085 89 -1532 -3087 -2836 -2751 -2793 -1142 1131 2498
127 2498 1976 306 72 -999 -1581 -1785 -701 -838 94 1255 1884 1804 1840 1687 1166 -222 -1032 -1800 -2601 -2500 -2082
148 -2082 -1726 -1024 -926 691 643 1091 1026 -435 169 1466 1413 490 -73 416 -1510 -1022 -411 351 280 118 961
169 961 -1191 -1227 78 654 491 457 1639 537 -1216 -2724 -2975 -3875 -3611 -2977 -2309 -694 -282 559 1815 482
190 -670 -1921 -2529 -3048 -2571 -1141 -949 390 1564 948 525 -91 -884 -1042 -1067 -1192 -1148 -1026 144 771 988
210 988 1926 2777 3324 3728 2538 38 -743 201 526 1157 2054 2888 2585 1693 145 -1217 -1606 -1034 -419 -548
230 -548 5 1137 2065 2038 2461 2207 1623 190 275 555 1733 2867 3267 3358 2390 2645 3046 2218 1106 2050 2507
251 2507 3617 3961 4400 4228 5123 4842 4474 4236 4439 4499 3659 3624 3868 4566 4369 5361 6460 7299 6604 7198
271 7198 6987 5959 5251 5293 3987 4024 4020 3093 4671 5091 5264 5041 5015 4836 4185 3377 3378 3866 3812 3105 2550 3136
293 3136 1830 2239 1954 1082 1554 1361 769 1787 1456 1834 1848 1480 895 846 -498 -1133 -1239 -1256 -1985 -1141
313 -1141 -763 -380 319 231 174 -314 -1242 -1059 -1617 -1334 -921 -962 -644 501 78 -845 -772 -779 -1100 -748 -1419 -1618
335 -1618 -1499 -1273 -1941 -1623 -1811 -2366 -1769 -2357 -1751 -1135 -974 -1451 -781 -1251 -1515 -2119 -2798 -2790 -3378 -3531 -4171
356 -4171 -4098 -4285 -3144 -3197 -3417 -4162 -2711 -2901 -3714 -4066 -4581 -4576 -4120 -3952 -4138 -3469 -2316 -2507 -2898 -2531
376 -2531 -2086 -2913 -2649 -3156 -2401 -2165 -1383 -395 -1145 -170 -97 -641 -1414 -1663 -1055 -641 -1103 284 652 1817
396 1817 2714 3378 2767 3438 3386 3477 2898 2854 3337 4035 4251 4737 5030 5583 5761 5930 5042 6024 6482 7090 6232
417 6232 6965 7043 7394 6546 6172 7051 6299 7085 6751 6820 6888 7413 8533 7891 8367 8655 7884 6836 6682 6242
437 6242 5846 6231 7398 7884 7611 8436 8302 7922 7649 6898 6768 5821 5696 6456 7279 8180 8717 7976 8833 8106
457 8106 7242 6535 7066 6883 7145 7561 7687 8652 8302 8608 8585 8078 7878 6977 6912 7025 6908 6716 8009 8551
477 8551 7911 7570 7181 6334 6269 5691 5264 5822 5635 4765 4713 4655 4554 3851 3462 3303 2840 2854 1988 2266 1724
498 1724 2475 1697 634 -509 -542 -1031 -1596 -1532 -1289 -506 -521 -358 -231 -396 -1094 -1999 -2743 -3840 -4543 -4766 -4512
519 -4512 -3431 -3357 -1588 -1584 -1525 -2810 -3044 -3965 -4420 -4729 -5191 -4417 -3776 -3579 -4268 -4137 -3622 -3631 -3773 -4174 -4030
540 -4030 -3805 -4161 -4920 -4157 -5489 -5692 -5911 -6168 -6136 -6370 -6148 -6755 -7014 -7527 -7807 -7018 -7298 -8070 -7418 -7535
560 -7535 -7490 -7927 -8901 -9183 -9869 -9365 -9009 -9590 -8293 -8061 -7989 -7762 -7826 -8271 -9051 -9595 -9630 -9023 -7857 -6920 -7276
581 -7276 -6052 -5220 -5903 -6699 -6909 -6345 -5580 -5425 -4883 -4255 -4025 -3274 -3492 -3701 -3551 -4173 -3986 -4688 -4330 -3933
601 -3933 -2672 -1918 -1595 -1726 -1644 -2386 -2739 -3352 -3790 -3280 -2455 -2510 -2344 -938 -1050 -1362 133 55 -62 83 241
622 241 -712 -730 -317 784 1348 2183 2572 2703 3850 3536 4259 4917 4954 5293 5818 5869 5823 7050 7422 7207 7391
643 7391 7633 8458 8964 9665 9520 9646 10793 9587 9424 8779 9522 9750 9889 11296 11771 11734 11446 10811 10441
662 10441 9644 9482 9397 9396 10849 11345 12271 12631 12330 12630 12124 11987 11090 10570 10878 11229 11273 11878 12313 13124 13544
683 13544 14284 13395 13449 14035 13735 13399 12970 12905 13222 13593 13717 14666 14716 14908 14852 15447 15050 15264 14627 13930 14063
704 14063 13760 13199 13068 13436 13404 13435 13934 13718 13312 12285 11837 11854 11079 10075 10227 10646 10601 10839 10852 10114 10676
725 10676 8959 8565 8525 9386 9019 8108 7468 8221 8244 7678 7905 8374 8726 8821 8503 7715 6697 6147 6688 5862
745 5862 6015 6982 7026 6704 7229 6351 6071 5611 5673 4761 4928 3208 2936 3320 1980 3064 3475 3288 2331 2437
765 2437 2196 1889 570 -55 -207 -1414 -1032 -1034 -1233 -1065 -215 -1123 -2036 -2559 -2932 -4757 -4279 -4204 -3363 -3687 -3558
786 -3558 -3378 -5264 -5218 -5545 -5792 -5558 -4865 -5344 -5706 -6904 -6310 -6158 -7219 -7026 -7083 -7785 -8395 -8023 -8574 -7818
806 -7818 -7325 -7097 -7526 -8515 -9115 -10272 -10746 -10236 -10320 -9891 -9759 -9029 -9610 -10977 -10415 -10246 -10250 -11387 -10684 -11712
826 -11712 -11564 -11794 -11232 -10660 -11496 -10720 -10729 -12185 -12547 -11707 -12267 -11622 -11123 -11173 -11161 -10766 -11396 -12224 -12256 -11867 -11897
847 -11897 -12282 -11668 -10642 -10220 -11183 -10082 -10082 -10725 -11281 -11894 -12084 -12032 -11581 -10885 -10170 -8436 -8498 -8018 -8865 -9308
867 -9308 -9661 -10268 -10375 -10092 -9719 -9190 -7443 -7366 -7523 -7691 -7741 -8591 -9100 -8628 -7936 -7130 -6611 -5850 -5566 -5781
887 -5781 -6406 -5823 -6670 -7823 -6521 -6073 -5640 -4962 -4164 -4074 -4304 -4231 -4046 -4115 -3373 -2986 -3082 -2896 -3688 -2709 -2691
908 -2691 -1171 -269 223 323 581 173 -236 180 1046 628 1380 2332 2979 3191 3005 2597 2597 3296 3092 3196
928 3196 3281 5203 6252 5784 5999 6302 6375 5030 5381 4824 5712 6582 7616 7967 8517 9160 8369 7944 8173
947 8173 8682 8492 8951 9078 9874 9643 9882 11509 12134 11956 12187 12805 12704 10950 11751 12609 13174 14220 14887
966 14887 15164 15821 15665 15787 14656 15980 15367 15222 15132 16909 17467 17711 17559 18476 18510 17861 17003 17665 18010
985 18010 17836 19481 20052 20931 20386 20243 20003 18973 20242 19532 20563 21025 20885 20769 21314 22319 22366 22064
1003 22064 22732 23138 22513 22023 21357 22093 22572 22206 22861 23189 23142 24086 23460 23475 23916 23289 22883 22707 23684 24022
1023 24022
##PAGE= T1=0.0030912
##FIRST=     0,             0,               0,               0
##DATA TABLE= (T2++(R..R)), PROFILE
0 0 0 0 0 0 0 0 0 0 0 0 0 0 0 0 0 0 0 0 0 0 0 0 2 3 -2 4 -2 2 -1 1 1 2 -1 3 -1 5 -3 2 -8 6 -8 8 -9 10 -9 12 -12 9 -12 12 -13 15 -18 23 -24
56 26 -30 35 -36 45 -48 59 -68 86 -117 168 -319 2106 4284 4919 4655 4351 3375 2835 4038 2429 1167 92
79 499 -190 1319 3573 5028 5367 5418 4377 2121 257 -1342 -2380 -1840 -634 540 1138 2843 2906 1368
98 -436 -2372 -4389 -3419 -2191 569 2428 3398 3972 2712 634 -323 -435 -2079 -3004 -2237 -2420 -2379 -643 985
118 2639 3170 4386 4591 2539 461 -959 -1542 -2192 -1202 -138 1046 2458 2865 2934 860 917 2094 978 -367
138 -217 482 431 1440 2065 2082 2515 2718 1079 -315 739 806 1072 2035 1389 1067 1003 106 1117 1291 1768 1750
159 1750 1275 -456 -1020 -261 491 674 1155 1532 1162 -1 -448 -1478 -1192 -1265 7 311 434 990 965 1214 1210 1443
181 1443 1220 1844 2578 1868 1506 2357 1797 903 761 1308 1291 932 2062 3137 3985 3796 3135 2677 656 467
201 467 -552 -511 427 1770 1114 295 386 -592 -1151 -969 79 -724 -1405 -1282 -1961 -2122 -1425 -1090 -975 -1651 -1414
222 -1414 -1686 -3209 -3872 -4632 -4613 -4749 -4096 -2598 -1871 -295 -10 555 -908 -2386 -3282 -4287 -4407 -3941 -3736
241 -3736 -3663 -1906 111 -239 -591 -1056 -583 -1271 -1896 -998 -1652 -1600 -2019 -1819 -2887 -1911 -2177 -1705 -1450 -1692
261 -1692 304 -1199 -1261 -1854 -1633 -1226 -2100 -1758 -1654 -1126 -1222 -1898 -2035 -2358 -1478 -1865 -1521 -612 -407 -459 290
283 -563 -1489 -1865 -2054 -2308 -2964 -1990 -999 -136 274 1115 1232 1646 991 -210 236 -451 -547 -1385 -1535 -1665 -442
305 262 1472 2085 3079 2620 2230 2166 812 49 267 380 966 1175 1434 2474 2737 2039 2247 2153 2000 1496 951
326 951 1155 1912 1183 1363 920 505 472 -616 136 -508 -301 381 412 1336 970 745 -153 -1205 -733 -1034 -1290
347 -1290 -1834 -1359 -2222 -1520 -898 -660 -115 -124 -240 -1223 -1119 -1753 -1205 -1166 -677 -779 -1211 -1426 -1569 -1372 -2352
368 -2352 -2364 -1600 -1527 -1853 -2133 -1244 -736 -768 -452 -1079 -1480 -3136 -2354 -3170 -2672 -2809 -1833 -1800 -1868 -2040 -3507
389 -3507 -3605 -3573 -3024 -4216 -3215 -2854 -2689 -3810 -3621 -3136 -3540 -4467 -4471 -4680 -4507 -3793 -4051 -3154 -2703 -2118
409 -2118 -2958 -3422 -3857 -3570 -4470 -4766 -5309 -4794 -4712 -4332 -3536 -2425 -2512 -3194 -3223 -4247 -4332 -4627 -5394 -4821 -3767
430 -3767 -2973 -2584 -3151 -2791 -3823 -4182 -4444 -5139 -5344 -4926 -4084 -3607 -3761 -2686 -2123 -2834 -3569 -4460 -5030
449 -5030 -4967 -5057 -4944 -4532 -3663 -2777 -2976 -2224 -2917 -2444 -3071 -3998 -4579 -4513 -3618 -3718 -2895 -3321 -2683 -3078 -2774
470 -2774 -2971 -3787 -2814 -2322 -1616 -1917 -1728 -1678 -2027 -2254 -2569 -3582 -3280 -2702 -2101 -1590 -264 237 869 -283
491 -289 -367 -1726 -2275 -2131 -1682 -1144 -853 -14 -236 490 1059 202 449 336 228 -201 473 -168 515 1089 760
512 760 766 225 78 796 1420 1060 2441 2071 1661 2137 1848 1923 1497 1122 1480 924 1051 1446 975 1607 2804
533 2804 3377 3502 3450 2793 2990 2422 2555 1785 1813 2419 1941 2258 2808 3144 3345 4594 5190 4818 4691 4039
553 4039 3546 2541 2666 1739 2571 3153 2171 2703 2842 3260 2578 3250 3683 3097 3115 2288 1951 1532 1477 926
573 926 1115 75 534 910 1010 1334 1485 2299 2080 2343 1097 722 533 -585 -640 -879 -1153 -1007 -929 -916 432
595 339 359 120 -747 -1655 -1946 -1627 -2452 -2611 -1188 -138 -1072 -1389 -1611 -1618 -2190 -3127 -3211 -3390 -2267 -2377 -1656
616 -1656 -1716 -1960 -1926 -2471 -3923 -4024 -4142 -4024 -3664 -3257 -2531 -1741 -3096 -2668 -2895 -4088 -3579 -4078 -4406 -2802
636 -2802 -2739 -3381 -2982 -3208 -3272 -3740 -4046 -4339 -3823 -3107 -2426 -2353 -2921 -2068 -3059 -3167 -4086 -4385 -5208 -5197 -4773
657 -4773 -5164 -3293 -2586 -2098 -1343 -2411 -2467 -3705 -4262 -5568 -6357 -5658 -5645 -4963 -3584 -3557 -2612 -2289 -3176
676 -3176 -2735 -4483 -5014 -5067 -4800 -5012 -3719 -3460 -3182 -3379 -3410 -3054 -2719 -2554 -3218 -3254 -2517 -3778 -4089 -3086
696 -3086 -3377 -3983 -2321 -2175 -3670 -3577 -3130 -4003 -3016 -2602 -2139 -2511 -3059 -2318 -3340 -3370 -3420 -3691 -3166 -2179
716 -2179 -1933 -1735 -1960 -2631 -2359 -2891 -2808 -3029 -2424 -2657 -1714 -1197 -436 -256 -1311 -1713 -2650 -3097 -2393 -1157
737 -1329 125 -321 -86 -965 -1251 -1349 -329 -419 385 486 386 -149 -183 -305 -354 85 -102 574 423 387 360 500 761
760 761 702 857 1196 1345 1038 1149 1209 1644 1105 1951 1872 2629 3282 3737 3590 2937 3451 2438 1339 1362 1429
781 1429 2907 3383 4632 5471 5147 5337 3690 3022 2397 2979 3363 3761 4650 4931 4550 5012 4715 4311 4357
800 4357 4594 4987 4606 4477 4866 4537 5027 5325 5309 6282 5879 6107 5496 5626 5954 5747 5402 5810 6280 5928
820 5928 6593 6619 7533 6479 5827 5960 5494 6125 6590 6849 7076 7301 7510 6727 5431 5538 5242 5749 5641 6012
840 6012 6179 6183 6965 6425 5951 5176 5163 5471 5343 5814 5814 5473 5445 5683 5461 5704 5547 5821 4784 5024 5466 5140
862 5140 4810 4961 5699 5240 5416 5471 5723 3701 4054 3443 3659 3319 4118 4321 3526 4453 3941 4132 3388 2720
882 2720 1866 2000 2225 3072 2574 3720 4233 3863 2158 2103 1730 2021 2403 2197 2285 2277 1438 2669 2360 1916
902 1916 2520 1875 2069 891 1694 580 1339 1714 1936 1279 1095 1212 908 1 611 669 520 204 497 658 425
923 425 593 -719 -582 -1115 -1252 -1661 -2495 -1470 -917 276 361 -938 -775 -2272 -2526 -3229 -3523 -3030 -2153 -1462
943 -1462 -1367 -1772 -1700 -2167 -2390 -1533 -3001 -3192 -2691 -2899 -2944 -1876 -824 -1609 -2246 -2440 -2948 -3477 -3955 -3797
963 -3797 -2716 -2015 -2387 -1931 -2412 -1994 -2562 -2859 -3656 -3697 -3767 -4174 -4459 -3577 -3016 -2849 -1700 -1376 -2786 -3879
983 -3879 -3354 -4251 -4597 -3379 -2808 -3135 -2971 -2199 -1781 -2939 -2636 -3759 -3404 -3508 -3617 -3081 -3252 -2921 -1969
1002 -1969 -2493 -3392 -3886 -4350 -4657 -5075 -4927 -4133 -4635 -3170 -3673 -3561 -3319 -3238 -3895 -5021 -4359 -4678 -5364
1021 -5364 -5471 -4358
1023 -4358
##PAGE= T1=0.0030912
##FIRST=     0,             0,               0,               0
##DATA TABLE= (T2++(I..I)), PROFILE
0 0 0 0 0 0 0 0 0 0 0 0 0 0 0 0 0 0 0 2 0 0 0 -1 0 1 1 3 1 -2 0 0 1 4 -2 -1 -2 1 -1 1 -1 3 -3 0 2 4 -6 4 -4 8 -3 9 -7 4 -5 10 -7 9 -7 9 -11 15 -12
62 19 -20 21 -28 36 -50 9 -432 -54 -1398 -2816 -1789 -1086 -1872 -2394 -2045 -224 -38 2150 4665 4694 2858 2033
84 2033 1021 -1628 -2315 -1796 -235 762 2759 3773 4124 3382 2929 649 -99 -827 -703 1389 3685 5266
102 5266 6275 4953 2325 848 -1003 -2258 -1660 -1898 -1713 -173 1338 1551 2704 4619 4597 3702 2153
119 2153 817 -190 -2153 -2406 -2240 -956 1568 3168 3020 2709 2092 1930 -12 8 578 345 511 1433 2029 2204
139 2204 4231 4316 3166 2925 2771 2570 936 1321 2703 2674 3135 3099 2510 1884 2678 3037 2945 2182 1276 2140
159 2140 771 -179 1220 2161 2251 1927 1476 -122 -248 -1105 -1450 -1518 -157 1556 1355 1279 659 636 217 90 208
180 208 -657 -23 25 -910 -1363 -1203 -1052 -917 -1151 -792 446 873 1836 3007 1554 2057 1336 -60 -1595 -1684 -105
202 1335 1273 1412 1175 767 125 -337 152 760 -41 580 491 424 865 1161 1359 1089 1477 1022 59 -695 -1596 -1351
224 -1351 -1154 -221 -137 1908 2190 3061 2416 2209 284 -1329 -2227 -2671 -2505 -2115 -668 505 1589 2132 2203 2398
244 2398 712 215 428 -55 274 53 -279 -540 0 390 408 1325 2485 2149 2157 2240 2022 1669 1283 1271 890 1725 1901
267 1901 2198 2483 2764 2717 2112 2233 2703 2920 3216 3661 3470 3543 2702 2254 1604 798 651 830 656 790 1783
288 1783 2924 2756 2983 2969 2021 915 377 -579 -291 -377 -176 -942 -365 486 607 1853 2250 2704 2100 1129
308 1129 995 -680 -1428 -1032 -562 102 1536 1174 1678 1162 932 517 69 262 56 41 -216 -441 -200 128 -656
330 -1541 -883 -748 -1400 -1386 -743 -422 105 394 -348 -587 -1280 -2253 -2776 -2766 -2740 -3826 -2888 -2793 -1885 -1635 -1508
351 -1508 -1486 -1440 -2303 -3075 -3386 -3706 -3591 -3802 -2832 -2846 -2951 -2850 -3925 -3751 -3963 -3885 -3725 -3820 -3598 -2825 -2608
372 -2608 -2917 -2207 -3204 -3168 -3777 -4293 -4193 -3975 -3358 -2424 -2270 -2600 -3090 -2715 -2474 -3230 -2927 -3268 -2299 -2385 -2230
393 -2230 -2415 -2536 -1905 -2159 -1992 -2247 -2753 -2612 -2885 -2073 -1211 -1649 -543 -975 -1222 -1890 -2806 -2917 -3289 -2994
413 -2994 -3315 -1730 -1127 -1799 -1480 -1113 -1405 -1880 -2582 -3240 -3085 -3284 -2731 -2448 -1651 -631 -404 -782 -567 -1012
433 -1012 -1530 -1898 -1811 -1540 -1449 -230 1427 618 361 879 582 -641 -1401 -1699 -537 -204 -601 -416 1026 2365
453 2365 2551 1557 966 1700 747 -628 -434 -201 295 490 1150 1490 1342 1402 1063 284 700 1544 1222 1450
473 1450 1254 780 465 -508 -104 -1098 -541 -11 -268 473 1306 1656 1689 2055 1323 639 -725 -1084 -862 -1210 -584
495 948 871 1108 -57 1103 1135 -363 5 -751 -550 -576 -894 -523 63 -1014 -485 -507 -318 -122 -738 -586 206 -236
518 655 -120 -462 -1105 -1805 -1858 -2509 -1910 -1247 -1675 -1556 -942 -1467 -924 -545 -218 -636 -1950 -2292 -3289 -3947
538 -3947 -3730 -3743 -3969 -3952 -2909 -2879 -2748 -1868 -1627 -2235 -2026 -2864 -4391 -4343 -5661 -6072 -5235 -5396 -3816 -4422
558 -4422 -4335 -4202 -4189 -4259 -4609 -4507 -4087 -4274 -5221 -6041 -6828 -6046 -5640 -6383 -6677 -5998 -5613 -6141 -5608 -5147 -4967
579 -4967 -4959 -5438 -5815 -6769 -7206 -8153 -7254 -7573 -7642 -6680 -6484 -6603 -5736 -5809 -6455 -6625 -7518 -8471 -7977 -8237 -8186 -8031
601 -8031 -7240 -6159 -6327 -6906 -7882 -7601 -8104 -8490 -8843 -8155 -7427 -6488 -6662 -6452 -6575 -6959 -7771 -7882 -7909 -8520
621 -8520 -7457 -6925 -6452 -5111 -5646 -5772 -6552 -6488 -7165 -6647 -6839 -6614 -6036 -4988 -4811 -5263 -4624 -5365 -5749
640 -5749 -5112 -5341 -4909 -4495 -3594 -3918 -3930 -4268 -4363 -3907 -5840 -5458 -5276 -5903 -4086 -3653 -3315 -2522 -1400 -2113
660 -2113 -2750 -3706 -4959 -6082 -5339 -5850 -4102 -3598 -2854 -1441 -1374 -1585 -1518 -1619 -3259 -3409 -3772 -3739 -3463
679 -3463 -2938 -2355 -2231 -1135 -1228 -1758 -2582 -1933 -1852 -1848 -1450 -1262 -912 -2037 -2183 -2177 -1940 -1696 -1091 -1412 -1245
700 -1245 -1769 -1868 -2371 -1483 -1608 -1304 -1742 -1262 -2657 -2467 -2920 -1928 -899 -739 -1046 -613 -165 -1159 -1698 -800
721 -452 -1416 -858 -386 52 249 436 66 116 -392 -1652 -2022 -1070 -820 338 1276 562 945 -185 -582 -801 -654
742 -654 -971 911 425 772 175 -490 -44 653 850 1156 1055 742 1810 1166 323 603 527 843 1296 1038 788
763 788 365 1490 1111 1499 2075 1687 2325 1807 2296 1947 1733 1252 538 11 -628 -684 1068 2093 1977 1917
783 1917 1909 710 33 -1472 -1829 -1316 -149 543 912 845 187 101 -229 -170 -590 -699 142 -775 -1516 -1594 -983 -712
805 -712 -733 -559 -497 -497 -1572 -1453 -1760 -2575 -1316 -2756 -1796 -1692 -1848 -1481 -2521 -2226 -2923 -3330 -3700 -3339
825 -3339 -3420 -3603 -2931 -2376 -3268 -3646 -4328 -5302 -5535 -6061 -5685 -5002 -4120 -4286 -3610 -4947 -5061 -5071 -5877 -6018
845 -6018 -5726 -5572 -5847 -5627 -5216 -5959 -5731 -6234 -6003 -6585 -5978 -6160 -6334 -7379 -5755 -6151 -6729 -5575 -6067
864 -6067 -6625 -6657 -7268 -7852 -7836 -8268 -6739 -7550 -7314 -7216 -6312 -6862 -6816 -6883 -8039 -8717 -9695 -8695 -8394 -7385
884 -7385 -6506 -6609 -6833 -7748 -7793 -8484 -8776 -8346 -8220 -7824 -8152 -7785 -7587 -7948 -7456 -7056 -7439 -7352 -8311 -8465 -8614
905 -8614 -8417 -8618 -8638 -7918 -7542 -8635 -8451 -8461 -8327 -8966 -8125 -8141 -7666 -7314 -8142 -8001 -8769 -8149 -8754 -9054 -8919
926 -8919 -9062 -9198 -8339 -7247 -6035 -7077 -7186 -7263 -7894 -9494 -9677 -8974 -8716 -7671 -6513 -6859 -6891 -6905 -6961
945 -6961 -7780 -7257 -7511 -8260 -7348 -7091 -7147 -6761 -5601 -6049 -6759 -7290 -7438 -7824 -8041 -7907 -6696 -5579 -5245
964 -5245 -5515 -5326 -6062 -5709 -5834 -6314 -6370 -6210 -6214 -5582 -5337 -3872 -3853 -3989 -4532 -4037 -4647 -5529 -5663 -4960 -5030
985 -5030 -3390 -3347 -2951 -3653 -3797 -4412 -4414 -4480 -4486 -4921 -4273 -3337 -3643 -3361 -3412 -2877 -3998 -4738 -4742 -4109 -4088 -4393 -4082
1008 -4082 -2549 -1683 -3049 -3379 -3430 -2713 -3645 -3107 -3315 -3009 -1604 -2164 -2216 -1292 -1049
1023 -1049
##PAGE= T1=0.003128
##FIRST=     0,             0,               0,               0
##DATA TABLE= (T2++(R..R)), PROFILE
0 0 0 0 0 0 0 0 0 0 0 0 0 0 0 0 0 0 0 0 0 0 -2 2 -1 -1 0 1 -2 3 -3 4 -2 0 -2 1 0 -1 -2 1 2 5 -3 0 -3 0 -1 6 -5 5 -4 8 -9 9 -4 12 -13 16 -16 11 -15
60 18 -21 27 -36 41 -53 83 -166 1172 3069 2522 841 670 384 -738 -1647 272 1097 1982 3688 3802 2241 -364
83 -455 -1126 -986 -308 357 1931 1773 646 -616 -1300 159 585 1962 4444 6223 6305 4852 3342 1490 -861
103 -724 -987 1001 1965 4197 5447 4900 4878 4535 4646 3140 2713 2914 3344 3564 4192 4571 4240 3855 1736
123 1132 560 1624 2919 4043 4168 2881 2142 1466 678 286 764 2039 1367 617 40 -569 97 388 1837
142 1837 1729 2291 2763 2001 1508 1286 565 1080 2393 3018 4033 5689 5746 5069 4817 4189 3052 1580 -150
162 152 1438 1714 3556 5903 7998 8184 7252 6274 5980 4485 4394 4042 2086 1279 975 2411 3004 5333
180 5333 8291 7896 6276 3517 1612 -845 -1748 -790 285 1362 2316 3765 3229 2872 2825 1485 354 351 -863
200 -678 -797 29 211 -143 424 562 -1084 -1628 -1861 -1674 -1282 -621 -495 -46 -270 -1112 -1046 -1487 -2074 -2454 -2929
221 -2929 -3466 -3590 -3802 -3354 -1348 142 420 309 -685 -2231 -4401 -5444 -5687 -4628 -3985 -3276 -3505 -2810
239 -2810 -2948 -2589 -3034 -2856 -2977 -2781 -3028 -1890 -1913 -1974 -2923 -2496 -3693 -4227 -4193 -4432 -3187 -2034 -682 181
260 349 570 332 -1366 -2324 -2759 -3277 -3111 -1558 -606 101 1447 2750 3174 1890 2254 1681 1044 -563 -521
279 -521 539 596 1631 2823 3457 4292 4267 3088 3412 3223 3821 3349 4113 5041 5776 5028 4694 4150 3767 3245
299 3245 3533 3105 3018 4740 4913 6280 6836 7970 6929 6511 5198 4967 3562 4256 4809 5340 5505 6794
317 6794 7381 7532 7143 6122 7008 7049 7082 6214 6964 7130 8198 7919 8417 8108 7686 7149 6365 6587 7749 7504
337 7504 7790 9110 9135 8550 8771 7941 6028 5637 5641 6038 5058 5409 6056 6340 6282 6938 6441 5567 4519 2907
357 2907 2082 1732 1716 1777 2485 3466 3174 2590 2079 1415 1066 1117 -117 -1580 -2092 -2657 -2067 -1962 -1117 -1385 -1476
378 -1476 -1889 -2428 -1948 -2811 -2563 -3004 -1990 -2235 -2935 -3326 -3466 -4144 -4310 -4636 -5163 -4840 -3881 -3567 -3621 -3419
398 -3419 -2902 -4366 -5020 -5449 -6116 -6675 -6447 -5575 -4883 -4487 -4299 -4207 -4644 -4348 -6107 -6286 -6750 -6917 -6612 -6622
418 -6622 -6425 -6083 -4843 -5114 -5325 -5253 -5969 -7723 -8229 -8218 -8824 -8387 -8004 -7008 -7412 -6957 -6442 -6859 -7905 -7590
438 -7590 -7078 -6777 -6906 -7129 -6412 -5967 -6257 -6363 -6550 -6414 -6244 -6773 -6112 -5635 -4694 -3742 -3751 -2420 -2723 -2450
458 -2450 -2849 -3669 -3666 -3254 -2988 -1402 -601 879 1357 2362 1795 1417 724 469 614 1124 942 2171 2177 2768
478 2768 2480 2407 3221 2805 2945 2832 3312 4735 5367 5353 4846 5112 4722 4008 3607 3306 4267 4699 6343 6612
498 6612 7573 7091 6866 6892 6714 6337 6291 6062 6476 6885 7532 8621 9643 10196 9567 9993 9498 8860 9066 9158
518 9158 9817 9975 11265 11429 12373 12755 12086 12105 13279 12185 11772 11848 12538 12375 12195 12206 12545 11928 12453 11594
538 11594 11253 11098 12277 12416 12466 12813 11853 11459 11133 10265 10443 9736 10206 10696 10967 10428 9938 10033 10084 9279
558 9279 8683 7761 8507 8489 9240 9181 9906 10877 9417 8639 7395 6919 6913 6276 7492 7388 7772 8327 7883 8018
578 8018 7421 6350 6566 5701 5141 4629 3960 4647 3845 4081 3762 4194 3469 3375 2686 3467 2844 1521 1074 173
599 271 -1381 -764 -510 538 1316 498 -333 -758 -1578 -2304 -2659 -2734 -3432 -2312 -2199 -2779 -2133 -3221 -2479 -2461
619 -2461 -2296 -3284 -3691 -2698 -3888 -4184 -4313 -4493 -4105 -4236 -4541 -4624 -3341 -3211 -4599 -4972 -4864 -4932 -6739
638 -6739 -5915 -6474 -6361 -6552 -6663 -6723 -6617 -6204 -6566 -7453 -6582 -7136 -7373 -6858 -7999 -8527 -8290 -8612 -8677 -8161
658 -8161 -8098 -8317 -8569 -8609 -9127 -8930 -8923 -9314 -8658 -8828 -7890 -7918 -7954 -7946 -9283 -9272 -8733 -8785 -9000 -7229 -6357 -6840 -6732
681 -6732 -6299 -6320 -6746 -7438 -7085 -7192 -7347 -6928 -7327 -5671 -5487 -5121 -5287 -5990 -5860 -6233 -6444 -5663 -5545 -5118
701 -5118 -5236 -5214 -4703 -4485 -4480 -3763 -3560 -4213 -3861 -3764 -4176 -3536 -3596 -3096 -1873 -2177 -2818 -2717 -2926 -2679 -2407
722 -2407 -2269 -1607 -956 -577 -357 854 1329 1514 1297 1122 637 966 1049 1469 1598 3025 4656 4610 4480 4801
742 4801 4628 4091 4300 4770 4374 5155 5233 5989 6832 7308 8191 8516 8200 7862 7141 7473 8085 8545 9705 10644
762 10644 10981 10581 9702 10295 11243 10813 11149 11387 11258 11073 12292 13046 13662 14127 14436 14673 14461 13460 13475
781 13475 12651 13877 14778 15554 16418 17146 16584 16617 15803 16977 17375 17060 17298 17332 17134 17154 17286 17922 17648 18210
801 18210 18006 17603 18291 18636 19160 18812 19020 18642 18487 17570 17809 17429 17287 18261 18684 18577 18997 19785 19254 19197
821 19197 18879 19479 17934 17532 17218 17416 18185 18690 19319 18900 18694 19047 18258 17241 16548 17450 17987 17903 18189
840 18189 18641 18834 18101 18065 16105 16308 16421 15542 16477 16413 16586 17248 16902 17381 17469 17054 16357 15574 15042 14906
860 14906 14518 14898 14811 15435 15716 16003 15587 15871 15196 14885 14080 14018 13713 13635 13675 13607 13944 13256 14036 13243 11923
881 11923 11179 11199 10850 10753 11178 11535 12329 11784 10763 9938 8856 9162 8120 8657 8966 8559 9309 8527 7856
900 7856 7547 7153 6735 5995 5580 5980 6378 6565 6417 6530 5565 4911 4438 3869 4124 3002 3864 3412 3110 3066
920 3066 3492 2930 2016 2281 1965 1600 730 -357 -377 -969 -1164 -200 -111 401 -152 -923 -1722 -2979 -4008 -3658
940 -3658 -3416 -3060 -2256 -2252 -2867 -2870 -3671 -4445 -4727 -4436 -5258 -5794 -5879 -5736 -5273 -5451 -5259 -5965 -6226 -6270 -6468 -7444
962 -7444 -7358 -6548 -7536 -7317 -8011 -8415 -8832 -7768 -7996 -8290 -8349 -9246 -9880 -10478 -11158 -10023 -10477 -9849 -9929 -10152
982 -10152 -10868 -10703 -11602 -11349 -11093 -10064 -10356 -11248 -11341 -10752 -11698 -11434 -11519 -11532 -10863 -11506 -11132 -11547 -11517 -11314 -10674
1003 -10674 -12309 -12358 -11892 -12309 -12932 -11998 -12112 -12190 -12302 -13298 -13447 -12724 -13025 -12931 -12222 -13099 -12620 -13226 -14374 -14448
1023 -14448
##PAGE= T1=0.003128
##FIRST=     0,             0,               0,               0
##DATA TABLE= (T2++(I..I)), PROFILE
0 0 0 0 0 0 0 0 0 0 0 0 0 0 0 0 0 0 0 0 0 1 0 0 0 1 -1 0 0 2 0 -2 1 0 -3 0 -3 0 -2 3 -3 6 -2 5 -4 4 -5 5 -6 4 -7 4 -8 7 -11 10 -12 16 -15 16
59 -19 17 -26 31 -39 47 -63 100 -195 1074 1051 168 -28 444 912 1991 3559 4713 5502 4888 3465 773 -759
82 -710 141 -254 503 1379 1528 1165 -540 -1101 -756 1887 2387 2281 3297 4061 1083 -1205 -1985 -2981 -2775
101 -2775 -2066 1080 2468 3320 4824 4828 2949 1036 1538 1259 387 364 1230 1800 3012 2141 2584 977 258
121 77 -346 481 2771 4092 3675 3077 2199 1034 654 1780 1559 1589 2993 2456 1279 752 1829 1519 2653
140 2653 3016 2597 2337 1531 1620 485 411 401 1831 2955 2766 2903 3022 2205 931 -427 -2289 -2237 -2555 -3310
160 -3310 -2107 -93 2191 2603 3320 2569 989 -703 -2049 -2488 -2675 -3019 -2619 -2447 -1860 -1221 718 2662 3347
179 3347 3884 1854 -759 -3535 -4958 -4934 -3222 -290 1287 915 2265 2035 343 -1247 -2277 -3485 -3539 -3818
197 -3818 -4044 -3467 -1953 -953 -1888 -1747 -2175 -2671 -4130 -4173 -5104 -3917 -2330 -2779 -1822 -2945 -2729 -3016 -4291
216 -4291 -4395 -3889 -3662 -3168 -2863 -3730 -2530 -496 507 917 493 -650 -1832 -2722 -3482 -2138 357 418 2013
235 2013 2218 2460 2495 2778 2497 2436 2324 2880 1940 1967 2535 3522 2813 2384 1798 2323 1656 1690 3572 4328 5005
256 5005 6050 5904 3585 3161 1978 702 85 841 1548 3371 4264 4987 5075 5305 5099 3788 2011 1958 1351
275 1351 684 10 890 2939 3322 3600 3898 4914 3511 3086 2446 2033 1990 2125 2990 3373 4076 3381 2878 3003
295 3003 1083 1586 297 1617 1867 3182 3867 4714 4971 4607 3259 2390 2079 1220 1233 1225 2434 2633 3929
314 3929 3154 3202 2616 1684 1233 938 24 -2 235 -549 -786 -364 -267 -953 -1151 -1521 -2129 -3035 -3590 -4044 -2854
335 -2854 -2375 -3268 -2836 -3243 -5296 -5563 -6451 -7147 -7466 -7957 -7064 -5825 -6811 -5876 -6465 -6489 -7134 -7782 -8875
354 -8875 -10314 -10404 -11103 -9742 -8651 -7858 -7922 -7147 -6684 -7230 -8093 -8833 -9298 -8415 -8943 -9019 -9286 -8078 -7351 -6962
374 -6962 -6098 -5931 -7117 -7223 -7269 -7260 -6519 -6756 -6425 -5709 -5513 -6694 -6616 -5898 -5552 -5689 -4617 -3952 -4722 -4489
394 -4489 -3867 -3322 -4111 -3933 -4158 -5092 -4987 -4602 -4442 -3569 -2377 -1995 -1353 -1842 -2231 -2582 -2716 -3698 -3502 -3449
414 -3449 -2004 -1345 -640 -303 300 704 882 -409 -391 -1372 -783 -168 137 139 1416 2785 3001 2985 2791 3404
434 3404 3790 2331 3331 3677 3241 4333 4102 4929 6326 6449 5370 5670 6593 6434 6126 6594 8141 8415
452 8415 8878 7496 7275 7123 6637 5798 5880 6509 7223 7476 8959 9822 9324 9031 8708 8177 6560 6704 6320
471 6320 6696 7372 7827 8212 8413 8351 7771 7144 6382 7523 7179 6694 6981 7420 7921 7390 6582 6044 5989 4435
491 4435 4495 6168 6679 7314 8056 8169 7473 6919 5935 5294 5361 4987 4985 5415 6270 6099 5922 5880 5897 5437 4560 4105
513 4105 3257 3142 2794 3792 2973 3866 3484 3344 2410 2820 2512 1599 939 799 607 320 376 -229 -216 -420 -1454
534 -1454 -2109 -2962 -3115 -3052 -2800 -2628 -2529 -2928 -3429 -4575 -4668 -4918 -4714 -4223 -5082 -5385 -5190 -4163 -5439 -6178
554 -6178 -6414 -6873 -6915 -7912 -6797 -7125 -6925 -7224 -7507 -7151 -8185 -9234 -10430 -11296 -10587 -10485 -10368 -10301 -9407
573 -9407 -10034 -10770 -11411 -11661 -12547 -13338 -12354 -12874 -13392 -14327 -13948 -13425 -13750 -13396 -14500 -14273 -14397 -14565 -15002 -14845
593 -14845 -15142 -15664 -15683 -15787 -15103 -15451 -14352 -13762 -12504 -12289 -13016 -13961 -13630 -13804 -14051 -14025 -12951 -12570 -12294
612 -12294 -11997 -12215 -11437 -12116 -12486 -13152 -12484 -12398 -13095 -12931 -12630 -12955 -13226 -11669 -11499 -12214 -11503 -11136 -10869 -11298
632 -11298 -11779 -11837 -12193 -11760 -12187 -12276 -10862 -10040 -9873 -9997 -9261 -9099 -9470 -9484 -8568 -9253 -9251 -8880 -9230 -8537 -7366
653 -7366 -7305 -7343 -7043 -5287 -5032 -4718 -5468 -5041 -4369 -4621 -3593 -2762 -2824 -2413 -2223 -1964 -1989 -2377 -2392 -2017 -919
675 -434 57 1170 638 369 1159 567 727 1277 307 707 1511 1692 2650 3615 3320 3900 3492 3541 2889 3486 2787
696 2787 3276 4545 4226 5152 3314 4946 4821 5573 6046 5660 6049 5820 6085 6328 5954 7318 7760 7756 8526
715 8526 8192 7526 6930 7046 7906 8626 8488 9341 10147 9881 9730 9698 9500 9260 9928 8747 7932 8872 9954 9993
735 9993 10675 10525 11376 10309 10244 9704 9512 9751 9689 10156 9554 10152 10353 11479 11202 11175 11426 10315 9511 9299
755 9299 9736 9559 10259 10545 10633 11427 10247 9849 8933 8978 10298 10067 9163 9291 10153 9418 9521 9913 9390 9905
775 9905 9531 8254 7340 6609 5947 6673 7310 7208 7443 7461 6094 6027 5607 5571 5058 4956 4087 4219 4152 4053 3466
796 3466 2912 2698 3324 2565 2131 2114 2054 2810 2128 1491 1088 738 528 -358 -680 -280 132 -151 373 -353 -526
817 -526 45 288 -1139 -2077 -1919 -2127 -3094 -3178 -3062 -2827 -3146 -2587 -3821 -4871 -4792 -5497 -5794 -6418 -5143 -5604
837 -5604 -5677 -5847 -6205 -7077 -8250 -8135 -9003 -8401 -8423 -8652 -8502 -7976 -7910 -8312 -8687 -9351 -9160 -10107 -10656 -10894 -11555
858 -11555 -11354 -11334 -11062 -10631 -11485 -10877 -10930 -11915 -12743 -12902 -14051 -13488 -13517 -13613 -13583 -13260 -12840 -13024 -14083 -13456 -14510
879 -14510 -15474 -16624 -16053 -14996 -14908 -14725 -14501 -14659 -16218 -16573 -17532 -18494 -17046 -16713 -16239 -16098 -15772 -16765 -17023
898 -17023 -17731 -18062 -18194 -18064 -17544 -18413 -18892 -17784 -17235 -18174 -18554 -18661 -18404 -19177 -18678 -19097 -18548 -18451 -18173 -17801
918 -17801 -19084 -18660 -18559 -19043 -19515 -18701 -18737 -19707 -19456 -19305 -18884 -17623 -16877 -16325 -16978 -17168 -17629 -19164 -18596
937 -18596 -18467 -17979 -16779 -15912 -15548 -16128 -17112 -16301 -16013 -17278 -16816 -15952 -16451 -16148 -16108 -14809 -14538 -15100 -14595
956 -14595 -15308 -15040 -15280 -15073 -14355 -15104 -13863 -14283 -14560 -13996 -13631 -13798 -13421 -12392 -13241 -12950 -13420 -13856 -13227
975 -13227 -11978 -10987 -10985 -10383 -10678 -10638 -10405 -10608 -9575 -9622 -9704 -8236 -8342 -8335 -9049 -8408 -7527 -8849 -6973 -7040 -7058
996 -7058 -6854 -6131 -6851 -5891 -5902 -5951 -6655 -6252 -4789 -5518 -5119 -4743 -3388 -4353 -4230 -3524 -3648 -3908 -2394 -1752
1016 -1752 -2170 -2148 -2380 -1863 -2320 -1308 -625
##PAGE= T1=0.0031648
##FIRST=     0,             0,               0,               0
##DATA TABLE= (T2++(R..R)), PROFILE
0 0 0 0 0 0 0 0 0 0 0 0 0 0 0 0 0 0 0 0 0 0 -2 1 -3 4 0 0 -1 4 -1 5 -7 8 -1 7 -6 7 -10 5 -12 10 -14 11 -16 17 -16 21 -25 25 -28 27 -32
52 34 -37 42 -52 52 -62 67 -79 87 -103 127 -154 199 -276 420 -810 4971 12921 11897 10289 4964 2101 -442
75 -2000 -4739 -4811 -4059 -2083 662 4622 8932 12548 12051 9339 4328 -265 -4641 -7268 -6776 -4452 -58 3588
94 6565 7196 7124 4471 1650 -22 -2616 -2552 -237 484 -172 519 1377 240 -431 -514 -1769 -1871 -746 -1040 -1616
114 -1616 -1838 -1948 -1876 -3027 -2742 -1710 366 1010 1580 1658 -28 -1376 -1469 -1583 -120 1077 1055 1587 1346 1077
134 1077 771 775 869 670 700 862 993 1163 1759 2450 4282 5438 5600 6359 6642 5971 5011 3231 1969 919
155 2446 2665 3583 4051 6573 6464 6140 5804 4657 2604 -7 -1220 -1351 -384 116 2859 3671 5226 5444 4363
174 4363 4306 2585 1050 256 -538 467 114 1157 2350 2826 3336 3715 3956 2116 1868 403 92 233 1035
193 1035 1683 1978 2501 1962 1561 358 -576 -1069 -1514 -860 -1881 34 155 1496 1125 1328 784 -267 -2856
212 -2856 -4767 -5077 -5098 -4253 -3025 -1871 -925 -959 -2362 -2985 -4839 -6139 -6598 -7177 -7345 -6394 -4874 -3813
230 -3813 -3238 -1963 -2383 -3871 -5201 -6794 -7993 -7869 -7304 -6394 -5796 -4641 -3254 -3831 -3780 -4153 -4329 -4651
248 -4651 -5475 -5309 -5705 -5048 -5491 -5358 -4472 -4635 -3684 -4001 -3902 -3910 -3929 -3055 -2499 -1524 -1471 -1714 -1533 -1965 -2805 -2726
270 -2726 -2176 -1839 -2106 -2220 -931 -79 -151 111 280 -276 -395 -866 -1634 -1511 -300 747 -525 918 532 44 -562
292 185 263 336 1317 1248 1476 683 1729 1501 62 -236 -9 -405 429 1148 1637 2513 3678 3701 3526 3715 3433 3054
314 3054 2653 1024 1426 1679 2146 2565 3456 3507 4820 4762 4359 4001 3196 2066 844 625 595 492 624 1828
334 1828 1718 1783 2423 1874 1180 100 -37 -624 -130 -972 -837 -1147 -1546 -1728 -2859 -3466 -3542 -3737 -3585 -3558 -3222
355 -3222 -2683 -3667 -3604 -3398 -4863 -5909 -6552 -7038 -6949 -7250 -6859 -5730 -5004 -3981 -4702 -5729 -6478 -7405 -8650
374 -8650 -9741 -10314 -9596 -10196 -9546 -8816 -8271 -8454 -8578 -9194 -9935 -10867 -11772 -11925 -11782 -11301 -10183 -10547 -9721
393 -9721 -11057 -11071 -11410 -11705 -11152 -11892 -11227 -11838 -11459 -11927 -12393 -12459 -12432 -12455 -13160 -12763 -13468 -13078 -12966 -12116 -11704
414 -11704 -12445 -12694 -13899 -13835 -14128 -14658 -14270 -13815 -13987 -13049 -12136 -12469 -11610 -12266 -12154 -12761 -12874 -13427 -13647 -13128
434 -13128 -12052 -11091 -10943 -10187 -10193 -10405 -11104 -11194 -11537 -11024 -10652 -10103 -9812 -8838 -8432 -7523 -7582 -7662 -7438 -8629 -7826
455 -7826 -7646 -7320 -6872 -6507 -6515 -6184 -6839 -6156 -6759 -6149 -6519 -5903 -4788 -4683 -4683 -4199 -3809 -3885 -4663 -4952 -4305
476 -4305 -4475 -3607 -3196 -2945 -2118 -1289 -1664 -1910 -2017 -1933 -2068 -2232 -1405 -610 -484 -191 -15 436 769 474 1004
497 1004 445 862 868 1353 1568 2049 2974 3187 3188 3200 2226 2295 3150 3242 2752 3794 4395 4074 4647 4675 3843 3979
519 3979 3994 3945 3739 4245 4324 4753 5048 5045 4935 4452 3770 4218 3870 5000 4797 5753 5838 4853 4297 4644 3094
540 3094 3374 2875 3594 3308 3384 3947 4438 4099 3827 3266 2706 2782 1908 1714 1874 1939 2743 2560 1995 1713 1916
561 1916 830 323 433 557 -150 -1337 -199 -1608 -1440 -878 -1907 -1397 -2556 -2656 -3139 -4126 -3254 -3567 -4525
580 -4525 -4328 -4887 -5669 -5618 -5484 -5056 -5313 -6151 -6959 -7154 -7491 -8292 -7519 -8152 -7702 -8923 -8943 -9186 -9193 -10648 -10383
601 -10383 -10934 -11090 -10320 -10870 -11550 -11463 -12219 -12963 -12911 -13540 -13759 -14008 -13784 -14473 -14087 -14112 -13930 -13782 -15510 -15670
621 -15670 -15656 -15939 -15549 -16120 -16124 -16627 -17232 -17446 -17347 -17347 -17330 -16647 -17226 -17005 -17010 -17376 -17824 -17874 -18286 -18391 -18080 -18519 -18217
644 -18217 -17816 -18198 -18083 -18315 -18197 -18203 -18967 -18185 -17284 -18330 -18434 -18347 -19503 -20391 -20656 -20140 -19640 -18169 -17201 -16958
664 -16958 -16471 -17305 -17494 -18983 -18797 -18550 -18731 -18493 -17794 -17365 -17201 -17474 -16219 -15973 -15524 -15233 -14763 -15611 -15495
683 -15495 -15935 -17072 -16100 -16274 -15290 -15072 -14098 -13046 -13271 -13051 -13842 -13245 -13286 -13291 -13210 -12046 -12388 -11970 -12314 -12756
703 -12756 -12526 -12253 -10910 -10775 -10297 -9392 -9638 -9121 -9221 -10416 -11025 -10710 -10151 -9715 -8885 -7688 -6839 -6887 -7100
722 -7100 -7228 -7259 -7314 -7139 -7084 -6558 -4958 -4551 -4440 -4797 -3799 -3753 -4033 -4368 -5181 -4969 -4305 -4294 -3043 -2597 -1182
744 -476 -495 -1426 -1804 -2092 -3125 -2776 -2530 -1677 -587 -165 1673 1360 1513 1631 553 -288 -386 -122 389 873
764 873 2324 3002 3042 2550 1804 1608 1251 1856 3547 3764 4828 4820 4421 3672 3743 4047 4009 4500 4561 4750 4087
785 4087 4254 4097 4196 5090 5827 6170 6348 5699 5835 5394 5032 5697 5242 5661 6897 7137 6319 6996 7693 7862
805 7862 7162 6695 5998 5585 6154 7442 7812 7979 8262 8037 7245 6688 6228 8217 7699 7993 8173 7679 7437
824 7437 7172 6192 7340 7154 7654 7177 7246 6209 5464 5015 6027 6353 6183 7031 6546 5499 5509 5392 5085
843 5085 4931 4176 4441 4495 4278 5079 5164 4235 3938 3052 2337 1409 1945 3050 2706 3467 3461 2976 1871 702 -363
865 290 -201 316 673 59 -885 -797 -1830 -2409 -2579 -2469 -2540 -3435 -3595 -4496 -3619 -4364 -4620 -4829 -5081 -5062 -6042
886 -6042 -6686 -6526 -6563 -7021 -8413 -7800 -7519 -8300 -8253 -8272 -9050 -9392 -9600 -10418 -11074 -11409 -11279 -10453 -10497 -11338 -11522
907 -11522 -12278 -12408 -12995 -14518 -13961 -12877 -13462 -14086 -14578 -14477 -15411 -15853 -16049 -16380 -16277 -15964 -16307 -17418 -16766
926 -16766 -17697 -17886 -18270 -18508 -17638 -18607 -18894 -19281 -19569 -20258 -19297 -19330 -19808 -20089 -19956 -20304 -20453 -20867 -21095 -20710
946 -20710 -21132 -21023 -21057 -20570 -20839 -20930 -22238 -21000 -21355 -22982 -23299 -23079 -22012 -22688 -22436 -22134 -21283 -22263 -23255
965 -23255 -23597 -23860 -23346 -22899 -22560 -22779 -22308 -22547 -22424 -22915 -23188 -22794 -23297 -22773 -22832 -22947 -23420 -22485 -22280 -21839
985 -21839 -21026 -21412 -21492 -21956 -22599 -23014 -22045 -22083 -21702 -21864 -21983 -21280 -22138 -21715 -21462 -20535 -21907 -22260 -21492 -21985
1005 -21985 -21616 -21805 -21278 -20774 -20592 -20242 -20817 -21717 -20530 -20660 -20089 -19292 -19581 -18624 -19259 -19434 -18913 -19384
1023 -19384
##PAGE= T1=0.0031648
##FIRST=     0,             0,               0,               0
##DATA TABLE= (T2++(I..I)), PROFILE
0 0 0 0 0 0 0 0 0 0 0 0 0 0 0 0 0 0 -6 2 0 0 0 0 -2 7 0 1 -6 -2 -2 6 -1 7 -7 0 -5 5 -9 8 -8 10 -9 7 -13 13 -17 19 -18 24 -23 27 -31 28 -33
54 41 -43 48 -52 55 -67 77 -90 108 -127 161 -208 296 -523 2748 1728 -4199 -8980 -10391 -8621 -8188 -6093
75 -6093 -4968 -1139 3669 6188 7569 7602 6336 2564 -2970 -7984 -9766 -10075 -6555 -2307 1980 5996
91 5996 8079 7237 4039 1573 -987 -2589 -2468 -2547 305 3580 5363 4208 3741 4271 2470 2384 2355 2411 1568
110 1568 2760 2581 1645 1600 1707 1713 1259 1839 3859 4266 4154 3196 1503 802 -181 916 2230 3056 4476
129 4476 4322 3081 3837 3279 1721 1914 3038 3776 2432 3450 3761 3155 4438 5299 5394 4549 4381 4078
147 4078 3641 1735 878 -243 611 1305 2801 4780 4995 5483 6211 5509 4647 2517 1740 266 -1384 -244
166 634 2428 3737 4087 4056 4177 2336 -468 -1528 -2237 -2996 -3389 -2406 -1621 -644 -200 1301 1237 581 -467
186 -1125 -1979 -3212 -3140 -2939 -2100 -2341 -999 -1624 -1655 -2193 -2989 -4499 -3755 -3252 -3060 -2298 -1396 -53 290 -37 -202
207 -202 -652 -1655 -2615 -3369 -2977 -1775 200 1740 2884 3607 3749 756 -19 -729 -784 -1068 257 794 1603 3360
227 3360 4565 4220 4313 4019 2167 724 101 -1082 35 2221 3365 4741 5500 6355 6102 4469 3413 3514
245 3514 3132 2655 2453 2424 3149 3723 3665 3293 3973 5289 4753 4465 4803 5811 5636 6318 6821 6856 6619 5998
265 5998 5944 5471 5902 6202 6999 7286 6944 7860 8502 8034 8277 7902 7094 6585 6556 6529 6623 6910 7932 7763 7228
286 7228 7013 6481 6288 5646 6458 6429 7238 6468 6184 5713 5209 4900 3712 3582 4173 3687 4194 4350 4327 4628
306 4628 4945 4382 3572 2503 1170 1315 900 -139 -2 601 1105 1939 2060 2202 2740 2357 1173 265 -1125
326 -1952 -2715 -2625 -2537 -1541 -633 -971 -767 -568 -748 -1828 -1215 -2845 -3796 -3077 -3520 -3085 -3094 -2516 -3276 -3666 -3405
347 -3405 -3556 -4301 -3653 -2554 -2865 -2550 -2755 -3204 -4295 -3986 -4461 -5122 -7242 -6354 -5117 -5167 -4246 -3643 -3099
366 -3099 -3896 -3064 -4834 -6336 -6169 -6497 -6493 -6289 -5441 -4566 -4289 -3214 -2086 -3243 -3976 -3992 -4804 -5319 -5826
385 -5826 -5688 -4675 -3488 -3465 -2661 -1974 -2165 -2361 -2179 -1952 -1374 -3 -942 -461 504 36 394 35 413 348 43 376
407 376 741 1281 2291 2686 2872 2629 1732 1499 715 1398 2007 1702 2894 3481 3642 3786 4837 4500 4254
426 4254 4066 3577 4010 3963 3495 4824 5621 7238 7503 7764 6727 6838 6360 5670 5479 6566 7446 7050 7479
445 7479 8014 9441 8662 8560 8485 8463 8548 8656 8318 8981 9470 9811 10138 10011 10013 9715 8952 8924 8736 9788 9788 10055
467 10055 10204 9952 9783 8935 9004 9375 8829 8673 8959 9206 9778 9384 10182 9925 8939 8018 8537 7747 7243 7792
487 7792 8126 7624 8187 7743 7467 7821 6455 6073 4855 5837 5669 5515 6172 5628 5553 5914 6030 5103 4627 3959
507 3959 3022 4278 4435 3825 2874 4141 3361 3365 2144 1477 1945 1093 1605 1200 1139 830 1086 -121 -412 -798
527 -798 -1531 -1709 -1747 -1068 -1800 -1581 -1477 -1959 -2989 -3723 -3798 -4613 -5198 -4880 -4944 -4860 -4811 -5999 -5372 -5901 -6934
548 -6934 -8328 -8093 -8931 -8345 -9219 -8399 -8566 -8306 -8519 -9088 -10251 -9663 -9777 -10675 -11405 -10375 -10709 -11239 -11032
567 -11032 -11223 -11466 -10836 -11191 -12755 -11858 -12247 -12589 -12846 -12435 -12759 -12955 -13672 -13446 -12661 -12581 -12151 -12652 -12853 -13098
587 -13098 -13198 -13517 -13466 -14524 -12960 -13108 -13346 -13144 -12259 -13224 -12967 -13534 -13590 -12866 -13021 -12654 -13327 -13548 -12764 -12403
607 -12403 -12156 -11890 -12851 -12670 -12430 -11892 -11875 -11166 -11625 -10867 -11950 -11317 -11551 -10934 -9920 -10016 -10246 -9620 -10014 -9411
627 -9411 -8888 -8905 -7858 -7296 -7194 -7227 -7641 -7092 -7166 -7513 -7188 -7305 -6710 -5693 -5592 -5420 -4519 -3759 -4668 -3816
647 -3816 -3559 -3819 -3080 -3214 -2502 -2843 -3468 -3792 -3230 -3710 -2535 -1860 -855 341 1334 850 580 244 -341 -610
667 -610 -974 -503 580 1299 1825 2319 2289 3563 3001 3066 3063 3371 2905 3531 2856 2848 2899 3130 4009 4682 4788 5694
689 5694 5711 5797 5277 5642 4584 4814 5561 5426 5466 5346 6121 5235 5432 6021 6293 6709 7854 7069 6971 6665 6040
710 6040 5965 6476 5533 5718 6853 7726 8799 8494 8151 8018 6480 7043 6549 6898 7021 7454 7622 8502 8196
729 8196 7604 7501 7874 7199 6904 6678 6584 6506 6729 7144 7877 8180 7707 7805 6802 5694 5196 4906 4889 5028 6119
750 6119 7450 7527 7601 6992 5704 5339 4816 3936 3703 4087 4678 5474 5909 5409 5796 4440 3299 3093 3215
769 3215 3297 3233 3555 4197 4069 3605 2562 1786 1920 1470 1599 1486 874 488 200 639 289 231 780 1040 1331
790 1331 206 -1837 -1928 -1566 -2039 -1858 -1731 -1226 -1289 -1730 -2741 -1930 -2275 -2992 -4122 -4099 -3924 -4176 -3902 -4137
810 -4137 -3574 -4573 -4863 -6160 -7057 -7044 -6558 -6477 -6020 -6724 -7059 -8611 -9725 -9562 -9563 -9615 -9337 -9387 -10896 -11900
830 -11900 -11081 -11957 -12620 -11558 -11953 -12670 -12596 -12895 -13800 -14515 -14394 -14481 -14696 -15036 -14747 -14319 -15117 -15293 -15476 -15993
850 -15993 -17280 -17319 -17846 -17234 -17957 -17324 -17489 -17663 -18136 -18448 -19746 -20620 -20584 -19533 -19231 -18801 -19463 -19977 -20145
869 -20145 -20549 -21451 -21547 -21366 -20780 -21071 -22240 -21167 -21931 -22360 -21296 -21769 -21764 -21048 -22697 -22785 -23104 -22116 -22718 -22890
889 -22890 -21881 -21453 -21539 -21696 -21552 -21998 -21446 -22276 -21899 -22260 -22377 -21143 -20998 -21306 -21411 -21315 -21103 -22120 -22660
908 -22660 -22079 -21646 -20223 -19854 -20632 -20890 -20634 -20279 -20718 -20697 -20676 -19820 -19476 -18608 -19476 -19272 -18454 -19160 -18813 -19382
928 -19382 -17477 -17415 -17910 -17977 -17571 -16995 -17079 -15754 -15550 -15370 -15072 -14891 -14686 -15248 -14804 -14202 -13438 -13944 -13193 -13747
948 -13747 -13591 -12398 -12256 -13205 -12612 -12511 -12952 -12620 -11125 -10772 -10827 -10381 -10074 -9893 -10323 -10243 -10435 -9518 -8833 -8463
968 -8463 -7700 -7355 -6196 -6791 -6565 -6409 -6270 -5695 -5841 -6056 -4531 -4540 -4022 -3609 -2970 -3857 -3575 -3286 -3550 -3725
988 -3725 -3688 -2508 -2399 -1658 -1932 -2139 -1195 -1014 -1305 -1128 -1020 -345 -487 -1461 -784 560 1189 648 1171 1256
1008 1256 1049 1317 1354 1174 1553 3665 3048 4005 3472 3639 3913 3398 4411 4464 3737
1023 3737
##PAGE= T1=0.0032016
##FIRST=     0,             0,               0,               0
##DATA TABLE= (T2++(R..R)), PROFILE
0 0 0 0 0 0 0 0 0 0 0 0 0 0 0 0 0 0 0 0 0 0 0 0 0 3 0 0 -3 10 -10 4 -5 9 -6 3 -5 12 -15 8 -3 12 -14 21 -15 20 -21 25 -31 30 -33 37
51 -38 41 -52 55 -62 67 -78 83 -97 110 -125 148 -176 218 -281 400 -723 3954 7716 5749 2132 -2242 -5878
73 -5878 -9113 -8073 -5740 -2741 -1458 2124 5127 5066 3283 1870 230 -2469 -4534 -4850 -3291 -197 3096
91 4210 2965 2900 1743 127 -1887 -2587 -1034 -1055 1649 1250 711 -335 -885 984 732 824 760 -431 -1562 -2652
111 -2652 -1501 -1148 97 373 -792 -1554 -2703 -2235 -682 543 -339 432 -1096 -1744 -2609 -3534 -2935 -1392 -994
130 -994 -911 -308 539 -456 -933 48 -724 -2095 -2161 -3704 -3761 -3304 -1844 -1192 -477 871 1343 532 36 474 -115
152 -1195 -246 -110 -890 -1443 -1789 -1987 393 2513 3698 3803 3041 2801 2325 699 625 667 233 607 369 -397
173 -2218 -714 -964 -1888 -1548 -428 -860 -185 610 1009 1116 119 -993 -2710 -3132 -2864 -2468 -1498 -967 -399 -13
194 -1019 -1585 -1373 -1599 -2656 -2300 -882 -1337 -634 -903 -1268 -1031 -164 1119 916 849 -680 -1619 -1533 -1853 -1784
214 -1784 -851 1352 2475 3358 2401 1826 936 339 -1348 -1516 -1308 -1119 -770 -96 785 -128 178 -579 -1559
233 -1559 -874 -905 -1562 -1964 -2001 -1282 -742 -432 -228 -223 -611 13 -773 -590 -1159 30 -906 -1116 -1594 -1236 -1600 -1140
255 -1140 -1623 -1298 -1252 -1573 -1158 -1716 -186 856 1385 520 426 -635 -883 -1903 -1837 -1175 -1475 -619 -111 81 750
276 750 1456 1147 1912 784 14 -1165 -1321 -1243 -1190 -1627 -853 -46 -495 -623 598 438 167 639 1229 933 188
298 425 -889 -535 -1462 -470 -951 -1774 -2040 -2535 -2065 -1326 -1175 -1066 -1512 -1510 -1588 -1818 -3228 -2559 -3019 -2367 -2647
319 -2647 -2052 -1695 -1510 -1151 -634 -674 -1082 -880 -1296 -1928 -1713 -1436 -1432 -865 -1368 -1395 -1364 34 121 -331 -773 309
342 -843 -690 -1258 -477 -664 -685 -317 97 65 337 -1088 -716 -252 -469 -1380 -1053 -374 -866 -1219 -1834 -1533 -2350
363 -2350 -2461 -2285 -2866 -1778 -1801 -1352 -760 -251 -7 -958 -1910 -1704 -1605 -1848 -1497 -192 -55 -401 -530 16 -250 -702
385 -702 -2136 -2249 -2001 -1313 -1414 -676 93 100 -277 -601 -1298 -2256 -1894 -2339 -1238 -711 -844 -500 641 702 583
406 583 -450 -221 -1121 -2455 -1824 -2224 -1701 -1127 -791 -716 -633 -878 -463 -870 -267 -384 -93 -792 -912 -411 -651
427 -651 -27 -727 -890 -1057 -969 -1156 -1613 -1030 -911 -56 955 451 145 224 -698 -520 -1150 -1666 -1542 -972 -963 58 342
450 342 1510 726 133 57 -548 -464 -1246 -1339 229 1288 368 990 1283 -71 -1124 -812 -1530 -1539 -1898 -1120 -880
471 -880 -218 530 1016 1186 142 415 -1187 -899 -1869 -1222 -827 -377 345 -136 294 325 508 59 -1116 -31 -898
492 -898 -1166 -1362 -1003 -744 175 15 -157 -1205 -841 -702 -943 -841 -364 -561 62 -326 -601 -1073 -1643 -2653
512 -2653 -1440 -585 -1513 -214 -42 -139 -25 -379 -1014 -2106 -2727 -3687 -2911 -2846 -2056 -1825 -1430 -292 125 -712 -226
534 -607 -978 -1067 -2183 -1376 -1971 -2083 -1718 -1358 -960 -67 -349 -504 -412 -446 -1064 -1976 -1431 -1732 -844 -1001 -569
555 -569 -522 -1063 -858 -1321 -1378 -2161 -2068 -1684 -775 74 722 858 841 -778 -1860 -2112 -2743 -2154 -2377 -1644 -399 -130
578 1296 178 -537 -643 -883 -1572 -2204 -1148 -70 -154 927 201 -211 -350 -1250 -2106 -3109 -1674 -1327 254 -330
599 658 773 1035 201 -849 -2027 -2133 -2853 -3011 -1824 -654 -15 911 956 1022 510 -472 -637 -1646 -1184 -845
619 -845 -1711 -1415 -481 515 18 204 -624 -786 -1596 -1192 -1338 -1425 -143 -898 -477 77 -749 -1035 -1090 -492 -560 -665
641 -665 393 856 205 546 -144 328 94 -556 4 -171 325 177 364 354 1562 834 -525 -610 473 -9 840 1554
663 1554 1943 2895 1824 1007 -144 -629 -369 -687 -1030 -897 -459 264 1532 1648 1891 1245 1353 256 -781
683 -1531 -1364 -1214 -1187 -685 -478 675 54 -64 817 315 1325 725 -273 -882 -1061 -1643 -1034 -336 442 1036 918
704 918 997 1497 1066 907 235 -22 -112 -593 -719 73 312 939 384 1594 1127 349 -645 20 117 199 228 501 719
727 719 291 414 -223 -237 -163 753 155 687 -382 490 -681 -475 526 292 609 849 554 1679 448 620 1321
748 1321 664 970 67 -191 -746 153 406 1044 1241 1548 1177 586 387 -74 -1267 -537 -920 -1928 -969 892
769 951 717 973 1692 500 19 -689 -1719 -1404 -677 -206 -103 373 1164 436 97 -603 -1119 -628 -1237 -565 -410
790 -410 127 133 196 -1041 -378 -513 -467 -977 -1303 -996 -98 239 983 -14 214 -462 -791 -2239 -2776 -1279 -1330 -60
813 772 1359 132 33 -519 -1466 -1301 -1063 -416 -564 -97 0 54 -561 766 1080 308 227 8 -18 -508 -16 1155 934
836 934 433 285 -343 -504 41 -153 172 372 414 -22 -726 189 -413 -188 -168 851 -974 -2116 -1502 -882 -587
857 -587 10 905 535 193 -844 -1865 -2153 -1840 -1302 -409 -455 918 1051 695 -94 467 -506 -744 -1146 -1092 -1724
878 -1724 -1041 -77 538 -521 -432 -250 -1687 -1200 -1668 -984 -339 -82 -917 -873 -2361 -1693 -776 -705 -204 156 -299
900 -1685 -1758 -1856 -1324 -756 -231 522 682 619 -325 -1172 -1344 -1392 -1369 -689 267 352 1173 586 1109 617 -517 -247
923 225 -1196 -825 416 843 963 459 -82 508 -166 -449 -41 249 526 1348 304 342 212 513 221 -56 640
945 117 -202 42 -650 -1248 884 1389 1125 1458 753 -43 358 -325 -981 -1222 -183 1412 1010 1348 1559 1269 1111
966 1111 -558 -216 -426 -67 -390 1219 1146 791 737 613 678 710 912 742 92 651 784 810 -162 515 702 617
988 617 1254 1390 467 736 391 52 65 1289 1246 1509 2067 2147 1773 743 727 341 -369 -304 904 2355 2481 2604
1010 2604 2389 1662 448 -385 37 547 352 1587 963 1499 1630 1058 264
##PAGE= T1=0.0032016
##FIRST=     0,             0,               0,               0
##DATA TABLE= (T2++(I..I)), PROFILE
0 0 0 0 0 0 0 0 0 0 0 0 0 0 0 0 0 0 0 0 0 3 0 0 -3 0 -1 0 -4 1 0 2 -3 7 -4 4 -6 5 -6 5 -12 10 -7 13 -12 21 -15 19 -20 21 -25 25 -31 33
53 -36 40 -49 51 -54 64 -72 83 -93 110 -124 150 -189 262 -420 1955 234 -4557 -5518 -6033 -6229 -2798 1348
76 4489 5414 5026 4658 1261 -1109 -3643 -5107 -6499 -5071 -2340 953 2892 3762 2694 1280 -1317 -2335
93 -2335 -3397 -2630 -1655 -228 592 1358 1290 305 -558 -256 605 952 676 642 -1214 -897 -123 127 2049 2055 2240
114 2240 2028 1335 987 1958 2857 4219 2861 1039 -190 -223 -1221 -1523 250 1202 975 275 289 -692 -947 -1027
134 -1027 -1292 -1532 -1908 -2220 -1371 -1639 380 1716 2079 2058 2336 1211 -105 -807 -1720 -2051 -2064 -1503 -1806 -1321
154 -1321 -1680 -1124 19 1521 2377 2383 1235 -113 -337 -841 -986 -950 192 749 203 452 232 -70 1165 728 1385
175 1385 1105 2075 2131 1773 1850 1631 112 -1563 -2723 -2356 -1930 -1134 172 874 1279 1436 1045 337 -258 -514
195 -514 173 -384 153 440 -303 -565 -1028 -1118 -882 -1494 -883 -2097 -2665 -3588 -4026 -2697 -2449 -1501 272 866
215 866 1306 637 -939 -1225 -1732 -1819 -2433 -1313 -470 -161 792 1385 1779 200 759 35 -210 -929 -234 -37 33
237 814 669 1770 1258 1351 970 1148 378 1243 1089 428 673 1014 81 -490 145 1133 775 419 -385 -732 -561
258 -561 -1036 -1128 -689 -177 -722 -1886 -2449 -2955 -2733 -2866 -2301 -1198 -711 143 507 495 1100 450 520 -510 -1091
279 -1091 -1471 -1358 -2075 -1780 -247 -625 681 146 -1060 -568 -151 304 -206 391 -5 -478 -811 -1639 -1405 -890
299 -890 -548 -521 -436 -1578 -1116 -318 -47 76 699 160 -861 -607 -1873 -2995 -2717 -2365 -2396 -1834 -1651 -1380 -1433
320 -1433 -1331 -1338 -762 -1913 -1804 -2240 -2076 -1762 -2148 -1355 -1420 -166 -335 -1026 -724 -249 -326 -1255 -990 -1176 -1791
341 -1791 -2165 -1352 -1945 -1457 -1134 -831 -692 -219 -999 -721 -1096 -323 287 -236 -85 -388 -242 -1057 -836 -60 -1099
362 -1099 -725 -601 -442 331 190 622 14 635 -1189 -1874 -2213 -1503 -1597 -1453 -341 -78 -364 -794 -666 -1400 -1098
383 -1098 -954 -1934 -2197 -1897 -755 -159 -89 -355 -836 -1595 -2411 -2654 -3143 -2388 -1761 -1010 -212 -875 -82 165 -1078
405 -1172 -1441 -1543 -1650 -2507 -1387 -991 -662 -76 -652 325 169 -757 -843 -905 -899 -735 -905 -806 -1468 -1370 -810 -1174
427 -1174 -1651 -1561 -1648 -1782 -751 -1127 -639 -179 169 627 197 -929 -1991 -2393 -2691 -3093 -2404 -1617 -1455 -1566
447 -1566 -606 -790 -1209 -1678 -2426 -2077 -2843 -2322 -2660 -1331 -64 437 236 -844 -966 -1466 -2781 -2946 -1459
467 -1409 -842 -1063 -258 -335 -507 320 -1175 -1403 -2619 -2273 -2061 -1623 -1295 -445 -126 -1153 -1207 -1023 -1553 -1004
487 -1004 -1497 -1239 -1525 -1057 -1199 -1624 -1194 -1084 -413 -1164 -1753 -2161 -2594 -2602 -1799 -2291 -1900 -1747 -2275 -2874 -2947
508 -2947 -3328 -3217 -3146 -2141 -2126 -1441 -1168 -1600 -1501 -2523 -2635 -2707 -3658 -5018 -4180 -2787 -1967 -1976 -973 -438 -579
529 -579 -1077 -1751 -2216 -2293 -2837 -3205 -2451 -2895 -2604 -1876 -915 -808 -809 -645 -1467 -1721 -1766 -1799 -2005 -1978 -2077 -735 -1964
552 -1964 -1645 -1686 -1683 -1655 -2338 -2503 -3006 -2170 -1977 -1170 -488 -387 -807 -1120 -1813 -3319 -3521 -4150 -2952 -2247 -1828
573 -1828 -618 -464 -842 -1710 -1459 -2852 -2639 -3295 -3085 -2725 -1117 -624 -859 -448 -1395 -2255 -2847 -3290 -3017
592 -3017 -2591 -1151 -908 272 -262 -78 -497 -352 -2464 -3450 -3246 -2995 -2260 -1834 -1629 -412 381 -135 -1179
611 -1179 -1777 -1985 -3161 -3527 -3243 -2398 -2457 -1508 -1757 -1602 -1055 -1603 -1253 -2349 -3126 -2613 -2793 -2315 -1518 -1266
631 -1266 -1766 -1196 -2067 -2649 -2650 -2230 -1797 -2189 -1885 -1192 -1371 -2337 -1360 -1581 -1204 -1706 -2168 -1951 -1702 -1117 -1266
652 -1266 -1400 -1301 -853 -2523 -2485 -2419 -1577 -1151 -996 -306 -748 -846 -2112 -2846 -2604 -3081 -3127 -2648 -2067 -853 -909
673 -909 -376 -579 -479 -1357 -1447 -1969 -2923 -3349 -3532 -2734 -2232 -1928 -1037 -445 -657 -1257 -1610 -1441 -1915 -1899 -2219
694 -2219 -2754 -2650 -2448 -2027 -1376 -1078 749 -227 -523 -1162 -2025 -1664 -2125 -3314 -2934 -3654 -2686 -3050 -1882
713 -1882 -1672 -1711 -1752 -2380 -2764 -3410 -3381 -2751 -2916 -2287 -2193 -2654 -3036 -3053 -3452 -3274 -2601 -2488 -2425 -3305 -2614 -3018
735 -3018 -3892 -4442 -3397 -2673 -2893 -3178 -2343 -2406 -3777 -3773 -3572 -3952 -3600 -3691 -4427 -3827 -3658 -2693 -2431 -2348 -2526
756 -2526 -2758 -3577 -3562 -3711 -4648 -4791 -3863 -3428 -2718 -2396 -1319 -1630 -2447 -2683 -2825 -3591 -4302 -4159 -4181 -3536
776 -3536 -2477 -2063 -2433 -1591 -1783 -2384 -3382 -3759 -3683 -3266 -3429 -2641 -2598 -3029 -3730 -3646 -4023 -3113 -3539 -3921 -3524
797 -3524 -2755 -3215 -3406 -1884 -2395 -2795 -3751 -3751 -4224 -3975 -3908 -2400 -1932 -1670 -1179 -1943 -2500 -3598 -3395 -3350
817 -3350 -3339 -2625 -2327 -2584 -2137 -1742 -2185 -1996 -2053 -1941 -1842 -2885 -3198 -2732 -2584 -2085 -1852 -2543 -3400 -2922 -3245
838 -3245 -3803 -3532 -2612 -2612 -3348 -3003 -4033 -3543 -3325 -3268 -4247 -3834 -3378 -3775 -4509 -4055 -2599 -2098 -1861 -1898 -1994
859 -1994 -3591 -3985 -4377 -4316 -3591 -2124 -1833 -1695 -1640 -1252 -2988 -3851 -3722 -4029 -3621 -3845 -3097 -3326 -2968 -2013
879 -2013 -1269 -1910 -2590 -2950 -3409 -3152 -3274 -2356 -2689 -2036 -2409 -2594 -3824 -3658 -2143 -2478 -1781 -1730 -2409 -3010
899 -3010 -3839 -3073 -2273 -1686 -688 -1233 -1602 -2589 -3235 -3829 -3480 -2072 -1744 -1841 -830 -535 -1146 -1488 -1919 -2230
919 -2230 -2285 -2730 -2492 -2378 -1728 -1182 -993 -1858 -1621 -2782 -2953 -2915 -1891 -1158 -901 -971 -1465 -1333 -1597 -1311
939 -1311 -1658 -2911 -1962 -1985 -2440 -2315 -2230 -2377 -2056 -1260 -773 -1262 -1575 -1853 -3086 -2835 -3088 -2710 -2678 -1767
959 -1767 -372 -521 -2023 -2917 -2336 -3145 -4042 -3846 -3149 -2799 -2617 -1775 -1800 -2226 -2221 -3078 -3467 -2611 -2571 -2512 -2112
980 -2112 -2202 -1985 -2052 -2620 -2083 -1423 -2334 -2052 -1096 -2192 -2568 -2133 -1707 -1665 -1269 -1438 -517 -1079 -1677 -2631 -2600
1001 -2600 -3461 -3124 -2625 -1587 -782 -665 -1170 -1470 -2791 -3151 -4017 -3657 -2899 -2496 -1840 -1711 -1755 -2240 -1309
1020 -1309 -2554 -2895 -2241
1023 -2241
##PAGE= T1=0.0032384
##FIRST=     0,             0,               0,               0
##DATA TABLE= (T2++(R..R)), PROFILE
0 0 0 0 0 0 0 0 0 0 0 0 0 0 0 0 0 0 0 0 0 0 -1 4 1 2 0 0 0 2 -3 2 -1 4 -3 3 -1 3 -3 3 -5 8 -3 8 -6 5 -7 9 -14 16 -12 11 -15 18 -19 24 -18
56 23 -30 31 -37 44 -46 57 -67 90 -124 182 -348 1782 4946 5867 6015 4729 4724 5344 3559 495 -291 -990 -1628
79 -1628 -3561 -3105 -1303 -473 -173 823 2909 3908 4848 3387 8 -3368 -5237 -6190 -6700 -5024 433 5172
97 5172 5842 5621 4816 2545 1379 -1979 -2480 -2798 -1864 -783 348 1041 3054 2394 2091 2548 2158 -28 -569
116 -569 -1636 -352 434 2602 3367 3065 4287 3068 1229 -499 -11 -506 -977 -842 282 2075 3236 4166
134 4166 5475 4470 1630 -1875 -5612 -7594 -7764 -6198 -3581 -826 2380 3059 3181 2877 1400 -464 -2393
151 -2393 -3086 -3564 -3412 -2567 -1426 1022 1065 1273 1323 655 -367 -675 -1285 -1086 -1053 -415 -45 900 1044 1388 1425
172 1425 2206 1956 863 744 278 402 1398 2193 3149 3356 3955 2162 1249 194 402 580 1928 3941 4372
191 4372 4056 2544 1141 -331 -581 -836 798 1635 1585 2454 2673 2781 1709 759 281 -378 -333 737 7 1439
211 1439 913 630 722 911 209 -52 427 126 206 93 -515 241 566 585 551 1115 1113 535 -27 -85 406 678 542
234 542 1737 3383 3479 3187 1633 490 -1615 -1149 -1732 -893 604 1855 3746 3786 3681 3161 1962 789 -565
254 -457 -88 -47 120 952 1830 1154 2253 1767 1232 858 850 -174 -74 781 666 1044 1457 1044 760 -748 -753 -2417
276 -2417 -1862 -1164 -939 -392 -507 1305 1995 2977 2472 2184 545 556 -41 -826 -581 987 1679 3132 2795 3200
296 3200 2349 2223 1294 1368 893 1134 1205 1062 763 1005 2476 2084 1647 1646 2696 2833 2661 1999 2441 1829 1671
317 1671 874 -408 -938 -274 -192 418 1480 1631 1627 1582 2117 1361 1074 569 -834 -1286 -1986 -2061 -1083 -827 1086
339 979 1963 1500 1533 1658 383 326 -603 -829 -933 -441 -299 -455 -766 -202 -3 900 375 350 -72 1252 890 1008
361 1008 1558 1959 1674 1114 461 714 53 -264 458 319 1288 1455 2023 2141 1523 1964 525 729 -126 -548
381 -548 675 897 1262 1290 2207 2170 1272 719 290 235 301 -64 126 770 1889 2010 2472 2142 1721 886 139 -401
404 -436 -363 284 255 1249 1586 1412 1886 1242 1690 893 709 763 199 738 1037 1963 2569 2517 2213 2182 1935 2253
426 2253 1940 1515 2238 2463 2360 1818 1265 1402 1202 1153 1650 1020 1390 1794 2348 2006 2278 3010 1911 1499
446 1499 1514 639 -136 1031 1901 1710 1473 2344 1355 1353 1166 1295 1355 510 705 906 1205 561 1152 1583 786
468 694 464 -337 -167 270 666 675 1744 1999 1595 634 998 451 333 -340 -630 607 1177 1297 656 2019
488 2019 2172 1874 1841 653 -293 -261 -198 350 294 13 378 862 771 1501 1190 1348 774 1064 1142 679 591 358 173
512 -23 -132 -157 -432 -1014 857 1541 500 538 1017 1639 1428 288 83 -124 -337 -340 139 -431 -42 -111 390 811 2285
535 2285 1117 210 688 237 -178 -550 45 -101 -4 -329 38 454 395 232 320 130 675 371 1131 1333 705 554
557 554 -304 97 573 -187 -189 90 444 -146 1194 922 418 448 657 337 321 -923 -176 -638 -616 -40 -210 868 714
580 714 402 543 697 66 124 209 272 -32 789 92 521 118 1065 303 -305 -510 34 1215 672 2341 3276 2887
602 2887 1609 1212 417 -872 -356 72 624 1807 3220 3814 3425 3125 2577 1329 364 411 -774 -152 1467
622 1848 2298 3209 2484 2661 1345 108 -146 314 856 1391 1774 2044 1957 1612 410 659 176 1122 -130 -1 650
644 647 1483 1932 2089 1510 1304 928 1514 1394 1747 1943 2475 2082 1321 1630 1198 535 1258 895 1623 2766
664 2766 2682 2235 2855 2794 2323 1607 608 560 333 532 905 1299 1935 2817 3105 2858 2310 1188 632 341 161
686 161 -76 561 648 1725 1902 1844 2168 1957 1863 1590 1272 1282 543 1857 814 997 -405 1319 801 1565 2618
707 2618 1898 2618 1507 888 -217 196 1107 800 710 964 1146 1161 1845 1376 1239 465 92 436 -623 786 450
728 450 345 1094 1802 1954 876 337 61 -452 -218 251 214 643 1551 1442 688 557 904 -606 -487 363 -15
750 -226 690 1103 209 -382 -515 -28 -1296 -667 198 697 1078 279 270 -1233 -1481 -977 -1720 -542 594 528 500
771 500 448 184 -462 -711 -1923 -1242 -1709 -1252 -1003 -247 -363 -768 -686 -570 -468 -1089 -1010 -1309 -235 -365 -1448
792 -1448 -163 -577 -832 -1716 -693 -1088 -969 -1524 -1934 -1428 -1390 -1286 -697 -1485 -705 -697 -1422 -2062 -1978 -2584 -2637 -1340
814 -1340 -1151 -698 -532 -15 -598 -1244 -2075 -1677 -1673 -1480 -1291 -248 142 327 -396 -1212 -717 -996 -562 326 170
835 170 -13 -16 -1539 -1324 47 34 -960 342 461 -401 -59 -179 -1163 -996 -761 -1418 -1436 -1143 -685 -148 -592 -504 -210
859 -1032 -517 -837 70 101 -83 186 -576 -1154 -470 221 -322 216 1181 418 819 -483 -537 -611 -685 424 354 147
882 1028 -396 -1122 -538 -540 311 498 1777 1655 915 220 452 -591 -429 -392 -9 703 504 227 759 744 -56 -532
904 -532 -1058 -836 -499 -314 760 2112 1669 674 -162 -304 415 68 437 733 1490 1703 779 242 101 413
924 413 436 1285 976 1158 247 2 456 122 564 965 2460 1435 1875 1440 1313 651 404 88 -82 73 973 1285
946 1285 1128 2036 2866 1604 529 410 1028 666 430 1923 1538 1593 1255 1586 1112 1833 2399 1503 1830 2098
966 2098 1863 835 737 841 460 1228 1536 1725 1181 1248 1472 1079 92 867 1761 1015 1017 1641 2490 486 986 -224
989 780 1125 1267 1506 2133 2105 2603 1641 1620 1386 1682 1687 2414 2040 1977 1794 1735 1972 1654 2321 2392 2678 2151 2008
1012 2008 1783 1521 961 1005 151 540 1198 1227 703 777 1699
1023 1699
##PAGE= T1=0.0032384
##FIRST=     0,             0,               0,               0
##DATA TABLE= (T2++(I..I)), PROFILE
0 0 0 0 0 0 0 0 0 0 0 0 0 0 0 0 0 0 -3 1 0 0 0 0 0 1 0 4 0 4 0 8 -1 2 -4 5 -7 3 -3 4 -3 9 -8 6 -8 10 -10 9 -10 15 -17 18 -19 20 -27 27
55 -30 32 -37 40 -51 51 -62 76 -95 115 -161 235 -455 2641 5386 4061 2180 1177 1259 126 -1040 -2469 -1318
77 -1318 -484 204 2282 4294 3718 2395 3520 4593 3046 -16 -1510 -4695 -6151 -6785 -4476 -2243 1392
95 4679 6018 4374 1339 -1439 -3879 -6385 -6720 -4159 -3058 -1695 924 880 1606 2783 1920 -489 -659
112 -659 -67 -2479 -2963 -1748 -790 1051 2416 1625 -12 -345 -941 -2634 -3252 -878 424 402 1434 3040 5268
131 5268 4722 4957 3940 1407 -2143 -4578 -4752 -3535 -396 2299 5402 6202 6931 4808 2814 42 -1627
149 -2510 -3204 -2180 -1019 -378 1336 2699 3747 3190 1904 657 -515 -357 -1210 -1919 -722 -464 851 765
167 765 -63 651 -1243 -1476 -1533 -1895 -2311 -3073 -2116 -1736 -1064 390 337 782 248 -814 -1888 -540 786 2387
187 2387 3434 3660 3546 1873 -172 -186 -902 -439 329 2110 2460 2203 1430 948 -88 103 -846 -1576 -83 497
208 1290 1195 990 733 -11 -278 423 -395 -343 -261 -522 -749 -1738 -1110 -768 -1177 -1043 -601 -463 -263 -487 -1721
229 -1721 -1409 -676 299 481 890 1573 454 -765 -2004 -2582 -2394 -1566 -781 1663 3117 3894 4210 2906 1509
248 1509 -14 -1315 -1554 -1890 -1403 -584 -19 1045 1635 1255 1470 488 636 -25 445 261 -119 696 811 1327
268 1327 960 1159 -329 -869 -1325 -1497 -1312 -1383 -333 729 1378 840 1048 1109 348 -799 -1548 -3034 -3051 -1834
288 -1834 -999 -468 871 1183 861 1104 93 -1070 -1384 -801 -793 -1239 -562 -589 120 -230 230 532 1615 834 -121
310 500 648 236 752 -205 -10 324 -84 -429 -45 1528 1716 2025 2893 3152 2681 2674 1679 924 -328 -797 -716 -866
332 -866 -1121 33 560 1748 2446 2557 2059 1196 -35 -609 -824 -459 -435 -366 -485 529 307 664 495 1186 260
354 591 394 -568 -140 139 233 -363 460 -40 -333 -946 -534 71 184 1260 1761 1653 1597 1787 2311 1477 1350
375 1350 861 -154 -519 331 506 1577 2176 2859 1590 1994 1031 179 -862 -1267 -9 905 224 1072 1861 1993
395 1993 1400 1526 1039 -78 -564 -782 -769 -552 637 666 818 1049 1543 612 542 408 -263 -561 -1204 -731 -354
417 -319 567 601 656 437 -26 96 224 228 195 122 276 744 719 18 44 708 144 526 1191 809 1116 805 1069 1343
441 1343 725 463 -751 -369 -454 -133 510 533 899 1653 1218 440 678 -165 -946 -32 -81 67 -488 4 627 104
464 333 -363 -101 -913 -1061 -1261 -464 8 -411 -282 -117 -734 -1276 -1738 -1192 -1503 -1571 -685 -473 950 1214 600
486 1493 817 816 -346 -979 -1379 -827 -806 -520 -144 743 75 1334 1667 1544 944 1032 1217 1054 391 765 675 702
508 702 -163 835 868 1283 1269 627 1321 1811 1873 1672 1270 1434 1062 1181 -542 342 -657 347 829 837 1290 1308
530 1308 1706 1185 2441 1428 1317 885 906 760 922 1186 1137 1005 1468 2196 1907 1862 1499 1330 1409 1509 1565
551 1565 1740 1677 1494 1697 1512 1597 1743 1467 2332 1973 2491 2780 2507 2497 2075 2559 2213 1876 1292 1749 579
573 686 1252 2370 2828 2564 2680 2726 2272 1659 1008 2119 1479 823 1768 1650 1905 1150 1049 1223 1598 1415
593 1415 1476 1460 1919 2742 2457 2692 2525 1986 532 -306 96 288 1365 2294 3362 4261 3775 3676 2018 1696
613 1696 315 -175 -68 -43 1070 1925 3202 3221 3734 2508 1456 1443 237 -253 4 1073 2083 2380 1632 1793
633 1793 1920 1307 1008 848 1758 880 955 1642 2348 2567 1994 1924 1510 826 1105 1056 1851 1586 1452 2218 1249
654 1249 1404 1186 782 679 836 1724 1406 2758 2499 2551 1531 1537 1462 247 -856 -960 137 -7 595 1748 2403
675 2403 3140 2371 1675 1239 1306 -48 189 -37 144 770 197 1489 1495 2825 2377 2095 2191 1186 1782 936 731
696 731 880 1375 829 1061 1471 1577 1716 2357 2263 2004 1942 1496 813 357 -394 707 1696 1340 1904 2568 2276
717 2276 2073 1488 894 1209 1333 2094 1240 945 2433 1872 2889 2780 2122 1990 578 560 621 1215 1398 2751
737 2751 2672 2410 2670 1880 1590 542 1030 855 657 1256 1161 1168 1927 2060 649 1223 664 802 829 1452 1994 1535
759 1535 1211 1142 21 -671 214 820 377 1544 1986 2384 1493 496 724 -622 -203 332 937 521 1073 1821
779 1821 1621 1016 1439 1489 1583 1179 1096 1321 714 1092 1034 1017 2122 1745 1449 679 1353 1499 155 1001 959 1472
801 1472 1973 2352 2779 2217 1845 2137 1538 531 643 1976 2196 2522 3658 3349 3637 3850 2549 1848 1948
820 1948 2062 3175 4036 3150 3864 4301 3086 3724 2932 3502 3949 3910 4264 3570 3842 3414 2971 3738 4517 4062
840 4062 4142 3678 3643 4060 3381 3389 3471 3128 3685 3551 3848 3894 4132 4242 4221 4357 3278 3491 3812 3727 4466 4525 4301
863 4301 4465 3681 3151 4206 3809 3851 4685 4541 4247 3840 2347 2692 2886 3564 3695 3752 3755 4216 3498 2332
883 2332 3417 3763 4401 3895 5123 4114 3361 3066 2879 3168 3851 4269 3451 4409 4940 4159 4590 3769 3114
902 3114 3508 3195 3178 4438 4125 4634 4499 4295 3160 2589 3582 3094 3499 4153 3868 4287 4180 3263 3373 2958
922 2958 3555 3304 3222 3211 3833 2698 2711 2867 3894 4018 4721 4621 4727 3476 3323 2864 2534 2182 3203 3261
942 3261 4037 4813 5320 4445 4112 5183 3421 3097 2895 3582 3487 3810 3913 4328 3772 3791 3187 3882 3595 4495
962 4495 3906 3203 3437 2617 2181 2217 2666 2417 2880 3464 3388 2593 2564 2801 2495 1921 2967 3124 3471 3003 2599
983 2599 3341 3240 2293 2416 1993 2623 3583 3595 3716 3206 3620 2422 1702 2212 2622 2436 3082 2555 2409 2311
1003 2311 2389 2449 2236 2473 3030 1726 2333 1591 1982 1371 1591 1491 1285 2448 2859 2326 2351 2053 2134 2362
1023 2362
##PAGE= T1=0.0032752
##FIRST=     0,             0,               0,               0
##DATA TABLE= (T2++(R..R)), PROFILE
0 0 0 0 0 0 0 0 0 0 0 0 0 0 0 0 0 0 0 0 0 0 0 0 0 0 -1 1 -4 2 -2 0 -1 1 -2 5 -4 7 -10 6 -6 11 -11 9 -11 13 -17 20 -16 23 -22 28 -31 34
53 -34 42 -44 49 -58 63 -70 78 -95 108 -128 156 -204 294 -526 2711 5540 2136 796 -486 -2016 -4162 -1987
76 -734 -1940 526 4776 5033 2707 2536 4293 4282 2418 -352 -2408 -3396 -3081 -3601 -4105 -1397 2946 4271
94 4271 4382 3905 3993 1467 -598 -702 -47 -1057 -320 421 1286 897 2444 3467 3481 3809 2671 2206 2823 2891
114 2891 2125 925 1366 1097 -1002 -636 -486 433 349 435 2765 2750 1925 3601 3185 1265 898 334 -766 -1092
134 -1092 -295 -940 -1173 -1903 -1122 -914 -713 947 1939 1531 503 142 -818 -2787 -4204 -4735 -4501 -4721 -3852
153 -3852 -2694 -2080 -697 -1383 -1832 -1882 -2024 -1008 -986 1040 1863 783 -351 -1234 -2720 -4483 -3921 -3370 -2800
172 -2800 -1756 326 2724 2262 2636 2851 2578 2758 2204 1175 198 1436 1801 2939 4358 6305 7386
189 7386 6811 5532 4221 3185 1294 1364 2935 3365 5175 6169 6628 6866 7567 7444 6502 5751 4680 2893
207 2893 3468 4346 5457 5244 5488 6416 7217 7088 7283 9042 9438 8952 9762 9536 8545 7391 7274 6273 6701
226 6701 7651 8227 8285 9296 9148 9687 9994 10540 11246 11076 10665 11485 11571 10507 12376 12187 10949 11492 11149
245 11149 10835 11290 10931 11415 11731 12124 11948 11127 10143 9966 10082 9924 10219 10027 9816 9087 8968 8903 8865 9325
265 9325 7986 7685 6993 6965 6483 6583 6695 7324 6507 5778 6487 6461 5105 4425 4561 4286 4058 3544 2988 2264
285 2264 1609 1580 1482 1790 2317 1759 3415 3399 2873 2514 1082 196 -363 -1597 -2591 -1076 -146 -210 -892 -373
306 -271 -824 -1375 -1810 -2347 -1666 -2587 -3059 -3479 -2869 -2403 -2032 -2232 -2214 -3007 -2185 -1612 -2295 -2971 -1691 -1182
326 -1182 -1443 -1774 -2422 -2246 -2327 -2346 -2726 -1704 -1267 -1257 -822 -406 315 811 215 -174 -270 549 -426 -188 1167
348 905 1834 2305 3320 4176 5134 5230 4593 4053 3847 4178 3253 3693 4785 5560 5431 6994 7396 6528 6891 7728
368 7728 6941 6441 6632 7242 7645 8120 8561 9151 9289 9718 9022 7907 8873 9423 8918 9903 10474 11145 11508 11391
388 11391 10427 10912 11584 11385 11857 12161 12507 12976 13727 14828 15524 16211 15339 15558 15505 16107 16343 16747 16885 17799
408 17799 18560 18837 18747 17871 17856 18939 19775 19054 19196 20105 20067 20216 20549 20480 20083 19835 18984 18567 19208 19107 19393
429 19393 18895 19917 19947 20014 18337 18021 17980 16745 17028 16822 15398 14862 15281 15560 15354 15704 14743 14719 14615 13624
449 13624 12862 13420 13168 13267 12484 12523 12971 12259 11821 11455 12092 11311 10930 10581 10330 9722 9967 9771 9939 10615
469 10615 9640 8834 7718 8008 7817 7545 8104 7950 7976 7509 7723 6364 6345 5831 5208 4281 4002 3347 2722 3098
489 3098 3359 3084 2407 2416 748 -285 -1288 -1550 -1749 -1783 -3056 -2502 -2482 -2544 -3356 -3841 -4428 -5485 -6123 -6873 -6138
510 -6138 -6656 -5862 -5499 -5361 -6478 -6946 -7816 -7825 -8120 -8494 -8687 -8080 -8248 -7392 -7825 -7335 -6762 -7227 -7358 -7755
530 -7755 -6792 -6787 -7485 -7579 -6258 -5999 -5735 -5739 -6732 -5766 -6180 -6426 -6122 -6416 -6127 -4926 -5283 -5944 -5023 -4768 -6079
551 -6079 -5984 -6259 -6425 -6836 -5683 -5769 -5044 -4846 -4575 -4782 -5342 -5924 -6400 -5712 -6093 -6204 -5472 -4216 -3664 -3099
571 -3099 -2658 -1800 -2364 -3039 -3057 -3142 -1919 -1847 -1234 -26 576 1438 1341 2014 2936 3199 4487 3606 4316 4436 5367
592 5367 5460 5788 6470 6266 6980 7375 7864 8567 9393 9859 9003 10307 9842 8850 8952 8898 9616 9373 11098 11787
612 11787 12487 11971 12704 12981 13186 12186 12686 12872 11740 12430 13165 14962 15030 15541 15539 16126 16486 15770 15932 16233
632 16233 17549 17949 18804 18644 19028 20462 19833 19975 20106 20383 21110 21546 21849 21396 22508 23306 23988 23362 23090
651 23090 23628 22691 22054 21134 21052 21638 22109 22226 22436 22944 23333 23177 22407 22458 21663 20452 19412 19025 19248 19452
671 19452 19566 20663 19973 20625 20746 20307 20581 20378 19420 18491 18372 18244 18012 18851 19155 20413 20496 20461 20783 19684
691 19684 18974 19000 18352 18471 19113 18843 18864 18320 18386 17965 16883 17589 17362 17223 17151 16945 16906 16432 15185 14212 13530
712 13530 12732 13592 13531 12698 12472 12917 11539 10340 10513 9402 8824 9787 8611 7630 8074 8280 8290 6962 6380
$$ [...]
##END NTUPLES=nD NMR FID
##END=
