##TITLE=	20121205-jiatao-1
##JCAMPDX=	6.0	$$ NMR Plug-in 1.4 of MestReNova 6.1.1-6384
##DATATYPE=	LINK
##BLOCKS=	2
##ORIGIN=	Bruker BioSpin GmbH
##OWNER=	Administrator

##TITLE=	20121205-jiatao-1
##JCAMPDX=	6.0	$$ NMR Plug-in 1.4 of MestReNova 6.1.1-6384
##BLOCKID=	1
##DATATYPE=	NMRSPECTRUM
##DATACLASS=	NTUPLES
##NUMDIM=	1
##ORIGIN=	Bruker BioSpin GmbH
##OWNER=	Administrator
##.OBSERVEFREQUENCY=	400.1300048828125
##.OBSERVENUCLEUS=	^1H
##.SOLVENTNAME=	9
##.PULSESEQUENCE=	zg30
##.ACQUISITIONMODE=	SIMULTANEOUS (DQD)
##$ORIGINALFORMAT=	Bruker XWIN-NMR
##$PARAMETERFILE=	(acqus, ASCII, H:/NMR/20121205-jiatao-1/1/acqus, 0)
$$ ##TITLE= Parameter file, TOPSPIN		Version 2.1
$$ ##JCAMPDX= 5.0
$$ ##DATATYPE= Parameter Values
$$ ##NPOINTS= 10	$$ modification sequence number
$$ ##ORIGIN= Bruker BioSpin GmbH
$$ ##OWNER= Administrator
$$ $$ 2012-12-05 10:12:06.343 +0800  Administrator@EP-ZH010007
$$ $$ D:/data/Administrator/nmr/20121205-jiatao-1/1/acqus
$$ $$ process C:\Bruker\TOPSPIN\prog\mod\vtu.exe
$$ ##$ACQT0= -2.85084027202189
$$ ##$AMP= (0..31)
$$ 100 100 100 100 100 100 100 100 100 100 100 100 100 100 100 100 100 100
$$ 100 100 100 100 100 100 100 100 100 100 100 100 100 100
$$ ##$ANAVPT= -1
$$ ##$AQSEQ= 0
$$ ##$AQ_mod= 3
$$ ##$AUNM= <au_zg>
$$ ##$AUTOPOS= <30 >
$$ ##$BF1= 400.13
$$ ##$BF2= 400.13
$$ ##$BF3= 400.13
$$ ##$BF4= 400.13
$$ ##$BF5= 400.13
$$ ##$BF6= 400.13
$$ ##$BF7= 400.13
$$ ##$BF8= 400.13
$$ ##$BYTORDA= 0
$$ ##$CFDGTYP= 0
$$ ##$CFRGTYP= 9
$$ ##$CHEMSTR= <none>
$$ ##$CNST= (0..63)
$$ 1 1 145 1 1 1 1 1 1 1 1 1 1 1 1 1 1 1 1 1 1 1 1 1 1 1 1 1 1 1 1 1 1 1 1
$$ 1 1 1 1 1 1 1 1 1 1 1 1 1 1 1 1 1 1 1 1 1 1 1 1 1 1 1 1 1
$$ ##$CPDPRG= <>
$$ ##$CPDPRG1= <>
$$ ##$CPDPRG2= <>
$$ ##$CPDPRG3= <>
$$ ##$CPDPRG4= <mlev>
$$ ##$CPDPRG5= <mlev>
$$ ##$CPDPRG6= <mlev>
$$ ##$CPDPRG7= <mlev>
$$ ##$CPDPRG8= <mlev>
$$ ##$CPDPRGB= <>
$$ ##$CPDPRGT= <>
$$ ##$D= (0..63)
$$ 0 1 0 0 0 0 0 0 0 0.06 0 0 0 0 0 0 0.0002 0 0 0 0 0 0 0 0 0 0 0 0 0 0 0
$$ 0 0 0 0 0 0 0 0 0 0 0 0 0 0 0 0 0 0 0 0 0 0 0 0 0 0 0 0 0 0 0 0
$$ ##$DATE= 1354673524
$$ ##$DBL= (0..7)
$$ 120 120 120 120 120 120 120 120
$$ ##$DBP= (0..7)
$$ 150 150 150 150 150 150 150 150
$$ ##$DBP07= 0
$$ ##$DBPNAM0= <>
$$ ##$DBPNAM1= <>
$$ ##$DBPNAM2= <>
$$ ##$DBPNAM3= <>
$$ ##$DBPNAM4= <>
$$ ##$DBPNAM5= <>
$$ ##$DBPNAM6= <>
$$ ##$DBPNAM7= <>
$$ ##$DBPOAL= (0..7)
$$ 0.5 0.5 0.5 0.5 0.5 0.5 0.5 0.5
$$ ##$DBPOFFS= (0..7)
$$ 0 0 0 0 0 0 0 0
$$ ##$DE= 9
$$ ##$DECBNUC= <off>
$$ ##$DECIM= 2432
$$ ##$DECNUC= <off>
$$ ##$DECSTAT= 4
$$ ##$DIGMOD= 1
$$ ##$DIGTYP= 12
$$ ##$DL= (0..7)
$$ 0 120 120 120 120 120 120 120
$$ ##$DP= (0..7)
$$ 150 150 150 150 150 150 150 150
$$ ##$DP07= 0
$$ ##$DPNAME0= <>
$$ ##$DPNAME1= <>
$$ ##$DPNAME2= <>
$$ ##$DPNAME3= <>
$$ ##$DPNAME4= <>
$$ ##$DPNAME5= <>
$$ ##$DPNAME6= <>
$$ ##$DPNAME7= <>
$$ ##$DPOAL= (0..7)
$$ 0.5 0.5 0.5 0.5 0.5 0.5 0.5 0.5
$$ ##$DPOFFS= (0..7)
$$ 0 0 0 0 0 0 0 0
$$ ##$DQDMODE= 0
$$ ##$DR= 22
$$ ##$DS= 0
$$ ##$DSLIST= <SSSSSSSSSSSSSSS>
$$ ##$DSPFIRM= 0
$$ ##$DSPFVS= 20
$$ [...]
$$ -1 -1 -1 -1 -1 -1 -1 -1 -1 -1 -1 -1 -1 -1 -1 -1 -1 -1 -1 -1 -1 -1 -1 -1
$$ -1 -1 -1 -1 -1 -1 -1 -1 -1 -1 -1 -1 -1 -1 -1 -1 -1 -1 -1 -1 -1 -1 -1 -1
$$ -1 -1 -1 -1 -1 -1 -1 -1 -1 -1 -1 -1 -1 -1 -1 -1 -1 -1 -1 -1 -1 -1 -1 -1
$$ -1 -1 -1 -1 -1 -1 -1 -1 -1 -1 -1 -1 -1 -1 -1 -1 -1 -1 -1 -1 -1 -1 -1 -1
$$ -1 -1 -1 -1 -1 -1 -1 -1 -1 -1 -1 -1 -1 -1 -1 -1 -1 -1 -1 -1 -1 -1 -1 -1
$$ -1 -1 -1 -1 -1 -1 -1 -1 -1 -1 -1 -1 -1 -1 -1 -1 -1 -1 -1 -1 -1 -1 -1 -1
$$ -1 -1 -1 -1 -1 -1 -1 -1 -1 -1 -1 -1 -1 -1 -1 -1 -1 -1 -1 -1 -1 -1 -1 -1
$$ -1 -1 -1 -1 -1 -1 -1 -1 -1 -1 -1 -1 -1 -1 -1 -1 -1 -1 -1 -1 -1 -1 -1 -1
$$ -1 -1 -1 -1 -1 -1 -1 -1 -1 -1 -1 -1 -1 -1 -1 -1
$$ ##$RG_tabA= (0..255)
$$ 0.25 0.28 0.32 0.35 0.4 0.44 0.5 0.56 0.64 0.7 0.8 0.89 1 1.12 1.28 1.4
$$ 1.6 1.78 2 2.25 2.56 2.8 3.2 3.56 4 4.5 5 5.6 6.35 7.12 8 9 10 11.3 12.7
$$ 14.2 16 18 20.2 22.6 25.4 28.5 32 36 40.3 45.2 50.8 57 64 71.8 80.6 90.5
$$ 101 114 128 144 161 181 203 228 256 287 322 362 406 456 512 575 645 724
$$ 812 912 1030 1150 1290 1440 1620 1820 2050 -1 -1 -1 -1 -1 -1 -1 -1 -1 -1
$$ -1 -1 -1 -1 -1 -1 -1 -1 -1 -1 -1 -1 -1 -1 -1 -1 -1 -1 -1 -1 -1 -1 -1 -1
$$ -1 -1 -1 -1 -1 -1 -1 -1 -1 -1 -1 -1 -1 -1 -1 -1 -1 -1 -1 -1 -1 -1 -1 -1
$$ -1 -1 -1 -1 -1 -1 -1 -1 -1 -1 -1 -1 -1 -1 -1 -1 -1 -1 -1 -1 -1 -1 -1 -1
$$ -1 -1 -1 -1 -1 -1 -1 -1 -1 -1 -1 -1 -1 -1 -1 -1 -1 -1 -1 -1 -1 -1 -1 -1
$$ -1 -1 -1 -1 -1 -1 -1 -1 -1 -1 -1 -1 -1 -1 -1 -1 -1 -1 -1 -1 -1 -1 -1 -1
$$ -1 -1 -1 -1 -1 -1 -1 -1 -1 -1 -1 -1 -1 -1 -1 -1 -1 -1 -1 -1 -1 -1 -1 -1
$$ -1 -1 -1 -1 -1 -1 -1 -1 -1 -1 -1 -1 -1 -1 -1 -1 -1 -1 -1 -1 -1 -1 -1
$$ ##$ROUT14= (0..7)
$$ 0 0 0 0 0 0 0 0
$$ ##$ROUTER= 3
$$ ##$RX22TY= <no>
$$ ##$RXFMAX= (0..7)
$$ 432.5 -1 -1 -1 -1 -1 -1 -1
$$ ##$RXFMIN= (0..7)
$$ 5 -1 -1 -1 -1 -1 -1 -1
$$ ##$RXINTLV= (0..7)
$$ 1 0 0 0 0 0 0 0
$$ ##$RXMSTY= <no>
$$ ##$SCMTY= <no>
$$ ##$SGUC1= (0..15)
$$ 18 19 0 0 0 0 0 0 0 0 0 0 0 0 0 0
$$ ##$SGUC2= (0..15)
$$ 33 256 0 0 0 0 0 0 0 0 0 0 0 0 0 0
$$ ##$SPECTR= 10
$$ ##$SY2FLAG= 0
$$ ##$TFXNUM= 0
$$ ##$TRIPLO2= 0
$$ ##$VTUTY= <tty05>
$$ ##$WBREFAM= (0..15)
$$ 273.4 115.7 100 100 100 100 100 100 100 100 100 100 100 100 100 100
$$ ##$WBREFPH= (0..15)
$$ 81.78 -67.52 0 0 0 0 0 0 0 0 0 0 0 0 0 0
$$ ##$XFAC= 2
$$ ##END=
$$ 
##$DECIM=	2432
##$DSPFVS=	20
##NTUPLES=	NMRSPECTRUM
##VARNAME=	FREQUENCY,	SPECTRUM/REAL,	SPECTRUM/IMAG,	PAGE NUMBER
##SYMBOL=	X,	R,	I,	N
##VARTYPE=	INDEPENDENT,	DEPENDENT,	DEPENDENT,	PAGE
##VARFORM=	AFFN,	ASDF,	ASDF,	AFFN
##VARDIM=	65536,	65536,	65536,	2
##UNITS=	HZ,	ARBITRARY UNITS,	ARBITRARY UNITS,
##FIRST=	6577.3853759765625,	4.2364211082458496094,	-2.1275913715362548828,	1
##LAST=	-1646.2991943359375,	4.2607893943786621094,	0.37533608078956604004,	2
##MIN=	-1646.2991943359375,	-7.2351894378662109375,	-1803.6512451171875,	1
##MAX=	6577.3853759765625,	3331.5029296875,	2041.8292236328125,	1
##FACTOR=	-0.12548538292992295062,	0.041643786621093754896,	0.025522865295410156888,	1
##PAGE=	N=1
##DATATABLE=	(X++(R..R)), XYDATA
$$ [...]
##PAGE=	N=2
##DATATABLE=	(X++(I..I)), XYDATA
-32509c190oP0M3o1q9j5Q%lj1J9J0l5k4n7j7jk9lK3N4O2J5m4j6J9QK1J3k8k3j5J1K4j3pmj8
-32471c309p7j9K5K1L0rN3J5n5j0m%M4J3j3j4j8Pqk5ljpOM5Q6P2j2l2l7J0Oon2j0MqJ0K1M6
-32431c215j5l9RRn2nJ1n0n0k1J1J3N6M5L1Nn2j9L5K1lk3NJ9K5M4k8k3L9Jo4k5L1kk0o6l7
-32394c399jp2n5kL3N4R1R0j1q5pJ1j8J8K8J4NJkp0j9Rm7l1L4K4K5K3k8m3k7n8P0J41K2j8
-32358c300k3l7m1l7Rk4l7mj8l3K1N2M2j4J4ml7L0K3j2j0K2J8J8K9Ok4jL5M5L2K2n1n0OJ8
-32322c315J4n4m0l3n4j8J2qK6QLJ0m5j8K9M8M9Pj3n0m2Kj1kjK3l5lj3jM9J0j3k6jN0K9k4
-32284c451rK9j0j8QO1Om0J6J0l1m5j4J2L1j9m1K6K4J9j4%J0J4N2L4l4m6j4J5k3n3QM6Kk8
-32248c467j07o9L9O9L9Oo7k0J2mJ2j1k1K8M9J2J9OJ1j6n0l3k4J7qJ7L7N4K8kk7r6n5Mj8J7
$$ plain form
-32509 -3190 -3196 -3126 -3083 -3144 -3233 -3248 -3240 -3240 -3243 -3254 -3235 -3225 -3260 -3284 -3341 -3358 -3359 -3388 -3391 -3368 -3314 -3252 -3237 -3281 -3297 -3278 -3270 -3249 -3236 -3264 -3287 -3302 -3291 -3267 -3280 -3287 -3291 -3309
-32471 -3309 -3386 -3405 -3380 -3359 -3329 -3338 -3285 -3270 -3325 -3335 -3339 -3339 -3295 -3282 -3295 -3309 -3327 -3320 -3328 -3353 -3356 -3357 -3364 -3358 -3313 -3227 -3155 -3167 -3199 -3236 -3226 -3220 -3226 -3278 -3288 -3284 -3292 -3282 -3261 -3215
-32431 -3215 -3230 -3269 -3260 -3251 -3303 -3308 -3297 -3347 -3397 -3418 -3407 -3394 -3338 -3293 -3262 -3257 -3309 -3328 -3293 -3272 -3275 -3298 -3293 -3274 -3249 -3205 -3233 -3256 -3217 -3216 -3280 -3305 -3274 -3276 -3296 -3362 -3399
-32394 -3399 -3400 -3472 -3527 -3529 -3496 -3442 -3351 -3261 -3272 -3357 -3364 -3353 -3371 -3353 -3325 -3311 -3306 -3305 -3307 -3377 -3396 -3387 -3434 -3465 -3431 -3407 -3382 -3359 -3387 -3430 -3457 -3515 -3445 -3304 -3282 -3300
-32358 -3300 -3323 -3360 -3401 -3438 -3429 -3453 -3490 -3494 -3512 -3545 -3524 -3472 -3430 -3444 -3430 -3434 -3471 -3441 -3418 -3430 -3440 -3418 -3400 -3382 -3353 -3347 -3371 -3372 -3337 -3292 -3260 -3238 -3289 -3339 -3333 -3315
-32322 -3315 -3301 -3355 -3395 -3428 -3482 -3500 -3488 -3496 -3470 -3462 -3459 -3449 -3494 -3512 -3483 -3435 -3386 -3379 -3392 -3442 -3484 -3482 -3493 -3495 -3496 -3473 -3508 -3511 -3524 -3525 -3476 -3466 -3479 -3505 -3506 -3456 -3427 -3451
-32284 -3451 -3460 -3431 -3441 -3459 -3451 -3390 -3384 -3424 -3408 -3398 -3429 -3474 -3488 -3476 -3445 -3464 -3505 -3479 -3455 -3436 -3450 -3450 -3440 -3426 -3374 -3340 -3374 -3420 -3434 -3419 -3442 -3495 -3487 -3441 -3439 -3467
-32248 -3467 -3574 -3643 -3604 -3535 -3496 -3490 -3557 -3577 -3565 -3569 -3557 -3568 -3589 -3561 -3512 -3500 -3481 -3475 -3464 -3480 -3530 -3563 -3587 -3570 -3578 -3561 -3524 -3470 -3442 -3444 -3471 -3567 -3622 -3618 -3636 -3619
-32212c619OJ3jo8k3N2M8qJ8NqJ4J7K1k0nL4k7k0NK3mJ2Q4K0p4p0o4j0J5M7L0K2LL4J5l1m1
-32174c555l7n9nJ7J6oj0j1J0m4o1J6N9%QM9O3L8l5m7jM7j1qk5o3l1jL5J1j8%RJ1ok0L6P6
-32136c553jn3m6k0pj4N3P3j9m1m2MN1M2L5lk3p5l9J4p9kP7L1l8p8l9JM7K6K2j7pO2K1k1J0
-32099c648J3l0k0K8K7j0n4n5l7qJ7lJL4M2Mm3k6J2K9L3Ml9%qk3%J8N8Q6L1o1p5k9J8l1j8
-32062c763L1No0LJ7KRL4J4m5L2M5qJ1K6J2k1p4n3nk5k9j1m4k2N5N5%k6J0M3J5Oj6J5pl9j
-32024c809l0nL7P6j4p9m9NJ3l3j3J3n1lJ01Pm0j2K6olJ9kn0NL5Rm9KJk9j6lJ9J5k1l5Pnj7
-31984c984pL0K7J0K3K6PlRk1l4O4K1m2j3LK9M4J0n4o2k6J8M4L5k4l5m0ORo0p2K2K8nJ8m5
-31947d044j5kK5M6J0M0J4k3J0Qj3j9n9LJ3K0J4m8l3K5J8J0qj4j2Kl0l6j8%N3M0J9k4oN5J8
$$ plain form
-32212 -3619 -3613 -3600 -3601 -3669 -3692 -3640 -3592 -3600 -3582 -3577 -3585 -3571 -3554 -3533 -3553 -3558 -3524 -3551 -3571 -3566 -3543 -3547 -3535 -3451 -3431 -3505 -3575 -3639 -3649 -3634 -3587 -3557 -3535 -3532 -3498 -3483 -3514 -3555
-32174 -3555 -3592 -3651 -3656 -3639 -3623 -3629 -3639 -3650 -3640 -3684 -3745 -3729 -3670 -3670 -3662 -3613 -3550 -3512 -3547 -3594 -3595 -3548 -3559 -3567 -3592 -3655 -3686 -3687 -3652 -3641 -3659 -3659 -3650 -3639 -3645 -3665 -3629 -3553
-32136 -3553 -3554 -3607 -3653 -3673 -3680 -3694 -3641 -3568 -3587 -3628 -3670 -3666 -3615 -3573 -3538 -3541 -3564 -3639 -3678 -3664 -3743 -3745 -3668 -3637 -3675 -3753 -3792 -3791 -3744 -3718 -3696 -3713 -3720 -3658 -3637 -3658 -3648
-32099 -3648 -3635 -3665 -3685 -3657 -3630 -3640 -3694 -3749 -3786 -3794 -3777 -3780 -3779 -3745 -3703 -3699 -3742 -3768 -3756 -3727 -3694 -3690 -3729 -3729 -3737 -3760 -3760 -3742 -3684 -3598 -3567 -3628 -3703 -3732 -3714 -3745 -3763
-32062 -3763 -3732 -3727 -3787 -3784 -3767 -3765 -3756 -3722 -3708 -3753 -3721 -3676 -3684 -3673 -3647 -3635 -3656 -3730 -3783 -3788 -3813 -3842 -3853 -3897 -3919 -3864 -3809 -3809 -3835 -3825 -3782 -3767 -3761 -3777 -3762 -3769 -3808 -3809
-32024 -3809 -3839 -3844 -3807 -3731 -3745 -3824 -3873 -3868 -3855 -3888 -3901 -3888 -3939 -3942 -3841 -3834 -3874 -3886 -3860 -3866 -3869 -3850 -3852 -3902 -3897 -3862 -3853 -3902 -3900 -3899 -3928 -3944 -3947 -3928 -3913 -3934 -3969 -3962 -3967 -3984
-31984 -3984 -3991 -3961 -3934 -3924 -3901 -3875 -3868 -3871 -3862 -3883 -3917 -3853 -3832 -3874 -3887 -3884 -3855 -3811 -3801 -3855 -3917 -3943 -3925 -3881 -3846 -3870 -3905 -3945 -3939 -3930 -3990 -4062 -4040 -4012 -4017 -3999 -4044
-31947 -4044 -4059 -4061 -4036 -3990 -3980 -3940 -3926 -3949 -3939 -3931 -3944 -3963 -4022 -4019 -4006 -3986 -3972 -4020 -4053 -4028 -4010 -4000 -4008 -4022 -4034 -4032 -4062 -4098 -4116 -4116 -4063 -4023 -4004 -4028 -4034 -3979 -3961
-31910c961J4K0K4Qk2r3m5J8nL1J9j6j0qj0j9mJ%k8l2j5lK4L2L3j8K5k1l5l0KK3O3J2K3J3
-31873c990k9k2k1k0l1j5lqn2n6L8L1L0M0K9K2K5On8KL0pm0j4l5j1M0kj4K2J4J7j1PKl0J0
-31836d104j3oL2qk1K3L8j7jJ2m5k4K3J5k8k7K4Oj1m1p8J9N3O1k5l6mnk0j0J1N0lJN8Mo6l3
-31798d196pM2jk2L5lm3rRl5n8JN8%l2j5rl9K9L6OK4K4k7k9J0K4J7J3Jn2p4k0L2J9N8M7j9
-31760d205k5L0k0j2M2nO2Qn1k2k4m8m9j7M4M6Po4l4M2L7nl9k3l2RM7l2k5K3QK0J5j0l4K4
-31724d312Nk2ONj2n9l4M8J3pL0N6l8m7l3m1n9NM7Mj9M6O2L3m9k4K1%K8Ol5j1Lm8o3kP2N7
-31686d368Pm9n8Pl3n0k2k0L3O2M1J8oj9L7L1Lk1j5k0PK4o4l0R2Rqkk8k4n2q3rL2N3L8Jm2
-31648d528m3Jm3l9NM9j2m1nL3M5J0K0j2m2j3%KL6l6o2j1M2Q2Opmj6k6%l0o9j8j7J0k0JK7
$$ plain form
-31910 -3961 -3947 -3927 -3903 -3895 -3917 -4010 -4055 -4037 -4042 -4011 -3992 -4008 -4018 -4026 -4036 -4055 -4059 -4058 -4058 -4086 -4118 -4133 -4136 -4112 -4080 -4047 -4065 -4040 -4061 -4096 -4126 -4124 -4101 -4038 -4026 -4003 -3990
-31873 -3990 -4019 -4041 -4062 -4082 -4113 -4128 -4131 -4139 -4191 -4247 -4209 -4178 -4148 -4108 -4079 -4057 -4032 -4026 -4084 -4082 -4052 -4059 -4099 -4113 -4148 -4159 -4119 -4121 -4135 -4113 -4099 -4082 -4093 -4086 -4084 -4114 -4104
-31836 -4104 -4117 -4123 -4091 -4099 -4120 -4097 -4059 -4076 -4077 -4065 -4110 -4134 -4111 -4096 -4124 -4151 -4127 -4121 -4132 -4173 -4251 -4232 -4179 -4118 -4143 -4179 -4183 -4188 -4208 -4218 -4207 -4157 -4160 -4159 -4101 -4097 -4163 -4196
-31798 -4196 -4203 -4161 -4162 -4184 -4149 -4152 -4195 -4204 -4195 -4230 -4288 -4287 -4229 -4229 -4261 -4276 -4285 -4324 -4295 -4259 -4253 -4229 -4205 -4232 -4261 -4251 -4227 -4210 -4197 -4196 -4248 -4322 -4342 -4310 -4291 -4233 -4186 -4205
-31760 -4205 -4230 -4200 -4220 -4232 -4190 -4195 -4133 -4125 -4176 -4198 -4222 -4270 -4319 -4336 -4292 -4246 -4239 -4303 -4337 -4295 -4258 -4263 -4302 -4325 -4357 -4348 -4301 -4333 -4358 -4335 -4327 -4307 -4292 -4302 -4336 -4312
-31724 -4312 -4307 -4329 -4323 -4318 -4330 -4389 -4423 -4375 -4362 -4369 -4339 -4283 -4321 -4368 -4401 -4442 -4501 -4496 -4449 -4445 -4464 -4418 -4356 -4323 -4372 -4396 -4375 -4375 -4347 -4341 -4376 -4387 -4384 -4432 -4495 -4497 -4425 -4368
-31686 -4368 -4361 -4410 -4468 -4461 -4494 -4544 -4566 -4586 -4553 -4491 -4450 -4432 -4438 -4457 -4420 -4389 -4386 -4407 -4422 -4442 -4435 -4411 -4475 -4505 -4413 -4404 -4412 -4414 -4442 -4466 -4518 -4601 -4610 -4578 -4525 -4487 -4486 -4528
-31648 -4528 -4571 -4570 -4613 -4652 -4647 -4598 -4610 -4651 -4656 -4623 -4578 -4568 -4548 -4560 -4602 -4615 -4615 -4613 -4577 -4613 -4675 -4686 -4644 -4562 -4556 -4563 -4567 -4583 -4609 -4609 -4639 -4708 -4726 -4743 -4733 -4753 -4752 -4725
-31610d725RL9J1L7k1n0%J9m3q5OK8K6K1l0j7RN4J9J3J4M8RNm2n6J5j6j6OK8l2p0m2Q0K8l4
-31573d755Mk2l2kn3KK1k6n3k3L9QqJ0J0j1ONK2J8mk3k3K8K1m5o3lpj5L9L4K1m2ML4l3J1o
-31534d912o9RJ8N5J7l6Pj1k4K0K4L9ko4o8m1oLk4qopL6M6j3PK4K1rm4l0%M6NJ6kj0k8q2m7
-31494e150P0L2n8j7k2j4j8lP1J03N4k6j09o7M5L3J3QJ5k2k1l3NN6Lk1j3m6n7n1K5M9RQjJ0
-31458e140m9p6J4M1j8q6l4J3J8K8Nm1l1MO3O3L1Pl9k9m4m1j2K9N9M8Lp0k1Qqk2l9M2R2L4
-31422e198rm0l5l3k4L1J6m2n4j8k3QL2l3k9J8J5K2J3j7p2o4j2J6p2n6K5N1M3K9Jnj1J4J3
-31387e500j4j0M1J7l5m4o5j0K4M3N6L4rJ4m9k5L3M4ll5m1o7q4J9O4j7m8KP2k0l9L0mPmj6
-31351e639o7l9L7O1qq5k3K8l5n0l1l6K2Q3J1J2M2O8lo5o1k2j2pM9M2ol2l8n6m2Mk8L3Km0
$$ plain form
-31610 -4725 -4716 -4677 -4666 -4629 -4650 -4700 -4700 -4681 -4724 -4809 -4803 -4775 -4749 -4728 -4758 -4775 -4766 -4712 -4693 -4680 -4666 -4618 -4609 -4604 -4646 -4702 -4687 -4703 -4719 -4713 -4685 -4717 -4787 -4829 -4749 -4721 -4755
-31573 -4755 -4751 -4773 -4805 -4807 -4860 -4858 -4837 -4863 -4916 -4939 -4900 -4892 -4900 -4890 -4880 -4891 -4885 -4880 -4858 -4840 -4844 -4867 -4890 -4862 -4841 -4886 -4949 -4952 -4959 -4974 -4935 -4901 -4880 -4922 -4918 -4884 -4917 -4906 -4912
-31534 -4912 -4981 -4972 -4954 -4899 -4882 -4918 -4911 -4922 -4946 -4926 -4902 -4863 -4865 -4929 -4997 -5038 -5044 -5041 -5065 -5073 -5079 -5086 -5050 -5004 -5017 -5010 -4986 -4965 -4974 -5018 -5048 -5048 -5002 -4997 -4981 -4983 -4993 -5021 -5103 -5150
-31494 -5150 -5080 -5048 -5106 -5123 -5145 -5159 -5177 -5180 -5109 -5006 -4952 -4978 -5087 -5154 -5109 -5076 -5063 -5055 -5040 -5062 -5083 -5116 -5111 -5055 -5052 -5073 -5086 -5132 -5189 -5240 -5215 -5166 -5157 -5149 -5150 -5140
-31458 -5140 -5189 -5265 -5251 -5210 -5228 -5314 -5348 -5335 -5317 -5289 -5284 -5325 -5356 -5352 -5289 -5226 -5195 -5188 -5227 -5256 -5300 -5341 -5353 -5324 -5265 -5217 -5214 -5284 -5305 -5297 -5305 -5327 -5366 -5324 -5232 -5198
-31422 -5198 -5207 -5247 -5282 -5315 -5339 -5308 -5292 -5334 -5388 -5406 -5429 -5421 -5389 -5422 -5451 -5433 -5418 -5396 -5383 -5400 -5472 -5536 -5548 -5532 -5604 -5660 -5635 -5584 -5541 -5512 -5511 -5516 -5527 -5513 -5500
-31387 -5500 -5514 -5524 -5483 -5466 -5501 -5545 -5610 -5620 -5596 -5553 -5497 -5463 -5472 -5458 -5507 -5532 -5499 -5455 -5458 -5493 -5534 -5601 -5685 -5666 -5602 -5619 -5667 -5665 -5593 -5613 -5652 -5622 -5626 -5619 -5623 -5639
-31351 -5639 -5706 -5745 -5708 -5647 -5655 -5740 -5763 -5735 -5770 -5820 -5851 -5887 -5865 -5782 -5771 -5759 -5717 -5649 -5652 -5717 -5778 -5800 -5812 -5819 -5770 -5728 -5734 -5766 -5804 -5860 -5902 -5898 -5926 -5893 -5891 -5931
-31315e931k9L7L8Rqj5J1j1Nmj7M8Po3n0l4m8m2kk1kO1O7Mk8LJ1k9o9j5N7L8j0l7l2j6O6L3
-31277f018l3m6M6J09L0j5k9m3rk3j4L6O5J1j9QJ5L5L9j3k1r0j00J7L8MN4J4kL2Ok1j3m3J0
-31242e983L4J2J7k2l8l4k3j8k6j6l2k8k1L2L5rK3j4oLl9ooj2K5J8L5L5n8o2mL5K0m0p8j2
-31206f263Oj9k9pj6kjrKjJ2qK9M8qk9kll7l6On3l7lJ5K9j5k7k7L7J0m7k3l5p7J7R0RJ0J1
-31166f483K3k9l8n1jn2r0m0m2J0O0K0J4M9M2j0m2o2k0N2K6K1j2o2j4n5p6j5lj5J1K2K9M9
-31132f784Ql2qnK5mk0mo2j27l5N2J2J3oQl5m1J6j8p3k5M4L9Moj1nJ1%l1m6j6j9OL9N6Pl2
-31093g105n0r5p7l5M0K6j2j4o2m1nNK8K4j0q0k4RK1P2j0j03l9J7j1l2mk1J0M5Rk7n8n1J7
-31058g643N8M3k1l7k5ml5J0j7oml3l1o5j1J0RNOPj2oJ1k5k6r0q0l9kO4L1n0l1Kj1pj5k5M
$$ plain form
-31315 -5931 -5960 -5923 -5885 -5876 -5884 -5899 -5888 -5899 -5894 -5898 -5915 -5867 -5860 -5923 -5973 -6007 -6055 -6097 -6099 -6120 -6122 -6061 -5994 -5990 -6018 -6015 -6004 -6033 -6102 -6117 -6060 -6022 -6032 -6069 -6101 -6117 -6051 -6018
-31277 -6018 -6051 -6097 -6051 -5942 -5912 -5927 -5956 -5999 -6008 -6031 -6045 -6009 -5944 -5933 -5952 -5944 -5929 -5894 -5855 -5868 -5889 -5979 -6079 -6062 -6024 -6020 -5966 -5952 -5954 -5922 -5916 -5937 -5950 -5993 -5983
-31242 -5983 -5949 -5937 -5920 -5942 -5980 -6014 -6037 -6055 -6081 -6097 -6129 -6157 -6178 -6146 -6111 -6120 -6097 -6111 -6117 -6114 -6153 -6159 -6165 -6177 -6152 -6134 -6099 -6064 -6122 -6184 -6188 -6153 -6133 -6173 -6251 -6263
-31206 -6263 -6257 -6276 -6305 -6312 -6328 -6330 -6331 -6340 -6338 -6339 -6327 -6335 -6306 -6258 -6266 -6295 -6297 -6300 -6337 -6373 -6367 -6420 -6457 -6460 -6445 -6416 -6431 -6458 -6485 -6448 -6438 -6485 -6508 -6543 -6620 -6603 -6513 -6504 -6494 -6483
-31166 -6483 -6460 -6489 -6527 -6578 -6579 -6631 -6721 -6761 -6803 -6793 -6733 -6713 -6699 -6650 -6608 -6618 -6660 -6722 -6742 -6690 -6664 -6643 -6655 -6717 -6731 -6786 -6862 -6877 -6880 -6895 -6884 -6862 -6833 -6784
-31132 -6784 -6776 -6808 -6816 -6821 -6796 -6800 -6820 -6824 -6886 -7013 -7048 -6996 -6984 -6971 -6977 -6969 -7004 -7045 -7029 -7047 -7120 -7145 -7101 -7062 -7058 -7064 -7075 -7080 -7069 -7069 -7100 -7146 -7162 -7181 -7175 -7136 -7080 -7073 -7105
-31093 -7105 -7155 -7250 -7327 -7362 -7322 -7296 -7308 -7322 -7384 -7425 -7430 -7425 -7397 -7373 -7383 -7463 -7487 -7478 -7457 -7385 -7395 -7498 -7537 -7520 -7531 -7563 -7567 -7588 -7578 -7533 -7524 -7551 -7609 -7660 -7643
-31058 -7643 -7585 -7542 -7563 -7600 -7625 -7629 -7664 -7654 -7671 -7677 -7681 -7714 -7745 -7810 -7821 -7811 -7802 -7797 -7791 -7784 -7796 -7802 -7791 -7816 -7842 -7932 -8012 -8051 -8053 -7989 -7958 -8008 -8039 -8037 -8048 -8055 -8070 -8095 -8091
-31019h091K7L4m5k9m2j1M0kl0Ml5o4l1l4q0l2J0L2N4K9K6J6L9nm5n8j3j4n0q8j4Nl8l0N0
-30984h515L6n0p0j2Lk8L9j3k5j6p0j1J4l4kl6L2R3J5p7m7k8K1J5Qkm4k7j9m6n1k9o7p8K2
-30949i099L8l6o4%Nn4MO7K5k5j3l3j8k4m1mop1j2J9j7l2m0m4lJk4J5rm0kJJk3k1j8l7n3l
-30910i690nJ7L3k1m5k0m5n6k1l4o5l1J0l2q6J9N8j4m0r8k6j4k6j6K3K1l3L5P8O1n6p6l4k1
-30876a0250m4n4n8nJ2Ql4p2p0k0m1j9nm2m1m5Nm0o5rl1J8km8o2o1j17r4M8L6qoOj4n3QL6
-30839a1233pj5L3k8m4p3o5j0k2PN6Po6m0m8p6r7q6K7P0%l0rl9j25j00J6K9M5J2n5o3n4p9
-30805a2162n0j7k8%OLl5q0q7Kj8l6n8o2k6n4m5k5n4q7nL7L3o5l7n5p3m3o6q2o1j8Qm4o8m0
-30769a3492n1n1m3J6K3n0j19p7n8m3l8j8j0j3l4q0o2m6p4k3l0n9j03j41o9J9L2p0p5p3q9
$$ plain form
-31019 -8091 -8064 -8030 -8075 -8104 -8146 -8157 -8117 -8119 -8149 -8145 -8180 -8244 -8275 -8309 -8389 -8421 -8411 -8379 -8325 -8296 -8270 -8254 -8215 -8220 -8265 -8323 -8336 -8350 -8400 -8488 -8502 -8497 -8535 -8565 -8515
-30984 -8515 -8479 -8529 -8599 -8611 -8608 -8636 -8597 -8610 -8635 -8651 -8721 -8732 -8718 -8752 -8754 -8790 -8758 -8665 -8650 -8727 -8774 -8802 -8781 -8766 -8758 -8760 -8804 -8831 -8850 -8896 -8947 -8976 -9043 -9121 -9099
-30949 -9099 -9061 -9097 -9161 -9161 -9156 -9210 -9206 -9139 -9114 -9139 -9152 -9185 -9203 -9227 -9268 -9272 -9278 -9349 -9361 -9342 -9359 -9391 -9431 -9475 -9478 -9477 -9501 -9486 -9495 -9535 -9537 -9536 -9535 -9558 -9579 -9597 -9634 -9687 -9690
-30910 -9690 -9695 -9678 -9645 -9666 -9711 -9731 -9776 -9832 -9853 -9887 -9952 -9983 -9973 -10005 -10091 -10072 -10014 -10028 -10068 -10166 -10192 -10206 -10232 -10248 -10225 -10204 -10237 -10202 -10124 -10063 -10119 -10195 -10229 -10250
-30876 -10250 -10294 -10348 -10406 -10411 -10399 -10391 -10425 -10497 -10567 -10587 -10628 -10647 -10652 -10694 -10735 -10780 -10775 -10815 -10880 -10889 -10920 -10902 -10904 -10952 -11014 -11075 -11192 -11286 -11238 -11202 -11210 -11216 -11210 -11224 -11277 -11269 -11233
-30839 -11233 -11240 -11255 -11222 -11250 -11294 -11367 -11432 -11442 -11464 -11457 -11401 -11394 -11460 -11500 -11548 -11624 -11721 -11807 -11780 -11710 -11710 -11740 -11749 -11788 -11913 -12013 -11997 -11968 -11923 -11911 -11966 -12029 -12083 -12162
-30805 -12162 -12212 -12229 -12257 -12257 -12251 -12248 -12283 -12363 -12450 -12448 -12466 -12502 -12560 -12622 -12648 -12702 -12747 -12772 -12826 -12913 -12918 -12881 -12848 -12913 -12950 -13005 -13078 -13121 -13187 -13269 -13330 -13348 -13340 -13384 -13452 -13492
-30769 -13492 -13543 -13594 -13637 -13621 -13598 -13648 -13767 -13844 -13902 -13945 -13983 -14001 -14011 -14024 -14058 -14138 -14200 -14246 -14320 -14343 -14373 -14432 -14535 -14676 -14745 -14726 -14694 -14764 -14839 -14912 -15001
-30738a5001p7q7q8j19j18j14j15j27j33r8o8r1o9p7j20j25j25r5r3r3q6j47j52j16j16q6
-30712a7736l1k7m6j19j24j43j42j41j79j53j10m9o2j33j15j09j00j21j05p9n8p7j84j68j07
-30687b0418o8n2o3j04j28j68j55j22j36o6q5j06r9r5j07j15q4p1j46j70j72j77j83j75j10
-30662b3375p3j31j51j37j47j66j39j42j51j67k10j82j83k36j93j91k26k18j83j87j67j49
-30640b7104j81j99j87j73k12k42k18k57k90k90k39k01k12j91k15k55k62k52k43k92l27k96
-30618c2338l22l05k38k47k73k28k57l31k85k65k94k80l48k90k44k62k57l32l33k43k07k68
-30596c8447k15j77k20k14j95j67j37j09j23m7NK5J1O7K06K47K85L38K92L70N69O53P11P60
-30572c5512Q05R21J055J168J277J329J465J536J645J757J839J910J957J985K064K185K219
$$ plain form
-30738 -15001 -15078 -15165 -15253 -15372 -15490 -15604 -15719 -15846 -15979 -16077 -16145 -16236 -16305 -16382 -16502 -16627 -16752 -16847 -16940 -17033 -17119 -17266 -17418 -17534 -17650 -17736
-30712 -17736 -17767 -17794 -17840 -17959 -18083 -18226 -18368 -18509 -18688 -18841 -18951 -19000 -19062 -19195 -19310 -19419 -19519 -19640 -19745 -19824 -19882 -19959 -20143 -20311 -20418
-30687 -20418 -20486 -20538 -20601 -20705 -20833 -21001 -21156 -21278 -21414 -21480 -21565 -21671 -21770 -21865 -21972 -22087 -22171 -22242 -22388 -22558 -22730 -22907 -23090 -23265 -23375
-30662 -23375 -23448 -23579 -23730 -23867 -24014 -24180 -24319 -24461 -24612 -24779 -24989 -25171 -25354 -25590 -25783 -25974 -26200 -26418 -26601 -26788 -26955 -27104
-30640 -27104 -27285 -27484 -27671 -27844 -28056 -28298 -28516 -28773 -29063 -29353 -29592 -29793 -30005 -30196 -30411 -30666 -30928 -31180 -31423 -31715 -32042 -32338
-30618 -32338 -32660 -32965 -33203 -33450 -33723 -33951 -34208 -34539 -34824 -35089 -35383 -35663 -36011 -36301 -36545 -36807 -37064 -37396 -37729 -37972 -38179 -38447
-30596 -38447 -38662 -38839 -39059 -39273 -39468 -39635 -39772 -39881 -40004 -40051 -40046 -40021 -40010 -39943 -39737 -39490 -39205 -38867 -38575 -38205 -37636 -36983 -36272 -35512
-30572 -35512 -34707 -33786 -32731 -31563 -30286 -28957 -27492 -25956 -24311 -22554 -20715 -18805 -16848 -14863 -12799 -10614 -8395
-30555h395K271K316K284K298K307K297K256K210K173K103K002J917J820J757J707J566J426
-30538B6315J289J238J091J005R97Q57P26O69O02M21L55L35L02K31J91J45K4oj8j49j26r0
-30516C6404j59j64k02k26k08k48j98k48l17l00k78k59l34l77l01k81k77k96k58k97l84l24
-30494C0468k91k91l33l13l15l26l06l03l10l16k84k90k56k41k55k53k67l12l01k57k53k31
-30472B4164k02k25k61k74k56k74k32k17k03k55k64k27k45j61j48j70k12j98j82k09j83k09
-30450A9357k55k23j33j14j79k08k27k35j59j66j61p6j54j88j76k02j26j48j99j31j14j60
-30428A5623j85j67j25j36j59j28j26j12j00j00q3r4j66j25j87j99q8o0q2r9r1q8m3o9q8j11
-30402A2612j09q9j64q2rJ0k2q0j05r9n1m0l1k7o4o2j8K9n8j17n4m0n2l0n1k5Kl0j8j5m9p5
$$ plain form
-30555 -8395 -6124 -3808 -1524 774 3081 5378 7634 9844 12017 14120 16122 18039 19859 21616 23323 24889 26315
-30538 26315 27604 28842 29933 30938 31935 32792 33518 34187 34789 35210 35565 35900 36202 36433 36624 36769 36793 36787 36769 36620 36494 36404
-30516 36404 36245 36081 35879 35653 35445 35197 34999 34751 34434 34134 33856 33597 33263 32886 32585 32304 32027 31731 31473 31176 30792 30468
-30494 30468 30177 29886 29553 29240 28925 28599 28293 27990 27680 27364 27080 26790 26534 26293 26038 25785 25518 25206 24905 24648 24395 24164
-30472 24164 23962 23737 23476 23202 22946 22672 22440 22223 22020 21765 21501 21274 21029 20868 20720 20550 20338 20140 19958 19749 19566 19357
-30450 19357 19102 18879 18746 18632 18453 18245 18018 17783 17624 17458 17297 17221 17067 16879 16703 16501 16375 16227 16028 15897 15783 15623
-30428 15623 15438 15271 15146 15010 14851 14723 14597 14485 14385 14285 14202 14108 13942 13817 13630 13431 13343 13283 13201 13102 13011 12923 12880 12811 12723 12612
-30402 12612 12503 12414 12250 12168 12159 12169 12147 12067 11962 11863 11812 11772 11741 11714 11650 11588 11570 11599 11541 11424 11370 11330 11278 11248 11197 11172 11174 11144 11126 11111 11062 10987
-30370A0987r3j5Kn2m6n9l8l5k6j12j07om1m3m4j2p5j11p0o7n3jl2n1k5l3rk3j00j53q3pj3
-30337I354k1o6q8j22j13m0Oo9p7l2m3p7p7j2l9l8j0l5j08p7l1o1q5l1k6j0J4Rp6p3k8o4n8
-30304G696po9q0n1o3k0rk3l2K7Kj01r3o8o9m0j2m7q8q0o8o%l1q8p4l9k4o5LK8j3p0l%l9j1
-30267F273oj6l8n0l7K4J2r8r2n8nJ2l0r8p1l4nM3j3p8r8o7o3k8k7k5o0m4j7%O1M8om8o5p0
-30231E126n0J5l0p1p1nOj1k0nJ1n8o5n3m%k0p7o1QL8M7J5l0k1Nk1m6l7j4l8j18J8J5l4rn7
-30194D278m7J8l4m8Rj3K7ln6k2j6K7Jo8l6j8K1pn5p1rj6m9J3K6k6n2j1m5p8l2O3K8L2M9m6
-30158C734n6m1l4k2k8j3K5N9O1J8k2p4k7nm2m9m9J4K0ok8k5K6J6q0p6m0K8N3K7K9o4n1l2
-30124C246k0L6k1m8n8JK3J5k6m5%K0m4k2J4m3m0p1l0K8O9N5K9k3j01n5k5j4K0k4l6k5jM3
$$ plain form
-30370 10987 10894 10879 10881 10829 10783 10724 10686 10651 10625 10513 10406 10400 10359 10316 10272 10260 10185 10074 10004 9937 9884 9883 9851 9800 9775 9742 9733 9710 9610 9457 9374 9367 9354
-30337 9354 9333 9267 9179 9057 8944 8904 8910 8841 8764 8732 8689 8612 8535 8523 8484 8446 8436 8401 8293 8216 8185 8124 8039 8008 7982 7972 7986 7995 7919 7846 7818 7754 7696
-30304 7696 7689 7620 7540 7489 7426 7406 7397 7374 7342 7369 7371 7270 7177 7109 7040 7000 6988 6941 6853 6773 6705 6699 6699 6668 6580 6506 6467 6443 6378 6381 6409 6396 6326 6323 6323 6284 6273
-30267 6273 6267 6251 6213 6163 6126 6150 6162 6064 5972 5914 5909 5921 5891 5793 5722 5688 5683 5726 5713 5635 5537 5470 5407 5379 5352 5327 5267 5223 5206 5206 5267 5315 5309 5261 5196 5126
-30231 5126 5076 5091 5061 4990 4919 4914 4920 4909 4889 4884 4895 4837 4772 4719 4715 4715 4695 4618 4557 4565 4603 4650 4665 4635 4614 4619 4598 4552 4515 4501 4463 4345 4363 4378 4344 4335 4278
-30194 4278 4231 4249 4215 4167 4176 4163 4190 4187 4131 4109 4093 4120 4121 4053 4017 3999 4020 4013 3958 3887 3878 3862 3813 3826 3852 3826 3774 3763 3718 3640 3608 3671 3699 3731 3780 3734
-30158 3734 3678 3637 3603 3581 3553 3540 3565 3624 3685 3703 3681 3607 3580 3575 3533 3484 3435 3449 3469 3463 3435 3410 3436 3452 3372 3296 3256 3284 3337 3364 3393 3329 3278 3246
-30124 3246 3226 3262 3241 3193 3135 3136 3159 3174 3148 3103 3103 3123 3079 3057 3071 3028 2988 2917 2887 2915 2984 3039 3068 3045 2944 2889 2864 2850 2870 2846 2810 2785 2784 2827
-30090B827L2nqPk8o0n2o6j4M6nn6L6L5k3k6k0j1J3L7j9l4k9l0M9Mp5r2j04j4P6J3K7L4rp4
-30054B382k1Q2K6o6m4j9n2qk7n3j3L2K3RL0J6l4r3q0QL4mn1p8p0n6J6O0k5l1K8N0Qom4j0
-30018A919M9k8jQm3n3p3lJ5on5l9N1N3L9M5nl6j1n6n5j3j3ll9MP5M2n7m1J8lK0j6o7k6J1
-29981A607ml3nK6l2j03pK8nPQJ6M5pk8knPJ0J9K1%o4l2mMMj1m8k5k4n3j5O2N5M0j9k0Rl8
-29941A384k2J1K5p5j10K4K0k3l7k4k9K2M7J5k9k8p0oj8NmOp0l4M1N2N7j7m2j7k1l5j4k9l0
-29906I25J5J3qn0m8K1K2K5N6O0L6p0j02k2J8nk0l0j6P4jo8K8J8l2mJ5k1J5n4p0L9Mj9l2l1
-29870F81k1kk3k0o8m9J6LL2N5N4L5J5o1q4m7K1Q1M3Om6K3J4m3m3j1J4L4K9Jk5k4K7K3qj9
-29834F13k7lj5K5Q4J8l2PL5J4Mk8k8l2o6l5L5M3L7m3o0L1P0%m6J0L0M3j0o8o9kM4mm2J8O8
$$ plain form
-30090 2827 2859 2854 2846 2853 2825 2765 2713 2647 2633 2679 2674 2618 2654 2689 2666 2640 2620 2609 2622 2659 2640 2606 2577 2547 2596 2600 2525 2433 2329 2315 2391 2404 2431 2465 2456 2382
-30054 2382 2361 2443 2469 2403 2359 2340 2288 2280 2253 2200 2187 2219 2242 2251 2281 2297 2263 2170 2090 2098 2132 2128 2077 1999 1929 1873 1889 1949 1924 1893 1921 1971 1979 1973 1929 1919
-30018 1919 1968 1940 1939 1947 1904 1851 1778 1775 1790 1784 1729 1690 1741 1794 1833 1878 1873 1837 1826 1770 1715 1702 1689 1686 1647 1651 1726 1768 1711 1670 1688 1685 1705 1689 1622 1596 1607
-29981 1607 1603 1570 1565 1591 1559 1456 1449 1477 1472 1479 1487 1503 1548 1541 1513 1511 1506 1513 1523 1542 1563 1563 1499 1467 1463 1467 1471 1460 1412 1387 1363 1310 1295 1357 1412 1452 1433 1413 1422 1384
-29941 1384 1362 1373 1398 1323 1213 1237 1257 1234 1197 1173 1144 1166 1213 1228 1199 1171 1101 1095 1077 1082 1078 1084 1014 980 1021 1073 1130 1113 1071 1054 1033 998 984 955 925
-29906 925 940 953 945 895 847 868 890 915 971 1031 1067 997 895 873 891 886 866 836 820 894 893 825 853 871 839 835 850 829 844 790 720 759 763 744 712 681
-29870 681 660 658 635 615 547 498 514 517 549 604 658 693 708 647 563 516 537 618 661 667 621 644 658 615 572 561 575 609 638 639 614 590 617 640 632 613
-29834 613 586 583 568 593 677 695 663 670 705 719 723 695 667 635 569 534 569 612 649 606 546 577 647 647 601 611 641 684 674 606 537 535 579 575 533 551 619
-29797F19Qm8J8K1l8m0J2M5K8l9m2Onm2K7K4J8rl9J2L7j2m9J4lK1N1pn7j9n9m6k4L3O8M0n2
-29760D72q0l8j5M6O2K9m6l0NOLM4Mm6k8j0rn5n2J9N2j6m2olK7J1k7m3j8J9Mk3QL6Lrnl8k2
-29720A89j2k0jk4l2J4lj0KN0PnJk4k2K2N2M0J1knK1K3p3n9pmmk9q1l5P2P8m1r1QK3pM1M1
-29680A04k3k7j8k7k0K2M0L9j8p9q3k3JJ0p3j4%L2J09Kl5m9j5J7M1L9J2n3KN0J0k1KJ4p3k1
-29644a26N3kj7k7m9n5j2J1l2j1N0L0m7Jk4m5nM3K3mP0Oo1j2M5L7m5l7l2J5J3q0l7L6M6K1
-29608b60Krj8j8m5k4JLRm9rN1N8Ql7k1J1Nj0K4Nl3l3n5K0Rj1qmRk9K1J5k2PJ9J2m8p1J9K6
-29567d80j5j6qoMK2Rj9mM7PKom0o6o0j1KOKL5k8o0j2RRk1lK0K0l0J1%L7M6J8NQL5m1n4j2
-29525f38J4kk9kj9k8l2pN3P7N9k6l0o0o8l3lL8J3k7k1m6l4L0N8M7K4Mk9n0rL5K0K1J6L6J8
$$ plain form
-29797 619 627 579 597 618 580 540 552 597 625 586 544 550 545 503 530 554 572 563 524 536 573 561 512 526 523 544 595 588 531 512 453 407 383 416 484 524 472
-29760 472 392 354 339 385 447 476 430 400 405 411 414 458 462 416 388 378 369 314 262 281 333 317 275 269 266 293 304 277 234 216 235 239 216 224 260 263 254 249 211 189
-29720 189 177 157 156 132 100 114 111 101 103 153 160 155 156 132 110 132 184 224 235 233 228 249 272 199 140 133 129 125 96 15 -20 52 130 89 -2 6 29 22 63 104
-29680 104 81 54 36 9 -11 11 51 90 72 -7 -90 -113 -112 -102 -175 -189 -189 -157 -48 -46 -81 -130 -145 -128 -87 -48 -36 -89 -87 -37 -27 -48 -46 -32 -105 -126
-29644 -126 -73 -75 -92 -119 -168 -223 -235 -224 -256 -267 -217 -187 -234 -233 -257 -302 -307 -264 -241 -245 -175 -169 -230 -242 -197 -160 -205 -242 -274 -259 -246 -326 -363 -327 -281 -260
-29608 -260 -258 -267 -285 -303 -348 -372 -371 -368 -359 -408 -417 -366 -308 -300 -337 -358 -347 -342 -352 -328 -323 -356 -389 -444 -424 -415 -426 -434 -438 -429 -458 -437 -422 -444 -437 -418 -406 -454 -525 -506 -480
-29567 -480 -495 -511 -519 -525 -521 -499 -490 -509 -513 -466 -459 -457 -463 -503 -569 -629 -640 -638 -632 -630 -595 -623 -683 -695 -686 -677 -698 -701 -681 -661 -691 -680 -680 -643 -597 -579 -574 -566 -531 -572 -626 -638
-29525 -638 -624 -626 -655 -657 -676 -704 -736 -743 -690 -613 -554 -580 -610 -670 -738 -771 -774 -736 -723 -750 -771 -817 -851 -821 -763 -716 -692 -688 -717 -767 -776 -741 -721 -700 -684 -648 -630
-29488f30m9r1k4K8k7l3m4n4J5N1M4M6Ol7k8L5J8L4l6n0k2k2OO0K3l6m1m9K1J9J0K1J6j1l2
-29453h63m1j9k3l2j9l2pJ3P8L4k4jK5O3L2Ll0k2k8J0O5L5l1n6m6l5l0M8Lq3n2J8lJ2L9Q1
-29417i18N4n1n3M9M5l1n9L7R1N4k1m7k6n9n0l2nL3O7L2pk2m6m4o8p9j0N7Q2O0L7j7m9j3m
-29382a013K2l5o5m1m6NJ9j4j9M3N2j0J0Qn8p2NM8np5l7M6K5N0M9m0n9K6O1j3n3n9j7K4kJ5
-29346a225J4mL4M1l9m1k6k6K5LJ3M4j5l5P8L6m5m2k8oj1j6K2j6j3M3J1j1l1p7p9l6J1nJ8
-29311a434P0P5J6m6l3k3J1L1L2Pm0l0J5O1L9n1p8r5N0J11Ll5QK3j5k5L2Pk5j4%Lkl5qjJ5
-29274a381pL4jl1k1j1K8L6J8m4n7ON6Ml3J1L1nj9p6n0K1M6K5j0l5n2j4M2N9O2j7r4m3l0k1
-29238a573Lj1pN4L2jj4j6J7k7k2M8K8nj9n2QM0N2lp3k8ol2jJ4k3J8Pn1k9OnL1L1J0klN3K2
$$ plain form
-29488 -630 -679 -770 -794 -766 -793 -826 -870 -924 -909 -858 -814 -768 -762 -799 -827 -792 -774 -740 -776 -826 -848 -870 -864 -804 -781 -817 -858 -907 -886 -867 -857 -836 -820 -831 -863
-29453 -863 -904 -923 -946 -978 -997 -1029 -1036 -1023 -945 -911 -935 -936 -911 -848 -816 -813 -843 -865 -893 -883 -818 -783 -814 -870 -916 -951 -981 -933 -930 -1013 -1065 -1047 -1050 -1038 -999 -918
-29417 -918 -864 -915 -968 -919 -874 -905 -964 -927 -836 -782 -803 -850 -876 -935 -985 -1017 -1022 -989 -922 -890 -897 -919 -965 -1009 -1077 -1156 -1166 -1109 -1027 -967 -930 -947 -996 -1009 -1013
-29382 -1013 -991 -1026 -1091 -1132 -1178 -1173 -1154 -1168 -1187 -1144 -1092 -1102 -1092 -1084 -1142 -1214 -1209 -1161 -1166 -1241 -1278 -1232 -1207 -1157 -1108 -1148 -1207 -1181 -1120 -1133 -1186 -1245 -1262 -1238 -1240 -1225
-29346 -1225 -1211 -1215 -1181 -1140 -1179 -1220 -1246 -1272 -1247 -1244 -1231 -1187 -1202 -1237 -1159 -1123 -1168 -1210 -1238 -1244 -1255 -1271 -1249 -1265 -1278 -1235 -1224 -1235 -1266 -1343 -1422 -1458 -1447 -1452 -1434
-29311 -1434 -1364 -1289 -1273 -1319 -1352 -1375 -1364 -1333 -1301 -1294 -1334 -1364 -1349 -1288 -1249 -1300 -1378 -1473 -1423 -1312 -1309 -1344 -1336 -1313 -1328 -1353 -1321 -1314 -1339 -1353 -1353 -1350 -1352 -1387 -1395 -1396 -1381
-29274 -1381 -1388 -1354 -1355 -1386 -1407 -1418 -1390 -1354 -1336 -1380 -1437 -1431 -1375 -1371 -1404 -1393 -1362 -1367 -1386 -1462 -1512 -1491 -1445 -1420 -1430 -1465 -1517 -1531 -1489 -1430 -1368 -1385 -1479 -1522 -1552 -1573
-29238 -1573 -1570 -1581 -1588 -1534 -1502 -1503 -1517 -1533 -1516 -1543 -1565 -1517 -1489 -1494 -1513 -1565 -1557 -1517 -1465 -1468 -1541 -1569 -1575 -1607 -1608 -1594 -1617 -1599 -1592 -1643 -1672 -1666 -1671 -1640 -1609 -1599 -1601 -1604 -1551 -1529
-29198a529n6l7j7Qj8Jj0J7J3l3J5L9J1j9l2j1lJK1Rk1m0jK7pk9Qj4J5M7J0k0m0J9k4m3K5
-29161a718J9l3n7lk0n6J6Q7O0J2JnJ4J8m3p7k2J5J9nlO6L6J3ok1k0o2l6L8Pk9k5KK9j1m9
-29124a849mRK4K0j4n5k9JL8N0N2j1m1k9j9J7Ro2l1O2K2qJ3N0k4%K8j4lkm9q0o4k1J7N0K5
-29087a922J1lk6OKJ5L2m2J4K9k8n2p5K8J5rJ4O3%l8M5L5k1m9n4k8K9K1L4k1o0k7M6O7J6P
-29051a926on9m5oJ5M5J6J1l8m6Pk3nRp4l3O4Q4N2RQk4k2J2j7m4K2J4Mpl3l1l1j5j8J5rjm
-29012b130m4K6O7J2lm1lqK8J3j2M9MJ4M3m1o4j1K1K8p9j09k5n3j2N6j1k9L1M9Oj0JL3M0n1
-28976b215l7l1j6J1j4j5N2N1l8J6L2O8K%l9n1pjnJ6J6ll8L4N1j6m7q9rj8m1L3RL0P4N8j0
-28939b187j8J9jLK7L1K9n6j11n9J0M0N1M3Ql4k7p0j04QM5N7J7NJ9MJ2oj5K1l5l2J9K4n1m5
$$ plain form
-29198 -1529 -1585 -1622 -1639 -1631 -1649 -1648 -1658 -1641 -1628 -1661 -1646 -1607 -1596 -1615 -1647 -1658 -1661 -1660 -1639 -1630 -1651 -1691 -1692 -1665 -1672 -1701 -1693 -1707 -1692 -1645 -1635 -1655 -1695 -1676 -1700 -1743 -1718
-29161 -1718 -1699 -1732 -1789 -1792 -1812 -1868 -1852 -1765 -1705 -1693 -1692 -1697 -1683 -1665 -1708 -1785 -1807 -1792 -1773 -1778 -1781 -1715 -1679 -1666 -1672 -1693 -1713 -1775 -1811 -1773 -1766 -1795 -1820 -1818 -1789 -1800 -1849
-29124 -1849 -1853 -1844 -1820 -1800 -1814 -1869 -1898 -1897 -1859 -1809 -1757 -1768 -1809 -1838 -1857 -1840 -1831 -1893 -1924 -1862 -1840 -1848 -1835 -1785 -1809 -1809 -1781 -1795 -1798 -1800 -1849 -1929 -1993 -2014 -1997 -1947 -1922
-29087 -1922 -1911 -1914 -1940 -1934 -1932 -1917 -1885 -1927 -1913 -1884 -1912 -1964 -2039 -2011 -1996 -2005 -1991 -1928 -1928 -1966 -1921 -1886 -1907 -1956 -2010 -2038 -2009 -1988 -1954 -1975 -2035 -2062 -2016 -1949 -1933 -1926
-29051 -1926 -1932 -1991 -2036 -2042 -2027 -1982 -1966 -1955 -1993 -2039 -2032 -2055 -2060 -2051 -2125 -2158 -2094 -2010 -1958 -1949 -1941 -1965 -1987 -1975 -1992 -2036 -2014 -2000 -1996 -2003 -2036 -2067 -2098 -2113 -2131 -2116 -2125 -2126 -2130
-29012 -2130 -2174 -2148 -2081 -2069 -2072 -2113 -2116 -2124 -2096 -2083 -2095 -2046 -2042 -2028 -1985 -2026 -2090 -2101 -2080 -2052 -2131 -2240 -2265 -2318 -2330 -2274 -2285 -2314 -2283 -2234 -2228 -2238 -2237 -2204 -2164 -2215
-28976 -2215 -2252 -2283 -2299 -2288 -2302 -2317 -2265 -2214 -2252 -2236 -2204 -2136 -2134 -2134 -2173 -2224 -2231 -2232 -2237 -2221 -2205 -2208 -2246 -2212 -2161 -2177 -2224 -2313 -2322 -2340 -2381 -2348 -2339 -2309 -2235 -2177 -2187
-28939 -2187 -2205 -2186 -2187 -2184 -2157 -2126 -2097 -2153 -2264 -2323 -2313 -2273 -2222 -2179 -2171 -2205 -2232 -2302 -2406 -2398 -2353 -2296 -2279 -2274 -2255 -2251 -2239 -2245 -2260 -2239 -2274 -2306 -2287 -2263 -2314 -2359
-28903b359j3k2j1kk2J5K0QRK5OmJ3J4k9l4J%j8qk5k7lj7qRRJ0j3L3N6PK4L0L8Ro3q7jpj0
-28862b447O0J2k9l4m0m4M0P5O2Jl5m6m7o2j2LK4J0L5LmmkK8Ppp1LM9ln9o6O6L7k1K5J9l4
-28824b508l4J3L3l5m2k6mKJ9M4K3J4m4j8K0M2No9n2k2jJ3j6K4j6n4j2L4N6K8KM0J0k3m3k9
-28788b626j7k9m4nK9O8J17pr7n5M3P3K9pqk1j9L5J4m3k9L0L0j9p6l0Rj0l0pj8j1Kk4KL4K8
-28751b689j9n8J9J7qL2M0Qjj5k5k7j6L8N5lk8%J6Moj2l7k3rn0k5L0OOO1j5lpj7Lk1n2l0j
-28711b862J8K5pk0MP4N5k2n9l7K4J5Rl3m5J3k9l8K4%j8n1l4%PoqpM9L0k8J3Nm2j3l7K1P9
-28673b931N4j7j2j8J4Pk7j8Oj8m0J4L5J2jkljl0m6o8j4Qqk8j1M9qqK1jK0JQL8K6J6K7J5j3
-28633b952K3Nq4l1Jj1N2L7j8lk7l2n4K1j6l6j8kK1K8l9pk0l4ll7LO8O0K5J2l7m7l0o8N2O9
$$ plain form
-28903 -2359 -2372 -2394 -2405 -2407 -2429 -2414 -2394 -2386 -2377 -2352 -2346 -2350 -2337 -2323 -2352 -2386 -2385 -2385 -2403 -2411 -2436 -2463 -2466 -2483 -2491 -2482 -2473 -2463 -2476 -2443 -2387 -2380 -2356 -2326 -2288 -2279 -2342 -2429 -2430 -2437 -2447
-28862 -2447 -2387 -2375 -2404 -2438 -2478 -2522 -2482 -2407 -2345 -2344 -2379 -2425 -2472 -2534 -2546 -2543 -2519 -2509 -2474 -2471 -2475 -2479 -2481 -2453 -2446 -2453 -2524 -2521 -2472 -2475 -2534 -2600 -2534 -2497 -2518 -2493 -2474 -2508
-28824 -2508 -2542 -2529 -2496 -2531 -2573 -2599 -2603 -2601 -2582 -2538 -2515 -2501 -2545 -2563 -2543 -2501 -2496 -2565 -2617 -2639 -2640 -2627 -2643 -2619 -2635 -2689 -2701 -2667 -2611 -2583 -2581 -2541 -2531 -2554 -2597 -2626
-28788 -2626 -2643 -2672 -2716 -2721 -2692 -2624 -2507 -2514 -2611 -2666 -2623 -2550 -2521 -2528 -2536 -2557 -2576 -2541 -2527 -2570 -2599 -2569 -2539 -2558 -2634 -2664 -2655 -2665 -2695 -2702 -2720 -2731 -2729 -2753 -2751 -2717 -2689
-28751 -2689 -2708 -2766 -2747 -2730 -2738 -2706 -2666 -2658 -2659 -2674 -2699 -2726 -2742 -2704 -2649 -2652 -2680 -2680 -2664 -2660 -2666 -2678 -2715 -2738 -2747 -2797 -2822 -2792 -2786 -2780 -2719 -2734 -2737 -2744 -2761 -2758 -2779 -2831 -2861 -2862
-28711 -2862 -2844 -2819 -2826 -2846 -2842 -2768 -2713 -2735 -2794 -2831 -2807 -2792 -2783 -2816 -2861 -2848 -2877 -2915 -2891 -2891 -2909 -2960 -2994 -2994 -2987 -2993 -3001 -3008 -2959 -2929 -2957 -2944 -2939 -2981 -2994 -3031 -3010 -2931
-28673 -2931 -2877 -2894 -2906 -2924 -2910 -2903 -2930 -2948 -2942 -2960 -3000 -2986 -2951 -2939 -2940 -2942 -2945 -2946 -2976 -3022 -3090 -3104 -3096 -3104 -3132 -3143 -3094 -3102 -3110 -3089 -3090 -3070 -3069 -3061 -3023 -2997 -2981 -2954 -2939 -2952
-28633 -2952 -2929 -2924 -3008 -3039 -3038 -3049 -2997 -2960 -2978 -2981 -3008 -3040 -3094 -3073 -3089 -3125 -3143 -3145 -3124 -3096 -3135 -3142 -3162 -3196 -3199 -3236 -3233 -3165 -3105 -3080 -3068 -3105 -3152 -3182 -3250 -3198 -3129
-28596c129M8Nj3k5krk7qPOk9l0qk8QQ2J00L1l4o4k0L0KNl6o2m8k2l5jJ9K0j3l0l1K4M8L0
-28558c239N2nm7m5nJ9o7o6M0N4rk5N8L0n0o1j1%N2K0l1kK9j2oj3l3L3K9j9l3n2j8M0Pm6m6
-28521c478J3j5j1Kl0J2K9N0Ql2J3J9L9J5J9n3j15j00K9J25R4k5l3l6l5QK8J3k6QJ4N1K8o5
-28487c437o3K8N7ok9l7n2L5K2J9nj3M3Qj2K8K1K5l3m0o8l1k8nL8K1K3K9Ok9j2j2j0j8l8m5
-28451c620m3o6m3J7%N0N3j6PK8P7Jm1l9nN9K3q9m9j9QqLM2on6qK3J7k2mK3oNNKjkl5n8K2
-28410c771K6mM1OOK6k8k9M2K5o7q4J1N0J0k8p6l1L1K8RRj6j5J9pk9J8L0p1j04k2M0L7l2l3
-28374c983M3N0k5qJ8J8j0l4J5j8l5NnnpK2jq5l6M9K3L4N8kqk4k5l1n1NK2N2j3m7l1k1O5Q7
-28336c939j6p3j5rKK5JJ3K7Rj4m9r6k2J5qk7p3o1K7J16N9m3p2J2j7j2K1J3kJJ2J0l2k3L5
$$ plain form
-28596 -3129 -3081 -3076 -3089 -3114 -3116 -3125 -3152 -3160 -3153 -3147 -3176 -3206 -3214 -3242 -3234 -3152 -3052 -3021 -3055 -3119 -3139 -3109 -3107 -3102 -3138 -3200 -3248 -3270 -3305 -3306 -3287 -3267 -3280 -3310 -3341 -3317 -3269 -3239
-28558 -3239 -3187 -3192 -3239 -3284 -3289 -3270 -3337 -3403 -3363 -3309 -3318 -3343 -3285 -3255 -3305 -3366 -3377 -3377 -3325 -3305 -3336 -3338 -3309 -3321 -3327 -3340 -3373 -3340 -3311 -3330 -3363 -3415 -3433 -3393 -3386 -3432 -3478
-28521 -3478 -3465 -3480 -3491 -3489 -3519 -3507 -3478 -3428 -3420 -3452 -3439 -3420 -3381 -3366 -3347 -3400 -3515 -3615 -3586 -3461 -3367 -3392 -3425 -3461 -3496 -3488 -3460 -3447 -3473 -3465 -3451 -3400 -3372 -3437
-28487 -3437 -3500 -3472 -3415 -3421 -3450 -3487 -3539 -3504 -3482 -3463 -3468 -3481 -3438 -3430 -3442 -3414 -3393 -3368 -3401 -3441 -3509 -3540 -3568 -3573 -3535 -3514 -3491 -3462 -3456 -3485 -3497 -3509 -3519 -3537 -3575 -3620
-28451 -3620 -3663 -3729 -3772 -3755 -3755 -3705 -3652 -3668 -3661 -3633 -3556 -3555 -3596 -3635 -3640 -3581 -3558 -3647 -3696 -3715 -3707 -3715 -3712 -3670 -3676 -3732 -3740 -3717 -3700 -3722 -3726 -3703 -3709 -3704 -3699 -3697 -3698 -3700 -3735 -3793 -3771
-28410 -3771 -3745 -3749 -3708 -3702 -3696 -3670 -3698 -3727 -3685 -3660 -3727 -3811 -3800 -3750 -3740 -3768 -3844 -3875 -3844 -3816 -3807 -3798 -3814 -3829 -3810 -3817 -3846 -3828 -3798 -3869 -3973 -3995 -3955 -3918 -3950 -3983
-28374 -3983 -3940 -3890 -3915 -3923 -3905 -3887 -3897 -3931 -3916 -3934 -3969 -3964 -3969 -3974 -3981 -3959 -3960 -4045 -4081 -4032 -4009 -3975 -3917 -3919 -3927 -3951 -3976 -4007 -4058 -4053 -4031 -3979 -3992 -4039 -4070 -4091 -4026 -3939
-28336 -3939 -3955 -4028 -4043 -4052 -4050 -4025 -4024 -4011 -3984 -3975 -3989 -4038 -4134 -4156 -4141 -4149 -4176 -4249 -4310 -4283 -4167 -4108 -4151 -4223 -4211 -4228 -4240 -4219 -4206 -4208 -4207 -4195 -4185 -4217 -4240 -4205
-28300d205M1L6K0K5J7m8l5J3J8MJ7Rj2k2qj2j0Qj7m9p0oJ6M0L9ok8l2j7j0KqJ5N0ql3l7K4
-28262d279K1J7K3k5j3J4J3j6j5j4k1Oqj8n5n9l6M1qk2M4mJ0K9k4o0j16OJ23M1kl8j9J2L6
-28227d416O4N7oj3jj24r6m9pJ4L1K0j0m7k7J9qk6O7O9j0j01o6M6R0l3p4m5K1J6o0rK3M1K3
-28192d627k5J0P3K5nj3n9k8j7j5k7jK7m8m4m5m3N2Q6L0ok9n5n3l3QN3K1j5l2pm0j0pl0j8
-28156d947K3N8N5J5l3m0n1%L5L4j4n3o1l7O4L3J4K5J5PMn3n6o5k5Q0J4k8M1M7p5j04n1rK7
-28121e111O0O8J7l7p7nN3K7j1l6l5k1j8J6jj5m6r2j0L7jk3k6m9Kj6j7j2k6RJ6lM5Q7j7j0
-28085e278k8m6m0pK4Qpn1k4M9L9J4nK0N4l6n3l7l3J0j8j3J0J9j5j7RK5k4k8k9L9k2l4Ko1
-28049e584p7k4RM4O1PL3J9jL3j9m1K3K4ql2p0m0n8j1L6M3L7j1mM4J8qk6J7nRL9l3n4L6N8
$$ plain form
-28300 -4205 -4164 -4128 -4108 -4083 -4066 -4114 -4149 -4136 -4118 -4114 -4097 -4088 -4100 -4122 -4130 -4142 -4152 -4144 -4161 -4210 -4280 -4286 -4270 -4230 -4191 -4197 -4225 -4257 -4274 -4284 -4282 -4290 -4275 -4225 -4233 -4266 -4303 -4279
-28262 -4279 -4258 -4241 -4218 -4243 -4256 -4242 -4229 -4245 -4260 -4274 -4295 -4289 -4297 -4315 -4370 -4429 -4465 -4424 -4432 -4454 -4410 -4414 -4404 -4375 -4399 -4459 -4575 -4569 -4446 -4405 -4407 -4445 -4464 -4452 -4416
-28227 -4416 -4352 -4295 -4301 -4314 -4315 -4439 -4535 -4584 -4591 -4577 -4546 -4526 -4536 -4583 -4610 -4591 -4599 -4625 -4558 -4489 -4499 -4600 -4666 -4620 -4530 -4563 -4637 -4682 -4661 -4645 -4705 -4714 -4691 -4650 -4627
-28192 -4627 -4652 -4642 -4569 -4544 -4549 -4562 -4621 -4649 -4666 -4681 -4708 -4709 -4682 -4730 -4774 -4819 -4862 -4810 -4724 -4694 -4700 -4729 -4784 -4837 -4870 -4862 -4809 -4788 -4803 -4835 -4842 -4882 -4892 -4899 -4929 -4947
-28156 -4947 -4924 -4866 -4811 -4796 -4829 -4869 -4920 -4920 -4885 -4851 -4865 -4918 -4979 -5016 -4952 -4919 -4905 -4880 -4865 -4858 -4854 -4907 -4963 -5028 -5053 -4973 -4959 -4987 -4946 -4899 -4974 -5078 -5129 -5138 -5111
-28121 -5111 -5051 -4983 -4966 -5003 -5080 -5085 -5032 -5005 -5016 -5052 -5087 -5108 -5126 -5110 -5111 -5126 -5172 -5264 -5274 -5237 -5238 -5261 -5287 -5336 -5334 -5350 -5367 -5379 -5405 -5396 -5380 -5383 -5338 -5251 -5268 -5278
-28085 -5278 -5306 -5352 -5392 -5399 -5375 -5367 -5374 -5425 -5449 -5400 -5361 -5347 -5352 -5332 -5278 -5314 -5367 -5404 -5437 -5427 -5445 -5458 -5448 -5429 -5444 -5461 -5452 -5427 -5451 -5479 -5508 -5469 -5491 -5525 -5523 -5584
-28049 -5584 -5661 -5685 -5676 -5632 -5571 -5564 -5531 -5512 -5513 -5480 -5499 -5540 -5517 -5493 -5501 -5533 -5603 -5643 -5701 -5712 -5676 -5633 -5596 -5607 -5611 -5567 -5549 -5557 -5583 -5566 -5571 -5562 -5523 -5556 -5610 -5574 -5516
-28012e516j6o1J1M6L2pq0q3m7Q7P3Pj0l1k1K9L9Pq2n2o0m5J4M7N9N6K5Lk2k2p0r6o8%M8N4
-27976e752J1k1l2lL2M9J1m2k1QPK6n6o0J0kom6l6J0k2q3n5K1O5J5M5P2M8l4m6n4o3m5n5J8
-27940f086M8Ll9m1NK1J0K4j5p2o2m0M4N1lk3j7j6k4l5k3n0LJ7j1J9K8kjk0n6k8k0J4J0l7
-27904f424%k0j8K5L0K2K9L3J1o3p2QOj0K7L8pJ5J1k4l7m0n6p2%k5j3N1k7m9k1j0k8l0N1L1
-27868f658p4r0n7L4O5np7k8P6M2m3j4j7m7m2J0J9mK9Ml7j9k5m2j1k3J3K6K1l3rj4l0j4m6
-27833g120m1J5mm4m7KK9L6K4p2n2KQN5m1q8m4k1K9Ok1l6m2K5L4k4j9K0N0Rk2j4m8J9J4j3
-27797g436K1j6om7l0N3K5k3l6n2q8m3KK4L2Kn6n2J5m7j04m6J5L3J0l8J6J7L1LlM7m7p5k9
-27762g928k5n2nNr4o7K5L7Ko2m5N6L8k7p5m2k9lk4j1rJ7lj6m1l2l0k5l2k4K5j2p4l0K2K5
$$ plain form
-28012 -5516 -5532 -5593 -5582 -5536 -5504 -5511 -5591 -5674 -5721 -5634 -5561 -5554 -5564 -5595 -5616 -5587 -5548 -5541 -5623 -5675 -5735 -5780 -5766 -5719 -5660 -5604 -5579 -5576 -5598 -5620 -5690 -5786 -5854 -5854 -5806 -5752
-27976 -5752 -5741 -5762 -5794 -5797 -5765 -5716 -5705 -5747 -5768 -5760 -5753 -5727 -5783 -5843 -5833 -5835 -5841 -5887 -5923 -5913 -5935 -6018 -6073 -6052 -5987 -5972 -5927 -5855 -5807 -5841 -5887 -5941 -6004 -6049 -6104 -6086
-27940 -6086 -6038 -6035 -6074 -6115 -6110 -6089 -6079 -6055 -6070 -6142 -6204 -6244 -6200 -6149 -6152 -6175 -6192 -6208 -6232 -6267 -6290 -6340 -6337 -6320 -6331 -6312 -6284 -6286 -6287 -6307 -6363 -6391 -6411 -6397 -6387 -6424
-27904 -6424 -6424 -6444 -6462 -6437 -6407 -6385 -6356 -6323 -6312 -6375 -6447 -6439 -6433 -6443 -6416 -6378 -6385 -6370 -6359 -6383 -6420 -6460 -6516 -6588 -6588 -6613 -6626 -6575 -6602 -6651 -6672 -6682 -6710 -6740 -6689 -6658
-27868 -6658 -6732 -6822 -6879 -6845 -6780 -6785 -6862 -6890 -6814 -6772 -6815 -6829 -6846 -6893 -6935 -6925 -6906 -6910 -6881 -6877 -6914 -6933 -6958 -7000 -7011 -7034 -7021 -6995 -6974 -7007 -7016 -7030 -7060 -7074 -7120
-27833 -7120 -7161 -7146 -7150 -7194 -7241 -7239 -7210 -7174 -7150 -7222 -7274 -7272 -7264 -7209 -7250 -7338 -7382 -7403 -7374 -7368 -7389 -7425 -7467 -7442 -7408 -7432 -7451 -7431 -7381 -7372 -7394 -7408 -7456 -7437 -7423 -7436
-27797 -7436 -7415 -7431 -7437 -7484 -7514 -7461 -7436 -7459 -7495 -7547 -7635 -7678 -7676 -7652 -7620 -7618 -7674 -7726 -7711 -7758 -7862 -7908 -7893 -7860 -7850 -7888 -7872 -7855 -7824 -7821 -7824 -7777 -7824 -7899 -7928
-27762 -7928 -7953 -8005 -8010 -8005 -8099 -8166 -8141 -8104 -8102 -8164 -8209 -8153 -8115 -8142 -8217 -8259 -8288 -8291 -8315 -8326 -8335 -8318 -8321 -8337 -8378 -8410 -8440 -8465 -8497 -8521 -8496 -8508 -8582 -8612 -8590 -8565
-27726h565J6k7J6K6m6o6n3NM7L4nm0n5m1Ll5n5m9j5j6L4J0k6L4mp3o9n3l0MJ7qk8n0k7l4
-27690i224m5%J5L1l3m8J4Pm0m4mmn2q2m8pJ7n5n7mJnK0j1p8m9n4l4j6j0L1K3kJ2J1ml5n2
-27652i915m8k5rK9m1p5o3p8n7P9M4m8j4n0l1l7j7K1QJ8k9k7k9k4j2l5n8lj7j08j39p2qk5
-27618a0895K4Q0L3k5l1n1JQl8MN3l1j16r9m0j6m7m7m6rJ2op6m0k0J1po6j12o3MNOK1kn7J6
-27581a1662m2q7p3l8o7o3K0j7m0m3o5p9J0K7K1l1j13j01k2JJ6O6K4q7q0p2j07n1Jo8j3O0
-27549a2775N6mn7q5j17o1pKk6n7j6Ln0n3m8p3q1p7q6q5m0nRl1p3m2n4r1r3o2j17j24r3n3
-27515a4566k7j18q5l7l0m9o2o9q6q5q5l4o9j27j01o5l4p0j49j10q5r7r7l1k4n6r8j77j11
-27486a6834o8q7q2j06j07n2p0r3j09j22o0j44j18j3p8j79j49j08m3mr5j76j46j18j08j46
$$ plain form
-27726 -8565 -8549 -8576 -8560 -8534 -8580 -8646 -8699 -8694 -8647 -8613 -8618 -8658 -8713 -8754 -8751 -8786 -8841 -8890 -8905 -8921 -8887 -8877 -8903 -8869 -8873 -8946 -9015 -9068 -9098 -9094 -9077 -9085 -9113 -9163 -9190 -9224
-27690 -9224 -9269 -9269 -9254 -9223 -9256 -9304 -9290 -9283 -9323 -9367 -9371 -9375 -9427 -9509 -9557 -9564 -9547 -9602 -9659 -9663 -9662 -9667 -9647 -9658 -9736 -9785 -9839 -9873 -9889 -9899 -9868 -9845 -9847 -9835 -9824 -9828 -9863 -9915
-27652 -9915 -9963 -9988 -9997 -9968 -10009 -10084 -10147 -10225 -10282 -10203 -10159 -10207 -10221 -10271 -10302 -10339 -10356 -10335 -10327 -10309 -10338 -10365 -10394 -10418 -10430 -10465 -10523 -10526 -10543 -10651 -10790 -10862 -10870 -10895
-27618 -10895 -10871 -10791 -10758 -10783 -10814 -10865 -10864 -10856 -10894 -10890 -10837 -10868 -10984 -11083 -11123 -11139 -11186 -11233 -11279 -11288 -11276 -11282 -11358 -11398 -11418 -11407 -11414 -11480 -11592 -11655 -11651 -11646 -11640 -11619 -11621 -11678 -11662
-27581 -11662 -11704 -11791 -11864 -11902 -11969 -12032 -12012 -12029 -12069 -12112 -12177 -12256 -12246 -12219 -12198 -12229 -12342 -12443 -12465 -12464 -12448 -12382 -12358 -12445 -12525 -12597 -12704 -12755 -12754 -12822 -12835 -12775
-27549 -12775 -12719 -12723 -12780 -12865 -12982 -13043 -13050 -13048 -13074 -13131 -13147 -13144 -13194 -13247 -13295 -13368 -13449 -13526 -13612 -13697 -13737 -13742 -13733 -13764 -13837 -13879 -13933 -14024 -14117 -14179 -14296 -14420 -14513 -14566
-27515 -14566 -14593 -14711 -14796 -14833 -14863 -14912 -14974 -15043 -15129 -15214 -15299 -15333 -15402 -15529 -15630 -15695 -15729 -15799 -15948 -16058 -16143 -16240 -16337 -16368 -16392 -16448 -16546 -16723 -16834
-27486 -16834 -16902 -16989 -17071 -17177 -17284 -17336 -17406 -17499 -17608 -17730 -17790 -17934 -18052 -18065 -18143 -18322 -18471 -18579 -18622 -18626 -18721 -18897 -19043 -19161 -19269 -19415
-27460a9415j65r1p3j68j88j80j50j15j17j34j49j04j10j14k18j87j09r6j08j49k01j22r4
-27437b2557r7j88k16r5j21j70j85k10j91j34j79j67j99j71j63j90j43j57k18k51j88k11k22
-27414b6623k50k32j86j55j25j68k05k33k70k40j68j75k45k17k98l11k92k70j99k14k32l21
-27392c1629k67k67l57l07l11l33k52k21k17k40k69k94k77k54k74l16l05l01k56k07k27k30
-27370c7611j47j49j07r8j42r5K5O3J00J56J80J85K45L62M45M59N61O56P57Q04R06R35R43
-27347c0567J093J166J103J174J283J336J340J323J332J325J334J287J200J216J176J039R69
-27330i871R74Q65Q11P36P05O61N65N11M78M41M37M32L55K75K84L52M35M69M63M74N74O27
-27308B053O65P18P65Q39Q84R51J051J158J208J279J294J372J417J324J335J380J343J327
$$ plain form
-27460 -19415 -19580 -19671 -19744 -19912 -20100 -20280 -20430 -20545 -20662 -20796 -20945 -21049 -21159 -21273 -21491 -21678 -21787 -21883 -21991 -22140 -22341 -22463 -22557
-27437 -22557 -22654 -22842 -23058 -23153 -23274 -23444 -23629 -23839 -24030 -24164 -24343 -24510 -24709 -24880 -25043 -25233 -25376 -25533 -25751 -26002 -26190 -26401 -26623
-27414 -26623 -26873 -27105 -27291 -27446 -27571 -27739 -27944 -28177 -28447 -28687 -28855 -29030 -29275 -29492 -29790 -30101 -30393 -30663 -30862 -31076 -31308 -31629
-27392 -31629 -31896 -32163 -32520 -32827 -33138 -33471 -33723 -33944 -34161 -34401 -34670 -34964 -35241 -35495 -35769 -36085 -36390 -36691 -36947 -37154 -37381 -37611
-27370 -37611 -37758 -37907 -38014 -38112 -38254 -38349 -38324 -38261 -38161 -38005 -37825 -37640 -37395 -37033 -36588 -36129 -35568 -34912 -34155 -33351 -32445 -31510 -30567
-27347 -30567 -29474 -28308 -27205 -26031 -24748 -23412 -22072 -20749 -19417 -18092 -16758 -15471 -14271 -13055 -11879 -10840 -9871
-27330 -9871 -8897 -8032 -7221 -6485 -5780 -5119 -4554 -4043 -3565 -3124 -2687 -2255 -1900 -1625 -1341 -989 -554 -85 378 852 1426 2053
-27308 2053 2718 3436 4201 5040 5924 6875 7926 9084 10292 11571 12865 14237 15654 16978 18313 19693 21036 22363
-27290B2363J309J245J147J108J073J004R08Q84Q29O87N58M56M47L81L06K65J58L0N4K0m5
-27269C5187o5o0j00j81k03j93k48k82k63l28l22l30k66k79l58l29k56k58k83l66l73k91l03
-27246B9250l81l96l45l01l16k83k66k68k60k54k96l00k80l16k90k95k87k78k77k60k30k09
-27224B2862k04k22k17k01k45j93j98k21k42k33k06j76k39k54k28k23k06k30k01k07k03j79
-27202A8134j10j27j74j83j57j57j46j84j93j32j28j24j18j43j12j76j63j45j68j61j16q4
-27180A4933p2q4j12j17j29m6p9j74j34j05j32r0o0j04j31p5k0m5j02j18j28q6n2p7q7o7q6
-27153A2421j03p2p7j43o2n9j35j39q3l1l1n3p8m8q5j16o5m9o8l6l6k9n0r7q7j2L4K0q4j60
-27123A0387r3m5k0Pl6n0r1r1p1k6k1j8k4n5m1k0r8o7k6l0o3p7o0n3o9k6l9n2o9p1l5k2k8
$$ plain form
-27290 22363 23672 24917 26064 27172 28245 29249 30157 31041 31870 32557 33115 33571 34018 34399 34705 34970 35128 35158 35212 35232 35187
-27269 35187 35122 35062 34962 34781 34578 34385 34137 33855 33592 33264 32942 32612 32346 32067 31709 31380 31124 30866 30583 30217 29844 29553 29250
-27246 29250 28869 28473 28128 27827 27511 27228 26962 26694 26434 26180 25884 25584 25304 24988 24698 24403 24116 23838 23561 23301 23071 22862
-27224 22862 22658 22436 22219 22018 21773 21580 21382 21161 20919 20686 20480 20304 20065 19811 19583 19360 19154 18924 18723 18516 18313 18134
-27202 18134 18024 17897 17723 17540 17383 17226 17080 16896 16703 16571 16443 16319 16201 16058 15946 15770 15607 15462 15294 15133 15017 14933
-27180 14933 14861 14777 14665 14548 14419 14373 14294 14120 13986 13881 13749 13659 13599 13495 13364 13289 13269 13224 13122 13004 12876 12790 12738 12661 12574 12507 12421
-27153 12421 12318 12246 12169 12026 11964 11905 11770 11631 11548 11517 11486 11433 11355 11307 11222 11106 11041 10992 10924 10888 10852 10823 10773 10676 10589 10577 10611 10631 10547 10387
-27123 10387 10294 10249 10229 10236 10200 10150 10059 9968 9897 9871 9850 9832 9808 9753 9712 9692 9594 9527 9501 9471 9408 9331 9271 9218 9149 9123 9084 9032 8963 8892 8857 8835 8807
-27090H807j07q4r3r7m7ml7m5l7k8p8m4q1o7j2J8n6j06q6p4k0j3l0j08q3j9k4k9j9l9q4p6
-27058G098rJp3k4ql6k4m1p3n5Pk0m6nm8p9l1m7o0J1j2n8l6pm2m9j9l6r8lQn4r9r3n3p7o1
-27021E649l2o1J1K6l0o3m9j0Om8lpj6J4oj8kl4n7Ko2p2p0l3Lk2k0Nk1p5q2o5l4K2M4J4k8
-26984D776nK9kn1m2k4Pnn5n9m2m7o0o1n4J4L7k3j09j06rK8N4K5j4j8j1n0p0M4J0j3J8j3j01
-26949C998q4l5m9KL0oq6l7K3K4l7p5m5Jj1lN3J0j9l5m3J3l5l5j5j7m2p7m2j7K4k9n0nK8L
-26913C280o0pM5J9o4o3pl1l1k7NPKn5q3J0Q7L3k4p0p7jk8n6l1L3Lm3q0j6K1K4M4nm7m7J3
-26876B673J3o1r2q4L2J14Nq2NK2j2k6n7n4j8PQnl0j6k9J3N2Pj3jJ0k7p1l6m4nPL6M4NJ3k4
-26838B279n3nm1k9j8Mj8rrl1l4m7k8n2oK8j8P9L3o7m9Q%l0k8kqj7J8om6pJ5n1o9k4mL5Ml2
$$ plain form
-27090 8807 8700 8616 8523 8426 8379 8375 8338 8293 8256 8228 8150 8106 8025 7958 7946 7964 7908 7802 7716 7642 7622 7609 7579 7471 7388 7369 7345 7316 7297 7258 7174 7098
-27058 7098 7089 7090 7017 6993 6985 6949 6925 6884 6811 6756 6763 6743 6697 6692 6644 6565 6534 6487 6427 6438 6426 6368 6332 6325 6283 6234 6215 6179 6081 6078 6086 6032 5933 5840 5787 5710 5649
-27021 5649 5617 5556 5567 5593 5563 5500 5451 5441 5447 5399 5396 5389 5373 5387 5381 5363 5361 5327 5270 5272 5210 5138 5068 5035 5038 5016 4996 5001 4980 4905 4823 4758 4724 4746 4790 4804 4776
-26984 4776 4771 4800 4798 4747 4705 4681 4688 4683 4628 4569 4527 4480 4420 4359 4305 4319 4356 4333 4224 4118 4109 4137 4191 4216 4202 4184 4173 4123 4053 4097 4107 4094 4112 4099 3998
-26949 3998 3914 3879 3830 3832 3862 3856 3770 3733 3756 3780 3743 3668 3623 3624 3613 3610 3663 3673 3654 3619 3576 3589 3554 3519 3504 3487 3445 3368 3326 3309 3333 3304 3254 3249 3277 3280
-26913 3280 3220 3213 3258 3277 3213 3150 3143 3112 3081 3054 3059 3066 3068 3013 2930 2940 3027 3060 3036 2966 2889 2888 2860 2804 2773 2806 2809 2766 2686 2670 2691 2715 2759 2754 2707 2660 2673
-26876 2673 2686 2625 2533 2449 2481 2595 2600 2518 2523 2545 2533 2507 2450 2396 2378 2385 2393 2388 2358 2342 2313 2326 2378 2385 2372 2371 2381 2354 2283 2247 2203 2198 2205 2241 2285 2290 2303 2279
-26838 2279 2226 2221 2180 2151 2133 2137 2119 2110 2101 2070 2036 1989 1961 1909 1903 1931 1913 1992 2025 1958 1909 1917 1917 1887 1859 1857 1849 1832 1850 1844 1798 1791 1806 1755 1686 1662 1658 1693 1697 1665
-26798A665k2j3J2Qm7J1O7rj5k0k4J5K1l4l2k7j8MoJL0k1p0k9mm1n2K2O1j7n8k3lk4j7j5j9
-26761A257pk7nK3M8kmj9j5%l4m3j1J0k8n3rP2N8Rq8j24m9j7mj3k6LN2O2kn8m5j5K8Rm7k7
-26723H59Pj01p7OJ3Ok5j4mM1L3mj9k7pJ9J2J7Lj4l9mOm1l1K7L9PnJ2j4rr7j06MLl6RJ6Rn6
-26682D18k5J4J7j2n7j7j1J9N8L1k6j4m5m6J0J2J5j1l9o2k3M4K2l2j8n6j3k2nJ4L6J7k0J8
-26648A91L8L9m6r6m2p5o0PRL8L4k6m2J9L6M3J2jnl7l9j8Kpj5j7J4J0m7rN8O0lm5K0M4M4L4
-26610A22l1l6k9m5n1l8K2Ok6RK0mj8J5%k7l7j5m4j7O4L9j8j0Ml2L2O4lj9K0L7j2j4j0QQq
-26572g4j2m5p5n4k3q0j9O4P6N6N2k3k8k2K8L0qk2m8k1k7k0k4J1L4%pM7lL0Ro8m9J4M7O8J8
-26535a68J0Kn4j3K2mj2mn8j00m9k6k1j9j4RM0M1J5k4k7J2Rl9n4l5PL4Nm3l2k6k6M1K1J4J
$$ plain form
-26798 1665 1643 1630 1642 1650 1603 1614 1681 1672 1657 1637 1613 1628 1649 1615 1583 1556 1538 1542 1536 1537 1567 1546 1476 1447 1443 1402 1350 1372 1433 1416 1358 1335 1332 1308 1291 1276 1257
-26761 1257 1250 1223 1218 1241 1289 1287 1283 1264 1249 1249 1215 1172 1161 1171 1143 1090 1081 1153 1211 1220 1132 1008 959 942 938 925 899 902 954 1016 1014 956 911 896 924 933 886 859
-26723 859 866 765 688 694 707 713 688 674 670 711 744 740 721 694 687 706 718 735 738 724 685 681 687 646 615 642 681 688 683 695 681 672 575 469 473 476 440 449 465 474 418
-26682 418 393 407 424 412 355 338 327 346 404 435 409 395 350 304 314 326 341 330 291 229 206 250 272 240 222 166 153 131 126 140 176 193 173 191
-26648 191 229 268 222 126 84 9 -51 -44 -35 3 37 11 -31 -12 24 67 79 78 73 36 -3 -21 -19 -26 -41 -58 -44 -34 -81 -90 -32 28 25 -20 0 44 88 122
-26610 122 91 55 26 -19 -70 -108 -86 -80 -106 -97 -77 -81 -99 -84 -84 -111 -148 -163 -207 -224 -160 -121 -139 -149 -145 -177 -145 -81 -84 -103 -83 -46 -58 -72 -82 -74 -66 -74
-26572 -74 -86 -131 -206 -260 -283 -363 -382 -318 -242 -186 -134 -157 -185 -207 -179 -149 -157 -179 -227 -248 -275 -295 -319 -308 -274 -274 -281 -234 -237 -207 -198 -266 -315 -301 -254 -186 -168
-26535 -168 -158 -156 -210 -223 -201 -205 -217 -221 -279 -379 -428 -454 -475 -494 -508 -499 -459 -418 -403 -427 -454 -442 -433 -472 -526 -561 -554 -520 -515 -558 -590 -616 -642 -601 -580 -566 -565
-26498e65L5N3j1n5n1k9Prk2m6l4NO9L9k6K6P1N3l7l3Rn6qPj8m5j00p6k4j5J8k0l1K3N4J6
-26462h26rJ0l5j3L5K0k1nk5k6rjk5J4oj8m6NM6j1m8k0lj2N9O0k1n9LK6J7l2pl0l0k0Jl4%
-26423a096L2M7M3%M9K4n1l2qQl7p0j5K7M2ko5n9m2l0M2K1kJm0Oj4K3k4l6j0l1l4Rj0oM3J1
-26385a286j6n4n8l3OQ3L9om2p8k9N7J0j0L4J6n2l6j6J6J3RM5N3O7po9o1k9L5K0l9QJ2l9k3
-26349a460N7N6l9k0K6j3K4m1m6K6J3l4m4rM4J0k2Rk3J9Lm3j2%M4L3j7m2l8l9k2JRJ2Ln8p4
-26312a707j7Jl6qM0L0mJ0m3m1oJ9Jj8l8j5K6J8L9M0kK0J6l1j3k2k5l2L3N0J2k2k1J1k9j5
-26276a779n0m0j4L5K6oL2k3m7%l5KJ8mNK7kj9k5j6ko2p4MK6j2q1j7M5J6L1Jj5K3Kn0OL8J8
-26237b018J6J3roLOl1p2l8P2L0o4n3j8K7L2L0QK2l7k2K3L3K2o4rN9Rl8L2L0j7l1nQml1j4
$$ plain form
-26498 -565 -530 -477 -488 -543 -594 -623 -616 -625 -647 -693 -727 -722 -653 -614 -640 -614 -543 -490 -527 -560 -551 -607 -615 -608 -626 -671 -771 -847 -871 -886 -868 -888 -919 -896 -842 -826
-26462 -826 -835 -825 -860 -873 -838 -818 -839 -844 -869 -895 -904 -905 -930 -916 -922 -940 -986 -981 -935 -946 -994 -1014 -1017 -1029 -970 -910 -931 -990 -987 -961 -944 -976 -983 -1013 -1043 -1063 -1062 -1096 -1096
-26423 -1096 -1064 -1017 -974 -974 -925 -901 -952 -984 -992 -984 -1021 -1091 -1106 -1079 -1037 -1039 -1104 -1163 -1205 -1235 -1193 -1172 -1174 -1173 -1213 -1207 -1221 -1198 -1222 -1258 -1268 -1299 -1333 -1324 -1334 -1340 -1297 -1286
-26385 -1286 -1302 -1356 -1414 -1447 -1441 -1358 -1319 -1325 -1367 -1445 -1474 -1417 -1407 -1417 -1383 -1367 -1419 -1455 -1471 -1455 -1442 -1433 -1388 -1335 -1268 -1275 -1344 -1405 -1434 -1399 -1379 -1418 -1410 -1398 -1437 -1460
-26349 -1460 -1403 -1347 -1386 -1406 -1380 -1393 -1369 -1410 -1456 -1430 -1417 -1451 -1495 -1504 -1460 -1450 -1472 -1463 -1486 -1467 -1464 -1507 -1519 -1519 -1475 -1442 -1459 -1501 -1539 -1578 -1600 -1599 -1590 -1578 -1575 -1633 -1707
-26312 -1707 -1724 -1723 -1759 -1767 -1727 -1697 -1701 -1691 -1734 -1775 -1781 -1762 -1761 -1779 -1817 -1832 -1806 -1788 -1749 -1709 -1711 -1691 -1675 -1706 -1719 -1741 -1766 -1798 -1765 -1715 -1703 -1725 -1746 -1735 -1764 -1779
-26276 -1779 -1829 -1869 -1883 -1848 -1822 -1828 -1796 -1819 -1866 -1866 -1901 -1899 -1881 -1885 -1880 -1853 -1855 -1874 -1899 -1915 -1917 -1979 -2053 -2049 -2023 -2035 -2116 -2133 -2088 -2072 -2041 -2040 -2055 -2032 -2030 -2080 -2074 -2036 -2018
-26237 -2018 -2002 -1989 -1998 -2004 -2001 -1995 -2026 -2098 -2136 -2064 -2034 -2098 -2151 -2169 -2142 -2110 -2080 -2072 -2050 -2087 -2109 -2086 -2053 -2031 -2095 -2104 -2045 -2036 -2074 -2042 -2012 -2029 -2060 -2065 -2057 -2061 -2092 -2106
-26199b106j4om1o0KK2jj8lL4j9n6Kk9o4j06m0O9N4JMK1JJ8L4L9J3mm5q6j7j0k3j3qL1mj5
-26161b443K5j9K7k6p6lj3kO6N2J2l8l2l2p5j1K4k3k6M7P7N7J0m3l9n8j9P2J5n9k7M4jk8k8
-26126b593k9%k2K9N6o2k7K3L2O8M2n4q7r7rNm2L4O2K5J8KqplK9k2K9L3n2o6l7k0J5%mk6J6
-26088b749jmQk2oj8k0L7M0J7J2l7m6j1j5k1L4j3n0%k2o5lO3O9L6o1J1J7Lj9q6m5j1rK6nj0
-26050b976nK0j0j1l9K9M6qj5K3jpjL4Jl6m1L1J2m9o0qql2K4L0K9J1qj6m7k1j6l5k3N6J3l9
-26012c153j4QqK8Jj0Lm3o8j2N6J1n8m7k0K3Npk0oJ0M3K9m5l2k3K2M6l4j00j3K9M3L7l7j9
-25976c375l1K8N7K2J5M4on5j9J8Nj8l2mK6j5j9lJ1k4m7p5o1Ok7o0J1M5L7L5O6K1k1m3Opl8
-25939c527K2J1lm4l0L0M3M9k7l5n1l9RN6l2n8Plk1n1l1O6L0l2m0K7J2k0L9lk5k0k9l3n6j4
$$ plain form
-26199 -2106 -2120 -2126 -2167 -2227 -2225 -2203 -2204 -2222 -2225 -2191 -2210 -2266 -2264 -2293 -2357 -2463 -2503 -2434 -2380 -2379 -2375 -2354 -2353 -2335 -2301 -2262 -2249 -2253 -2298 -2384 -2401 -2411 -2434 -2447 -2455 -2424 -2428 -2443
-26161 -2443 -2418 -2437 -2410 -2436 -2512 -2515 -2528 -2530 -2464 -2412 -2400 -2438 -2470 -2502 -2577 -2588 -2564 -2587 -2613 -2566 -2489 -2432 -2422 -2465 -2504 -2562 -2581 -2509 -2494 -2553 -2580 -2536 -2537 -2565 -2593
-26126 -2593 -2622 -2622 -2644 -2615 -2559 -2621 -2648 -2625 -2593 -2525 -2483 -2537 -2624 -2721 -2730 -2725 -2767 -2733 -2671 -2646 -2628 -2626 -2634 -2641 -2644 -2615 -2637 -2608 -2575 -2627 -2693 -2730 -2750 -2735 -2735 -2739 -2765 -2749
-26088 -2749 -2750 -2754 -2746 -2768 -2774 -2792 -2812 -2775 -2735 -2718 -2706 -2743 -2789 -2800 -2815 -2836 -2802 -2815 -2865 -2865 -2887 -2952 -2955 -2892 -2823 -2787 -2848 -2837 -2820 -2817 -2836 -2922 -2967 -2978 -2987 -2961 -2966 -2976
-26050 -2976 -2981 -2961 -2971 -2982 -3021 -2992 -2946 -2954 -2969 -2946 -2947 -2954 -2955 -2921 -2920 -2956 -2997 -2966 -2954 -3003 -3063 -3071 -3079 -3111 -3087 -3057 -3028 -3017 -3025 -3041 -3088 -3109 -3125 -3160 -3183 -3127 -3114 -3153
-26012 -3153 -3167 -3159 -3167 -3139 -3138 -3148 -3145 -3188 -3256 -3268 -3212 -3201 -3259 -3306 -3326 -3303 -3298 -3305 -3325 -3331 -3321 -3278 -3249 -3294 -3326 -3349 -3327 -3281 -3315 -3415 -3428 -3399 -3356 -3319 -3356 -3375
-25976 -3375 -3406 -3378 -3321 -3299 -3284 -3240 -3246 -3301 -3320 -3302 -3297 -3315 -3347 -3351 -3325 -3340 -3359 -3362 -3351 -3375 -3422 -3497 -3558 -3552 -3579 -3639 -3628 -3583 -3546 -3511 -3445 -3424 -3445 -3488 -3482 -3489 -3527
-25939 -3527 -3505 -3494 -3497 -3541 -3571 -3541 -3498 -3449 -3476 -3511 -3562 -3601 -3592 -3536 -3568 -3626 -3619 -3622 -3643 -3694 -3725 -3659 -3629 -3661 -3701 -3674 -3662 -3682 -3643 -3646 -3671 -3691 -3720 -3753 -3809 -3823
-25903c823K5L1pN0L5Nj3L4j2p4l2K7ok3m0ll2Jk7kl3j2N2K6J7RL0mk6m0L2J4m7n2m3J1L7
-25866c915K4j5k4l6Ol3l4K0J0k4K1J6J5oJ4L1qm6m9l8j2j6jN0L2J1k4k5k6LN8%p2J3j5l0
-25830d125j1J2J8Kk2J0k5k2K1J8N3N0j1j04j7M2Qo2q4n6j5L4J2mJ6J5k3n3j8o6m2L7Q2M6
-25796d284LJ9J2n8k9pjQJ3j2PM6l4m8M9K8m7l3l8p0J5K1k2k9K4J3K0L9j1j3l1k7k2o3m7J3
-25760d596N4k9l9k8N8N7k9lJ3j3l2kJ8rm7m8N5K2m7MM5J6K0kp3n5oRqm1n0JJ8oNK2mo5m1
-25721d856M4l5nO4K3LJ0ml2l0j9L5L0k2jn4n1j2j3ok4j9pk8k2RP0L5j5n5k7l0qjJ9K8N3j
-25683d954k6k1p4k2Qm9o0l9J6N1K5L0m0oO5L9Jk5l0k5n3j4j6no0j0J3oL9O5k3n3Ll8k9j5
-25647e338lPmLj8k3j0K1n8L1R3J6K8k0p4m5qJ5M8k0q4m7M5Pn5j9M4O5N7j7j33q7Kk8kl0j
$$ plain form
-25903 -3823 -3798 -3767 -3774 -3724 -3689 -3684 -3697 -3663 -3675 -3749 -3781 -3754 -3760 -3783 -3823 -3826 -3858 -3857 -3884 -3886 -3919 -3931 -3879 -3853 -3836 -3827 -3797 -3801 -3827 -3867 -3835 -3821 -3868 -3920 -3963 -3952 -3915
-25866 -3915 -3891 -3906 -3930 -3966 -3960 -3993 -4027 -4007 -3997 -4021 -4000 -3984 -3969 -3975 -3961 -3930 -3938 -3984 -4033 -4071 -4083 -4099 -4100 -4050 -4018 -4007 -4031 -4056 -4082 -4079 -4021 -4021 -4093 -4080 -4095 -4125
-25830 -4125 -4136 -4124 -4106 -4104 -4126 -4116 -4141 -4163 -4142 -4124 -4071 -4021 -4032 -4136 -4153 -4111 -4103 -4165 -4249 -4305 -4320 -4286 -4274 -4278 -4262 -4247 -4270 -4323 -4341 -4407 -4449 -4412 -4330 -4284
-25796 -4284 -4281 -4262 -4250 -4308 -4337 -4344 -4345 -4337 -4324 -4336 -4329 -4283 -4317 -4365 -4316 -4288 -4335 -4368 -4406 -4476 -4461 -4440 -4462 -4491 -4467 -4454 -4434 -4395 -4406 -4419 -4450 -4477 -4499 -4562 -4609 -4596
-25760 -4596 -4542 -4571 -4610 -4638 -4580 -4523 -4552 -4555 -4542 -4555 -4587 -4589 -4571 -4580 -4627 -4675 -4620 -4598 -4645 -4641 -4596 -4580 -4560 -4562 -4635 -4690 -4696 -4687 -4695 -4736 -4786 -4785 -4767 -4773 -4768 -4746 -4750 -4815 -4856
-25721 -4856 -4812 -4847 -4852 -4788 -4765 -4762 -4752 -4756 -4788 -4818 -4837 -4802 -4772 -4794 -4795 -4849 -4900 -4912 -4925 -4931 -4955 -4974 -4981 -5009 -5031 -5022 -4952 -4917 -4932 -4987 -5014 -5044 -5052 -5053 -5034 -5006 -4953 -4954
-25683 -4954 -4980 -5001 -5075 -5097 -5089 -5138 -5198 -5237 -5221 -5170 -5145 -5115 -5155 -5161 -5096 -5057 -5056 -5081 -5111 -5136 -5189 -5203 -5219 -5224 -5284 -5294 -5281 -5287 -5248 -5183 -5206 -5259 -5256 -5294 -5323 -5338
-25647 -5338 -5341 -5334 -5338 -5335 -5353 -5376 -5386 -5365 -5423 -5392 -5299 -5283 -5255 -5275 -5349 -5394 -5402 -5387 -5339 -5359 -5443 -5490 -5445 -5438 -5493 -5512 -5468 -5403 -5346 -5363 -5496 -5583 -5581 -5609 -5611 -5641 -5642
-25610e642R0M3j1KQl8m6l1qkm2K0l5o5K3J8J0Pl0J6Jm8kK3K8n0j01mNK9LM2N5oo1n4ppk9
-25571e896m0JK2O1J3n7o5oj8lJ9l3n9m6l2k8N1K7PN0LM9L4Rm9p1j8p8p8NM4N5Pjj9o2l2k7
-25533f261n8KM4L0L9L8K6l5k1Lo7n6j4jJ9Km9j4J9k3L9k4j1o6p5o4JO3K5Jk6J1M0lj9jJ8
-25496f468j7k3k7ql3k5K1L8J3Qp1k6jON9P5k6n7p3l1j8J3O2j9q4J4K5l7no4p7j6L4m3n7K1
-25460f917k1q6k7L1L9J0j8k0k0j1ML8N6m3q2l5j7qj1L0j6n0j6M5K6j1j1l0nk0k2mj6j2l1
-25425g281m4k9m3K1O8M8k9o5m3l0n4m9j9j3N7J04M4K3J6Ll9q1p8%k4o5PL0qm7ML1m3n3%o5
-25389g746o1K9M8N9K7o6q3k4k0j7qJ2M9L4jl1k3n9k5Km3rK3k6o9k9LjL4L7j8l7kj3m9l4J
-25352h136Nl8PQ5O0n0o1n2m3lLk7j8l0j6L1Jl1p0q3K0m4o9m0l2k9M2L3%p1m2rk5K1Np3o6
$$ plain form
-25610 -5642 -5552 -5509 -5520 -5518 -5510 -5548 -5594 -5625 -5633 -5635 -5677 -5657 -5692 -5757 -5734 -5716 -5706 -5699 -5729 -5713 -5712 -5760 -5762 -5739 -5711 -5761 -5862 -5866 -5861 -5832 -5829 -5787 -5732 -5738 -5799 -5853 -5860 -5867 -5896
-25571 -5896 -5936 -5935 -5913 -5852 -5839 -5896 -5961 -5967 -5985 -5988 -5969 -6002 -6061 -6107 -6139 -6167 -6116 -6089 -6082 -6032 -6029 -5980 -5946 -5937 -5986 -6057 -6075 -6153 -6231 -6226 -6182 -6127 -6120 -6121 -6140 -6202 -6234 -6261
-25533 -6261 -6319 -6317 -6273 -6243 -6204 -6166 -6140 -6175 -6196 -6193 -6260 -6316 -6330 -6331 -6312 -6310 -6359 -6373 -6354 -6377 -6338 -6362 -6373 -6439 -6514 -6578 -6577 -6514 -6489 -6488 -6514 -6503 -6463 -6466 -6485 -6486 -6468
-25496 -6468 -6485 -6508 -6535 -6543 -6576 -6601 -6580 -6542 -6529 -6521 -6592 -6618 -6619 -6613 -6554 -6479 -6505 -6562 -6635 -6666 -6684 -6671 -6609 -6628 -6712 -6698 -6673 -6710 -6715 -6779 -6856 -6872 -6838 -6881 -6938 -6917
-25460 -6917 -6938 -7024 -7051 -7020 -6981 -6971 -6989 -7009 -7029 -7040 -7036 -6998 -6942 -6985 -7067 -7102 -7119 -7127 -7138 -7108 -7124 -7174 -7190 -7145 -7119 -7130 -7141 -7171 -7176 -7196 -7218 -7222 -7238 -7250 -7281
-25425 -7281 -7325 -7354 -7397 -7376 -7308 -7260 -7289 -7354 -7397 -7427 -7481 -7530 -7549 -7562 -7505 -7401 -7357 -7334 -7318 -7315 -7354 -7435 -7513 -7513 -7537 -7602 -7595 -7565 -7573 -7620 -7616 -7585 -7628 -7681 -7681 -7746
-25389 -7746 -7807 -7778 -7730 -7671 -7644 -7710 -7793 -7817 -7837 -7854 -7862 -7850 -7801 -7767 -7768 -7799 -7822 -7881 -7906 -7904 -7947 -7956 -7933 -7959 -8028 -8057 -8054 -8055 -8021 -7984 -8002 -8039 -8041 -8054 -8103 -8137 -8136
-25352 -8136 -8131 -8169 -8162 -8077 -8017 -8067 -8128 -8180 -8223 -8226 -8223 -8250 -8268 -8298 -8314 -8283 -8282 -8313 -8383 -8466 -8446 -8490 -8559 -8599 -8631 -8660 -8618 -8585 -8585 -8656 -8698 -8707 -8732 -8711 -8706 -8779 -8845
-25315h845K9L0k1OL8Kl8j5rL5L6L1J6J1KJ%o2q4j9K%k1k1J4J3j1k2j0J5n0p3p0n2kojNk7
-25276i173m0K1ro1m8l8oLj8l1k2%m5n7jM2J6n5j9L5K6m6m6j6j6k9l2J3MO7M0k5o9l9L0O2
-25240i582L0j8o1k7K5OL2lq8k2N8O8J4k6k3Rk9m1m0JJ7LNo1j0N4k1k1lj1m0j2Jj7qj4l0k8
-25202i913r1l0l0o4p5r4k5qL0L8J4O4L0Pk4n4%l2kO8M9J1k8l9jJ0k2o0lQm6J4O3nj32p7K8
-25165a0421PJ5j8l3mk9l8m9MKK7rn3j2On3n6nj7pm4k3L7N0j2q1r7j6k5k4L0N8M8K0l0m9k1
-25128a0922m5o5n1k1pJ5K4l7j02o5m8m6K8j5k1m7p5n0k8m5l3n3m5M7ROj6l2n7p9nO4J9p9
-25094a1877l9M1P7N3m7r6o9qK6Nj4m5m5L6L3Kj1l7j2qk2j8j8nol9m8mMl6l2k4l1n7o8m2o0
-25057a2541l2K6M7M7Mj4m7Ln0j07r6q5o9k7M9n4q0ok2k6l6m6j17l8L6M2k5q2m9l4Llk2o1
$$ plain form
-25315 -8845 -8816 -8786 -8807 -8801 -8763 -8761 -8799 -8814 -8823 -8788 -8752 -8721 -8705 -8694 -8692 -8691 -8691 -8753 -8837 -8856 -8854 -8854 -8875 -8896 -8882 -8869 -8880 -8902 -8912 -8897 -8947 -9020 -9090 -9142 -9144 -9150 -9151 -9146 -9173
-25276 -9173 -9213 -9192 -9201 -9262 -9310 -9348 -9354 -9351 -9369 -9400 -9422 -9422 -9467 -9524 -9525 -9483 -9467 -9522 -9541 -9506 -9480 -9526 -9572 -9588 -9604 -9633 -9665 -9652 -9648 -9581 -9541 -9566 -9635 -9674 -9644 -9582
-25240 -9582 -9552 -9570 -9631 -9658 -9633 -9627 -9595 -9598 -9686 -9708 -9650 -9582 -9568 -9594 -9617 -9608 -9637 -9678 -9718 -9717 -9700 -9697 -9692 -9753 -9763 -9709 -9730 -9751 -9754 -9765 -9805 -9817 -9816 -9833 -9841 -9855 -9885 -9913
-25202 -9913 -10004 -10034 -10064 -10128 -10203 -10297 -10322 -10330 -10300 -10262 -10248 -10184 -10154 -10147 -10171 -10225 -10225 -10257 -10259 -10191 -10142 -10131 -10159 -10198 -10199 -10189 -10211 -10271 -10274 -10266 -10312 -10298 -10235 -10240 -10372 -10449 -10421
-25165 -10421 -10414 -10399 -10417 -10450 -10454 -10483 -10521 -10570 -10566 -10564 -10537 -10546 -10599 -10611 -10605 -10658 -10714 -10719 -10736 -10743 -10787 -10810 -10773 -10723 -10735 -10816 -10913 -10929 -10954 -10978 -10948 -10890 -10842 -10822 -10852 -10901 -10922
-25128 -10922 -10967 -11032 -11083 -11104 -11111 -11096 -11072 -11109 -11211 -11276 -11324 -11370 -11342 -11357 -11378 -11425 -11500 -11550 -11578 -11623 -11656 -11709 -11754 -11707 -11698 -11692 -11708 -11740 -11797 -11876 -11881 -11817 -11798 -11877
-25094 -11877 -11916 -11875 -11798 -11745 -11792 -11888 -11957 -11965 -11939 -11934 -11948 -11993 -12038 -12002 -11969 -11967 -11978 -12015 -12027 -12035 -12057 -12075 -12093 -12098 -12104 -12143 -12191 -12195 -12191 -12227 -12259 -12283 -12314 -12371 -12439 -12481 -12541
-25057 -12541 -12573 -12547 -12500 -12453 -12449 -12463 -12510 -12507 -12557 -12664 -12760 -12845 -12914 -12941 -12892 -12946 -13026 -13032 -13054 -13080 -13116 -13162 -13279 -13317 -13281 -13239 -13264 -13346 -13395 -13429 -13426 -13429 -13451 -13512
-25023a3512p2q4m9j7m5q0o3mrkl5n6k5j4k7L5M7Kk7RM9l5q5r1j00r3j19j38l1K1J5M2M7j7
-24989a4563r6o6LK1j6n7o0n8l9m1j8Kjm5l3n7n3rOm0mMm9p0o7m7n0r3j06n0l6n4k1J2Ol0
-24953a5875p7ok0m2k1n1m8k2l5o3k3L1kp2l9l2k6q1r4o1qJ0o1j9jPk3k3j0n3q0k2n2n1m8
-24918a7093m3k8n2r9r2l6j6j8k3j07j09J1k0p2n4m7k3j5K2n1r9l6Ol5j18o3n5j4kJl4p5k1
-24885a8510o0r2n1J8j6l1Pl4r6l8M1%o8l9n0n3Mr7r5l2k4o0mnn2p5q8m1n2o0k5j0rp4j11
-24850a9982j00j21m9m5p2j33j02r0q7j35j18q1m1q5j49j40NL1k9j26j48q6o3o1l1m1p1p1
-24822b2221l2o2n7j2m0p8l0m0r6q6j03q8o5p7p3q4p3l0k6k6m5j13j47j08o3j08j41m6j25
-24793b4295j98j23r8j37j35j80j27j10j37j90j99j52j41j32j45j55j72j90j38j65k33j65
$$ plain form
-25023 -13512 -13584 -13668 -13717 -13734 -13779 -13859 -13922 -13926 -13935 -13937 -13972 -14028 -14053 -14067 -14094 -14059 -14012 -14010 -14037 -14028 -13979 -14014 -14099 -14190 -14290 -14383 -14502 -14640 -14671 -14650 -14635 -14593 -14546 -14563
-24989 -14563 -14659 -14725 -14722 -14701 -14717 -14774 -14834 -14892 -14931 -14972 -14990 -14988 -14989 -15034 -15067 -15124 -15177 -15186 -15180 -15220 -15224 -15220 -15269 -15339 -15406 -15453 -15503 -15596 -15702 -15752 -15788 -15842 -15863 -15851 -15845 -15875
-24953 -15875 -15952 -15958 -15978 -16020 -16041 -16092 -16140 -16162 -16197 -16260 -16283 -16252 -16254 -16326 -16365 -16397 -16423 -16504 -16598 -16659 -16667 -16657 -16718 -16737 -16738 -16731 -16754 -16777 -16787 -16840 -16920 -16942 -16994 -17045 -17093
-24918 -17093 -17136 -17164 -17216 -17315 -17407 -17443 -17459 -17477 -17500 -17607 -17716 -17705 -17725 -17797 -17851 -17898 -17921 -17936 -17914 -17965 -18064 -18100 -18094 -18129 -18247 -18310 -18365 -18379 -18381 -18380 -18414 -18489 -18510
-24885 -18510 -18570 -18662 -18713 -18695 -18711 -18742 -18735 -18769 -18865 -18903 -18862 -18862 -18930 -18969 -19019 -19072 -19068 -19165 -19260 -19292 -19316 -19376 -19380 -19385 -19437 -19512 -19600 -19641 -19693 -19753 -19778 -19788 -19797 -19871 -19982
-24850 -19982 -20082 -20203 -20252 -20297 -20369 -20502 -20604 -20694 -20781 -20916 -21034 -21115 -21156 -21241 -21390 -21530 -21525 -21494 -21523 -21649 -21797 -21883 -21946 -22007 -22038 -22079 -22150 -22221
-24822 -22221 -22253 -22315 -22372 -22384 -22424 -22502 -22532 -22572 -22668 -22754 -22857 -22945 -23010 -23087 -23160 -23244 -23317 -23347 -23373 -23399 -23444 -23557 -23704 -23812 -23875 -23983 -24124 -24170 -24295
-24793 -24295 -24493 -24616 -24714 -24851 -24986 -25166 -25293 -25403 -25540 -25730 -25929 -26081 -26222 -26354 -26499 -26654 -26826 -27016 -27154 -27319 -27552 -27717
-24771b7717j53j35j03j51j60j64j76j08j20j42j77j75j52r3o5n8j38j38j10j87j53j06p5
-24748c0756j03r2j61k26j74j46k00k56j45q7j74k20k38j92k03k45k43k53k81k45k44k99l55
-24725c5538l33l08k95l05l64m37l70l97l90l84l93l71l52l62l66l83m39m17l44l87n01m47
-24703d3883m35m72m88n33n06m99m77n00n21n09m56m24m66m15k97k86l01k12r0L8J67K74M15
-24680e0876N78O56P38Q19J023J158J162J183J165J065Q90P38O16N16M10K62J96J39n6j59
-24660c7777k04l15m72n84o67p61q06q89j035j054j013j037j116j137j211j249j322j384j425
-24641e5458j404j439j427j360j326j231j204j167j089r69q83p36n58l62n5N6K44N24P93J173
-24621f7878J482J691J888K095K437K808L179L625L946M131M256M240M092M015L917L735L472
$$ plain form
-24771 -27717 -27870 -28005 -28108 -28259 -28419 -28583 -28759 -28867 -28987 -29129 -29306 -29481 -29633 -29726 -29791 -29849 -29987 -30125 -30235 -30422 -30575 -30681 -30756
-24748 -30756 -30859 -30951 -31112 -31338 -31512 -31658 -31858 -32114 -32259 -32346 -32520 -32740 -32978 -33170 -33373 -33618 -33861 -34114 -34395 -34640 -34884 -35183 -35538
-24725 -35538 -35871 -36179 -36474 -36779 -37143 -37580 -37950 -38347 -38737 -39121 -39514 -39885 -40237 -40599 -40965 -41348 -41787 -42204 -42548 -42935 -43436 -43883
-24703 -43883 -44318 -44790 -45278 -45811 -46317 -46816 -47293 -47793 -48314 -48823 -49279 -49703 -50169 -50584 -50881 -51167 -51468 -51680 -51770 -51732 -51565 -51291 -50876
-24680 -50876 -50298 -49642 -48904 -48085 -47062 -45904 -44742 -43559 -42394 -41329 -40439 -39701 -39085 -38569 -38159 -37897 -37701 -37562 -37618 -37777
-24660 -37777 -37981 -38296 -38768 -39352 -40019 -40780 -41586 -42475 -43510 -44564 -45577 -46614 -47730 -48867 -50078 -51327 -52649 -54033 -55458
-24641 -55458 -56862 -58301 -59728 -61088 -62414 -63645 -64849 -66016 -67105 -68074 -68957 -69693 -70251 -70613 -70668 -70612 -70368 -69844 -69051 -67878
-24621 -67878 -66396 -64705 -62817 -60722 -58285 -55477 -52298 -48673 -44727 -40596 -36340 -32100 -28008 -23993 -20076 -16341 -12869
-24604a2869L077K666K271J822J382J059O55K08j40n47r42j214j452j703j913k058k119k132
-24586a3949k215k275k294k291k189k109k104k058j962j857j691j497j347j199j074j082j082
-24569d4275j054j052r96r18p38m84k00J88O84J305J932K538L155L643L999M230M439M596
-24551a9008M696M653M490M146L715L215K692K137J637J242Q04L51j62o52j066j482j796k030
-24533G582k270k366k479k607k675k753k770k751k833k837k791k829k809k647k644k620k566
-24516c7665k485k296k018j732j552j191q02m42J9N39J113J700K217K592K879L054L111L192
-24498b9767L278L452L797M346M960N591O163O647O982P037O819O480N920N220M550L871L258
-24481E8604K649K095J639J171P38L23j98p01j095j407j614j814j955k067k160k198k247k217
$$ plain form
-24604 -12869 -9792 -7126 -4855 -3033 -1651 -592 63 271 131 -416 -1358 -2572 -4024 -5727 -7640 -9698 -11817 -13949
-24586 -13949 -16164 -18439 -20733 -23024 -25213 -27322 -29426 -31484 -33446 -35303 -36994 -38491 -39838 -41037 -42111 -43193 -44275
-24569 -44275 -45329 -46381 -47377 -48295 -49033 -49517 -49717 -49529 -48845 -47540 -45608 -43070 -39915 -36272 -32273 -28043 -23604 -19008
-24551 -19008 -14312 -9659 -5169 -1023 2692 5907 8599 10736 12373 13615 14419 14770 14608 13956 12890 11408 9612 7582
-24533 7582 5312 2946 467 -2140 -4815 -7568 -10338 -13089 -15922 -18759 -21550 -24379 -27188 -29835 -32479 -35099 -37665
-24516 -37665 -40150 -42446 -44464 -46196 -47748 -48939 -49741 -50183 -50164 -49625 -48512 -46812 -44595 -42003 -39124 -36070 -32959 -29767
-24498 -29767 -26489 -23037 -19240 -14894 -9934 -4343 1820 8467 15449 22486 29305 35785 41705 46925 51475 55346 58604
-24481 58604 61253 63348 64987 66158 66896 67219 67021 66320 65225 63818 62204 60390 58435 56368 54208 52010 49763 47546
-24463D7546k137k050k041k071k074j976j871j834j756j640j599j552j370j130j040r12p13
-24446A9780n08l26j47O5K36K97M79P57J059J293J491J701J880J973J976J847J751J765J692
-24427C9061J598J632J671J674J576J443J333J021P47M87K36Rk31l87m27n53p04p85q27r46
-24407D7628r88j007j050j111j142j108j107j077j085j017j055j059j014r28r13j003j010
-24390B9954r13q81q72q42p78p56q65q80q05p95p71p67p68q44r04q23p83q17q32q76r59r87
-24368A1436r25q61q31p74p95p58o31n50m75l29j02O6K59M16L70L98M75N04M66N51P41Q40
-24346I491J035J156J204J236J305J284J192J047Q67O82O24N91O03N92N12M21L92L19R5j21
-24326B4527k97l66m51n24n45o04n88o59q03q34r38j017j018r88r59r13q96q35p98p22n94
$$ plain form
-24463 47546 45409 43359 41318 39247 37173 35197 33326 31492 29736 28096 26497 24945 23575 22445 21405 20493 19780
-24446 19780 19272 18946 18799 18864 19100 19397 19876 20633 21692 22985 24476 26177 28057 30030 32006 33853 35604 37369 39061
-24427 39061 40659 42291 43962 45636 47212 48655 49988 51009 51756 52243 52479 52488 52257 51870 51443 50890 50186 49401 48574 47628
-24407 47628 46640 45633 44583 43472 42330 41222 40115 39038 37953 36936 35881 34822 33808 32880 31967 30964 29954
-24390 29954 29041 28160 27288 26446 25668 24912 24047 23167 22362 21567 20796 20029 19261 18417 17513 16690 15907 15090 14258 13382 12423 11436
-24368 11436 10511 9650 8819 8045 7250 6492 5861 5311 4836 4507 4405 4471 4730 5146 5516 5914 6389 6893 7359 7910 8651 9491
-24346 9491 10526 11682 12886 14122 15427 16711 17903 18950 19817 20499 21123 21714 22317 22909 23421 23842 24234 24553 24648 24527
-24326 24527 24230 23864 23413 22889 22344 21740 21152 20493 19690 18856 17918 16901 15883 14895 13936 13023 12127 11292 10494 9772 9178
-24305I178m82l35j59r8j11j13j02L8K14L84N19O51Q28J017J228J458J713J996K255K476K517
-24284B5072K392K237K103J903J621J428J258J071Q48O23L48J06m9j88k82l59l64l67m78n15
-24264C8408n70n79n68o09o24n95n91o66p20o61o41o89p17o59o41o40n91n07l91k95k21j50
-24242B6083j13p4l8m4j8j6J5R4K28L04L36N01O97O57N57N03M14L68K97K39L34L89L38K61
-24218C2312J95J97K02R1o6j59k16j89j92k63k93l05l50l75l83l54l04l71m42m19m01l90k92
-24195B7233k46l12k72k86l48k79k56k45k35k35j99k21k92k16k08k36j67j85k13j91j69j06
-24173B2116j49j80j51j23j67j42j58k36k09j32j71j71j30j14j35j60j19j22k00j39j19j47
-24151A8742j44j69j57j17r5r6j44j10j21j26j50j46q5p1n0p5p6o5j25j23j17q9m3o3q7j17
$$ plain form
-24305 9178 8696 8361 8202 8104 7993 7880 7778 7816 8030 8414 8933 9584 10412 11429 12657 14115 15828 17824 20079 22555 25072
-24284 25072 27464 29701 31804 33707 35328 36756 38014 39085 39933 40556 40904 41010 40961 40773 40491 40132 39768 39401 38923 38408
-24264 38408 37838 37259 36691 36082 35458 34863 34272 33606 32886 32225 31584 30895 30178 29519 28878 28238 27647 27140 26749 26454 26233 26083
-24242 26083 25970 25896 25858 25814 25796 25780 25795 25889 26117 26421 26757 27258 27955 28612 29169 29672 30086 30454 30751 30990 31324 31713 32051 32312
-24218 32312 32507 32704 32906 32997 32931 32772 32556 32367 32175 31912 31619 31314 30964 30589 30206 29852 29548 29177 28735 28316 27915 27525 27233
-24195 27233 26987 26675 26403 26117 25769 25490 25234 24989 24754 24519 24320 24099 23807 23591 23383 23147 22980 22795 22582 22391 22222 22116
-24173 22116 21967 21787 21636 21513 21346 21204 21046 20810 20601 20469 20298 20127 19997 19883 19748 19588 19469 19347 19147 19008 18889 18742
-24151 18742 18598 18429 18272 18155 18060 17964 17820 17710 17589 17463 17313 17167 17082 17011 16961 16886 16810 16745 16620 16497 16380 16291 16248 16185 16098 15981
-24125A5981j25q3Mqr5j14q1n1m9l3PKJ0j17j56j09p3r7r6j10p1m4j24j02r2o6n7j20j48p4
-24095A3709r3j14m3o9n4np3q2q9j45j24o1r4r3j8n3q2j01o8k2p8q2r7q4j9k9q4j30r4n8n1
-24064A1420p0q7r2qqj5l2o1j15q3l9J8m4j34j42j25j02k4o%k0n7p7o5k6o6j22r7j1o8r0o6
-24032I486p6r8n3k6q2r4n0k7o4n7j22j51j08p4l3j7m9n0J2Lk9p1o7o6j32q1m0qKL4J5q5r3
-23999G649m7l3j2m8p3j45p9k0l7o5j7k4l8p6j09o7l1Qj0l0q9q3n4n9n8k5o7m5j4q6j04m9
-23967E963m4o0q2n1n8r4m0l5n5j0o3j04p0l4nk0k6l3n9l0ml5p0p3o3m9MJ5j6o6k0j7lL7r
-23932D621n4o6p1j8k2o1m3j8m5o8q6m0q4m2p8j15r6r3n3k5n2k2jm9j25j17m5j7m9n4l7o5
-23900B810p9o9m2n5n1o6j21r0j5J7k2r3q0j02l9k9l0p0o0j8J5l9OJ8r6j02m2j1o8q3r5n5
$$ plain form
-24125 15981 15856 15773 15777 15769 15674 15560 15479 15428 15379 15346 15353 15355 15365 15248 15092 14983 14910 14813 14717 14607 14536 14492 14368 14266 14174 14108 14051 13931 13783 13709
-24095 13709 13616 13502 13459 13390 13336 13331 13258 13176 13087 12942 12818 12757 12663 12570 12552 12499 12417 12316 12248 12226 12148 12066 11969 11885 11866 11837 11753 11623 11529 11471 11420
-24064 11420 11350 11263 11171 11163 11155 11140 11108 11047 10932 10849 10810 10828 10784 10650 10508 10383 10281 10257 10251 10251 10231 10174 10097 10032 10006 9940 9818 9721 9710 9642 9552 9486
-24032 9486 9410 9312 9259 9233 9151 9057 9007 8980 8916 8859 8737 8586 8478 8404 8371 8354 8305 8255 8267 8270 8241 8170 8103 8037 7905 7824 7784 7776 7778 7812 7827 7742 7649
-23999 7649 7602 7569 7557 7509 7436 7291 7212 7192 7155 7090 7073 7049 7011 6935 6826 6759 6728 6736 6726 6696 6607 6524 6470 6411 6353 6328 6261 6216 6202 6116 6012 5963
-23967 5963 5919 5859 5777 5726 5668 5574 5534 5499 5444 5434 5371 5267 5197 5163 5158 5138 5112 5079 5020 4990 4986 4951 4881 4808 4745 4696 4700 4715 4699 4633 4613 4596 4593 4630 4621
-23932 4621 4567 4501 4430 4412 4390 4329 4286 4268 4223 4155 4069 4029 3945 3903 3825 3710 3614 3521 3468 3443 3391 3369 3368 3319 3194 3077 3032 3015 2966 2912 2875 2810
-23900 2810 2731 2662 2620 2565 2514 2448 2327 2237 2222 2239 2217 2124 2044 1942 1903 1874 1844 1774 1714 1696 1711 1672 1678 1696 1600 1498 1456 1445 1377 1294 1199 1144
-23868A144Nrl5o7r3l5J5m3p0r2n9J6K6J0m9j15n4j5l6q3p4l5m0k6k4m1p2q2q7j22m1k0m9
-23835c52n4j04j00j63j91j28q6j37j95j13q3q2j22k09k27k22j91j57j21j36j73j56p9o6j27
-23810c774j35o8n6r6m8o6j03q7m8r2n5o1l0k7j05o8p1j35j39j11j15j34j03j39j48j16j44
-23783f274k32k70j81j46j49j71k02k29j99j29j05j35j47k06j86k02j74j42j59j92j74q3j17
-23760a0204j55j76j47j70j62j53r7j04k16k24j39j98k56j99k18j64j62j90k04k74k94k80
-23738a4386k32k07k54k62k33k93l30k66k49k42k93l15k78k94l16l34m06l90l31l72l51m04
-23716b1038m50m47m79m87m42m01m76n44m94n05n65n70n88o00o30o62o91p30p65p96p89q66
-23694c4015r26r30r72j003j017j100j129j124j162j210j234j240j252j281j265j294j313
$$ plain form
-23868 1144 1149 1140 1105 1038 945 910 925 882 812 720 661 677 703 713 664 549 495 480 444 361 287 252 212 186 162 121 49 -33 -120 -242 -283 -303 -352
-23835 -352 -406 -510 -610 -773 -964 -1092 -1178 -1315 -1510 -1623 -1706 -1788 -1910 -2119 -2346 -2568 -2759 -2916 -3037 -3173 -3346 -3502 -3581 -3647 -3774
-23810 -3774 -3909 -3977 -4033 -4129 -4177 -4243 -4346 -4433 -4481 -4573 -4628 -4689 -4719 -4746 -4851 -4919 -4990 -5125 -5264 -5375 -5490 -5624 -5727 -5866 -6014 -6130 -6274
-23783 -6274 -6506 -6776 -6957 -7103 -7252 -7423 -7625 -7854 -8053 -8182 -8287 -8422 -8569 -8775 -8961 -9163 -9337 -9479 -9638 -9830 -10004 -10087 -10204
-23760 -10204 -10359 -10535 -10682 -10852 -11014 -11167 -11264 -11368 -11584 -11808 -11947 -12145 -12401 -12600 -12818 -12982 -13144 -13334 -13538 -13812 -14106 -14386
-23738 -14386 -14618 -14825 -15079 -15341 -15574 -15867 -16197 -16463 -16712 -16954 -17247 -17562 -17840 -18134 -18450 -18784 -19190 -19580 -19911 -20283 -20634 -21038
-23716 -21038 -21488 -21935 -22414 -22901 -23343 -23744 -24220 -24764 -25258 -25763 -26328 -26898 -27486 -28086 -28716 -29378 -30069 -30799 -31564 -32360 -33149 -34015
-23694 -34015 -34941 -35871 -36843 -37846 -38863 -39963 -41092 -42216 -43378 -44588 -45822 -47062 -48314 -49595 -50860 -52154 -53467
-23677e3467j295j239j159j015q96p12m89k48J26N98J103J578K181K716L249L771M198M574
-23659c6426M871N135N292N383N352N215N087M891M455L967L398K831K362J836J286Q29L54
-23642B6118j70n26q67j214j470j734j926k059k152k254k320k229k117j964j743j621j430
-23625a678j128p64l15J31O93J275J854K449K959L554L989M337M636M918N139N203N197N145
-23607D7594N026M791M366L896L445K975K452J877J491J127O86K74q7m17o71q91j090j287
-23589G5557j434j528j581j481j498j514j452j409j330j322j267j227j245j127r61r46r26
-23572E3309q84q33q49q66p54p41p23o76o70p21o76o30o26o27n40m48m55m88n63n50n09m03
-23550C9077l89m29m12l52l68l74l92l70l99l47k91l29l25l42l74l55l05k73k66k76k42j55
$$ plain form
-23677 -53467 -54762 -56001 -57160 -58175 -59071 -59783 -60272 -60520 -60394 -59796 -58693 -57115 -54934 -52218 -48969 -45198 -41000 -36426
-23659 -36426 -31555 -26420 -21128 -15745 -10393 -5178 -91 4800 9255 13222 16620 19451 21813 23649 24935 25764 26118
-23642 26118 25948 25422 24555 23341 21871 20137 18211 16152 14000 11746 9426 7197 5080 3116 1373 -248 -1678
-23625 -1678 -2806 -3570 -3885 -3754 -3061 -1786 68 2517 5476 9030 13019 17356 21992 26910 32049 37252 42449 47594
-23607 47594 52620 57411 61777 65673 69118 72093 74545 76422 77913 79040 79726 80000 79913 79496 78825 77934 76844 75557
-23589 75557 74123 72595 71014 69533 68035 66521 65069 63660 62330 61008 59741 58514 57269 56142 55181 54235 53309
-23572 53309 52425 51592 50743 49877 49123 48382 47659 46983 46313 45592 44916 44286 43660 43033 42493 42045 41590 41102 40539 39989 39480 39077
-23550 39077 38688 38259 37847 37495 37127 36753 36361 35991 35592 35245 34954 34625 34300 33958 33584 33229 32924 32651 32385 32109 31867 31712
-23528C1712k65l59l10k68j83k36k60j92j96k46k39k36k27k45k52k44k55k34j47j30k07k32
-23506B6549j80j55j45j21j22j95k28j51j48j53j37r8q9p7p0p0r7rm7q8n2o0m1o2j30j38o9
-23479B3617k4l7j01j17q0p8j09j09j26j20j06j11j19j60j26j33j19j34j12r6j52j56o0p9
-23455B1053o8n0n8q1r3o0lMl5n0l1Mj9PJ6j6J1J8Mk0l8k8p7n9k5m3q1n6n5k4p6r0j06p9n1
-23420A9645o3q9p4m2l7j08j44j72q6l5l1m2n5p0k7p6p6l5q9p0o8o8n0l5n2n7j06r5o8m4m7
-23389A7534p4r8r1p3j4k8r3q2o6n8jk7l9k3m6q5r4q3n2m7j6N6K7q6j17m2q1r4l2j6k6j4k1
-23356A5898m5l6j0n0r7n0p0o7r6k0J0m0knk3p2o9l2o2n3m6l7k7n7m9M4K8j4l5r3q6m7q1n5
-23322A4454n7nJ0j4j4m9l9l5k9k4k9jLp3n3k8j9p2m0K3N5K1lk0l5J4o4p7j07p2L9%L0K0n1
$$ plain form
-23528 31712 31447 31088 30778 30510 30327 30091 29831 29639 29443 29197 28958 28722 28495 28250 27998 27754 27499 27265 27118 26988 26781 26549
-23506 26549 26369 26214 26069 25948 25826 25631 25403 25252 25104 24951 24814 24716 24627 24550 24480 24410 24313 24304 24257 24169 24117 24057 24016 23954 23824 23686 23617
-23479 23617 23593 23556 23455 23338 23258 23180 23071 22962 22836 22716 22610 22499 22380 22220 22094 21961 21842 21708 21596 21500 21348 21192 21132 21053
-23455 21053 20985 20935 20877 20796 20703 20643 20640 20644 20609 20559 20528 20532 20513 20520 20536 20520 20531 20549 20553 20533 20495 20467 20390 20331 20306 20263 20182 20126 20071 20047 19971 19881 19775 19696 19645
-23420 19645 19582 19493 19419 19377 19340 19232 19088 18916 18830 18795 18764 18722 18667 18597 18570 18494 18418 18383 18294 18224 18156 18088 18038 18003 17951 17894 17788 17693 17625 17581 17534
-23389 17534 17460 17362 17271 17198 17184 17156 17063 16981 16915 16857 16856 16829 16790 16767 16721 16636 16542 16459 16407 16360 16344 16400 16427 16341 16224 16182 16101 16007 15975 15959 15933 15919 15898
-23356 15898 15853 15817 15807 15757 15660 15610 15540 15473 15377 15357 15367 15327 15325 15320 15297 15225 15156 15124 15062 15009 14963 14926 14899 14842 14793 14837 14865 14851 14816 14723 14637 14590 14509 14454
-23322 14454 14397 14392 14402 14388 14374 14325 14286 14251 14222 14198 14169 14168 14171 14098 14045 14017 13998 13926 13886 13909 13964 13985 13982 13962 13927 13941 13877 13800 13693 13621 13660 13660 13690 13710 13659
-23287A3659m3l1j2j7m1n3j1l6k6n0n8l5Rk3k9k2j8l0p2o0k3jM6M6m5p0m2oK4j0n7PK5n4o4
-23252A2777%n0p0k8l7M5j9p4K3j1l2pml5p3m6j0nj3l0M6J7j06q4k5J7Ro2j8M2l3l8Plm3j9
-23216A2008K2%l8q7N%m3n3l5m8m0j4j1mM3N1nn4r2l4M4K9n6m9M6k2q4o6PJ6k2k9J7K6j4l9
-23180A1375o1q0k7J3K1J3n5j6k3m4k8j0l5j3L5jl0j1Jk8n4nL0Mk8o1l4l4m8Rk2j8J9M0N2
-23145A0846pl8j9l2q3m1m8j9L3L2J6J0k8nkj1j4JJ0qj0j4j6Pq7j31k3K2K2Pl4k1rk8j5j4
-23109A0249M2j2l9j5m7m5l2m4k8J1K6L3qn1J0NOJ5l1m7nl0nK1l3Nl4o4l2j6l2L2K3l2k3j6
-23073I757M1K8ol1j2l1k4LN5M8m0PJ4o3r9m7j3K4J0mn3o9r2q3j0J8k1l2M4L2K6J1Lm3m8l6
-23037I264m1J7M8M7pk9l7k9k8n0rL1k6l1J0o4l1n1j9M8k4J5K9j4m5k1K2Om7n5k8j9j7Ol8
$$ plain form
-23287 13659 13616 13585 13573 13556 13515 13462 13451 13415 13389 13339 13281 13246 13255 13232 13203 13181 13163 13133 13061 13001 12978 12977 13023 13069 13024 12954 12912 12906 12930 12920 12863 12870 12895 12841 12777
-23252 12777 12777 12727 12657 12629 12592 12637 12618 12544 12567 12556 12524 12517 12513 12478 12405 12359 12349 12344 12331 12301 12347 12364 12258 12174 12149 12166 12175 12113 12095 12137 12104 12066 12073 12070 12027 12008
-23216 12008 12030 12030 11992 11905 11910 11910 11867 11814 11779 11731 11691 11677 11666 11662 11705 11756 11751 11697 11605 11571 11615 11644 11588 11539 11585 11563 11479 11413 11420 11436 11414 11385 11402 11428 11414 11375
-23180 11375 11314 11234 11207 11220 11241 11254 11199 11183 11160 11116 11088 11078 11043 11030 11065 11064 11034 11023 11024 10996 10942 10937 10967 10971 10943 10882 10848 10814 10766 10775 10753 10735 10754 10794 10846
-23145 10846 10839 10801 10782 10750 10667 10626 10578 10559 10592 10624 10640 10650 10622 10617 10615 10604 10590 10591 10601 10593 10583 10569 10553 10560 10473 10342 10319 10341 10363 10370 10336 10315 10306 10278 10263 10249
-23109 10249 10291 10279 10240 10225 10178 10133 10101 10057 10029 10040 10066 10099 10091 10040 10050 10055 10061 10076 10045 9998 9993 9963 9958 9979 9946 9951 9917 9853 9821 9805 9773 9805 9828 9796 9773 9757
-23073 9757 9798 9826 9820 9789 9777 9746 9722 9725 9780 9828 9788 9795 9809 9746 9647 9600 9587 9611 9621 9617 9564 9495 9403 9320 9310 9328 9307 9275 9319 9351 9377 9388 9391 9348 9300 9264
-23037 9264 9223 9240 9288 9335 9328 9299 9262 9233 9205 9155 9146 9177 9151 9120 9130 9066 9035 8984 8965 9013 8989 9004 9033 9019 8974 8953 8975 8981 8934 8879 8851 8832 8815 8821 8783
-23002H783m5K5O0K8J2l4p0j8K7K6K5o1n5K9ln8j6M5N5K6k4mO0O8Nk8l5M7L3Ml0m9jPl8M4
-22966H840P0J0n6j12j46k8L4K4M8jJ1J3m3n8J7O9Kn8l7J1J8l0j9K0K3O3Q4N2J1m6RM4j3J
-22932H827O9l5p9l3KJ6j4K9J5m2l9nl8jj6j17j05K7Q4K1J5LL0J0nj7n4m0Mj8o2k3L2k1mJ3
-22896H429ok0J6K9m%qj6KL8L7MJ4J2Ol7q5n4Npj5j5m5nM0rl5j2NqJ4j5l1k6K0m8k4L6J3l7
-22856H158j4K1qj4Rl3j09p8j7N7K7j5m4n3l3M8O6Qpm8l4jJ5N2K2kL0L9J8opJpn5J5j0o2m9
-22818G880l7N4O3K4m4l9m8m5K7JoK3pN1m6m7l9k7k9j6n1k8pj6qQJ9JK3N3J7j1P0K4k4l5n4
-22781G674k6n0j5j3kJ2M7Q6K3km0m2J1K6M7j3l6l4j7j5m5m1j0m8o3k7%kK2K5Ll6j1K2J5j9
-22745G406P%l6j3L5O2K4j8p7n9K9M7K1j2n4j2K2l7m3j6JM4k2o4L0N9j9l4kj0j1m5oj1j8J1
$$ plain form
-23002 8783 8738 8763 8823 8851 8863 8829 8759 8741 8768 8794 8819 8758 8703 8732 8729 8671 8655 8700 8755 8781 8757 8753 8813 8881 8886 8858 8823 8870 8903 8907 8877 8828 8827 8834 8796 8840
-22966 8840 8910 8920 8864 8752 8606 8578 8612 8636 8684 8683 8694 8707 8664 8606 8623 8692 8694 8636 8599 8610 8628 8598 8579 8599 8622 8685 8769 8821 8832 8786 8795 8839 8826 8827
-22932 8827 8896 8861 8782 8749 8751 8767 8753 8782 8797 8755 8716 8711 8673 8672 8656 8539 8434 8461 8545 8566 8581 8584 8614 8624 8619 8602 8548 8508 8512 8494 8432 8409 8441 8420 8416 8429
-22896 8429 8423 8403 8419 8448 8444 8444 8436 8420 8422 8460 8497 8501 8515 8527 8533 8496 8411 8357 8362 8355 8340 8325 8280 8275 8315 8306 8271 8259 8264 8256 8270 8255 8224 8198 8218 8170 8146 8182 8195 8158
-22856 8158 8144 8165 8157 8143 8152 8119 8010 7932 7915 7972 7999 7984 7940 7887 7854 7902 7968 7976 7969 7921 7887 7886 7901 7953 7975 7973 8003 8042 8060 8054 8047 8048 8041 7986 8001 7991 7929 7880
-22818 7880 7843 7897 7960 7984 7940 7901 7853 7808 7835 7836 7830 7853 7846 7897 7851 7804 7765 7738 7709 7693 7642 7614 7607 7591 7583 7591 7610 7611 7634 7687 7704 7693 7763 7787 7763 7728 7674
-22781 7674 7648 7598 7583 7570 7568 7580 7627 7713 7736 7734 7694 7652 7663 7689 7736 7723 7687 7653 7636 7621 7576 7535 7525 7477 7414 7387 7387 7385 7407 7432 7435 7399 7388 7410 7425 7406
-22745 7406 7413 7413 7377 7364 7399 7461 7485 7467 7390 7331 7360 7407 7428 7416 7362 7350 7372 7335 7292 7276 7277 7321 7299 7235 7265 7324 7305 7271 7269 7259 7248 7203 7197 7186 7168 7179
-22709G179j7RM7Lm4r3l4L4M0K8mm8mjm2k3o4J6M9J5L1RL9K6j9j7p1l4O3K3kPm1n3n0qK5k9
-22671F945m2k5PJJ0OK8N4J0k1L6M4n4k7k5n7q0n5NN8N7J7n1j6k2L4O6O3k5n4j3p5r0K2O3
-22636F794K7pqm5j8M9Oj7l6l0j0J1OJ7K1m2J9N5qo9r1lO5Qm1k0kj4j7j9LRj8n1j7L5M9L7
-22598F628LJ7K4j7rj8j9j3j8l3j2M3K9M1K4m6q3pJn4j3J1q%O0L0Nk5j30q8RL4Pj3j9M2O6
-22561F449L6K8k2k3n7jK1pJ9M9kK5j3q7n7p1m7J6L4M0roK0M8J9l7o1l0M9k0j3Q0P9Lk7n3
-22525F372k4M2Rm3p3m4KJ1k0j3%k4l5j3l%mQPj7qQk8k7M0M7L3Mk2%j7n9m0krk2PL2K6L0J6
-22484F147lK9L9j7J2P1J6o6r4k9K6L8j3j9K7M5k7n6KL0O0K6j2q1p8m3j2oNP4J6L6M2J5j7
-22449F183l6m0jm2q0Jj9m8k4J3J7K1k5o0RL9J7lJ3N5K0m7j6lOJ1J1k2l0lLj0m2N3O4J3j7
$$ plain form
-22709 7179 7162 7171 7218 7221 7177 7084 7050 7084 7124 7152 7148 7100 7096 7095 7053 7030 6966 6982 7031 7046 7077 7086 7125 7151 7132 7115 7044 7010 7073 7096 7094 7101 7060 7007 6957 6949 6974 6945
-22671 6945 6903 6878 6885 6886 6896 6902 6930 6984 6994 6973 7009 7053 6999 6972 6947 6890 6810 6755 6760 6818 6875 6892 6841 6825 6803 6837 6903 6966 6941 6887 6874 6799 6709 6731 6794
-22636 6794 6821 6814 6806 6761 6743 6792 6798 6781 6745 6715 6705 6716 6722 6739 6760 6718 6737 6792 6784 6715 6624 6621 6686 6694 6653 6633 6631 6617 6600 6581 6584 6593 6575 6524 6507 6542 6591 6628
-22598 6628 6631 6648 6672 6655 6646 6628 6609 6596 6578 6545 6533 6576 6605 6646 6670 6624 6541 6534 6535 6481 6468 6479 6471 6471 6531 6561 6566 6541 6411 6323 6332 6366 6373 6360 6341 6383 6449
-22561 6449 6485 6513 6491 6468 6411 6410 6431 6424 6443 6492 6490 6515 6502 6415 6358 6287 6240 6256 6290 6330 6321 6315 6335 6383 6402 6365 6304 6274 6323 6303 6290 6370 6449 6452 6425 6372
-22525 6372 6348 6390 6399 6356 6283 6239 6241 6252 6232 6219 6219 6195 6160 6147 6144 6144 6140 6148 6155 6138 6130 6138 6110 6083 6123 6170 6203 6207 6185 6185 6168 6109 6069 6067 6058 6036 6043 6075 6101 6131 6147
-22484 6147 6144 6173 6212 6195 6207 6278 6294 6228 6134 6105 6131 6169 6156 6137 6164 6209 6182 6126 6128 6158 6218 6244 6232 6151 6073 6030 6018 6012 6017 6091 6107 6143 6185 6200 6183
-22449 6183 6147 6107 6106 6064 5984 5985 5966 5918 5894 5907 5924 5945 5920 5860 5869 5908 5925 5922 5935 5990 6010 5963 5947 5944 5950 5961 5972 5950 5920 5917 5920 5910 5868 5921 5985 5998 5981
-22412E981KRm0p3ooo1rK3J9j6n7nO1Q6Pn8o6l6j9JL7L8j7j7j5kk3l7L3Q4J2l2%jJ0k4l7J3
-22373E759J8j8Lk4j9rLM1RK7L7K8l5m0j8K9Op9r9n4j8k2k1%N2K1M5K3M5kk3Oj1J5Kl3NN2
-22335E701M7j8k9J7Ml0j8l2m1k0JK1K5n1p2l9L0O9J9n1j1NJ9M4KRk5qJ5k6k0%n4m5N8N4j1
-22298E539q1l7K5K0J4MnN9N5rl3J5k8o4m8k6ooM1M9n9q7l7j9M4J23K0n4J1mJ5K4l0m6j9M1
-22262E401L9l5k5K4O3O8J8k5j9M3L9Jq1q7k5j6Jl8K3O0L4qk6q7o1K3L7O0L5j4Ok4m6j5L7
-22227E380K0m4m2k7O4K2Nj0m3J5N4M1m6l8l0j5K0j5mrn6l4K6L7k2l1k7M8N6n3j25n7J00R1
-22193E251lj7N3K6NL6J4q5n1Qk3n5J0k2o1oJ2J6Q8N9j8o6o9k3J1J8k1q2l2L6K0k7N3P9O4
-22158E198O7Nq5n9J1M0Lk0k0Nj1r0p3J4Q0L2k5j4k2M4N0L7p2j14j9J7Q1N7J9j0J2Mj5k1l8
$$ plain form
-22412 5981 5983 5992 5952 5879 5873 5867 5806 5797 5820 5839 5823 5766 5761 5822 5908 5915 5857 5791 5755 5736 5737 5774 5812 5795 5778 5763 5761 5738 5701 5734 5818 5830 5798 5798 5797 5807 5783 5746 5759
-22373 5759 5777 5759 5762 5738 5719 5710 5713 5754 5763 5790 5827 5855 5820 5780 5762 5791 5797 5718 5619 5565 5547 5525 5504 5504 5556 5577 5622 5645 5690 5688 5665 5671 5660 5675 5677 5644 5649 5701
-22335 5701 5748 5730 5701 5718 5722 5692 5674 5642 5601 5581 5582 5603 5628 5577 5505 5466 5496 5565 5584 5533 5522 5527 5546 5590 5592 5601 5576 5568 5583 5557 5537 5537 5483 5438 5496 5550 5539
-22298 5539 5458 5421 5446 5466 5480 5484 5479 5538 5593 5584 5551 5566 5538 5474 5426 5400 5394 5388 5429 5478 5419 5332 5295 5276 5320 5443 5463 5409 5420 5416 5431 5455 5425 5379 5360 5401
-22262 5401 5440 5405 5380 5404 5467 5535 5553 5528 5509 5552 5591 5592 5511 5424 5399 5383 5384 5346 5369 5429 5463 5455 5429 5342 5281 5304 5341 5401 5436 5422 5428 5404 5358 5343 5380
-22227 5380 5400 5356 5314 5287 5351 5373 5378 5368 5325 5340 5394 5435 5389 5351 5321 5306 5326 5311 5307 5298 5242 5208 5234 5271 5249 5218 5191 5239 5295 5242 5117 5060 5160 5251
-22193 5251 5248 5231 5284 5310 5315 5351 5365 5280 5229 5237 5214 5159 5169 5147 5086 5080 5092 5108 5196 5255 5237 5171 5102 5079 5090 5108 5087 5005 4973 5009 5029 5002 5055 5134 5198
-22158 5198 5265 5270 5185 5126 5137 5177 5180 5160 5140 5145 5134 5044 4971 4985 5065 5097 5072 5058 5036 5080 5130 5167 5095 4981 4962 4979 5060 5117 5136 5126 5138 5142 5127 5106 5068
-22123E068kj7J0J5k2l0J4L9LK4l4k7OL1N0L9j5o4n4m5o6l6KJ8J8L4Nj8l5m1J4M9L6OL6j0
-22087E001j9k8l9j3l3J8J0J2K6K5M8nk6n7o1k7mM5M3j9j8Jm0l7k3K0N8M4RM2k1q5n3qP5L4
-22051D895l8J3k9j4M2P3Mn8j9j2k2QK6K2J6j1j6j5M1L3n0l8l1k4l1J5kn9n3RL1Pm6m7j0L1
-22015D641O7M8jl6j3K7L9J7k3m1m0n8j0N2K5K1N1L8J8k5%L8m2n9k1K2RL1K8j3%m1k2jk3l2
-21979D671j5ml1j1kK0j7l7J0j1qPL2l1j5L4J9L3RoM3M1k0Kj8j7n1j8qM3J3MQO%n2j6PpqL9
-21938D638N6m9r2lN8j7o6k6j8L7Q3L0J1j8n9n4m9J2P4K6o5k5K2N0Nk7jM5jj5l3k5L3M4m9
-21903D532m2L3J3o1j4L1lk4K1kLK2j9j3j1mL9M4K6M3j5n7l2o0m3K0kl0k3QJrQM0J8n5J2R6
-21865D491L9n8q5l2qL4RO1Q9N1K4j6p5lJ4MJ4j5m4J0K8j2L3R1K4k7o5m0MM1K4o9q2j9K2K6
$$ plain form
-22123 5068 5066 5049 5059 5074 5052 5022 5036 5075 5078 5102 5068 5041 5047 5078 5128 5167 5152 5088 5034 4989 4923 4887 4889 4907 4925 4959 4964 4946 4911 4870 4884 4933 4969 4975 5011 5001
-22087 5001 4982 4954 4915 4902 4869 4887 4897 4909 4935 4960 5008 5003 4977 4920 4859 4832 4828 4873 4916 4897 4879 4880 4840 4803 4780 4800 4858 4902 4911 4953 4932 4847 4794 4786 4861 4895
-22051 4895 4857 4870 4841 4827 4869 4942 4946 4888 4869 4857 4835 4843 4869 4891 4907 4896 4880 4865 4906 4939 4889 4851 4820 4796 4765 4780 4778 4719 4666 4675 4706 4713 4667 4620 4610 4641
-22015 4641 4708 4756 4755 4719 4706 4733 4772 4789 4766 4725 4685 4627 4617 4669 4694 4715 4766 4804 4822 4797 4797 4835 4793 4734 4713 4735 4744 4775 4803 4790 4790 4749 4727 4726 4703 4671
-21979 4671 4656 4652 4621 4610 4608 4628 4611 4574 4584 4573 4565 4572 4604 4573 4558 4592 4611 4644 4653 4647 4690 4731 4711 4713 4695 4678 4627 4609 4601 4644 4657 4661 4669 4675 4675 4623 4607 4614 4607 4599 4638
-21938 4638 4694 4645 4553 4550 4608 4591 4525 4499 4481 4518 4601 4631 4642 4624 4565 4511 4462 4474 4548 4574 4509 4484 4506 4556 4561 4534 4533 4578 4577 4562 4529 4504 4537 4581 4532
-21903 4532 4490 4523 4536 4475 4461 4492 4489 4465 4486 4484 4487 4509 4490 4477 4466 4462 4501 4545 4571 4614 4599 4542 4510 4450 4407 4427 4425 4395 4372 4380 4381 4372 4380 4420 4438 4383 4395 4491
-21865 4491 4530 4472 4387 4355 4347 4381 4390 4451 4540 4591 4615 4599 4524 4521 4535 4539 4553 4538 4494 4504 4532 4520 4553 4644 4668 4641 4576 4536 4540 4581 4605 4536 4454 4435 4457 4483
-21829D483J4oJ9R7Nj7Rm1rqn6n1J4O7N0Kp2o4n9nN0K0M2k6p8k2j0Qj9MK2k0qJ0j2l8N7R3
-21791D445P6jmn1q8J7O8J9J7j8l2j3Rjj1M1L3n3m5l1qL3J3K4J1Jn5k0Rj2Jlk7J6J7l5m6K3
-21753D319M0L0%rJ9Mpj5o0j9L5L6l0rn8q4mM1K0J2J3KJ3L4Mm3m9L7K1m2n7k7PM5K9Oj8p7
-21715D159l5l3JL2J6l5J0M7N1j3K8O6rn4jKj1j9m2OM4QqJ2jqMj9l0l2j2m4n8K1M5KkK9J1
-21676D128lkNJ4K2K0J4j2Qj3m0J9K4Rk0Qk5n4o2j8M6L0j0L6K9k6m7nnQM7K2jL3%m0o7j3K1
-21637D080Qk1j0j8Lk3l5J9L1J6M6J8%k3jJ2L3K8l5k8j5n4r4m4j6kL4K0P5M7J1j7k1K2kpr
-21600D028k3kL1k8j3k0l8koK4N3K4Pj8q0l5J6l1J0M4RoK0K4K8j2rk4%jjl0l6oJ4N4On6l8
-21561C877K9jMrm5j3j6jK3j9m2J2P0L8lJ7Q8J4J8L7M2Lp5n9L1N6N2L2O3k2o2k3k7k8l9qr
$$ plain form
-21829 4483 4497 4491 4510 4607 4612 4595 4604 4563 4554 4546 4490 4439 4453 4520 4570 4572 4500 4436 4377 4372 4422 4442 4484 4458 4380 4358 4348 4356 4337 4341 4363 4343 4335 4345 4333 4295 4352 4445
-21791 4445 4521 4520 4516 4465 4377 4394 4462 4481 4498 4480 4448 4435 4444 4443 4432 4473 4506 4453 4408 4377 4369 4402 4415 4439 4450 4451 4396 4376 4385 4373 4374 4371 4344 4360 4377 4342 4296 4319
-21753 4319 4359 4389 4389 4380 4399 4403 4396 4381 4321 4302 4337 4373 4343 4334 4276 4192 4188 4229 4249 4261 4274 4276 4289 4323 4327 4284 4235 4272 4293 4251 4194 4167 4174 4219 4248 4254 4236 4159
-21715 4159 4124 4091 4092 4124 4140 4105 4115 4162 4213 4200 4228 4294 4285 4231 4230 4232 4221 4202 4160 4166 4210 4218 4210 4222 4221 4213 4217 4198 4168 4136 4124 4080 4022 4043 4088 4090 4088 4117 4128
-21676 4128 4125 4123 4128 4142 4164 4184 4198 4186 4194 4181 4141 4160 4184 4193 4173 4181 4156 4102 4040 4022 4068 4098 4088 4124 4153 4127 4080 4075 4070 4078 4125 4147 4146 4179 4179 4139 4072 4059 4080
-21637 4080 4088 4067 4057 4039 4042 4019 3984 4003 4034 4050 4096 4114 4114 4091 4090 4102 4135 4163 4128 4100 4085 4031 3937 3893 3877 3875 3909 3929 4004 4051 4062 4045 4024 4046 4044 4037 4028
-21600 4028 4005 4003 4034 4006 3993 3973 3935 3933 3927 3951 4004 4028 4035 4017 3937 3902 3918 3887 3897 3941 3950 3944 3964 3988 4016 4004 3995 3971 3971 3970 3969 3939 3903 3897 3911 3965 3971 3915 3877
-21561 3877 3906 3905 3909 3900 3855 3842 3826 3825 3848 3829 3787 3799 3869 3907 3904 3921 4009 4023 4041 4078 4120 4123 4048 3989 4020 4076 4128 4160 4223 4201 4139 4116 4089 4061 4022 4014 4005
-21524D005n3kJ03L4OJl5n9oM3J5l2l0j7k3j7l0m1m5m2J1O8M8K4lK2ol6o6%N5rj4N4K6j9m7
-21487C883l1KRj5j2K7Q7Qp1nk8PL4N3M4K7l1q7m3O4J7K4M5jk9%M2L2M3K4M5Qj02q2K8M0o1
-21450C995o2M1O7k2j8kpl4p2o7L0M1L5J2K8k6l3Ok0LPO0L4k1m8k4n5k9L0J8k9JK5m0j2j4
-21414C798M3K6j5m8q3n8J3O2L3L0J5k8k5k0K1O6M8J9l5n1j6j2lL7P2qo3n3m0N2M0RJ1J6j1
-21379C842n5n0n7OJ9j4k4n3J9K4J5ml2K6J0j8m1MO9J5j6N5M1JRM3L2l0Kk9J2Pn3k6j0j%j3
-21341C725J5RK6M4J3Pjm2j09m9M0Q7Ll3l3k5m6j0j7J6K1k7Kk8j4jJ2L5jJQJK2oJ0J8Lm0N0
-21302C686J07J4L2%n0l3qkK0%m3J5mp2n7k9OkPK2K4L7J3l3m5J3M6jpJ3K0m6n7m1jN1M8l6
-21264C607o2k5K5M8K6Nl7J2mp8k1K5L7N6m0p8LO8N4l4l0j9j0J8K4Q4L5m2%J5L1M6n3m5N3
$$ plain form
-21524 4005 3952 3950 4053 4087 4093 4094 4059 4000 3994 4037 4052 4020 3990 3973 3950 3933 3903 3862 3817 3775 3786 3854 3902 3926 3923 3945 3939 3903 3837 3837 3892 3883 3869 3923 3949 3930 3883
-21487 3883 3852 3854 3863 3848 3836 3863 3950 3958 3887 3882 3854 3861 3895 3948 3992 4019 3988 3901 3858 3922 3939 3963 4008 4007 3978 3978 4020 4052 4095 4119 4164 4172 4070 3988 4016 4056 3995
-21450 3995 3933 3974 4041 4019 4001 3999 3992 3958 3886 3819 3849 3890 3925 3937 3965 3939 3906 3912 3892 3895 3902 3962 3996 3975 3927 3903 3848 3819 3849 3867 3838 3839 3864 3824 3812 3798
-21414 3798 3841 3867 3852 3804 3721 3663 3676 3738 3771 3801 3816 3788 3763 3743 3764 3830 3878 3897 3862 3811 3795 3783 3780 3817 3889 3881 3818 3765 3725 3777 3817 3826 3837 3853 3842
-21379 3842 3787 3737 3680 3686 3705 3691 3667 3614 3633 3657 3672 3668 3636 3662 3672 3654 3613 3617 3686 3701 3685 3740 3781 3782 3791 3834 3866 3836 3838 3809 3821 3828 3775 3749 3739 3738 3738 3725
-21341 3725 3740 3749 3775 3819 3832 3839 3838 3796 3687 3638 3678 3765 3768 3735 3702 3677 3631 3621 3604 3620 3641 3614 3616 3588 3574 3573 3585 3620 3619 3620 3628 3629 3651 3645 3655 3673 3676 3636 3686
-21302 3686 3793 3807 3839 3839 3789 3756 3748 3746 3766 3766 3723 3738 3734 3662 3605 3576 3582 3580 3587 3609 3633 3670 3683 3650 3605 3618 3664 3663 3656 3669 3689 3643 3586 3545 3544 3595 3643 3607
-21264 3607 3545 3520 3545 3593 3619 3624 3587 3599 3595 3517 3496 3521 3558 3614 3574 3496 3499 3567 3621 3587 3557 3538 3528 3546 3570 3654 3689 3647 3647 3662 3693 3739 3686 3641 3694
-21229C694K2k8np7q6N4O5m9l8L6J0k9m2j4PK2L7PK0l2r2k0J5k0k8N3O5K0k0o2l6j7%K0rK7
-21193C470L0L8M3l5l8j3k0j1J4L2L6j4J7J7l8k3J2K3O8%m6pO0J9k3p0o7l6J6K1L4Kl3n1j5
-21158C412J10P3qll7k6k2j6J9L6K5L1J0J9M0K6k0q4o2Mj9m7o5q0j4N2L8J6J9L5j1m4oj5K5
-21123C411J5j8k1K5jjJ2kJ5J4L0j3ML2k6o1rM0K8J5OJ5kl5%K6ol7KJ5np0o9k3PL3Kk1J8P
-21083C352NJ9j4j9k5M1N4M4J4L8Ln8m1Jqll2k1rK7j9o5j2LKJ4jrJ8L1N7O8k2o2m6L4N3k3
-21045C389o2k5j7K9K2j7K3J9l9m7j9N1K7M0N9J7l9k8Km4m2KM3J0Lj1kk0l2J5L1m0n2NO9M6
-21009C366kJ1k3n1kk1JJ0M8J6J3M1Pl1o8j5rqk0JPj7J6J4o1n6JN4J6K7mj0k5L8K8M9M1n7
-20971C325m6k0L5J1L4L8n2m6j3l7oO5M9L1L0Lj4l0o1k6Rl4n5m8L3R2N5%L8K9K0r0n4Qk3j2
$$ plain form
-21229 3694 3716 3688 3683 3606 3520 3574 3639 3590 3552 3588 3598 3569 3527 3513 3520 3542 3579 3586 3606 3574 3482 3462 3477 3457 3429 3482 3547 3567 3547 3485 3449 3432 3432 3452 3443 3470
-21193 3470 3500 3538 3581 3546 3508 3495 3475 3464 3478 3510 3546 3532 3549 3566 3528 3505 3517 3540 3608 3608 3562 3555 3615 3634 3611 3541 3474 3438 3454 3475 3509 3511 3478 3427 3412
-21158 3412 3522 3595 3587 3584 3547 3521 3499 3483 3502 3538 3563 3594 3604 3623 3663 3689 3669 3585 3523 3527 3508 3461 3396 3316 3302 3354 3392 3408 3427 3462 3451 3407 3401 3386 3411
-21123 3411 3426 3408 3387 3412 3411 3410 3422 3420 3435 3449 3479 3466 3470 3502 3476 3415 3406 3446 3474 3489 3495 3510 3508 3473 3473 3499 3493 3456 3458 3473 3468 3398 3329 3306 3313 3346 3348 3327 3345 3352
-21083 3352 3357 3376 3362 3343 3318 3359 3413 3457 3471 3509 3512 3454 3413 3414 3406 3403 3371 3350 3341 3368 3349 3284 3272 3275 3277 3291 3290 3281 3299 3330 3387 3455 3433 3371 3325 3359 3412 3389
-21045 3389 3327 3302 3285 3314 3336 3319 3342 3361 3322 3275 3256 3307 3334 3374 3433 3450 3411 3383 3385 3341 3299 3301 3344 3354 3357 3346 3344 3324 3292 3307 3338 3298 3246 3251 3320 3366
-21009 3366 3364 3375 3352 3301 3299 3278 3279 3289 3337 3353 3366 3407 3414 3383 3315 3300 3291 3283 3263 3264 3271 3254 3270 3284 3223 3167 3168 3222 3238 3265 3261 3251 3226 3264 3292 3341 3382 3325
-20971 3325 3279 3259 3294 3305 3339 3377 3325 3279 3266 3229 3223 3288 3337 3368 3398 3401 3387 3357 3296 3270 3279 3245 3190 3142 3175 3267 3322 3322 3360 3389 3409 3319 3265 3273 3250 3238
-20935C238J1J8J7Mj4QK1k1j0J6p4j06%O6O1J7mJ4j5m3j6K0J7n5j6k7m0nJ2L7J8P%K6L8N6
-20899C276L6Pj0l5l9p2k2mJ2M4N5O1k5K6J0rK0n2l8k8n0J7k0l6Kk8j6M2J1j8NJ6K5JK8n2
-20863C140j08j4O4J00K3l8m6n2m0L4N7RL2J5q3k9NJ1PJ6L1m2J2O0Nk9n4j6M2L3J1M7J2j5
-20829C200pm1m1k5M0nm5l2K5N7K7m5n4QO4N3rj5J6jk4J5Lqk8J9K5K7J4j5rNk0l1lJm6k7N1
-20790C119K2K2j1k3rp9j9ok1L8L1k1QR4k0o9K2JqK8j5n1m1rj1N4M9J5oj7ql0lK2PK6m6j1
-20752C024orJ5Jnk6n8j0L6P1N6j1m1k1L0K0rj7l9k0L3M4k3K0ln4m1J2J3n9J8Q0N7O6mk3j4
-20715C103PJ2qJ6l1j7j01q5j3N1N6O1M1qPRk6m1j0OMJ6M1J6J5j8mnl4p0n0l7jj3l3oL9M9
-20677B938k6J6K4j8J1J8lplk4j3N1N2om7k6LJ5J2mK3L8K7l0n2l8MM1M6L7m2mN1Ro5mP4%o
$$ plain form
-20935 3238 3249 3267 3284 3288 3274 3282 3303 3282 3272 3288 3214 3108 3108 3174 3235 3252 3248 3262 3247 3204 3188 3208 3225 3170 3154 3127 3087 3082 3094 3131 3149 3156 3156 3182 3220 3276
-20899 3276 3312 3319 3309 3274 3235 3163 3141 3137 3149 3193 3248 3309 3284 3310 3320 3311 3331 3279 3241 3213 3163 3180 3160 3124 3126 3098 3082 3124 3135 3117 3122 3138 3163 3164 3192 3140
-20863 3140 3032 3018 3082 3182 3205 3167 3121 3069 3029 3063 3120 3129 3161 3176 3093 3064 3069 3080 3087 3103 3134 3092 3104 3164 3169 3140 3086 3070 3112 3145 3156 3203 3215 3200
-20829 3200 3193 3152 3111 3086 3126 3121 3076 3044 3069 3126 3153 3108 3054 3062 3126 3179 3170 3155 3171 3170 3146 3161 3164 3156 3128 3147 3172 3199 3213 3198 3189 3194 3174 3143 3140 3141 3095 3068 3119
-20790 3119 3141 3163 3152 3129 3120 3041 3022 3016 2995 3033 3064 3043 3051 3145 3125 3056 3078 3079 3071 3099 3084 3033 2992 2983 2972 3026 3075 3090 3084 3067 3059 3029 3026 3048 3055 3081 3035 3024
-20752 3024 3018 3009 3024 3025 3020 2994 2936 2926 2962 3033 3089 3078 3037 3016 3046 3066 3057 3040 3001 2981 3014 3058 3035 3055 3052 2998 2957 2969 2982 2923 2941 3021 3078 3144 3140 3117 3103
-20715 3103 3110 3122 3114 3130 3099 3082 2981 2896 2883 2934 2990 3051 3092 3084 3091 3100 3074 3033 3023 3029 3033 3049 3090 3106 3121 3103 3099 3094 3060 2990 2940 2903 2902 2889 2856 2850 2889 2938
-20677 2938 2912 2928 2952 2934 2945 2963 2960 2953 2950 2926 2913 2964 3016 3010 2963 2937 2940 2955 2967 2963 2986 3024 3051 3021 2969 2931 2935 2976 3022 3059 3017 3013 3064 3073 3008 3004 3078 3078 3072
-20638C072Lmj7kj0m4mj4L3J4Kk7oP2J3J9j6m5jM3k3m7NK1N8m5r7K6J1J0pn0k8n0j1O8O1k
-20600B981k1o4m3%J6%%l5l0N2R1N8K9m0r0L0O5m4k4L2k6K6J3l7J9oqj0qK1L9J0k3K0rl4k3
-20563B927k2j6KK5Pj5k6j4lOK2j7J7P5Ln4l8K7J0n2k2QO%L0M5l6lkk4k7J3K9K4K0k5p4k5
-20525B801L6O7J5k1j7MpK7L3OK8K1k3J3k8m8k4j5m1n5k3QJ5L6M2L1K2J3P1L4j8m5m4k5J0
-20490B899lJ0K3Pk5k2L1L5K7Klmm5o7NM3J9QL7N4k4m4nK6K2m4n0jM0l2o4l2OM2M3k3n4jk2
-20451B814o6nO4M5L2nj4O3Pn1j6m7l3j5J4J3M9N0k9l5n1M7j6o5j6O8N6k6l8k1mP3L8J8Mj7
-20415B885j2m7j3kQrl9K0L3j3p5n8M1L1ok6j1nrkj9NJ5qL2j3j6j0JNJ6K0nM6N9Lm3k1N4O5
-20375B877K3l6kJ0p3r7K2P5Nn5l0m4o1qL6L9K2J4K8J5pm7K4K1LN4mn7k8J0j2J5M5k7KM6l7
$$ plain form
-20638 3072 3075 3071 3054 3052 3042 2998 2994 2980 3013 3027 3029 3002 2996 3068 3081 3100 3084 3039 3038 3081 3058 3011 3016 3037 3095 3050 2953 2979 2990 3000 2993 2943 2915 2865 2854 2922 2983 2981
-20600 2981 2960 2896 2853 2853 2869 2869 2869 2834 2804 2856 2947 3005 3034 2994 2904 2934 2999 2955 2931 2963 2937 2963 2976 2939 2958 2952 2944 2934 2926 2947 2986 2996 2973 2993 2984 2950 2927
-20563 2927 2905 2889 2891 2916 2923 2908 2882 2868 2865 2871 2893 2876 2893 2968 2971 2917 2879 2906 2916 2864 2842 2850 2856 2856 2886 2931 2895 2892 2890 2866 2839 2852 2881 2905 2925 2900 2826 2801
-20525 2801 2837 2904 2919 2898 2881 2885 2878 2905 2938 2944 2972 2993 2970 2983 2955 2907 2883 2868 2827 2772 2749 2757 2772 2808 2850 2881 2903 2916 2987 3021 3003 2958 2914 2889 2899
-20490 2899 2896 2906 2929 2936 2911 2889 2920 2955 2982 2984 2981 2977 2932 2865 2870 2913 2932 2940 2977 3031 3007 2963 2958 2984 3006 2962 2912 2911 2951 2919 2855 2823 2829 2871 2914 2891 2837 2836 2814
-20451 2814 2748 2743 2807 2852 2884 2879 2865 2928 2935 2884 2868 2821 2788 2773 2787 2800 2849 2899 2870 2835 2784 2831 2815 2750 2734 2802 2858 2832 2794 2773 2769 2842 2880 2898 2902 2885
-20415 2885 2873 2826 2813 2811 2819 2810 2771 2791 2824 2811 2736 2678 2719 2750 2744 2718 2707 2702 2693 2691 2672 2677 2692 2684 2716 2703 2687 2677 2678 2683 2699 2719 2714 2760 2819 2822 2779 2758 2812 2877
-20375 2877 2900 2864 2862 2872 2799 2702 2724 2799 2804 2749 2719 2675 2614 2606 2642 2681 2703 2717 2745 2760 2753 2706 2730 2751 2754 2808 2804 2747 2719 2729 2717 2732 2777 2750 2752 2798 2761
-20338B761p8l0kL9K8Kn5KK0M6rK9K2jJ4O4k2m9j7Mrk8J4L7lj3J9LlJ6o3l7K0m2l2j1Q%KK4
-20298B670K1mj0M6M2J0rk5RQl0mK6mo7QQ2L3o2q1n0L5j3l7L1N0j2j7K5j0j8J3N1J5n5J4L9
-20261B720PN7ol7j6NM1M6%qj3qj3j6n2j4M3L3k7o6k3j9K3K9Mk8OO2LNNk4l7p1l0N1j7j8N
-20222B602oK2L1J4JJJ9Rl7lpj4J0j4L0K3l0j6R2J8j4K9j8n6k1l1j0N9pm6j7k9oJ2k1kJ8K7
-20184B612No3l2m1LN0N7M9Qk0rK0op7PN8K3J3rO2M7L4j1o9p0oLk5k3K4jl8o2k5P3L7m8n6
-20146B494j2N2N9Ln7J3M3J2N6K0k4j3K4Mk9l9j8j2k0K7kk2Km0NkJ8P5M4%j7m8j7LjqPQ0r
-20107B651q1K%Jj5k1M9L4nk5K3J8n0K4j4m1m5jOp%N4O0m8j03m5M0R9O3J3K1m0onm3k4k9m8
-20069B462k2N1N8J5J7j2j0lk0j5lk8%O2l6l6K7P9Ok0NN5N5k8k3m6k4L9K1ql4lJ7K3k2n6k6
$$ plain form
-20338 2761 2683 2653 2651 2690 2718 2720 2665 2667 2687 2733 2724 2753 2775 2774 2788 2852 2830 2781 2764 2768 2759 2731 2745 2782 2779 2766 2785 2788 2785 2801 2738 2701 2721 2679 2647 2636 2644 2644 2646 2670
-20298 2670 2691 2687 2677 2723 2765 2775 2766 2741 2750 2758 2728 2724 2750 2746 2679 2687 2769 2802 2740 2659 2609 2644 2631 2594 2625 2675 2663 2646 2671 2661 2643 2656 2707 2722 2667 2681 2720
-20261 2720 2727 2784 2778 2741 2725 2730 2771 2817 2817 2809 2796 2788 2775 2759 2707 2693 2736 2769 2742 2676 2653 2634 2657 2686 2690 2662 2668 2730 2733 2738 2743 2719 2682 2611 2581 2632 2615 2597 2602
-20222 2602 2596 2618 2649 2663 2664 2665 2684 2693 2656 2653 2646 2632 2642 2628 2658 2681 2651 2635 2727 2745 2731 2760 2742 2686 2665 2634 2624 2683 2676 2630 2613 2584 2578 2590 2569 2567 2585 2612
-20184 2612 2617 2554 2522 2481 2484 2534 2591 2640 2648 2628 2619 2639 2633 2556 2563 2621 2644 2657 2648 2710 2757 2791 2780 2711 2641 2635 2638 2613 2590 2614 2613 2575 2513 2488 2561 2598 2550 2494
-20146 2494 2482 2534 2593 2596 2539 2552 2595 2607 2663 2683 2659 2646 2670 2674 2645 2606 2588 2576 2556 2583 2581 2559 2561 2521 2526 2524 2542 2617 2661 2661 2644 2596 2579 2582 2581 2573 2580 2660 2651
-20107 2651 2570 2572 2572 2573 2558 2537 2586 2620 2615 2590 2613 2631 2581 2605 2591 2550 2505 2504 2510 2503 2503 2557 2617 2569 2466 2421 2461 2560 2623 2636 2657 2617 2611 2606 2563 2539 2510 2462
-20069 2462 2440 2491 2549 2564 2581 2569 2559 2556 2536 2521 2518 2490 2490 2552 2516 2480 2507 2586 2592 2572 2577 2632 2687 2659 2636 2590 2566 2605 2626 2618 2584 2581 2598 2621 2599 2543 2517
-20032B517M2J5l3l3n2PM5J5JJ1L2M7k2o0l0j0JJ6J2P7N4pK1L3k2q5r2J4L5pmJPK4kj8j4L1
-19994B567Jo3rj4j1j1RL5K0J7N0k4j4mJ3L6pl6n9J1J0j8%Oj3j5rk4OJ0K1M9loJ0l7n0k2L0
-19955B452N7m8o2j1N8P6J1n5p1mM2O5O1l2q7o1L6N6jj5kJ0J3K9L5oJ3RNk2j3Jk6oJ1ok4K5
-19917B513N5M1Rj4l8l6K7J1q9l1J8L4n2m2K0K1J1j4m1l1k4M4N6n4j9nK2L9K9Jm8k6Rpp4l2
-19881B283j6J7Q9K1j5n0o2j6j8K5J6L3P6P2K4n2j6rmK1M1L2Q9Kk2k8k2n1q1j9O1L0n7m0K1
-19846B375P1L9lL2L1j5k8om0m5K0K6rmkPj1m9Pj0J8N6M1Qjl8k9J8K4qKj0qJ0L5N0Jr6j03
-19807B356o6JO8N4m0rO1M8Kj4J0J0k3K5ol3nk9m6mN1O2J9j2k4m9m0RP0L9m1r7o1j7K0nLk4
-19769B263J5Q3J0o5oN3j2pMm1p4M1P4l1m1P5J00J8m4j2on9PK1K5qm0l6k9mM8O7K2L3j2k2
$$ plain form
-20032 2517 2559 2574 2541 2508 2456 2463 2508 2523 2524 2535 2567 2614 2592 2532 2502 2492 2493 2509 2521 2598 2652 2645 2666 2699 2677 2592 2500 2514 2549 2542 2538 2539 2546 2570 2568 2550 2536 2567
-19994 2567 2568 2505 2496 2482 2471 2460 2469 2504 2524 2541 2591 2567 2553 2549 2562 2598 2591 2555 2496 2507 2517 2499 2499 2505 2492 2477 2468 2444 2450 2460 2481 2530 2527 2521 2531 2494 2444 2422 2452
-19955 2452 2509 2461 2399 2388 2446 2522 2533 2478 2407 2403 2445 2510 2571 2539 2452 2391 2427 2483 2482 2467 2465 2475 2488 2517 2552 2546 2559 2568 2573 2551 2538 2539 2513 2507 2518 2512 2488 2513
-19917 2513 2568 2609 2618 2604 2566 2530 2557 2568 2479 2448 2466 2500 2448 2406 2426 2447 2458 2444 2403 2372 2348 2392 2448 2394 2375 2370 2392 2431 2460 2461 2413 2387 2396 2389 2315 2283
-19881 2283 2267 2284 2373 2394 2379 2329 2267 2251 2233 2258 2274 2307 2383 2455 2479 2427 2411 2402 2398 2419 2460 2492 2581 2583 2561 2533 2511 2460 2379 2360 2421 2451 2394 2354 2375
-19846 2375 2446 2485 2482 2514 2545 2530 2502 2496 2456 2411 2431 2457 2448 2444 2442 2449 2438 2389 2396 2386 2404 2460 2501 2509 2508 2470 2441 2459 2483 2475 2477 2467 2459 2469 2504 2554 2555 2459 2356
-19807 2356 2290 2291 2359 2413 2373 2364 2425 2473 2475 2461 2471 2481 2458 2483 2477 2444 2439 2410 2364 2360 2411 2473 2492 2480 2456 2407 2367 2376 2446 2485 2444 2347 2286 2269 2289 2284 2287 2263
-19769 2263 2278 2361 2371 2306 2300 2353 2341 2334 2338 2297 2223 2264 2338 2307 2266 2341 2441 2459 2415 2403 2397 2338 2345 2366 2391 2383 2343 2307 2278 2274 2322 2389 2411 2444 2432 2410
-19733B410mrPK1l2j5L0MK1j3jLQK7mK8jq8j12j6j4J9N6N7j2lj3J0J0p7n1KN4J00J6J7mk8
-19695B403m4k3J6RJ1RM2k4m2l4l0N1L8j3j8M1Mm9l2j9L3L4Lj6l1l5j5KK7J5L7j0k6K5M4N2
-19659B435O0K9l1r4l1L6K6mL2O7J13N0j86j28p0m6J3%M5L2K7P5K8lK4p7o7Ol2nk0rK3L1L8
-19624B387o9o1k3jM6J2oO6M1j2k8m0p1n0K7%k7M3L7j6k4N2N5po2n4K7N0K2RmP5N2k8p1q1
-19588B266n1pl2LL8L9Jk4K7MJ8R1on7N7M6l0n2J0km4JJ0j5k5J9mK3k3o5l9M3R9J01qq5n1
-19551B276n3n1J0L9NJ8JJ5J5qk0P3O7j5k3Kl3k6Qm8m5k1L2O2O2Kjk7N9J1n8m8l5M6N4J1k2
-19514B334m5k0qRn0j6Kj0L0L7K7lK2Lj2nK2j2n7kKJ6L4j3K6kq9l5K5K5N5K8Nj2nll4j9MJ6
-19474B270Jo1n4pK8njK5J0NK9P1Ol3ol9pJ6j8pqK7K1k5k3J2P8M6l2k3j0kPK2Kkm1q4l1M1
$$ plain form
-19733 2410 2406 2397 2404 2425 2393 2378 2408 2412 2433 2420 2419 2422 2430 2457 2453 2481 2480 2392 2280 2264 2250 2269 2325 2382 2370 2367 2354 2364 2374 2297 2246 2248 2302 2402 2418 2435 2431 2403
-19695 2403 2359 2336 2352 2361 2372 2381 2423 2399 2357 2323 2293 2344 2382 2369 2351 2392 2396 2347 2315 2296 2329 2363 2366 2350 2319 2284 2269 2271 2298 2313 2350 2340 2314 2339 2383 2435
-19659 2435 2495 2524 2493 2399 2368 2404 2430 2426 2458 2525 2638 2688 2502 2374 2304 2258 2271 2271 2316 2348 2375 2450 2478 2475 2499 2422 2355 2361 2329 2324 2304 2295 2318 2349 2387
-19624 2387 2318 2257 2234 2233 2279 2291 2285 2351 2392 2380 2352 2312 2241 2191 2218 2218 2191 2234 2271 2255 2231 2283 2338 2331 2269 2215 2242 2292 2314 2323 2319 2394 2446 2418 2347 2266
-19588 2266 2215 2208 2176 2179 2217 2256 2257 2233 2260 2264 2282 2373 2367 2310 2367 2413 2383 2331 2341 2339 2295 2296 2306 2291 2266 2285 2281 2304 2281 2216 2177 2220 2319 2420 2412 2327 2276
-19551 2276 2223 2172 2182 2221 2226 2244 2245 2260 2275 2267 2247 2320 2387 2372 2349 2351 2318 2292 2300 2252 2207 2186 2218 2280 2342 2344 2343 2316 2375 2386 2328 2280 2245 2291 2345 2356 2334
-19514 2334 2289 2269 2261 2270 2220 2204 2206 2196 2226 2263 2290 2287 2309 2312 2300 2295 2317 2305 2248 2246 2248 2264 2298 2285 2311 2309 2220 2185 2210 2235 2290 2318 2323 2311 2306 2303 2269 2250 2254 2270
-19474 2270 2271 2210 2156 2149 2177 2172 2171 2196 2206 2211 2240 2311 2317 2284 2278 2239 2232 2248 2230 2223 2215 2242 2263 2238 2215 2227 2305 2351 2319 2296 2286 2284 2291 2313 2315 2313 2272 2188 2157 2198
-19434B198M5nK6ol7n0j8J4PJ0k2J6PL1L4nMM5L9J2o0j6K8j0L7P5k4p8k7j6J4j8j8L5K8k0
-19398B275l7l1K1j0%J3l7m4j8J1k2rlj2J9O3M4m1j8Ok9n4K0Q7J6K2Ll1q5r5J2O2L8L3J9l2
-19362B156j6L6pK4N5Kj9l8p%Rk9j7M6L5K4j4oJ4K1K7j7p1n5K4M6l9n2K6J0l2%J2Qj9n1M4
-19325B130L0ol1mJ6LjL7mk9LPj2K6n0o7J5O7K0l4l1K4N6K2L0M3m3n8l6l6lkJ0N4L6k9m7o0
-19287B046m2j5kK8L4%lj9Jpj1J0K2J6L4M1qoJ0M4kq9n3j4l1PN3L9N1K2j4l6j8l6J7M6K0J6
-19249B151m6pj1o0k6Jm3J6O2jK3N5N5J4PK7J5n4m7j5L8J8k8m9j0Rnpk7m7K0K7K1J2J7j0k3
-19212B072Kj3l3l8l0L3P4M2J1J4j2l9k0l3pQ6Q6K1mn5n5j5NL4l5p8j9k0L8K0K6J1M0K4n0
-19177B083l4M5M5j2l0p6nN0j0n3K1Q4O1L6N0j8p8j0Km0q4k9K8K8K9K3k7oM6L7J8kMP7Mp6
$$ plain form
-19434 2198 2243 2238 2264 2258 2221 2171 2153 2167 2174 2184 2162 2178 2185 2216 2250 2245 2249 2294 2333 2345 2285 2269 2297 2287 2324 2399 2375 2297 2270 2254 2268 2250 2232 2267 2295 2275
-19398 2275 2238 2207 2228 2218 2218 2231 2194 2150 2132 2143 2121 2112 2109 2097 2116 2179 2223 2182 2164 2170 2141 2087 2107 2194 2210 2232 2235 2204 2119 2024 2036 2098 2136 2169 2188 2156
-19362 2156 2140 2176 2169 2193 2248 2250 2231 2193 2186 2186 2195 2166 2149 2195 2230 2254 2240 2234 2248 2269 2296 2279 2208 2153 2177 2223 2184 2132 2158 2168 2136 2136 2148 2156 2137 2086 2130
-19325 2130 2160 2154 2123 2119 2135 2138 2137 2174 2170 2141 2144 2151 2139 2165 2115 2048 2063 2130 2150 2116 2085 2109 2165 2187 2217 2260 2217 2159 2123 2087 2084 2082 2092 2146 2182 2153 2106 2046
-19287 2046 2004 1989 1987 2015 2049 2049 2046 2027 2028 2021 2010 2020 2042 2058 2092 2133 2125 2119 2129 2173 2171 2082 2029 2015 1984 1991 2044 2083 2134 2156 2142 2106 2088 2052 2069 2115 2135 2151
-19249 2151 2105 2098 2087 2027 2001 2002 1959 1975 2037 2036 2059 2114 2169 2183 2190 2217 2232 2178 2131 2116 2154 2172 2144 2095 2085 2094 2089 2082 2055 2008 2028 2055 2076 2088 2105 2095 2072
-19212 2072 2074 2061 2028 1990 1960 1993 2067 2109 2120 2134 2122 2083 2063 2030 2023 2109 2195 2216 2212 2157 2102 2087 2092 2126 2091 2013 1994 1974 2012 2032 2058 2069 2109 2133 2083
-19177 2083 2049 2094 2139 2127 2097 2021 2016 2066 2056 2003 2024 2108 2169 2205 2255 2237 2159 2149 2151 2111 2027 1998 2026 2054 2083 2106 2079 2073 2119 2156 2174 2172 2176 2253 2257 2181
-19141B181m3L2k3n9okPJ7JJ8J3k1j00l5Jl4%P2O9K0kMK8Rl1m9l0M7K3JJ7J2l6RJ1j2l9j7
-19103B053j4RQk7k7M3N0k1n2J8ko2k8KK3L6K7k2p3q2n1J0LL0M1JJ4L3M1L3L0L9lm6k3k5l2
-19066A954N8K9LPL7K5Rj4j8L3Lk3n0l1k1L2M6Nm7k1RL6m6l4m8k0K8K3L6O1N7l3p2o8M4J19
-19030B108J0k5%j0Ljm5J6j4m7J9j6o3j4O2J3K1Qk4j7jNl6nQ4J08k0o4n4k1RM7J0ol4MM2R
-18992B061j3N3K9m9o0K1k4l3L9J2j6K8K7j7n0j7Kk9J4kqM2J6L4m8l5L6l2J0Q0K5l3p2m8K7
-18957A970K5j3RK1j3l7NP3M9k4j3jL5J6q0l8J5J8mn3j5N4L2N1nj6J9J2J5l8o9n8J8K2NKJ6
-18920B005L6J5kK9N7o5k1J1j9l3NL6jrK8OK1k6m8k9J7J3j0K0%m6oj5r4j7N1M5M0K3j7p3J0
-18883A937RmRooM9K5ok8k4j7k9L0K1K4nk2j2NK9j2n4J1jJ5ROJ2j4J5L6K0j5j9o4k3K9J5L1
$$ plain form
-19141 2181 2138 2170 2147 2088 2082 2080 2087 2104 2105 2123 2136 2115 2015 1980 1981 1947 1947 2019 2088 2108 2106 2110 2138 2147 2116 2067 2037 2084 2107 2108 2125 2137 2101 2110 2121 2109 2070 2053
-19103 2053 2039 2048 2056 2029 2002 2045 2095 2074 2022 2040 2038 1976 1948 1950 1973 2009 2036 2014 1941 1859 1808 1818 1821 1851 1892 1893 1907 1940 1981 2014 2044 2083 2080 2034 2011 1986 1954
-19066 1954 2012 2041 2044 2051 2088 2113 2122 2108 2090 2123 2126 2103 2053 2022 2001 2033 2079 2084 2037 2016 2025 2061 2015 1981 1933 1913 1941 1964 2000 2061 2118 2085 2013 1945 1989 2108
-19030 2108 2118 2093 2093 2083 2086 2085 2040 2056 2042 1995 2014 1998 1935 1921 1983 1996 2017 2025 2001 1984 1983 1988 1952 1947 2031 2139 2119 2055 2001 1980 1989 2036 2046 2040 2006 2010 2052 2061
-18992 2061 2048 2101 2130 2081 2021 2042 2018 1985 2024 2036 2020 2048 2075 2058 2008 1991 1993 1964 1978 1976 1968 2010 2026 2060 2012 1977 2013 1981 1991 2071 2096 2063 1991 1943 1970
-18957 1970 1995 1982 1991 2012 1999 1962 1967 2040 2089 2065 2052 2051 2086 2102 2022 1984 1999 2017 2013 1960 1945 1999 2031 2082 2077 2061 2080 2092 2107 2069 2000 1942 1960 1982 1987 1989 2005
-18920 2005 2041 2056 2054 2083 2140 2075 2054 2065 2046 2013 2018 2054 2053 2044 2072 2078 2099 2073 2025 1996 2013 2026 2016 2036 2036 1990 1984 1969 1875 1858 1909 1954 1994 2017 2000 1927 1937
-18883 1937 1946 1942 1951 1945 1939 1988 2013 2007 1979 1955 1938 1909 1939 1960 1984 1979 1957 1945 1950 1979 1967 1913 1924 1923 1938 1947 1953 1965 1951 1966 2002 2022 2007 1988 1924 1901 1930 1945 1976
-18844A976L1J6J9lm6j0L2K2m5p1o1J8JoJ4K6Nk7j4pJ5k3j2J4K4K5K6K6M2ll0K2J4k3n5J1
-18808A943L2l3l9k2LL6J4Jnm1l7k2L5M8k0j5L7L5K9mL4K1m4l9k8m2k1J5K3k6n0j7M3QJ3K9
-18772A894J2k3j5mj0J8J9m4m9Ppk8M0N1P6L9m6o7JP6M9J4k5j2nPJ8j2RK5k8l7m6o4J9J4n9
-18735A807K4M5K2K1M1K8p0n0L7J1%j9jN3O4jl5l5j4J4L6lj4k6l4ML3J3j4o9L7M4J5M1K7L7
-18699B069L1o5j26k8K2QK5MM3j1q5nK4k6j5OLL6L0l2l8j1L8K8k4l6k4K8M4P3K2m5mpmm8p9
-18662A821oM7j1j2M1OrJ0j7o2k5OMjkL4m0j7O5M4K1Ll8k0k3KL5J0nM2L8o2n1L7Kl2m3l5Q
-18623A765Q8R2Nk5n5l6m6J7P2k7l9nl9k5L2M2K3K9L4l4k9J4Q6L8l1j21o1N7L5k3j1J7L7J2
-18589A888j1O4K2m3o6l7k9k8MO2M2K1n0J0L6Lj5Pj3J8rj0j5k8kl2%M1J6j3oj2mp1l8O0J5
$$ plain form
-18844 1976 2007 2023 2042 2039 1993 1983 2015 2037 1992 1921 1860 1878 1879 1873 1887 1913 1918 1891 1877 1870 1885 1862 1850 1864 1888 1913 1939 1965 2007 2004 1974 1996 2010 1987 1932 1943
-18808 1943 1975 1942 1903 1881 1884 1920 1934 1935 1930 1889 1852 1830 1865 1913 1893 1878 1915 1950 1979 1975 2009 2030 1986 1947 1919 1877 1856 1871 1894 1868 1818 1801 1844 1852 1865 1894
-18772 1894 1906 1883 1868 1864 1854 1872 1891 1847 1798 1805 1798 1770 1810 1861 1937 1976 1930 1863 1864 1940 1989 2003 1978 1966 1961 1968 1986 1974 1983 2008 1980 1943 1897 1833 1852 1866 1807
-18735 1807 1831 1876 1898 1919 1960 1988 1918 1868 1905 1916 1916 1897 1896 1949 2013 2012 1977 1942 1928 1942 1978 1975 1961 1935 1901 1905 1938 1951 1937 1868 1905 1949 1964 2005 2032 2069
-18699 2069 2100 2035 1909 1881 1903 1911 1936 1940 1983 1972 1887 1882 1906 1880 1865 1871 1874 1910 1940 1908 1870 1859 1897 1925 1901 1865 1841 1869 1913 1986 2008 1963 1959 1952 1948 1900 1821
-18662 1821 1815 1862 1851 1839 1880 1886 1877 1887 1870 1808 1783 1789 1793 1792 1790 1824 1784 1767 1832 1876 1897 1900 1862 1842 1819 1821 1856 1866 1861 1903 1941 1879 1828 1865 1867 1835 1792 1757 1765
-18623 1765 1853 1945 1950 1925 1870 1834 1788 1805 1877 1850 1811 1806 1767 1742 1774 1816 1839 1868 1902 1868 1839 1853 1939 1977 1946 1825 1764 1821 1856 1833 1822 1839 1876 1888
-18589 1888 1877 1941 1963 1920 1854 1817 1788 1760 1764 1826 1868 1889 1839 1849 1885 1888 1873 1880 1867 1885 1876 1866 1851 1823 1821 1789 1789 1830 1846 1833 1827 1815 1811 1740 1702 1762 1777
-18552A777o9p2L3M6J1M4J1k8%J3lk7k8O9L6k6RM3RK9M4m7o9j3oJ5O5N9N7j4l2l5j4ol4K3
-18516A870N7K4L7j0m8n4l2n4m3L0O5M6N7J9n1J8L7pn6p7n4l4JQ4N1QMm4l5oJ9KnJ0L7K0K0
-18479A906J3J1k1o4k2J7J6L4K2j3m2o5NL2K3J9k3k7J1jm5k4J2NK1L1o0p1P4M8PjL9J1j7m4
-18443A817J1k2rPJ3J1m8j3M1M9J9j9p0k6j5J3M0k2r5k5J9K6k8j4J4J1J3N2L6N3L9k3k6%L1
-18408A860kK3L2J9J4L5Rp1k9J9nn9n6j5P1O8Lo2n8m1NO4L9J1j9J0LL1O0k8l9k0lJ9j9j7q
-18371A844J3L8L7l0j2J5J1nJ6L9%m2n4o6j6lqM1L9k0pM7M3qnK8Qk1n2r4o6j5O4L4J4L2K7
-18334A866m2l2QN3Mql1l8M4M7kJ7Pl6n8n0j4j8K9O9M3oJ8L0Km2OM2k9o7n1l9k1j6M8qLK9
-18296A757l8oJ3j4oM0M4l5k8K3Kl1k2NOL4N6L7Jn8q1J1Mk7L6J6kJ6k2m8nRJ9J7M4L9J2K7
$$ plain form
-18552 1777 1708 1636 1669 1715 1726 1770 1781 1753 1753 1766 1763 1736 1708 1777 1813 1787 1796 1839 1848 1877 1921 1874 1805 1792 1786 1801 1866 1925 1982 1968 1936 1901 1887 1881 1847 1870
-18516 1870 1927 1951 1988 1978 1930 1876 1844 1790 1747 1777 1842 1888 1945 1964 1913 1931 1968 1961 1905 1828 1774 1740 1741 1825 1876 1884 1888 1844 1809 1803 1822 1824 1819 1829 1866 1886 1906
-18479 1906 1919 1930 1909 1845 1823 1840 1856 1890 1912 1899 1857 1792 1797 1829 1852 1871 1848 1821 1832 1831 1786 1762 1774 1779 1800 1831 1771 1700 1774 1822 1829 1828 1867 1878 1861 1817
-18443 1817 1828 1806 1797 1804 1817 1828 1780 1767 1808 1857 1876 1857 1787 1761 1746 1759 1799 1777 1682 1657 1676 1702 1674 1660 1674 1685 1698 1750 1786 1839 1878 1855 1829 1829 1860
-18408 1860 1858 1881 1913 1932 1946 1981 1990 1919 1890 1909 1904 1845 1789 1774 1845 1913 1916 1854 1796 1755 1760 1824 1863 1874 1855 1865 1868 1899 1959 1931 1892 1872 1869 1888 1869 1852 1844
-18371 1844 1857 1895 1932 1902 1890 1905 1916 1911 1927 1966 1966 1924 1870 1804 1788 1785 1777 1818 1857 1837 1830 1877 1920 1912 1907 1935 1943 1922 1870 1776 1710 1695 1759 1793 1807 1839 1866
-18334 1866 1824 1792 1800 1853 1857 1849 1818 1780 1824 1871 1869 1886 1893 1857 1799 1749 1735 1717 1746 1815 1858 1852 1870 1900 1902 1860 1866 1908 1879 1812 1761 1722 1701 1685 1733 1725 1728 1757
-18296 1757 1719 1713 1726 1712 1706 1746 1790 1755 1727 1750 1752 1721 1699 1704 1710 1744 1800 1837 1838 1780 1699 1710 1714 1687 1723 1739 1737 1753 1731 1683 1678 1687 1706 1723 1767 1806 1818 1845
-18258A845J8l0n8j4k0j5K0pL9Q8J0n3m7p8J4M1k6o3J9N0l5l3j2L9O3k3l5oJ2RK3N4M1kl9
-18223A789J2M0kLNj0j5Kk4l2n4PL4j0o7%O2n0k6M1L3nj7l2mJnl0k7O0J7k0J9K4P4N9j3k8
-18185A811J1jm3n5k8L2K8M5Mql1k0O7Nm1LJ6mK7k5p9n8M5L9Jj1pnj6m1k9L7j0%K3J5N9K3
-18147A779j5k5j5jJ5J0j9M8j6o0m6j4l2K1K5rK7L1%l1j9M1L8ol6mMpl4m5PM6M6M1Mm6j5N
-18109A693m4k2K6J4j6nL1l7PR5pl8k5J6j1J9J6kl1rJ3%M5J13P4l8m5j7j0j2Kk3j2j5p0n2
-18073A623j4J4M2J2k8j3J2NRJ7L2j2K0O8M7j5m5o0j7M1K9K1J8rk9l5l8j3l9j8Oj5J6K2OL8
-18037A698J0j8J4k5m2L2N9J6J0m8o5m7jN3L4K8M2K7Qm0n1m2JK7j4L9O3J1j7J4j5k0J9o4j06
-18002A590qL0L5L1l5orM3M4M3L5qJ7N7Rn7m6o8M6N7Mm2k5j8K3K2m4j8L6J8K5K0l7o6K5On9
$$ plain form
-18258 1845 1863 1833 1775 1761 1741 1726 1746 1739 1778 1866 1876 1823 1776 1698 1712 1753 1727 1664 1683 1733 1698 1665 1653 1692 1755 1732 1697 1691 1703 1712 1735 1789 1830 1828 1789
-18223 1789 1801 1841 1839 1842 1847 1837 1822 1824 1800 1768 1714 1721 1755 1745 1678 1678 1740 1690 1664 1705 1738 1733 1716 1684 1680 1681 1676 1646 1619 1679 1696 1676 1695 1719 1793 1852 1839 1811
-18185 1811 1822 1821 1778 1723 1695 1727 1755 1800 1804 1796 1765 1745 1812 1817 1776 1779 1795 1791 1818 1793 1714 1656 1701 1740 1741 1730 1723 1718 1702 1661 1632 1669 1659 1659 1682 1697 1756 1779
-18147 1779 1764 1739 1724 1723 1738 1748 1729 1777 1761 1701 1655 1641 1609 1630 1655 1646 1673 1704 1704 1673 1654 1695 1733 1727 1691 1687 1691 1684 1650 1605 1612 1658 1704 1745 1749 1703 1688 1693
-18109 1693 1649 1627 1653 1667 1651 1646 1677 1640 1647 1742 1735 1697 1672 1688 1677 1696 1712 1710 1679 1670 1683 1683 1728 1841 1915 1877 1832 1815 1805 1793 1795 1772 1760 1745 1675 1623
-18073 1623 1609 1623 1665 1677 1649 1636 1648 1653 1662 1679 1711 1699 1719 1787 1834 1819 1774 1714 1697 1738 1767 1788 1806 1797 1768 1733 1695 1682 1643 1625 1631 1616 1632 1654 1660 1698
-18037 1698 1708 1690 1704 1679 1637 1669 1728 1744 1754 1706 1641 1594 1593 1646 1680 1708 1750 1777 1785 1745 1694 1652 1653 1680 1666 1705 1768 1779 1762 1776 1761 1741 1760 1696 1590
-18002 1590 1582 1612 1647 1678 1643 1637 1628 1671 1715 1758 1793 1785 1802 1859 1868 1811 1765 1697 1743 1800 1804 1762 1737 1719 1742 1764 1720 1702 1738 1756 1781 1801 1764 1698 1723 1729 1670
-17965A670K4K9kk2l0n0l2j5K9R9N4n6o2n0j8qj3Qk1K9M1pj2J4P4M8qjj4M5O2J3o4j21p4l7
-17929A522j2mK1M4L6Mj0n9n6QO9L8J2K0N4k5q2l8JO4J4l4l1%nJ0N7k1J4N5N0n0l6K5O5N1
-17893A771m0l8l7l5j1k9j9L9L6m5oK8k4k8j8J8J6NJ4R0P6j2%M5L3m8n5m7l9LRPjJ5Kj3m5
-17856A617J3L6M0qk1J9l3n5j5M0k6r0J9pm1K0Rm6j5K2M1L7L7K3K8L4k1lj3l9k4K4L2K8M0
-17821A702jo%k1n3l8NM1O2K4j9j5nMk0k2l6l0L4M0p0j2K8n1o4NL2k6qK2L0N8K9k8nP%pJ8
-17782A604J0M1N2kMj5lj4m6L9O4qj7K1J5n4p2m2j7M3j6JN3J7k6Rk0n8n1k1K0PJ6m9l2J0k0
-17745A443LN8Q1L6l3l2LQO9P5j8n4Pmk3l7l5L4K7j2j8L7N0n7r0m3J9M3O0l%J0n3l5N8N6j6
-17708A614p2QL1NL0M0pj9n1l7k7K3rj0L2K7nl2J5L7K3J0o5r7oJ05R0R5L6o7pJ1k2k4k0Pj0
$$ plain form
-17965 1670 1694 1723 1721 1699 1669 1619 1587 1572 1601 1700 1754 1698 1636 1586 1568 1560 1547 1555 1534 1563 1604 1597 1585 1599 1673 1721 1713 1712 1698 1743 1805 1818 1754 1633 1559 1522
-17929 1522 1510 1506 1527 1571 1607 1611 1601 1542 1486 1494 1563 1601 1613 1633 1687 1662 1580 1542 1543 1607 1621 1587 1556 1556 1551 1561 1618 1597 1611 1666 1716 1666 1630 1655 1720 1771
-17893 1771 1731 1693 1656 1621 1610 1581 1562 1601 1637 1592 1586 1614 1590 1562 1544 1562 1578 1583 1597 1687 1763 1751 1751 1796 1829 1781 1726 1679 1640 1643 1652 1659 1658 1673 1675 1662 1617
-17856 1617 1630 1666 1706 1698 1677 1696 1663 1608 1593 1633 1607 1517 1536 1529 1488 1508 1517 1471 1456 1478 1519 1556 1593 1616 1644 1678 1657 1654 1641 1602 1578 1602 1634 1662 1702
-17821 1702 1701 1695 1695 1674 1621 1583 1588 1629 1691 1715 1696 1681 1676 1680 1660 1638 1602 1572 1606 1646 1576 1564 1592 1541 1477 1482 1514 1488 1480 1502 1532 1590 1619 1591 1586 1593 1593 1586 1604
-17782 1604 1614 1655 1707 1705 1709 1694 1691 1677 1631 1670 1734 1726 1709 1730 1745 1691 1619 1577 1560 1603 1587 1588 1641 1658 1632 1641 1621 1563 1512 1491 1511 1518 1534 1485 1453 1463 1443
-17745 1443 1446 1504 1585 1621 1588 1556 1559 1567 1636 1711 1693 1639 1646 1642 1619 1582 1547 1581 1608 1596 1578 1615 1665 1608 1518 1475 1494 1537 1597 1594 1594 1604 1551 1516 1574 1630 1614
-17708 1614 1542 1550 1581 1586 1616 1656 1649 1630 1579 1542 1515 1538 1529 1519 1551 1578 1573 1541 1556 1593 1616 1626 1561 1464 1458 1563 1653 1748 1784 1717 1710 1721 1699 1675 1655 1662 1652
-17671A652rkK8kl6l9l9J9K6j5l1j3k6k6L4k5mL7J1OK6kkoj7Lk8k8J3Jo7k6J2J9N4j9k5L6
-17633A490j3QM2j8RK0l2k7K2L2MK4R0lq6k3N3J4j8j5nok0lnj3J8M9j3j2l9l6ON9M1j2p6l2
-17595A474j2j6K0K9mK5O9O8M8k5j7K0j7m8K7M5k4o3j3mlL7l1n0O1O7Lk2l7m5j4Jj6l4NM2
-17559A546j0m3j0J9QL3N5ol1k7k9k6OQq0jP3L8K0P5k5q8k0kl9l7j3N8K1KN3L3nK2M3j8l2
-17522A571m0J9K9j4J5L7J7J2j6l2nJ2l0K1on1l0k5m5K2P7Ql4k9o7m5K7K5pqJ8K6M6K9jqJ9
-17485A537P9J5p4n0LKm3K6J2J4L1Nl6j3Q3M5l5l7j5n5m3j1L7J06J1l8l8jM6pn6k8j7k0PO5
-17449A507L4j9m6k8NL7k6j3Pj0o6QN3M6J1PK0J8Ml1LN4l7n2l6k5J1K1R%PL0k8j1K1J1P0K3
-17411A589p4m8JJ7lJ4M8l5LJ5N6Q9k4n8J2j3l9j6JJ9j1q5k7J1l3l8M0R3J17M9ok6k0m5n3
$$ plain form
-17671 1652 1643 1641 1669 1667 1631 1592 1553 1572 1598 1583 1552 1539 1513 1487 1521 1496 1492 1529 1540 1546 1572 1570 1568 1562 1545 1548 1520 1492 1505 1506 1439 1413 1425 1444 1498 1479 1454 1490
-17633 1490 1477 1485 1527 1509 1518 1538 1506 1479 1501 1533 1537 1561 1651 1648 1562 1539 1592 1606 1588 1573 1568 1562 1542 1539 1534 1521 1539 1588 1575 1563 1524 1488 1494 1553 1594 1582 1506 1474
-17595 1474 1462 1446 1466 1495 1491 1516 1585 1653 1701 1676 1659 1679 1662 1614 1641 1686 1662 1599 1586 1582 1579 1616 1585 1535 1596 1663 1666 1644 1607 1562 1548 1549 1533 1499 1504 1546
-17559 1546 1536 1493 1483 1502 1510 1543 1598 1592 1561 1534 1505 1479 1485 1493 1413 1412 1485 1523 1543 1618 1593 1505 1485 1483 1444 1407 1394 1452 1473 1475 1528 1561 1556 1578 1621 1603 1571
-17522 1571 1531 1550 1579 1565 1580 1617 1634 1646 1630 1598 1593 1605 1575 1596 1590 1539 1509 1484 1439 1461 1538 1546 1512 1483 1416 1371 1398 1423 1416 1408 1426 1452 1498 1527 1526 1518 1537
-17485 1537 1616 1631 1557 1507 1510 1512 1469 1495 1507 1521 1552 1557 1521 1508 1591 1636 1601 1564 1549 1494 1451 1440 1477 1583 1594 1556 1518 1517 1563 1556 1500 1472 1455 1435 1442 1507
-17449 1507 1541 1522 1476 1448 1453 1490 1464 1451 1458 1448 1382 1390 1443 1489 1500 1507 1527 1545 1549 1518 1521 1575 1538 1486 1450 1425 1436 1457 1466 1466 1473 1503 1475 1464 1485 1496 1566 1589
-17411 1589 1515 1467 1468 1485 1482 1496 1544 1509 1512 1527 1583 1672 1648 1590 1602 1589 1550 1534 1535 1554 1543 1458 1431 1442 1409 1371 1411 1504 1621 1670 1664 1638 1618 1573 1520
-17376A520k7k4k1k1K0M5Kok6k7j9J3K3K0pPk0j9K9l0%M7L6pn9j0j4O8O6l0J7j6p8n6l3J9
-17340A382M6L3L5J0L2J0%Nrk4qm3p1k2L0J8Mj4J6L2Mm9l0m0oQ1K8j6M4N0k4n6k6k1j3l8m3
-17303A307j5M4Q4J5o6k2k9j5QJ4L3N3Q0k5n8m3MJ7k8oL1K1j4%J6J2Nk6J0M1Ml4k7j3j3mK1
-17266A382M8lm2j0j0moK8J03P1l0r7m0oJ4J9qk3N9N1l1q5m7JJ6k7l4K3N0O0O6J7j6k6JKk2
-17229A444L9jj5K4K3Ql8k8j1N0M6L2Ql4m1m9j8QK3K0M1Nk5LJ1lnL5K0l2J4Pl5m8k2L7M9N2
-17191A594L1%j6p1p7M6j0k1j2k2m1k1M7L3qk2m0K7K2j5O%lnK6mk1p1o2m8J1P0L8J3J2kRK6
-17153A419n0j2M2J7L9Lk3PJ3mOM5N1L5qk6j9j2NJ1J0N6N4k5k0k2o4NM0K6Nn1lk5nmk2No8
-17114A431l7P7Q3K5p9m4j2QP0j6n0J6K6l3j1JL5O4j3l6J7l2k3Pk6n1L9M3j5LQ0L7o5n0OK2
$$ plain form
-17376 1520 1493 1469 1448 1427 1447 1492 1494 1488 1462 1435 1416 1429 1452 1472 1465 1472 1452 1433 1462 1432 1432 1479 1515 1508 1449 1439 1425 1493 1559 1529 1546 1530 1452 1396 1363 1382
-17340 1382 1428 1461 1496 1506 1538 1548 1548 1553 1544 1520 1512 1469 1398 1376 1406 1424 1428 1414 1430 1462 1466 1417 1387 1347 1341 1422 1450 1434 1478 1528 1504 1448 1422 1401 1388 1350 1307
-17303 1307 1292 1336 1420 1435 1369 1347 1318 1303 1311 1325 1358 1411 1491 1466 1408 1365 1369 1386 1358 1352 1383 1404 1390 1390 1406 1418 1423 1397 1407 1448 1452 1418 1391 1378 1365 1361 1382
-17266 1382 1430 1427 1385 1375 1365 1361 1355 1383 1486 1557 1527 1430 1390 1384 1398 1417 1409 1386 1445 1496 1465 1380 1333 1334 1350 1323 1289 1312 1362 1422 1488 1505 1489 1463 1464 1466 1444
-17229 1444 1483 1482 1467 1491 1514 1522 1484 1456 1445 1495 1541 1573 1581 1547 1506 1457 1439 1447 1470 1490 1531 1536 1511 1514 1525 1522 1517 1552 1572 1540 1554 1561 1526 1478 1456 1493 1542 1594
-17191 1594 1625 1625 1609 1538 1461 1507 1497 1476 1464 1442 1401 1380 1427 1460 1452 1430 1390 1417 1439 1424 1430 1430 1427 1422 1448 1444 1423 1352 1290 1242 1253 1323 1361 1374 1386 1384 1393 1419
-17153 1419 1369 1357 1399 1416 1455 1458 1435 1442 1455 1451 1457 1502 1553 1588 1580 1554 1535 1523 1528 1539 1549 1605 1659 1634 1614 1592 1528 1533 1573 1599 1604 1553 1550 1525 1520 1516 1494 1499 1431
-17114 1431 1394 1471 1554 1579 1500 1456 1444 1452 1522 1506 1456 1472 1498 1465 1454 1455 1490 1554 1541 1505 1522 1490 1467 1474 1448 1397 1436 1479 1464 1467 1547 1584 1519 1469 1475 1497
-17078A497QL8j1J0J3mn2m7J2J1oJ4L8jo4n3J0J9M0N3k1l7l8k6N6j1o4m1n4L5M3J5K2K0K3
-17043A447lM4Pok8J2K4K3K9l6k6m5j8n8k7PN5K4pOK5lpM7K3j6l8k2J3M1mo7n4k0JM6J6k4
-17005A381pl2k8NN5Q5pr9j8R8Q8K9J6j4p1n8mj7m0N9O4qn4l6k5kj0k1J9O4N5ok2n3NR3K6
-16968A510m0j00l0Q9K6Qk6j5k4k1j5K1Mj6jlmk8j6M0ml0k5K9j4k8M1Q5O0j5ml8nN5Qjj7j
-16930A455LK0kj1Qmk8rKk5L0J0mmJ3M9L7JorJ6M7j5p0l7Km8k4K0J7Nl8o8J0Kk4K9Q6N5kJ2
-16889A501K4l8l5nLk3k0L8M0k9m6K4K8k1lK2J3o5n1K1Q1M3Kl3p3p3k7k6O5N3k6O6M5o1m1
-16854A373rJ3K5K5J7k3J4L7m9q4PK3K0L6oJ6l3J9M8j0kL6J6J8M2j4l1l5p2lk1k3N5N3jL6
-16818A513N1l1q9j5M1J8l4l8K5L6j5n7Ojm1j8j3%M2kk1m7n6K8P9N0J5K1K1n7o5o2J3L3K2
$$ plain form
-17078 1497 1505 1543 1532 1542 1555 1551 1499 1452 1464 1475 1469 1483 1521 1520 1456 1403 1413 1432 1472 1525 1504 1467 1429 1403 1459 1448 1384 1343 1289 1324 1367 1382 1404 1424 1447
-17043 1447 1444 1488 1495 1489 1461 1473 1497 1520 1549 1513 1487 1442 1424 1366 1339 1346 1401 1425 1418 1424 1449 1446 1439 1486 1509 1493 1455 1433 1446 1487 1483 1416 1362 1342 1343 1389 1405 1381
-17005 1381 1374 1342 1314 1319 1374 1459 1452 1353 1335 1433 1521 1550 1566 1552 1481 1423 1419 1402 1362 1421 1485 1477 1423 1387 1362 1360 1350 1329 1348 1412 1467 1461 1439 1386 1391 1484 1510
-16968 1510 1470 1370 1340 1429 1455 1463 1437 1422 1398 1377 1362 1383 1387 1371 1370 1367 1363 1335 1319 1359 1355 1325 1300 1329 1315 1287 1328 1413 1473 1458 1454 1416 1411 1466 1474 1473 1456 1455
-16930 1455 1458 1478 1476 1465 1473 1469 1441 1432 1434 1409 1439 1449 1445 1441 1454 1503 1540 1541 1535 1526 1542 1589 1574 1504 1467 1469 1421 1397 1417 1434 1439 1401 1333 1343 1345 1321 1350 1436 1491 1489 1501
-16889 1501 1525 1487 1452 1447 1450 1427 1407 1445 1485 1456 1410 1434 1462 1441 1438 1460 1473 1408 1357 1378 1459 1502 1504 1471 1398 1325 1298 1272 1337 1390 1364 1430 1475 1414 1373
-16854 1373 1364 1377 1402 1427 1444 1421 1435 1472 1423 1339 1346 1369 1389 1425 1419 1435 1402 1421 1469 1459 1457 1493 1509 1527 1569 1555 1524 1489 1417 1414 1393 1370 1425 1478 1477 1513
-16818 1513 1564 1533 1444 1429 1470 1488 1454 1416 1441 1477 1462 1405 1411 1410 1369 1351 1338 1338 1380 1378 1357 1310 1254 1282 1361 1411 1426 1447 1468 1411 1346 1284 1297 1330 1352
-16783A352O6M7k2o0j1N9J5L4Qjm8m9l4l4K7J5l5m7K7N1L2N9N2nm8k7QoQJj3j3n0qM6J1lJ1
-16745A415rm7J1M6M9J2o1m3k7J1L9k5n7RK6oJ5L5j1p6l7M0M7L1j7q2m3K7J3%K3rLRJ6J0L8
-16708A375RJ9K9j2m2l6j1j0K6K1j7l1J9j3pM1j9J9J3mM4j5m7j3L8J4l0J3J5L8L9K5Rl3r1
-16673A375j03m1j8K1L9O7J8J7K2J9K5KKKQl8OK1r9r1n1kJ6L7N1K4K7L1pn3J9O4l1J6J6l1
-16637A380j3l1p6l9jk6J1N5P7O7K9jm0n4MjJ2%j2K6OQJ2Jm6l8n6J5J9LJ8J3K2M8J4j1k0j2
-16599A363j5qj9J2N6O7k5o9r2k9Q0O1J5j5m1jj1PL1ok1K6qm5J1K8l1J8O8K1q%k9k5K0Mk5
-16562A365k0l1K4J7m8j0K2mK8N9Mm1Orm9J0M5Lj6M3l5r7l1J8Rr2k3Q9J14L5l1J7j1m6j8k7
-16526A269l6K7L4K5L2J6p2k9%K3J7j2ML7L3l5J0o0o5PN9M0j9lJ0l2L2O0L9L3j4k2m1k5nK8
$$ plain form
-16783 1352 1418 1465 1443 1383 1372 1431 1446 1480 1488 1487 1439 1390 1356 1322 1349 1364 1329 1282 1309 1360 1392 1451 1503 1498 1450 1423 1431 1425 1433 1434 1421 1408 1358 1350 1396 1407 1404 1415
-16745 1415 1406 1359 1370 1416 1465 1477 1416 1373 1346 1357 1396 1371 1314 1323 1349 1343 1358 1393 1382 1306 1269 1309 1356 1387 1370 1288 1245 1272 1285 1285 1308 1299 1302 1311 1327 1337 1375
-16708 1375 1384 1403 1432 1420 1378 1342 1331 1321 1347 1368 1351 1320 1339 1326 1319 1360 1341 1360 1373 1369 1413 1398 1351 1338 1376 1390 1360 1373 1388 1426 1465 1490 1499 1466 1375
-16673 1375 1272 1231 1213 1234 1273 1340 1358 1375 1397 1416 1441 1443 1445 1447 1455 1417 1423 1444 1345 1254 1203 1201 1217 1254 1305 1329 1356 1387 1380 1327 1346 1410 1379 1395 1411 1380
-16637 1380 1367 1336 1260 1221 1220 1194 1205 1260 1337 1404 1433 1432 1392 1338 1342 1341 1353 1353 1341 1367 1373 1381 1393 1394 1348 1310 1254 1269 1288 1291 1309 1322 1344 1392 1406 1395 1375 1363
-16599 1363 1348 1340 1321 1333 1389 1456 1431 1362 1270 1241 1321 1382 1397 1382 1341 1340 1329 1336 1367 1361 1340 1366 1358 1313 1324 1352 1321 1339 1407 1428 1420 1420 1391 1366 1386 1390 1365
-16562 1365 1345 1314 1338 1355 1307 1297 1319 1315 1343 1402 1406 1365 1371 1362 1313 1323 1368 1371 1355 1398 1363 1266 1235 1253 1262 1170 1147 1236 1350 1385 1354 1371 1360 1314 1296 1269
-16526 1269 1233 1260 1294 1319 1351 1367 1295 1266 1266 1289 1306 1294 1298 1335 1368 1333 1343 1283 1218 1225 1284 1324 1305 1302 1312 1280 1312 1372 1411 1444 1430 1408 1367 1342 1337 1365
-16490A365M0mk7k0o2k9L0M5K2J3j9rnl6J1J5j1K6K9j7j0J0Kk5J5%l2mL3k3j6k4rK8j5k1K8
-16453A294jj8jL8Lj1j6oOOj3pL1l7n8j7l6J4P5L6LL7J2j3K2k5%mJ2Nk3qJ6pj0rnK8j5k3j2
-16412A263n9m8J4N7K7O2J8j9L4O%Qj2J5M4Jlorp9o3mKk8Knk7M3N9k5j7K6M7K5k8J9J1k7m5
-16373A279J1N3L9K2j6n5KL1J3K6n5m2l0m5K6pl2RN6M9N6nn9j7K3o6kpjj3J2M6ql2j1l4k0
-16336A196l2N6N8P9M6m9j5K4J7J7%nM4k3j7rRQm4l5m6p5k5Q1P0J7L0j4l6JL4Ko8q1l5J7j
-16299A196PK7N0N5K7n6PP2M7p3j10k0L7L0j0oj4n3K5lQN4l3oPL9n0j8K5J7K4J5qrO2k5p2
-16262A265RJ1rO9O4m4j0M0j2p4o5k9J8%L8K3j8PJ5j3L1N3pPOJ3jk2l1n4l4J0K1J4m9p3o5
-16225A104j2J7M3K8J7k6pL4L2O2P7J6k2m2l7j2L4m8p5p5j0Q2L9L5Rk4k2M9N0j5n4n3%j8J3
$$ plain form
-16490 1365 1405 1401 1374 1354 1292 1263 1293 1338 1360 1373 1354 1345 1340 1304 1315 1330 1319 1345 1374 1357 1347 1357 1359 1334 1349 1349 1317 1313 1346 1323 1307 1283 1274 1302 1287 1266 1294
-16453 1294 1293 1275 1274 1312 1315 1304 1288 1282 1288 1294 1281 1274 1305 1268 1210 1193 1157 1171 1246 1282 1285 1322 1334 1321 1343 1318 1318 1314 1326 1331 1308 1300 1316 1309 1299 1290 1285 1313 1298 1275 1263
-16412 1263 1204 1156 1170 1227 1254 1316 1334 1315 1349 1355 1355 1363 1351 1366 1410 1411 1408 1402 1393 1314 1251 1247 1249 1221 1223 1218 1191 1234 1293 1268 1251 1277 1324 1349 1321 1340 1351 1324 1279
-16373 1279 1290 1343 1382 1404 1388 1333 1335 1366 1379 1405 1350 1308 1278 1233 1259 1252 1220 1229 1285 1334 1390 1385 1326 1309 1332 1266 1264 1257 1256 1243 1255 1301 1293 1261 1250 1216 1196
-16336 1196 1164 1220 1278 1357 1403 1354 1339 1363 1380 1397 1397 1392 1436 1413 1396 1387 1396 1404 1360 1325 1279 1204 1179 1260 1330 1347 1377 1363 1327 1328 1362 1364 1296 1215 1180 1197 1196
-16299 1196 1203 1230 1280 1335 1362 1306 1313 1385 1432 1359 1249 1229 1266 1296 1286 1280 1266 1213 1238 1235 1243 1297 1264 1258 1265 1304 1254 1236 1261 1278 1302 1317 1309 1300 1362 1337 1265
-16262 1265 1274 1285 1276 1345 1409 1365 1355 1395 1383 1309 1244 1215 1233 1233 1271 1294 1276 1283 1298 1285 1316 1369 1362 1369 1375 1388 1387 1365 1334 1280 1246 1256 1277 1291 1242 1169 1104
-16225 1104 1092 1109 1152 1180 1197 1171 1164 1198 1230 1292 1369 1385 1363 1321 1284 1272 1306 1258 1183 1108 1098 1180 1219 1254 1263 1239 1217 1266 1316 1301 1247 1194 1194 1176 1189
-16190A189M7L7L3K3K5m3p8o2m3QK1l1%M9K4RK5K1J8kj1N5K8m1p5l2L0Ql1PJ2L5K3n1q1MO6
-16153A216K2MJ4L8M7j6l8l2mJ1jm7m1j5L1K5l2QK0K2Kj3J6J6J0J5j2J1J2J4oj7k1o1pkj0
-16116A179J5Ll7L8O5j%l5k1O0P7Ml0K7j4K3K0m6l2J4L4j7j1o1k8l6mK2L0J0l9k3k6K9%M2
-16080A231K4M1O6n6m7j0NN8Nn9k0n5k7%KM3Q6L2MolJpk3K8l1o8oqL2P6j3k8K8nm2l4L1%J2
-16040A257l1l4J9K9Q8J7q1q6OOK8O5jl8n7K2M7Km4l5L9L6k8l2K0MOM0Ll7k0l3L3J7J8L3K0
-16003A298k7M5K3m8m4n8q4kP8O9J5JMl3l1J1J5K5K7J8L1K6m9l0J4n4NN7M0K0Nm7o8o9m6O6
-15967A203K6nlJ1Qmk6mM1L7ql8r2o3O2N2J1n2j6l4o9k2L5O9O8L2L1J5pl2rj7J9K3jK1Lqj8
-15928A239l2Rln1l3RK4K1ll5%N3M6kn8j9K5K0M1J0RN5Ll4n6qL5J7K2o6j16j4M3N1P6N4o1
$$ plain form
-16190 1189 1236 1273 1306 1329 1354 1311 1233 1171 1128 1136 1157 1126 1126 1175 1199 1208 1233 1254 1272 1270 1259 1314 1342 1301 1226 1194 1224 1232 1201 1208 1220 1255 1278 1227 1146 1150 1216
-16153 1216 1238 1242 1256 1294 1341 1325 1287 1255 1251 1262 1261 1214 1173 1158 1189 1214 1182 1190 1210 1232 1234 1221 1237 1253 1263 1278 1266 1277 1289 1303 1297 1280 1259 1198 1191 1189 1179
-16116 1179 1194 1197 1160 1198 1263 1262 1262 1227 1206 1266 1343 1347 1317 1344 1330 1353 1373 1327 1295 1309 1343 1326 1315 1254 1226 1190 1186 1208 1238 1248 1209 1186 1160 1189 1189 1231
-16080 1231 1255 1296 1362 1306 1259 1249 1254 1312 1317 1258 1238 1183 1156 1156 1158 1201 1287 1319 1323 1317 1314 1315 1308 1285 1313 1282 1214 1208 1200 1232 1308 1295 1267 1295 1290 1248 1214 1245 1245 1257
-16040 1257 1226 1192 1211 1240 1328 1345 1264 1178 1184 1190 1218 1283 1282 1244 1187 1209 1256 1258 1214 1179 1218 1254 1226 1194 1214 1218 1224 1264 1267 1230 1210 1177 1210 1227 1245 1278 1298
-16003 1298 1271 1316 1339 1291 1247 1189 1105 1103 1181 1250 1265 1266 1270 1237 1206 1217 1232 1257 1284 1302 1333 1359 1310 1280 1294 1240 1245 1302 1342 1362 1367 1320 1252 1183 1137 1203
-15967 1203 1229 1224 1221 1232 1240 1236 1210 1206 1247 1284 1276 1238 1146 1083 1145 1197 1208 1156 1140 1106 1037 1015 1050 1119 1187 1219 1250 1265 1258 1226 1217 1200 1219 1242 1241 1262 1265 1257 1239
-15928 1239 1207 1216 1213 1162 1129 1138 1162 1183 1180 1145 1145 1198 1244 1242 1184 1165 1190 1210 1251 1261 1270 1325 1328 1294 1238 1230 1265 1282 1304 1238 1122 1108 1151 1202 1278 1332 1271
-15891A271q8l5l0kL7j5nL1K4L1LL3Pm7o5k1L7%k7j6l8k3MJJ1M9J9j2J0L5J0p4p4j5K8N5L6
-15854A145K6NJ0Kk5k1L3M9j9l6m4k1K2M8J5K4K5k4j4K2nm3pK8K6l8k6%Jj0n2m7n3l5K7N4
-15818A042J15M7k3j4qoK6rQj4J1Nrl0qJ6J7J0qk0j0J5M3N5j7o7j1J2PL4j3q2L4M7J0j3o9
-15781A123j5L8J6k1j9KqK5Mm0m5OM0L2j1m7J6P5L8k2j1L0j9n5l7oRM1J1lM8M2J5j6j10o1
-15745A065P8or6l6J4K4N1j5k6p0K4R4Q8L8k8KPKqj3l2n4MJ2o1o1K2M6L2k0L2JJ3P0K8J0J0
-15708A241L3m9n8L8M7k7l3j8m0N4NJ6K4j7JNk3l7l8%K8N4K4k7j3m2o2rP0K7rMn4q3j4J4K7
-15671A059RPJ7K0K6K4K0J7J9j4n0k0Mjl3j1j4Omk4J8O5Ol3J2N5N2k1m4k5k2n6l7m4J7M2L9
-15634A081l0l3K7L0M5Q0K7j8m8o2n5rK4rJ4J1NL6J1k3j4j4k6OQk0J1N2J6J9J0k8l7j3k2J7
$$ plain form
-15891 1271 1183 1148 1118 1116 1153 1138 1133 1164 1188 1219 1222 1255 1262 1215 1150 1129 1166 1166 1139 1123 1085 1062 1066 1067 1078 1127 1146 1134 1144 1179 1189 1115 1041 1026 1054 1109 1145
-15854 1145 1171 1176 1186 1188 1163 1142 1175 1224 1205 1169 1125 1104 1126 1174 1189 1213 1238 1214 1200 1222 1217 1174 1167 1195 1221 1183 1157 1157 1158 1148 1096 1049 996 961 988 1042
-15818 1042 1157 1204 1181 1167 1159 1153 1179 1170 1178 1164 1175 1180 1171 1141 1133 1149 1166 1176 1168 1148 1138 1153 1196 1251 1234 1167 1156 1168 1175 1209 1196 1114 1148 1195 1205 1192 1123
-15781 1123 1108 1146 1162 1141 1122 1124 1116 1141 1145 1105 1060 1066 1106 1138 1127 1080 1096 1171 1209 1187 1176 1206 1187 1132 1095 1089 1098 1139 1150 1147 1195 1237 1252 1236 1126 1065
-15745 1065 1143 1137 1041 1005 1019 1043 1094 1079 1053 983 1007 1101 1189 1227 1199 1201 1208 1210 1202 1189 1157 1103 1107 1119 1058 997 1019 1065 1097 1077 1109 1110 1123 1193 1221 1231 1241
-15708 1241 1274 1225 1167 1205 1252 1225 1192 1174 1134 1188 1193 1209 1233 1216 1217 1222 1199 1162 1124 1124 1152 1206 1230 1203 1190 1148 1086 1077 1147 1174 1165 1169 1115 1032 1018 1032 1059
-15671 1059 1068 1075 1092 1112 1138 1162 1182 1199 1218 1204 1154 1134 1138 1137 1104 1093 1079 1085 1081 1057 1075 1140 1146 1113 1125 1180 1232 1211 1167 1142 1120 1064 1027 983 1000 1042 1081
-15634 1081 1051 1018 1045 1075 1120 1200 1227 1209 1161 1099 1044 1035 1059 1050 1064 1075 1080 1116 1127 1104 1090 1076 1050 1056 1064 1044 1055 1107 1123 1142 1152 1124 1087 1074 1052 1069
-15598A069J8n6KRM1K0LJ6M4K6j6l7o6n3j4M0klJ7L4j2nMk2k7J0k0j2l8k6J3Q7P1Mk8m0pK4
-15560A068k9k2J4J0jk6j2J0k6mJ2L9J6Lk4n2l2mK3L7L1RQqm4k0J3qj2O1Pm4J4L8J1lJ6K6
-15522A095j7jqq7k3O6ml6M2K3K2K0ql3k2N3M6K6Lp1n3Km8p6n2RO2O0K7K0k2j1j5J9K1k3N0
-15485A056P7M1L0O0L8o3r3l1rKM1N4N0J5j1kM7j2m5NM0k5j07m1K4O7L7m5m3J0m8o5JM7oN
-15449A101k7n1K9K8M9M5kj6P6Q7J9k8L0k7n8j3l1J4J9Np5m1L4M2K1pl2k3l5j3J9N0Pj6J0
-15414A190J7Ol6m2K4OJ7O4L6pm2q9QL1ooL6K1Ljl1l1k5n0j0M3M9J3J9J8l2k9NO5N7m5m0m0
-15376A166q6QP3L8l7m7L0L6j2k4P4R6L6m2q4m3Roo6q8k9L3P9R7M3J9J9J4m3o2k6k7Opk7j0
-15340A110J3j9p2n6OL4Q9N5npj4J7%n0n4j1K1P5Q5Mm4p5p5m2O6R5J2k9QK3j4k1K9O0Pk0o
$$ plain form
-15598 1069 1087 1031 1033 1042 1083 1103 1106 1122 1166 1192 1176 1139 1073 1020 1006 1046 1044 1041 1058 1092 1080 1075 1079 1057 1030 1040 1020 1008 970 944 957 1044 1115 1119 1091 1051 1044 1068
-15560 1068 1039 1017 1031 1041 1040 1014 1002 1012 986 982 994 1033 1049 1052 1028 976 944 940 963 1000 1031 1040 1048 1040 996 976 989 981 969 1030 1037 993 1007 1045 1056 1053 1069 1095
-15522 1095 1078 1077 1069 982 959 1025 1021 985 1027 1050 1072 1092 1084 1051 1029 1082 1128 1154 1157 1086 1033 1035 987 911 859 868 930 990 1017 1037 1015 1004 989 1008 1029 1006 1056
-15485 1056 1133 1174 1204 1264 1302 1239 1146 1115 1106 1108 1149 1203 1253 1268 1257 1255 1302 1290 1245 1250 1290 1265 1158 1117 1141 1208 1245 1200 1157 1167 1119 1054 1055 1102 1096 1101
-15449 1101 1074 1023 1052 1080 1129 1174 1172 1156 1232 1319 1338 1310 1340 1313 1255 1242 1211 1225 1244 1249 1174 1133 1167 1209 1230 1223 1191 1168 1133 1120 1139 1189 1196 1180 1190
-15414 1190 1207 1213 1177 1135 1159 1165 1182 1246 1282 1275 1233 1144 1152 1183 1177 1171 1207 1228 1231 1230 1199 1168 1143 1093 1083 1126 1175 1188 1207 1225 1193 1164 1169 1234 1291 1246 1206 1166
-15376 1166 1080 1088 1161 1199 1162 1115 1145 1181 1169 1145 1219 1315 1351 1309 1225 1182 1191 1185 1119 1031 1002 1035 1114 1211 1254 1273 1292 1306 1263 1201 1175 1148 1154 1147 1120 1110
-15340 1110 1123 1104 1032 976 982 1016 1105 1160 1155 1148 1134 1151 1151 1101 1047 1036 1057 1132 1217 1221 1177 1102 1027 985 1051 1146 1158 1129 1137 1160 1146 1125 1154 1214 1221 1201 1195
-15303A195jml3L0j8o0J9N7l3k9j0J2j9J2J5J3jj7o1kN0J7j4k3J3Rk5j7oK4M7Ro9l2J1JL2
-15266A092O2P7J6n3lqm7l7j4OK5J6Ol9Rk5l6L2L0QJ1j5l9j3pK5N5nq6k2j6l9oL0N6N8L9K7
-15228A170l8k4l6n1M7K7lJ1J9J6M7L6jj5j2Nn4j7L1Ppm7oJ7j1K8%n7K0rl9JQjoL2K4k0l4
-15189A058j0K3Q7K6m0j2k2k0N0Kk1k2k8Kql7k1K6J2qK6J8J1LJ9M2j1J5j5m8OJj9j5K8RJ4
-15152A121o4l1P1M1L1M4kj4l9q5l3K5Kk1N8N6j9j3Joj9pK8L3l7p2JK3N8oo9LM2k9k7k7j7
-15115A001k4l9j3j1k3J3O6j1K7M8k5l9RO3R2RpqJ1J3Qm1m6nK3J3m8l3kK1NjkK4k3j2RL4L8
-15076A114qJ6J5m1p9k9O8N3j6NP5L6Qjj1k8n7o9q0J8Q9M6j1m9Oj3l5oK5L9o2l1LO0M1k0n6
-15039A015j1J4k1K4j4q2k0M4R9R2OMm0l3M4N3J1J4k1n1q0o7p1n3O2N1LNk4j2KJ6J2l2%L7
$$ plain form
-15303 1195 1194 1190 1157 1187 1169 1109 1128 1185 1152 1123 1113 1125 1106 1118 1133 1146 1145 1128 1067 1065 1115 1132 1118 1095 1108 1117 1092 1075 1069 1093 1140 1149 1080 1048 1059 1060 1092
-15266 1092 1154 1231 1247 1194 1191 1183 1136 1099 1085 1091 1116 1132 1138 1099 1108 1083 1047 1079 1109 1117 1128 1113 1074 1061 1054 1079 1134 1129 1043 1021 1005 966 960 990 1046 1104 1143 1170
-15228 1170 1132 1108 1072 1021 1068 1095 1092 1103 1122 1138 1185 1221 1220 1205 1193 1198 1144 1127 1158 1165 1158 1111 1105 1122 1111 1139 1139 1082 1102 1093 1054 1055 1063 1062 1056 1088 1112 1092 1058
-15189 1058 1048 1071 1158 1184 1144 1132 1110 1090 1140 1142 1121 1099 1071 1073 1065 1028 1007 1033 1045 1037 1063 1081 1092 1095 1114 1156 1145 1160 1145 1097 1103 1104 1085 1070 1098 1107 1121
-15152 1121 1057 1026 1097 1138 1169 1213 1211 1197 1158 1073 1040 1065 1067 1046 1104 1160 1141 1128 1129 1123 1104 1097 1125 1158 1121 1049 1050 1073 1131 1125 1056 1059 1101 1072 1045 1018 1001
-15115 1001 977 938 925 914 891 904 970 959 986 1034 1009 970 979 1042 1134 1143 1136 1128 1139 1152 1160 1119 1073 1068 1091 1104 1056 1023 1021 1042 1047 1046 1044 1068 1045 1033 1042 1076 1114
-15076 1114 1106 1122 1137 1096 1017 988 1056 1109 1093 1098 1173 1209 1217 1216 1205 1177 1120 1051 971 989 1078 1124 1113 1064 1070 1057 1022 1016 1041 1080 1018 987 990 1050 1091 1071 1015
-15039 1015 1004 1018 997 1021 1007 925 905 949 1048 1140 1146 1150 1110 1077 1121 1174 1185 1199 1178 1127 1047 980 909 856 918 969 972 977 953 941 943 959 971 939 939 976
-15003I76J6K5M4M1Q8j0l5n3r1n1j1L2M1O3N4kk5n7k7l1%L1Lk4k2o9JN7M4K8Nl1lPk2m1m7
-14966I04l6RO4P5K4orj1L3j6n5K9O2N7ppJ1m8p7q0o1K1O6N5l5k5N8L1k2l0l0N6K6j4K5Ln6
-14929I84l7J5j8j8N3Kk4j4k3K0N0J9J9M6J9m6l9j1k6j3j2J2L4J0K2J0J2J1l6n6l5JM7L0O
-14894A014lj5n2rN6k0m5NK1j8k9K2M3L4olj3Ml0K7Q1Nq9o9kK7J0mQ9L4o0m2JL2M2rJ9P2N6
-14855A176k3l9o6p6J6L7k4n1L9L0J8K9k5J6L2n2q7m5K5L8L5k7M3M3l8k5K6M0qn5j4L8P5J7
-14821A118o9j8Oj5k7lK5J2mm0k6N3OJ0qk4k4j3pL9P2l4m5k4PL1K0Rl5MOL9%p5k6K6K4knm
-14781I79m2J3K8M4j3l7K2Lllor9o6M7L6K1J8Nqj4jPk2K6rk6L8J4J0jmjM9K9k5n2n7l3J6J16
-14741I99O1J5l7p5k9M6L6l0Nj6mkk8l8l9j4M1M2L1L4L1J7k5l0j1JOj9K7M2L5J4J9nm6kk9
$$ plain form
-15003 976 992 1017 1061 1102 1190 1180 1145 1092 1001 950 939 971 1012 1075 1129 1127 1102 1045 1018 987 987 1018 1021 997 975 906 907 964 1008 1036 1041 1010 1007 1014 992 951 904
-14966 904 868 877 941 1016 1040 1034 1025 1014 1047 1031 976 1005 1067 1124 1117 1110 1121 1073 996 916 855 876 942 997 962 937 995 1026 1004 974 944 1000 1026 1012 1037 1040 984
-14929 984 947 962 944 926 979 981 957 943 920 940 990 1009 1028 1074 1093 1047 1008 997 971 958 946 958 992 1002 1024 1034 1046 1057 1021 965 930 931 978 1008 1014
-14894 1014 1011 996 944 935 991 971 926 931 952 934 905 927 970 1004 998 995 982 986 956 983 1064 1069 980 911 909 936 946 942 1031 1065 1005 963 964 996 1038 1029 1048 1120 1176
-14855 1176 1153 1114 1048 972 988 1025 1001 950 989 1019 1037 1066 1041 1057 1089 1037 950 905 930 968 1003 976 1019 1062 1024 999 1025 1065 1057 1002 988 1026 1101 1118
-14821 1118 1049 1031 1037 1022 995 992 1017 1029 1025 985 959 1012 1018 1028 1020 996 972 959 952 991 1063 1029 984 960 967 998 1018 1027 992 996 1002 1041 1041 966 940 966 990 988 983 979
-14781 979 937 950 978 1022 1009 972 994 997 994 991 985 886 820 867 903 924 942 947 939 925 924 931 909 935 926 900 938 952 962 961 957 956 1005 1034 1009 957 900 867 883 999
-14741 999 1060 1075 1038 963 934 980 1016 986 991 975 971 969 941 903 864 850 891 933 964 998 1029 1046 1021 991 980 981 987 968 995 1037 1072 1086 1105 1100 1054 1052 1023
-14704A023k9k5J6O1M1J8m4k1J7l6l0K1K1%oJJJ7o1j10l5k2K8K1K6K9M0Mm2k2%J6N3Kj3%k1
-14667I39k7OP3L3l2k9K4Mk4j8l0M4RlpQj4RN4L1n5q1j8%rRJ9J2o7k0M9K1pl5n7m1K4R2O2
-14628I48J4N3jl1kL0L8K2k9o1m8l6NK7J0Nn6j9P5mo3j6L8Q2K8m9o1NN6J1l6k6K2L6J0j2m7
-14591I18k0%N0N5L1j2m3k1k7m8mJ8M0%j3M5J9k5j6N3J9jJ8m8j4J3o4j3K2l9k3J6m5J6O2K8
-14555I47J6k1LK1rqm6m4k4lL7O4P9J8o7l8mK8j0m5m9K4k4M0M9Po7q1NO5O9L3L9J3MK2Ql3
-14517A018p3o2j7J2j8kJ7j3l9nk0L1M7j0J9j1n4o3J6K3j1K5MQL3L0Mk1jL3%m1k8LP0P3mn2
-14479I21k9k2pK3m3Ql6m2J6N6N1k6k2QRml3l0L7lj6O1Q9N2k3m2k2l1n9ML8O5O0K4Jj1k6l3
-14441I63l1n6m0LK3k5k6J1J2K8M1M3Kn8j0%j9Qo%NM2J9Qj3KL9k5q0K2Q5L7lm9j9m0m0j4J4
$$ plain form
-14704 1023 994 969 985 1046 1087 1105 1061 1040 1057 1021 991 1012 1033 1033 1027 1028 1029 1046 985 875 840 818 846 867 893 922 962 966 924 902 902 918 971 973 960 960 939
-14667 939 912 918 991 1024 992 963 987 991 967 949 919 963 972 969 962 970 956 965 1019 1050 995 914 896 896 887 896 915 927 860 840 889 910 903 868 811 770 794 886 948
-14628 948 962 1015 1014 983 981 1011 1049 1071 1042 981 933 897 902 929 939 944 888 869 944 940 877 861 899 981 1009 960 899 904 960 971 935 909 931 967 977 965 918
-14591 918 898 898 948 1003 1034 1022 979 958 931 883 879 897 937 937 924 969 988 963 947 1000 1019 1018 1036 988 974 987 923 910 932 893 870 886 841 857 919 947
-14555 947 963 942 945 966 957 949 903 859 835 832 869 933 1012 1030 963 925 921 949 939 894 845 869 845 885 934 941 874 793 798 863 932 965 1004 1017 1021 1043 1051 1018
-14517 1018 945 883 866 878 860 858 875 862 823 818 798 829 876 866 885 874 820 757 773 796 785 810 814 822 855 885 889 868 867 900 900 859 831 834 904 977 973 921
-14479 921 892 870 863 886 843 851 815 773 789 845 896 870 848 856 865 861 828 798 835 832 816 877 966 1018 995 953 931 900 841 845 883 948 1008 1032 1033 1022 996 963
-14441 963 932 876 836 839 862 837 811 822 834 862 903 946 948 890 880 880 861 869 863 863 868 910 929 937 924 926 965 940 860 882 967 1004 1001 952 933 893 853 839 853
-14402H53M6J8n4j0M3N4l5l3l9lL4P5J0m3j0k2l0J5lOK0nPJ9K0Ml8l8m5k6L0K2j8J8K8L6j8
-14365H88o9m2nL0J4M4O8Pj6k0m0k8K3K0PR2O4k9n4n2l3RK3J0K6J4n0l5pl1j5L4K0p6PP0J3
-14328H81M1J0K1Oj3l1j5j4Lj5n0J3lJ8J0k7j7k2j1k7k3J8P1N6L6J7n1l0Rk2m8l4mO9M3L0
-14292H95lj8j5m5m0OJ4M9M8J1J8K9k6l4l0j4k8o2j5P0N1PJ4LjK6K7J8k1k6l8o2j7K6oj2J0
-14255H09N5M5nkL4J3l6j2L1O%j2o6j9L1J8j4k5k1J7J1k3k1lK6O7J7o8o4j6M1L7Okm0K0P9
-14218I14J9L1kj6K3m0n9j7J4QPM5l8jj9j0Qn5J8J33O4rm2o3m8K0L4L9K9Ol4l9m8l4m5o6m8
-14181F79K6P0J4K6N2RJ0Jk6j5N7M0k9mPl1l9m4m9L2P2M2LJ7J5j7k0q3m8K9P9K8q5m5K0Q1
-14145H74N9l7m6PQjJ0L5J0lNL0J0l7J1K1k1lL8N1o3p5m2j6J4J8j3k7jL6J1k4K8M3k4l2J1
$$ plain form
-14402 853 899 917 863 853 896 950 915 882 843 840 874 949 959 916 906 884 854 869 866 872 892 887 894 913 933 937 899 861 816 790 820 842 824 842 870 906 888
-14365 888 819 777 772 802 816 860 928 935 919 899 859 831 854 874 881 973 1037 1008 954 902 869 878 901 911 937 951 901 866 859 828 813 847 867 791 798 868 881
-14328 881 922 932 953 959 946 915 900 886 889 874 824 837 834 852 862 835 818 796 785 758 735 753 824 880 916 933 882 852 861 839 791 757 753 822 865 895
-14292 895 892 874 859 814 774 780 794 843 891 902 920 949 923 889 859 845 817 755 740 810 861 868 882 885 884 910 937 955 934 908 870 808 791 817 811 799 809
-14255 809 864 909 904 902 936 949 913 901 932 938 938 926 860 841 872 890 876 851 830 847 858 835 814 811 837 904 921 853 789 773 814 851 857 855 815 835 914
-14218 914 933 964 962 946 969 929 870 853 867 875 882 927 889 888 869 859 867 812 830 963 1027 1018 976 913 865 885 919 958 987 993 959 920 872 838 793 727 679
-14181 679 705 775 789 815 867 876 886 887 861 846 903 943 914 910 917 886 847 803 754 786 858 900 903 920 935 918 898 815 767 796 875 903 818 773 793 874
-14145 874 933 896 850 857 865 864 874 909 919 916 921 951 961 924 935 956 935 932 970 1021 958 883 841 825 839 857 844 817 816 852 863 839 867 910 886 854 865
-14108H65k5o0j5j1m3pK0j2K5J9N1L1k2%Mk9K0Jj8K8K7QJ2K2l9m0J6M6Rk4o3m1Pk0N1N6nL4
-14070H78N8l0k7QM0O3J2l9n2l9j9n8n7k4J0N7P2J0l4nJ3j8j2k5k4j7K1jn7l1J1K2M9O3ml0
-14034G84K7M2K6k5o8qJ2j6K4K9jm7l3L0K8N5K2LK0K6k7n7m5l8OJ5rl2L2N5K0qm0j1L3K5J8
-13997H67plj7p7o2l8K1O0K1pJoJ4qj6k2k5j5L1J6N6M3L0M6no3k9k6l4k4m2J6M0Rnk7J8j4
-13959G17j0qq4n9K0L6M8N6L0nl8mJ5P3N7j5pRj6o2nN9N2M9l6m8m2n6j5mK9L6J9K9%J4MPk
-13920H43j7M1J8o0o3n6M3O3k1m4n1J0K1l0J6j8j9j0J9O2K4L1J3j4OK0PN1N6qj3l6l5L2L0
-13885I11Rln6m4J6K2K6K3J1J4K5lp5LO9kj6%K6O0k4o9m0k7K7J3K3j7RP1N6JPkj5n8k8j2j4
-13846I17ol0m9l5J9Q2R5K6j7J3j8l9nj1J0k0o2j3O2J4l8k1J7j2N3N2NJ1J5j6n3n5l6k5J5
$$ plain form
-14108 865 840 780 765 754 711 704 724 712 737 756 807 838 816 816 820 791 811 812 794 822 849 857 869 891 852 812 828 874 883 859 796 755 762 742 793 849 844 878
-14070 878 936 906 879 887 927 990 1002 963 911 872 853 795 738 714 724 781 853 863 829 824 837 819 807 782 758 741 762 761 704 673 684 706 755 818 814 784
-14034 784 811 853 879 854 786 778 790 774 798 827 826 779 746 776 804 859 881 884 904 930 903 846 801 763 769 784 775 743 775 830 850 842 802 791 824 849 867
-13997 867 860 857 840 763 701 663 684 744 765 758 759 753 767 759 743 721 696 681 712 728 784 827 857 903 898 835 806 780 746 722 680 696 736 745 740 713 731 717
-13959 717 707 699 615 556 576 612 660 716 746 741 703 699 714 787 844 829 822 831 815 753 748 807 859 908 872 824 782 726 711 707 736 772 791 820 820 834 838 845 843
-13920 843 826 867 885 825 762 706 749 812 791 747 696 706 727 697 713 695 676 666 685 747 771 802 815 801 807 827 834 885 941 933 920 884 849 881 911
-13885 911 920 917 861 817 833 855 881 904 915 929 954 951 876 879 948 946 930 930 956 1016 992 923 883 856 883 896 919 902 911 982 1038 1039 1046 1044 1029 971 943 931 917
-13846 917 911 881 832 797 816 898 993 1019 1002 1015 997 958 953 942 952 932 870 857 919 933 895 874 891 879 932 984 989 1000 1015 999 946 891 855 830 845
-13811H45K1L1J5j0Lm7K6P9J5J4%k9kkl4OK1Jk7j3K4N4ml4l6m1l0OL9K1oj6nk9ol3njJ4O9
-13771H94K7J3%lj9l4k2L0J6m5j5J4N2J4n6p3nl6MkJ8nJ7P5Omnk3l9k2L2N1J4l8k4oRL1Lk7
-13731H17PL9P1J5j9J1j7n5o4ml6o5K3L3K4N2Mk8NJ3J3po7k9kRK7qm5KK1Nk1K0M2jl5mL3L6
-13691H15O2J5k1k6m%l5rJ9K0Om0m0j8L3P3j9l5J0L8O2m2p0K4O9L5l9k2n2n9%j0k2m0m2LR2
-13654G31O1J0rj1N3J2KM5J9JL4j3n2k3oPn1o4pJ8N1RL3K2j8l6o4m5J9Q3L1Kk7k1ROl6QM9
-13615H32L9l1m9k5OK2pk6m3l0NJ9K3P6J5K0l7k8n4l1PQ4O4j8j3pj1KNK1L6k1mK4jOk4j8m2
-13576G86l2K9LM0K6k9k9k2j5Q8M1j5k4k3M2m4l8J0K1Kk0nML0O1M1Mn4m7k5k4o8m9M0P7N3
-13540H35RJqJ7oo0k2m4o%j3qK9lK2j1j8J6l3QM2L3J0J0L5J8m1n0l4K3L5qjL0J2k4o7n4N3
$$ plain form
-13811 845 866 897 912 902 905 858 884 963 978 992 992 963 961 959 925 931 952 953 926 913 937 991 987 953 917 876 846 852 891 912 906 890 885 856 850 817 812 811 825 894
-13771 894 921 934 934 931 912 878 856 886 902 857 842 856 908 922 866 793 788 752 756 754 772 767 784 859 865 861 856 833 794 772 804 855 869 831 807 801 810 841 844 817
-13731 817 824 863 934 949 930 941 924 869 805 801 765 700 723 756 780 832 836 808 813 826 839 832 765 736 734 743 770 762 717 719 740 745 724 744 786 785 750 746 779 815
-13691 815 877 892 871 845 841 841 806 797 816 836 842 802 762 744 777 850 831 796 806 844 906 864 794 818 887 922 883 861 809 750 750 740 718 678 636 639 731
-13654 731 792 802 793 782 835 847 849 894 913 914 948 935 883 860 854 861 810 746 739 757 808 817 850 872 854 818 754 709 728 811 842 844 817 796 805 811 775 783 832
-13615 832 871 840 791 766 772 794 787 761 718 688 693 712 735 811 826 846 809 781 727 696 703 787 851 833 820 813 802 804 809 830 866 845 841 865 864 870 846 828 786
-13576 786 754 783 786 826 852 823 794 772 757 845 886 871 847 824 866 822 784 794 815 817 797 792 796 826 887 928 932 878 831 806 782 714 665 705 782 835
-13540 835 844 845 837 854 848 788 766 722 716 716 703 695 724 721 743 732 714 730 697 705 747 780 790 800 835 853 812 762 728 751 786 778 777 807 819 795 728 674 727
-13501G27O4j5L6M6mj1nk5m8NK5k6kN2K4k7o3m7P4M2k9l5j2K7P1mp2j0Oj2ql9o7N0K0kj2k
-13463F92M2J3m5Krj1j7k1L7P4Mj7lK2lL0k9m6lL2J0j5K2K7l1k3L9N0M9M3roJ9l3l2p9j7l4
-13425G24k0L7M2J7Pk1k6l5KJ7j9n4K2P8L1k3qpJ9L1L3k6j9k2p9m8K7M4J7l9j2KKjj6pJ7M3
-13387G30P2N2n3l9J8K8j6j4Mll6r4l0P8N3jM7OJ0RK%l8l2QMk2n0k5N3O6l1j27o9K6ML3Q3
$$ plain form
-13501 727 791 776 812 858 854 843 838 813 765 770 795 769 767 819 843 816 753 706 780 822 793 758 746 773 844 840 768 758 764 752 744 705 638 688 708 706 694 692
-13463 692 734 747 702 704 695 684 667 646 683 757 761 744 741 763 760 790 761 715 712 744 754 739 761 788 757 734 773 823 872 915 906 900 919 886 854 775 758 724
-13425 724 704 741 783 800 807 786 760 725 727 744 725 671 693 771 802 779 771 764 783 814 847 821 802 780 701 653 680 724 741 702 690 692 694 693 677 670 687 730
-13387 730 802 854 801 762 780 808 792 778 782 779 743 649 619 697 750 749 796 802 812 821 823 823 785 753 761 765 743 693 668 721 787 756 629 560 586 590 623 706
$$ [...]
13119A4
##ENDNTUPLES=	NMRSPECTRUM
##$OBSERVEDINTEGRALS=	(X Y Z)
(7.3581262291709013112, 7.4725944375294233168, 2)
(7.5287309013545611336, 7.8257210200272186995, 5.2558899752243473102)
(8.4344409992707500834, 8.718573045223683593, 2.0594651013773614956)
(9.4546193055454601506, 9.7202482712431788059, 2.0261670940524463269)
##END=	

##TITLE=	20121205-jiatao-1
##JCAMPDX=	6.0	$$ NMR Plug-in 1.4 of MestReNova 6.1.1-6384
##BLOCKID=	2
##DATATYPE=	NMRPEAKTABLE
##DATACLASS=	PEAKTABLE
##.OBSERVEFREQUENCY=	400.1300048828125
##.OBSERVENUCLEUS=	^1H
##NPOINTS=	15
##FIRSTX=	2.4967519194982510378
##LASTX=	9.5816144344546430034
##XFACTOR=	1
##YFACTOR=	1
##FIRSTY=	1612.89013671875
##XUNITS=	PPM
##YUNITS=	ARBITRARY UNITS
##PEAKTABLE=	(XY..XY)
2.4967519194982510378, 1612.89013671875
3.3427817968000610449, 627.8118896484375
7.4044487893725383643, 2484.01611328125
7.4185152085532006794, 2566.222412109375
7.5986843384879199093, 456.851043701171875
7.6161285155769782307, 1174.7122802734375
7.633833584113342674, 889.83819580078125
7.6622075201406101286, 1449.7308349609375
7.6803141672033996556, 3331.5029296875
7.699533377993907024, 2354.62744140625
7.7180084638478110293, 2213.7119140625
7.7375284112354885124, 776.16436767578125
8.5610281612863570189, 1460.522705078125
8.5727938860123487075, 1457.4794921875
9.5816144344546430034, 1954.3935546875
##END=	

##END=	
