##TITLE=	20121205-jiatao-1
##JCAMPDX=	6.0	$$ NMR Plug-in 1.4 of MestReNova 6.1.1-6384
##DATATYPE=	LINK
##BLOCKS=	2
##ORIGIN=	Bruker BioSpin GmbH
##OWNER=	Administrator

##TITLE=	20121205-jiatao-1
##JCAMPDX=	6.0	$$ NMR Plug-in 1.4 of MestReNova 6.1.1-6384
##BLOCKID=	1
##DATATYPE=	NMRSPECTRUM
##DATACLASS=	NTUPLES
##NUMDIM=	1
##ORIGIN=	Bruker BioSpin GmbH
##OWNER=	Administrator
##.OBSERVEFREQUENCY=	100.61277008056640625
##.OBSERVENUCLEUS=	^13C
##.SOLVENTNAME=	9
##.PULSESEQUENCE=	zgpg30
##.ACQUISITIONMODE=	SIMULTANEOUS (DQD)
##$ORIGINALFORMAT=	Bruker XWIN-NMR
##$PARAMETERFILE=	(acqus, ASCII, H:/NMR/20121205-jiatao-1/2/acqus, 0)
$$ ##TITLE= Parameter file, TOPSPIN		Version 2.1
$$ ##JCAMPDX= 5.0
$$ ##DATATYPE= Parameter Values
$$ ##NPOINTS= 10	$$ modification sequence number
$$ ##ORIGIN= Bruker BioSpin GmbH
$$ ##OWNER= Administrator
$$ $$ 2012-12-05 10:36:24.609 +0800  Administrator@EP-ZH010007
$$ $$ D:/data/Administrator/nmr/20121205-jiatao-1/2/acqus
$$ $$ process C:\Bruker\TOPSPIN\prog\mod\vtu.exe
$$ ##$ACQT0= -2.73109243697479
$$ ##$AMP= (0..31)
$$ 100 100 100 100 100 100 100 100 100 100 100 100 100 100 100 100 100 100
$$ 100 100 100 100 100 100 100 100 100 100 100 100 100 100
$$ ##$ANAVPT= -1
$$ ##$AQSEQ= 0
$$ ##$AQ_mod= 3
$$ ##$AUNM= <au_zg>
$$ ##$AUTOPOS= <>
$$ ##$BF1= 100.612769
$$ ##$BF2= 400.13
$$ ##$BF3= 100.612769
$$ ##$BF4= 100.612769
$$ ##$BF5= 100.612769
$$ ##$BF6= 100.612769
$$ ##$BF7= 100.612769
$$ ##$BF8= 100.612769
$$ ##$BYTORDA= 0
$$ ##$CFDGTYP= 0
$$ ##$CFRGTYP= 9
$$ ##$CHEMSTR= <none>
$$ ##$CNST= (0..63)
$$ 1 1 145 1 1 1 1 1 1 1 1 1 1 1 1 1 1 1 1 1 1 1 1 1 1 1 1 1 1 1 1 1 1 1 1
$$ 1 1 1 1 1 1 1 1 1 1 1 1 1 1 1 1 1 1 1 1 1 1 1 1 1 1 1 1 1
$$ ##$CPDPRG= <waltz16>
$$ ##$CPDPRG1= <>
$$ ##$CPDPRG2= <waltz16>
$$ ##$CPDPRG3= <>
$$ ##$CPDPRG4= <mlev>
$$ ##$CPDPRG5= <mlev>
$$ ##$CPDPRG6= <mlev>
$$ ##$CPDPRG7= <mlev>
$$ ##$CPDPRG8= <mlev>
$$ ##$CPDPRGB= <>
$$ ##$CPDPRGT= <>
$$ ##$D= (0..63)
$$ 0 2 0.00345 0 0 0 0 0 0 0.06 0 0.03 2e-005 3e-006 0 0 0.0002 0 0 0 0 0
$$ 0 0 0 0 0 0 0 0 0 0 0 0 0 0 0 0 0 0 0 0 0 0 0 0 0 0 0 0 0 0 0 0 0 0 0 0
$$ 0 0 0 0 0 0
$$ ##$DATE= 1354674983
$$ ##$DBL= (0..7)
$$ 120 120 120 120 120 120 120 120
$$ ##$DBP= (0..7)
$$ 150 150 150 150 150 150 150 150
$$ ##$DBP07= 0
$$ ##$DBPNAM0= <>
$$ ##$DBPNAM1= <>
$$ ##$DBPNAM2= <>
$$ ##$DBPNAM3= <>
$$ ##$DBPNAM4= <>
$$ ##$DBPNAM5= <>
$$ ##$DBPNAM6= <>
$$ ##$DBPNAM7= <>
$$ ##$DBPOAL= (0..7)
$$ 0.5 0.5 0.5 0.5 0.5 0.5 0.5 0.5
$$ ##$DBPOFFS= (0..7)
$$ 0 0 0 0 0 0 0 0
$$ ##$DE= 9
$$ ##$DECBNUC= <off>
$$ ##$DECIM= 832
$$ ##$DECNUC= <off>
$$ ##$DECSTAT= 4
$$ ##$DIGMOD= 1
$$ ##$DIGTYP= 12
$$ ##$DL= (0..7)
$$ 0 120 120 120 120 120 120 120
$$ ##$DP= (0..7)
$$ 150 150 150 150 150 150 150 150
$$ ##$DP07= 0
$$ ##$DPNAME0= <>
$$ ##$DPNAME1= <>
$$ ##$DPNAME2= <>
$$ ##$DPNAME3= <>
$$ ##$DPNAME4= <>
$$ ##$DPNAME5= <>
$$ ##$DPNAME6= <>
$$ ##$DPNAME7= <>
$$ ##$DPOAL= (0..7)
$$ 0.5 0.5 0.5 0.5 0.5 0.5 0.5 0.5
$$ ##$DPOFFS= (0..7)
$$ 0 0 0 0 0 0 0 0
$$ ##$DQDMODE= 0
$$ ##$DR= 22
$$ ##$DS= 4
$$ [...]
$$ -1 -1 -1 -1 -1 -1 -1 -1 -1 -1 -1 -1 -1 -1 -1 -1 -1 -1 -1 -1 -1 -1 -1 -1
$$ -1 -1 -1 -1 -1 -1 -1 -1 -1 -1 -1 -1 -1 -1 -1 -1 -1 -1 -1 -1 -1 -1 -1 -1
$$ -1 -1 -1 -1 -1 -1 -1 -1 -1 -1 -1 -1 -1 -1 -1 -1 -1 -1 -1 -1 -1 -1 -1 -1
$$ -1 -1 -1 -1 -1 -1 -1 -1 -1 -1 -1 -1 -1 -1 -1 -1 -1 -1 -1 -1 -1 -1 -1 -1
$$ -1 -1 -1 -1 -1 -1 -1 -1 -1 -1 -1 -1 -1 -1 -1 -1 -1 -1 -1 -1 -1 -1 -1 -1
$$ -1 -1 -1 -1 -1 -1 -1 -1 -1 -1 -1 -1 -1 -1 -1 -1 -1 -1 -1 -1 -1 -1 -1 -1
$$ -1 -1 -1 -1 -1 -1 -1 -1 -1 -1 -1 -1 -1 -1 -1 -1 -1 -1 -1 -1 -1 -1 -1 -1
$$ -1 -1 -1 -1 -1 -1 -1 -1 -1 -1 -1 -1 -1 -1 -1 -1 -1 -1 -1 -1 -1 -1 -1 -1
$$ -1 -1 -1 -1 -1 -1 -1 -1 -1 -1 -1 -1 -1 -1 -1 -1
$$ ##$RG_tabA= (0..255)
$$ 0.25 0.28 0.32 0.35 0.4 0.44 0.5 0.56 0.64 0.7 0.8 0.89 1 1.12 1.28 1.4
$$ 1.6 1.78 2 2.25 2.56 2.8 3.2 3.56 4 4.5 5 5.6 6.35 7.12 8 9 10 11.3 12.7
$$ 14.2 16 18 20.2 22.6 25.4 28.5 32 36 40.3 45.2 50.8 57 64 71.8 80.6 90.5
$$ 101 114 128 144 161 181 203 228 256 287 322 362 406 456 512 575 645 724
$$ 812 912 1030 1150 1290 1440 1620 1820 2050 -1 -1 -1 -1 -1 -1 -1 -1 -1 -1
$$ -1 -1 -1 -1 -1 -1 -1 -1 -1 -1 -1 -1 -1 -1 -1 -1 -1 -1 -1 -1 -1 -1 -1 -1
$$ -1 -1 -1 -1 -1 -1 -1 -1 -1 -1 -1 -1 -1 -1 -1 -1 -1 -1 -1 -1 -1 -1 -1 -1
$$ -1 -1 -1 -1 -1 -1 -1 -1 -1 -1 -1 -1 -1 -1 -1 -1 -1 -1 -1 -1 -1 -1 -1 -1
$$ -1 -1 -1 -1 -1 -1 -1 -1 -1 -1 -1 -1 -1 -1 -1 -1 -1 -1 -1 -1 -1 -1 -1 -1
$$ -1 -1 -1 -1 -1 -1 -1 -1 -1 -1 -1 -1 -1 -1 -1 -1 -1 -1 -1 -1 -1 -1 -1 -1
$$ -1 -1 -1 -1 -1 -1 -1 -1 -1 -1 -1 -1 -1 -1 -1 -1 -1 -1 -1 -1 -1 -1 -1 -1
$$ -1 -1 -1 -1 -1 -1 -1 -1 -1 -1 -1 -1 -1 -1 -1 -1 -1 -1 -1 -1 -1 -1 -1
$$ ##$ROUT14= (0..7)
$$ 0 0 0 0 0 0 0 0
$$ ##$ROUTER= 3
$$ ##$RX22TY= <no>
$$ ##$RXFMAX= (0..7)
$$ 432.5 -1 -1 -1 -1 -1 -1 -1
$$ ##$RXFMIN= (0..7)
$$ 5 -1 -1 -1 -1 -1 -1 -1
$$ ##$RXINTLV= (0..7)
$$ 1 0 0 0 0 0 0 0
$$ ##$RXMSTY= <no>
$$ ##$SCMTY= <no>
$$ ##$SGUC1= (0..15)
$$ 18 19 0 0 0 0 0 0 0 0 0 0 0 0 0 0
$$ ##$SGUC2= (0..15)
$$ 33 256 0 0 0 0 0 0 0 0 0 0 0 0 0 0
$$ ##$SPECTR= 10
$$ ##$SY2FLAG= 0
$$ ##$TFXNUM= 0
$$ ##$TRIPLO2= 0
$$ ##$VTUTY= <tty05>
$$ ##$WBREFAM= (0..15)
$$ 273.4 115.7 100 100 100 100 100 100 100 100 100 100 100 100 100 100
$$ ##$WBREFPH= (0..15)
$$ 81.78 -67.52 0 0 0 0 0 0 0 0 0 0 0 0 0 0
$$ ##$XFAC= 2
$$ ##END=
$$ 
##$DECIM=	832
##$DSPFVS=	20
##NTUPLES=	NMRSPECTRUM
##VARNAME=	FREQUENCY,	SPECTRUM/REAL,	SPECTRUM/IMAG,	PAGE NUMBER
##SYMBOL=	X,	R,	I,	N
##VARTYPE=	INDEPENDENT,	DEPENDENT,	DEPENDENT,	PAGE
##VARFORM=	AFFN,	ASDF,	ASDF,	AFFN
##VARDIM=	65536,	65536,	65536,	2
##UNITS=	HZ,	ARBITRARY UNITS,	ARBITRARY UNITS,
##FIRST=	22080.0350341796875,	0.025195019319653511047,	-0.31142267584800720215,	1
##LAST=	-1958.4259033203125,	0.29633060097694396973,	0.079531423747539520264,	2
##MIN=	-1958.4259033203125,	-1.655788421630859375,	-61.841876983642578125,	1
##MAX=	22080.0350341796875,	120.1926116943359375,	66.11952972412109375,	1
##FACTOR=	-0.36680340180819409612,	0.0015024076461791992156,	0.00082649412155151374612,	1
##PAGE=	N=1
##DATATABLE=	(X++(R..R)), XYDATA
$$ [...]
##PAGE=	N=2
##DATATABLE=	(X++(I..I)), XYDATA
$$ plain form
-20049 21 4 68 -92 196 851 1187 918 357 59 -65 -123 -211 -260 -277 -274 -271 -479 -765 -819 -586 -411 -434 -550 -706 -717 -555 -467 -422
-20021 -422 -434 -601 -720 -721 -574 -286 -349 -473 -668 -665 -579 -816 -1009 -1050 -919 -623 -682 -1062 -1222 -1191 -1223 -1229 -1112 -1101 -845 -629 -483
-19994 -483 -151 4 49 92 -81 68 153 -176 -938 -1071 -596 -351 -95 241 277 25 -177 -200 -5 300 260 -38 -336 -226 -80
-19969 -80 -328 -456 -470 -783 -950 -780 -531 -324 -23 141 -88 -672 -742 -327 -67 -205 39 317 370 401 595 1003 1103 546
-19945 546 -91 -169 -57 205 273 223 90 -139 -74 154 20 -271 -322 -262 -407 -457 -638 -574 -302 -281 -444 -459 -447 -577 -891 -1012
-19919 -1012 -893 -598 -117 354 567 437 63 -268 -162 173 193 73 -101 -433 -782 -867 -587 -80 296 402 289 171 13
-19896 13 -414 -560 -334 -279 -417 -508 -518 -585 -763 -695 -471 -211 -275 -512 -760 -950 -884 -459 -237 -287 -108 -162 -287 -221 -294 -248 -1
-19869 -1 85 114 83 -146 -435 -541 -508 -412 -280 -255 -400 -520 -651 -827 -848 -859 -929 -882 -830 -589 -360 -398 -579 -475 -481 -473 -481 -701 -869
$$ packed form
-20049B1j7O4j60K88O55L36k69n61k98j24n8q8m9j7LLk08k86n4K33J75k3j16j56j1J62Q8M5
-20021d22j2j67j19jJ47K88o3j24j95LQ6k37j93m1J31K96n9l80j60L1l2oJ17J1K56K16J46
-19994d83L32J55M5M3j73J49Q5l29p62j33M75K45K56L36L6k52k02k3J95L05m0k98k98J10J46
-19969h0k48j28j4l13j67J70K49K07L01J64k29n84p0M15K60j38K44K78N3L1J94M08J00n57
-19945E46o37p8J12K62O8n0j33k29O5K28j34k91n1O0j45n0j81O4K72K1j63j5J2j30l14j21
-19919a012J19K95M81M71K13j30l74l31J06L35K0j20j74l32l49q5K80N07L76J06j13j18j58
-19896A3m27j46K26N5j38r1j0o7j78O8K24K60o4k37k48j90O6M25K22n0J79n4j25O6p3M6K47
-19869aQ6K9l1k29k89j06L3R6J32K5j45j20j31j76k1j1p0M7N2K41K29l8j81J04oQqk20j68
$$ plain form
-19840 -869 -715 -265 161 446 480 263 247 334 28 -214 -231 -175 -87 5 110 182 112 231 558 724 801 912 768 811 964 935 648
-19813 648 415 369 289 -91 -568 -704 -392 -50 160 460 268 -247 -429 -224 -272 -407 -635 -593 -543 -371 -265 -200 -188 -216 16
-19788 16 291 311 140 -50 -312 -722 -814 -765 -545 -67 415 625 624 173 -94 67 234 247 227 59 -161 -80 -19 16 -13 -41 19
-19761 19 227 44 -656 -1137 -1089 -670 -416 -478 -559 -725 -724 -613 -576 -418 -217 -228 -53 340 55 -107 -27 177 194 -251 -658 -706
-19735 -706 -362 -131 249 566 673 753 791 676 464 341 157 -21 14 -150 -565 -605 -294 -180 -152 -21 -96 -158 -84 124 18
-19710 18 -54 93 235 393 251 98 -19 214 403 -41 -466 -371 -348 -681 -678 -567 -442 -264 -388 -630 -1003 -941 -598 -434 -184
-19685 -184 40 110 -96 -285 -444 -509 -551 -709 -670 -737 -758 -366 82 324 296 48 -73 29 100 -8 -456 -805 -578 -96 3 -219
-19659 -219 -440 -462 -286 -136 111 -150 -525 -318 -274 -469 -576 -518 -403 -193 386 872 1049 459 192 482 247 -185 -486 -621
$$ packed form
-19840h69J54M50M26K85L4k17j6Q7l06k42j7N6Q8R2J05P2p0J19L27J66P7J11j44M3J53k9k87
-19813F48k33m6q0l80m77j36L12L42K10L00j92n15j82K05m8j35k28M2N0J72J06O5J2k8K32
-19788A6K75K0j71j90k62m10r2M9K20M78M82K10jm51k67J61J67J3k0j68k20Q1O1L5k9k8O0
-19761A9K08j83p00m81M8M19K54o2q1j66JJ11L7J58K01j1J75L93k85j62Q0K04J7m45m07m8
-19735g06L44K31L80L17J07Q0L8j15k12j23j84j78L5j64m15m0L11J14K8J31p5o2P4K08j06
-19710A8p2J47J42J58j42j53j17K33J89m44m25R5K3l33LJ11J25J78j24k42l73O2L43J64K50
-19685a84K24P0k06j89j59o5m2j58L9o7k1L92M48K42k8k48j21J02P1j08m48l49K27M82R9k22
-19659b19k21k2J76J50K47k61l75K07M4j95j07N8J15K10N79M86J77n90k67K90k35m32l01j35
$$ plain form
-19635 -621 -742 -681 -524 -426 -72 471 805 564 384 462 515 428 254 205 8 -365 -522 -418 -341 -588 -616 -282 -38 -32 76 352
-19609 352 508 414 378 346 359 343 338 248 32 -315 -588 -420 -36 285 576 354 210 291 481 730 845 510 457 478 362 215
-19583 215 45 -144 -368 -246 -76 -23 -250 -464 -480 -160 -201 -376 -480 -350 101 160 140 153 -67 -281 -333 -433 -494 -366 -73
-19558 -73 383 305 -135 -349 -479 -500 -271 -136 -232 -377 -745 -974 -688 -316 -153 16 265 409 508 539 536 147 -265 -201 -194 -162 -140
-19531 -140 -190 -72 -206 -306 -439 -648 -564 587 1104 916 894 816 1008 737 226 -85 -261 -193 -38 34 82 264 501 705 814
-19506 814 566 232 94 -179 -267 -207 -159 -267 -648 -486 80 315 618 754 424 95 -228 -495 -426 -338 -381 -151 107 450 487
-19481 487 345 10 -305 -263 -37 219 -116 -849 -951 -750 -450 -147 -5 74 260 115 -162 -298 -456 -731 -571 -303 -275 -248
-19457 -248 -281 -275 -437 -529 -496 -185 107 -138 -639 -661 -601 -662 -805 -599 -399 -693 -848 -675 -488 -431 -204 -98 172 183 74 -70
$$ packed form
-19635f21j21O1J57R8L54N43L34k41j80P8N3q7j74m9j97l73j57J04P7k47k8L34K44OJ08K76
-19609C52J56r4l6l2J3j6nr0k16l47k73J68L84L21K91k22j44Q1J90K49J15l35n3K1j16j47
-19583B15j70j89k24J22J70N3k27k14j6L20m1j75j04J30M51N9k0J3k20k14n2j00o1J28K93
-19558g3M56p8m40k14j30k1K29J35r6j45l68k29K86L72J63J69K49J44R9L1ll89m12O4PL2K2
-19531a40n0J18j34j00j33k09Q4J151N17j88k2p8J92k71n11l11j76O8J55P2M8J82K37K04J09
-19506H14k48l34j38k73q8O0M8j08l81J62N66K35L03J36l30l29l23k67O9Q8m3K30K58L43L7
-19481D87j42l35l15M2K26K56l35p33j02K01L00L03J42P9J86j45k77j36j58k75J60K68K8K7
-19457b48l3Oj62r2L3L11K92k45n01k2O0o1j43K06K00k94j55J73J87N7K27J06K70J1j09j44
$$ plain form
-19431 -70 -328 -175 8 22 52 -124 -352 -377 -427 -367 -581 -1200 -1468 -919 -524 -459 -320 -213 -87 -22 -262 -609 -652 -586 -441 -351
-19405 -351 -392 -213 32 366 785 473 -44 -225 -106 -160 -237 -221 -168 -342 -578 -450 -256 -409 -614 -682 -755 -645 -506 -201 -439
-19380 -439 -678 -716 -678 -482 -152 135 243 40 -267 -255 -352 -775 -926 -745 -747 -681 -553 -618 -717 -1139 -1155 -730 -533 -630 -937 -1095
-19354 -1095 -1044 -765 -390 -58 231 350 271 110 -43 -22 265 238 78 -273 -435 -262 -326 -393 -200 -104 -59 -49 -271 -262 -373 -505
-19328 -505 -589 -856 -887 -590 -444 -426 -616 -692 -833 -1163 -874 -206 -24 -232 -429 -593 -566 -497 -295 -23 154 585 589 506 406 297
-19302 297 285 243 148 122 -9 -217 -262 -199 -470 -963 -791 -361 -1 329 427 277 36 -468 -582 -336 -316 -456 -122 449 496 -15
-19276 -15 -431 -462 -244 -94 -4 -78 -200 -227 -69 29 -344 -964 -1097 -724 -508 -462 -560 -593 -411 -191 -199 -411 -483 -514 -717 -701 -663 -409
-19248 -409 -475 -610 -501 -482 -440 -279 -195 -300 -216 -29 -68 -118 -323 -624 -728 -593 -698 -719 -698 -562 -608 -543 -482 -525 -377 -75 99
$$ packed form
-19431g0k58J53J83J4L0j76k28k5n0O0k14o19k68N49L95O5J39J07J26O5k40l47m3O6J45R0
-19405c51m1J79K45L34M19l12n17j81J19n4p7J6N3j74k36J28J94j53k05o8p3J10J39L05k38
-19380d39k39l8L8J96L30K87J08k03l07J2r7m23j51J81kO6J28o5r9m22j6M25J97r7l07j58
-19354a095N1K79L75L32K89J19p9j61j53K1K87k7j60l51j62J73o4o7J93R6M5J0k22Rj11j32
-19328e05q4k67l1K97J46J8j90p6j41l30K89O68J82k08j97j64K7O9K02K72J77M31Mq3j00j09
-19302B97j2m2r5k6j31k08m5O3k71m93J72M30L60L30R8j50k41n04j14K46K0j40L34N71M7n11
-19276a5m16l1K18J50R0p4j22k7J58R8l73o20j33L73K16M6r8l3J82K20qk12p2l1k03J6L8K54
-19248d09o6j35J09J9M2J61Q4j05Q4J87l9n0k05l01j04J35j05k1K1J36m6O5O1m3J48L02J74
$$ plain form
-19221 99 68 -52 -139 -40 -37 -199 -108 218 327 71 342 697 915 943 474 210 209 311 292 303 391 442 333 339 257 118 108 -12 -265
-19192 -265 -231 -70 -41 82 200 -171 -430 -591 -583 -771 -884 -929 -942 -743 -287 92 288 176 61 -25 -118 26 133 -254 -542
-19167 -542 -463 2 76 -356 -744 -935 -689 -421 -177 -96 -307 -354 -384 -260 60 54 -214 -350 -438 -530 -246 23 -322 -829 -795 -780
-19141 -780 -1007 -649 -122 -254 -690 -778 -701 -831 -1050 -1346 -1268 -1176 -1163 -1214 -1048 -768 -307 -350 -976 -1398 -1156 -526 -74 -68 -216 -40
-19115 -40 -10 -199 -367 -143 144 282 246 141 116 172 272 465 501 476 664 602 251 -273 -637 -736 -662 -897 -1066 -1090 -1487 -1591
-19089 -1591 -1138 -655 -478 -349 -494 -388 -100 260 442 321 243 -52 -354 -412 -276 -159 58 94 105 -200 -519 -458 -441 -822
-19065 -822 -725 -416 -360 -601 -977 -1307 -1427 -1192 -1033 -783 -873 -1309 -1601 -1471 -1374 -1395 -1252 -938 -653 -395 -250 -511 -760 -928
-19041 -928 -823 -597 -562 -546 -673 -313 61 321 415 283 27 -132 -58 -334 -487 -461 -473 -729 -652 -590 -849 -1040 -924 -691 -767 -761
$$ packed form
-19221I9l1j20q7R9Lj62R1L26J09k56K71L55K18K8m69k64jJ02j9J1Q8N1j09Oq2j39j0j20k53
-19192b65L4J61K9J23J18l71k59j61Qj88j13m5j3J99M56L79J96j12j15q6r3J44J07l87k88
-19167e42P9M65P4m32l88j91K46K68K44Q1k11m7l0J24L20ok68j36q8r2K84K69l45n07L4J5
-19141g80k27L58N27j32m36q8P7j30k19k96P8R2J3n1J66K80M61m3o26m22K42O30M52Oj48J76
-19115d0L0j89j68K24K87J38l6j05k5N6J00J93L6k5J88o2l51n24l64r9P4k35j69k4l97j04
-19089a591M53M83J77J29j45J06K88L60J82j21p8k95l02n8J36J17K17L6J1l05l19O1J7l81
-19065h22R7L09N6k41l76l30j20K35J59K50r0m36k92J30R7k1J43L14K85K58J45k61k49j68
-19041i28J05K26L5J6j27L60L74K60R4j32k56j59P4k76j53K6j2k56P7O2k59j91J16K33p6O
$$ plain form
-19015 -761 -700 -621 -472 -309 73 475 609 664 532 272 240 -87 -692 -915 -717 -540 -250 -221 -377 -247 -118 172 378 268
-18991 268 -98 -293 -227 -120 -226 -442 -588 -628 -333 157 145 -9 307 586 499 234 -133 -546 -912 -1075 -1077 -800 -599 -498 -18
-18966 -18 594 778 506 149 -311 -837 -1019 -1046 -1117 -1313 -1267 -898 -490 -288 -501 -818 -1052 -1140 -1004 -767 -323 72 25 -106 -274
-18941 -274 -455 -654 -849 -707 -385 -86 -38 -41 -148 -579 -993 -1003 -907 -910 -958 -903 -440 -10 -2 141 573 711 292 -141 -293 -670
-18915 -670 -933 -845 -540 -220 -123 -60 -5 -140 21 134 -14 -154 -70 -135 -543 -710 -699 -721 -731 -395 -30 -68 -46 98 165 277 10
-18888 10 -69 -85 -78 129 615 827 995 720 -30 -643 -936 -752 -418 -76 236 265 300 421 521 444 394 333 318 542 685 518
-18862 518 273 187 -62 -299 -335 -545 -706 -453 -129 -135 -369 -228 -63 -117 -159 11 90 115 186 202 278 281 253 345 286 -139 -680 -888
-18834 -888 -1088 -912 -377 -18 52 111 127 123 79 -311 -488 -374 -46 21 -86 -122 -366 -237 312 576 458 42 -210 -115 -140 -111
$$ packed form
-19015g61O1P9J49J63L82M02J34N5j32k60l2l27o05k23J98J77K90K9j56J30J29K90K06j10
-18991B68l66j95O6J07j06k16j46m0K95M90j2j54L16K79q7k65l67m13l66j63kK77K01J01M80
-18966a8O12J84k72l57m60n26j82k7p1j96M6L69M08K02k13l17k34q8J36K37M44L95m7j31j68
-18941b74j81j99j95J42L22K99M8lj07m31m14j0R6lm8N5M63M30QJ43M32J38m19m33j52l77
-18915f70k63Q8L05L20R7O3N5j35J61J13j48j40Q4o5m08j67J1k2j0L36L65l8K2J44O7J12k67
-18888A0p9j6PK07M86K12J68k75p50o13k93J84L34L42L12K9L5J21J00p7n0o1j5K24J43j67
-18862E18k45q6k49k37l6k10j61K53L24ok34J41J65n4m2J70P9K5P1J6P6Lk8R2n9m25n41k08
-18834h88k00J76N35L59P0N9J6mm4l90j77J14L28O7j07l6k44J29N49K64j18m16k52R5k5K9
$$ plain form
-18808 -111 242 377 266 129 120 -146 -304 -135 22 382 727 763 668 688 657 568 377 89 -316 -433 -546 -776 -887 -516 -235
-18783 -235 -162 -123 266 548 307 -247 -689 -723 -409 0 302 329 147 74 -131 -269 -163 -27 251 446 316 -94 -547 -317
-18759 -317 -219 -261 -396 -345 -320 -590 -678 -341 74 106 223 155 170 24 -192 -351 -438 -381 -630 -1035 -1184 -1016 -745 -541 -172 120
-18733 120 310 306 139 -12 -123 -186 -252 -226 -211 -400 -634 -673 -582 -452 -294 -158 -181 -442 -578 -711 -747 -664 -640 -499 -335 -61 397
-18706 397 619 648 320 -194 -174 77 -212 -330 -551 -907 -963 -647 -259 -269 -212 -306 -579 -498 -282 -322 -311 -605 -997 -1108 -1124 -1021
-18680 -1021 -829 -673 -494 -117 78 155 439 422 420 460 267 -67 -174 -225 -324 5 176 -205 -308 -286 57 297 25 -109 -217
-18655 -217 -642 -748 -700 -594 -523 -737 -723 -908 -1113 -912 -751 -471 -174 5 217 544 488 69 -112 -142 -273 -416 -630 -678 -404
-18630 -404 -398 -662 -928 -812 -620 -478 -329 -345 -527 -503 -492 -436 -425 -345 -240 -245 -110 118 351 432 141 -317 -604 -732 -833 -674
$$ packed form
-18808a11L53J35j11j37rk66j58J69J57L60L45L6r5K0l1q9j91k88m05j17j13k30j11L71K81
-18783b35P3L9L89K82k41n54m42l4L14M09L02K7j82p3k05j38J06J36K78J95j30m10m53K30
-18759c17R8m2j35N1K5k70q8L37M15L2J17o8J5j46k16j59q7N7k49m05j49J68K71K04L69K92
-18733A20J90mj67j51j11o3o6K6J5j89k34l9R1J30J58J36k3k61j36j33l6Q3K4J41J64K74M58
-18706C97K22K9l28n14K0K51k89j18k21l56n6L16L88j0N7r4k73Q1K16m0J1k94l92j11j6J03
-18680a021J92J56J79L77J95P7K84j7kM0j93l34j07n1r9L29J71l81j03K2L43K40k72j34j08
-18655b17m25j06M8J06P1k14J4j85k05K01J61K80K97J79K12L27n6m19j81l0j31j43k14m8K74
-18630d04Ok64k66J16J92J42J49j6j82K4J1N6J1Q0J05nJ35K28K33Q1k91m58k87j28j01J59
$$ plain form
-18604 -674 -321 -57 -44 -151 -488 -995 -1152 -989 -690 -227 -72 -151 -255 -337 -401 -663 -943 -1269 -1328 -948 -770 -788 -821 -556 -226
-18579 -226 -154 -282 -428 -282 -156 -196 -403 -606 -543 -291 -13 287 409 448 359 218 -163 -445 -509 -163 136 1 -217 -496 -685
-18554 -685 -870 -894 -606 -176 -217 -305 -339 -433 -245 -259 -481 -473 143 467 209 -211 -324 -276 -397 -428 -153 -143 -126 11 -37 -89 -271
-18527 -271 -448 -216 85 68 -138 41 278 231 268 556 798 773 371 116 107 170 157 -60 58 360 342 546 678 696 274 -323
-18501 -323 -743 -878 -676 -719 -716 -407 -275 -253 -240 -253 -340 -633 -454 -4 79 -53 -241 -658 -841 -556 -212 97 35 -109 -275 -482
-18475 -482 -400 -570 -748 -633 -452 -152 22 266 354 115 -273 -431 -420 -449 -428 -432 -488 -673 -876 -889 -847 -724 -594 -594 -544 -522 -901
-18448 -901 -1085 -725 -361 -112 -223 -532 -558 -37 429 596 503 416 408 343 192 28 -227 -287 -97 171 144 78 396 562 417 83
-18422 83 9 104 112 295 272 105 264 589 502 207 334 787 659 214 -121 -170 -236 -298 -73 230 41 -307 -300 -160 -74 207 127
$$ packed form
-18604f74L53K64J3j07l37n07j57J63K99M63J55p9j04q2o4k62k80l26n9L80J78j8l3K65L30
-18579b26P2j28j46J46J26m0k07k03O3K52K78L00J22L9q9j41l81k82o4L46K99j35k18k79j89
-18554f85j85k4K88M30m1q8l4r4J88j4k22QO16L24k58m20j13M8j21l1K75J0J7J37m8n2j82
-18527b71j77K32L01j7k06J79K37m7L7K88K42k5m02k55rO3j3k17J18L02j8K04J32J8m22n97
-18501c23m20j35K02m3LL09J32K2J3j3q7k93J79M50Q3j32j88m17j83K85L44L09o2j44j66k07
-18475d82Q2j70j78J15J81L00J74K44Q8k39l88j58J1k9K1mn6j85k03j3M2J23J30%N0K2l79
-18448i01j84L60L64K49j11l09k6N21M66J67r3q7qo5j51j64k55o0J90K68k7o6L18J66j45l34
-18422H3p4R5QJ83k3j67J59L25q7k95J27M53j28m45l35m9o6o2K25L03j89l48PJ40Q6K81q0
$$ plain form
-18395 127 111 16 -579 -989 -1009 -835 -654 -717 -568 25 488 616 637 589 557 481 378 311 303 523 631 629 781 708 244 -91 -282
-18368 -282 -360 -227 1 72 -193 -501 -647 -433 -6 490 408 15 -106 -124 46 -119 -492 -431 -459 -674 -616 -334 -276 -305 -279 -54
-18342 -54 163 245 30 -330 -588 -753 -587 -473 -512 -488 -400 -565 -707 -647 -665 -534 -259 -93 76 145 175 129 -114 -399 -399 -137 138
-18315 138 328 524 668 693 543 164 -267 -521 -836 -1001 -968 -1199 -1217 -1103 -1240 -1228 -819 -464 -515 -796 -892 -1075 -1141 -1082 -890
-18290 -890 -767 -648 -545 -717 -822 -645 -408 -485 -759 -708 -493 -446 -487 -503 -408 -283 -363 -670 -690 -402 -290 -202 -300 -321 -250 -162 28
-18263 28 124 160 388 327 -58 -293 -354 -330 -203 -72 62 43 -242 -297 -115 -286 -461 -330 -254 -481 -580 -272 -161 -134 -224 -493 -446
-18236 -446 -30 -73 -371 -243 -63 -14 92 64 -190 -652 -599 -49 270 209 10 -55 -83 -261 -333 -375 -439 -513 -556 -315 -286 -376 -187
-18209 -187 172 201 118 254 -58 -140 -99 -177 -83 77 -24 -235 -367 -275 -123 -11 63 31 -61 -177 -432 -430 -515 -341 -209 -314 -204
$$ packed form
-18395A27j6r5n95m10k0J74J81o3J49N93M63J28K1m8l2p6j03o7qK20J08kJ52p3m64l35j91
-18368b82p8J33K28P1k65l08j46K14M27M96q2l93j21j8J70j65l73O1k8k15N8K82N8k9K6K25
-18342e4K17Q2k15l60k58j65J66J14l9K4Q8j65j42O0j8J31K75J66J69O9L0m6k43k85%K62K75
-18315A38J90J96J44K5j50l79m31k54l15j65L3k31j8J14j37J2M09L55n1k81r6j83o6N9J92
-18290h90J23J19J03j72j05J77K37p7k74N1K15M7m1j6R5J25q0l07k0K88J12Q8r8k1P1Q8J90
-18263B8R6L6K28o1l85k35o1K4J27J31J34j9k85n5J82j71j75J31P6k27r9L08J11K7r0k69M7
-18236d46M16m3k98J28J80M9J06k8k54m62N3N50L19o1j99o5k8j78p2m2o4p4m3K41K9r0J89
-18209a87L59K9q3J36l12q2M1p8R4J60j01k11j32R2J52J12P4l2r2j16k55Kq5J74J32j05J10
$$ plain form
-18182 -204 -222 -90 -101 -686 -1343 -1252 -1346 -1414 -1209 -1161 -994 -501 -170 -414 -465 -274 -360 -448 -504 -633 -705 -511 -301 -442 -665 -462
-18156 -462 -94 192 254 222 399 423 176 -79 -90 -164 -361 -386 -176 24 -65 -49 136 177 135 -76 -130 -214 -159 -101 -144 -16 73 230
-18128 230 223 -6 -198 -394 -442 -389 -309 122 454 570 746 852 403 -207 -278 -284 -149 226 585 433 -68 -130 -11 8 23 -81
-18102 -81 -454 -663 -495 -317 -61 94 -234 -433 -394 -428 -384 -406 -409 -300 -460 -601 -705 -934 -838 -592 -359 -337 -380 -466 -379 -377 -333 -505
-18074 -505 -904 -1101 -953 -506 -402 -417 -554 -1002 -1071 -790 -585 -593 -676 -857 -943 -748 -377 3 233 378 493 321 90 229 32
-18049 32 -177 -340 -539 -728 -932 -803 -519 -326 -504 -434 -131 51 123 231 380 279 -92 -410 -556 -443 -338 -332 -195 -119 -310
-18024 -310 -285 -79 -320 -752 -1068 -1257 -1180 -1179 -989 -727 -593 -333 -117 -80 -162 -493 -614 -560 -444 -394 -317 -210 -100 -64 111 293
-17998 293 30 -171 -429 -905 -1256 -1412 -959 -575 -311 -283 -431 -428 -408 -385 -405 -411 -480 -740 -761 -607 -494 -303 -188 -93 -153 -304 -399
$$ packed form
-18182b04j8J32j1n85o57R1r4o8K05M8J67M93L31k44n1J91q6q8n6j29p2J94K10j41k23K03
-18156d62L68K86O2l2J77K4k47k55j1p4j97k5K10K00q9J6J85M1m2k11n4q4N5N8m3J28Q9J57
-18128B30pk29j92j96m8N3Q0M31L32J16J76J06m49o10p1oJ35L75L59j52n01o2J19J9J5j04
-18102h1l73k09J68J78K56J55l28j99L9l4M4k2lJ09j60j41j04k29R6K46K33K2m3q6Q7KM4j72
-18074e05l99j97J48M47J04j5j37m48o9K81K05qq3j81q6J95L71L80K30J45J15j72k31J39j97
-18049C2k09j63j99j89k04J29K84J93j78P0L03J82P2J08J49j01l71l18j46J13J05OJ37P6j91
-18024c10K5K06k41m32l16j89P7JJ90K62J34K60K16L7q2l31j21N4J16N0P7J07J10L6J75J82
-17998B93k63k01k58m76l51j56M53L84K64K8j48LK0K3k0oo9k60k1J54J13J91J15R5o0j51r5
$$ plain form
-17971 -399 -249 -88 -1 247 470 492 422 495 762 682 315 287 480 489 270 89 41 -235 -546 -370 12 47 -271 -717 -800 -805 -945
-17944 -945 -1062 -844 -466 -105 -270 -434 -780 -979 -980 -819 -577 -527 -596 -489 -212 185 549 584 321 105 378 456 55 -483 -593
-17919 -593 -256 -97 71 162 268 401 217 -354 -446 -397 -350 -328 -397 -448 -402 -320 -350 -541 -510 -227 -231 -192 -81 66 -140 -471 -745
-17892 -745 -824 -660 -668 -810 -747 -614 -802 -785 -463 -384 -466 -785 -777 -455 -494 -558 -417 -324 -399 -659 -807 -577 -375 -356 -666 -615 -318 25
-17864 25 254 -88 -35 188 36 77 137 120 -58 -269 -149 -304 -671 -789 -595 -212 -94 -142 -318 -630 -749 -608 -567 -290 47
-17839 47 -208 -323 -87 168 165 -267 -772 -649 -327 -77 -12 0 -290 -573 -558 -292 -110 -549 -1076 -983 -737 -654 -905 -1036 -895
-17814 -895 -911 -1020 -989 -762 -836 -823 -555 -600 -697 -735 -863 -623 -294 -142 -44 -35 -294 -567 -698 -423 -32 -140 -338 -252 -263 -304 -157
-17787 -157 -9 27 -140 -357 -615 -459 7 -32 -293 -94 -208 -404 -389 -641 -795 -735 -635 -580 -616 -683 -538 -358 -187 51 -111
$$ packed form
-17971c99J50J61Q7K48K23K2p0P3K67q0l67k8J93Rk19j81m8k76l11J76L82L5l18m46q3nj40
-17944i45j17K18L78L61j65j64l46j99jJ61K42N0o9J07K77L97L64L5k63k16K73P8m01n38j10
-17919e93L37J59J68R1J06J33j84n71r2M9M7K2o9n1M6Q2l0j91L1K83mL9J11J47k06l31k74
-17892g45p9J64qj42O3J33j88J7L22P9q2l19QL22l9o4J41R3p5k60j48K30K02J9l10N1K97L43
-17864B5K29l42N3K23j52M1O0j7j78k11J20j55l67j18J94L83J18m8j76l12j19J41M1K77L37
-17839D7k55j15K36K55lm32n05J23L22K50O5J2k90k83J5K66J82m39n27R3K46Q3k51j31J41
-17814h95j6j09L1K27p4J3K68m5r7l8j28K40L29J52R8Rk59k73j31K75L91j08j98Q6j1m1J47
-17787a57J48L6j67k17k58J56M66l9k61J99j14j96J5k52j54O0J00N5l6o7J45J80J71K38j62
$$ plain form
-17762 -111 -460 -430 -164 -401 -621 -410 -428 -865 -784 -528 -490 -326 107 539 548 97 -396 -682 -528 -420 -332 98 246 63 -171
-17737 -171 -351 -147 -64 9 310 362 191 -277 -796 -1095 -992 -685 -113 263 205 -134 -658 -909 -862 -648 -442 -457 -535 -534 -696 -391
-17711 -391 94 419 450 38 -250 -346 -553 -826 -945 -813 -605 -766 -1219 -1385 -1121 -925 -864 -826 -689 -493 -340 -133 -115 -348
-17687 -348 -283 -361 -954 -1285 -1251 -1202 -946 -639 -413 -413 -602 -470 -521 -977 -1154 -1147 -960 -721 -534 -443 -419 -403 -317 -194 119 187 185 234
-17659 234 331 295 148 96 -165 -461 -605 -715 -621 -587 -618 -547 -537 -418 -334 -353 -772 -1237 -1388 -1421 -1327 -1395 -1304 -961 -491 -326 3
-17632 3 301 243 135 -16 8 -45 -14 408 211 12 187 38 -405 -374 -161 -132 263 681 668 392 -39 -495 -633 -522 -273 -244
-17606 -244 -407 -574 -608 -433 -344 -460 -534 -502 -328 -361 -209 -261 -558 -573 -706 -572 -124 139 232 269 94 -103 -3 141 107 209
-17580 209 187 0 -398 -743 -984 -1043 -921 -687 -547 -555 -602 -634 -535 -446 -343 -537 -670 -580 -456 -451 -235 -451 -811 -919 -918 -940 -657
$$ packed form
-17762a11l49L0K66k37k20K11j8m37Q1K56L8J64M33M32Rm51m93k86J54J08Q8M30J48j83k34
-17737a71j80K04Q3P3L01N2j71m68n19k99J03L07N72L76n8l39n24k51M7K14K06j5p8Jj62L05
-17711c91M85L25L1m12k88r6k07k73j19J32K08j61m53j66K64J96O1L8J37J96J53K07J8k33
-17687c48O5p8n93l31L4M9K56L07K26%j89J32n1m56j77PJ87K39J87R1K4J6Q6J23L13O8kM9
-17659B34R7l6j47n2k61k96j44j10R4L4l1P1J0J19Q4j9m19m65j51l3R4o8R1L43M70J65L29
-17632CK98n8j08j51K4n3L1M22j97j99J75j49m43L1K13K9L95M18j3k76m31m56j38J11K49K9
-17606b44j63j67l4J75Q9j16p4L2J74l3J52n2k97j5j33J34M48K63R3L7j75j97J00J44l4J02
-17580B09k2j87l98l45k41n9J22K34J40qm7l2R9Q9J03j94j33R0J24NK16k16l60j08Jk2K83
$$ plain form
-17553 -657 -536 -637 -745 -826 -708 -691 -744 -635 -779 -892 -689 -503 -153 -129 -285 -412 -585 -776 -975 -1219 -1272 -1180 -1334 -1198 -727
-17528 -727 -200 21 201 142 -128 -176 -142 -237 -333 -306 -302 -263 -390 -621 -972 -1175 -974 -533 -240 -103 2 297 339 260 250 -32 -358
-17501 -358 -481 -480 -158 96 9 -411 -933 -1131 -799 -455 -383 -257 -117 -27 -174 -302 -327 -235 -79 134 374 253 -27 -375 -440
-17476 -440 -267 23 223 -68 -481 -635 -772 -833 -947 -974 -913 -683 -311 -249 -347 -346 -41 250 330 487 399 197 81 156 22 -159
-17450 -159 -310 -461 -354 -75 259 279 -50 -10 138 50 67 -63 -547 -758 -725 -551 -145 -11 -271 -247 -108 -277 -295 -27 -10
-17425 -10 -81 60 110 211 17 -254 -301 -286 -211 -244 -500 -862 -936 -970 -993 -903 -715 -621 -797 -952 -978 -900 -795 -725 -327 -472 -823 -923
-17397 -923 -642 -349 -317 -260 -328 -522 -763 -835 -838 -764 -652 -477 -340 -213 -222 -419 -755 -908 -979 -853 -790 -691 -624 -990 -1288 -1060 -694
-17370 -694 -668 -795 -835 -649 -339 -243 -439 -568 -385 -528 -823 -1044 -684 -300 -507 -809 -839 -539 -411 -10 408 341 343 161 26
$$ packed form
-17553f57J21j01j08q1J18J7n3J09j44j13K03J86L50K4j56j27j73j91j99k44n3R2j54J36M71
-17528g27N27K21J80n9k70m8L4r5r6K7ML9j27k31l51k03K01M41K93J37J05K95M2p9j0k82l26
-17501c58j23JL22K54q7m20n22j98L32L44P2J26J40R0j47j28k5R2J56K13K40j21k80l48o5
-17476d40J73K90K00k91m13j54j37o1j14k7O1K30L72O2r8JL05K91Q0J57q8k02j16P5j34j81
-17450a59j51j51J07K79L34K0l29M0J48q8J7j30m84k11L3J74M06J34k60K4J39j69j8K68J7
-17425a0p1J41N0J01j94k71m7J5P5l3k56l62p4l4k3R0J88R4j76j55k6P8J05P0L98j45l51j00
-17397i23K81K93L2N7o8j94k41p2lP4J12J75J37J27rj97l36j53p1J26O3R9O7l66k98K28L66
-17370f94K6j27m0J86L10R6j96j29J83j43k95k21L60L84k07l02l0L00J28M01M18o7Kj82j35
$$ plain form
-17345 26 10 -143 -355 -279 -176 -186 -588 -994 -974 -986 -1243 -1132 -784 -566 -623 -565 -222 -49 -305 -563 -561 -395 -210 -47 171 376
-17319 376 371 323 256 281 450 451 119 -358 -358 -196 -177 -410 -709 -624 -562 -577 -101 520 650 472 144 -70 -164 -269 -275 -102 -101 -150 -245
-17290 -245 -574 -864 -740 -560 -675 -794 -768 -763 -725 -631 -340 -191 -173 -32 69 224 92 -195 -406 -535 -679 -897 -1158 -1273 -1211
-17265 -1211 -1114 -733 -364 -315 -456 -594 -679 -561 -323 -186 8 223 100 -341 -510 -431 -412 -516 -700 -665 -270 -187 -408 -521 -320
-17240 -320 153 382 289 141 -161 -265 -238 -194 -402 -631 -513 -321 -369 -514 -368 3 96 -161 -382 -379 -506 -657 -551 -540 -510 -224
-17214 -224 4 127 -234 -227 330 593 379 -2 -405 -541 -758 -939 -763 -688 -800 -826 -1029 -1091 -692 -338 -50 -54 -81 -153 -210 -526
-17188 -526 -891 -1265 -1528 -1260 -883 -520 -393 -205 -151 -559 -910 -912 -732 -406 -323 -483 -624 -635 -503 -300 -149 -243 -588 -881 -1004
-17163 -1004 -807 -469 -210 -99 -122 -599 -893 -816 -801 -620 -619 -655 -744 -793 -773 -693 -747 -877 -862 -1004 -1217 -951 -556 -273 96 461
$$ packed form
-17345B6j6j53k12P6J03j0m02m06K0j2k57J11L48K18n7N8L43J73k56k58KJ66J85J63K18K05
-17319C76nm8o7K5J69Jl32m77%J62J9k33k99Q5O2j5M76O21J30j78l28k14r4j05oJ73Jm9r5
-17290b45l29k90J24J80j15j19K6NL8R4K91J49J8J41J01J55j32k87k11j29j44k18k61j15O2
-17265a211R7L81L69M9j41j38q5J18K38J37J94K15j23m41j69P9J9j04j84L5L95Q3k21j13K01
-17240c20M73K29r3j48l02j04K7M4k08k29J18J92m8j45J46L71R3k57k21Lj27j51J06J1L0K86
-17214b24K28J23l61PN57K63k14l81m03j36k17j81J76P5j12k6k03o2L99L54K88mk7p2n7l16
-17188e26l65l74k63K68L77L63J27J88N4m08l51kJ80L26Q3j60j41j1J32K03J51r4l45k93j23
-17163a004J97L38K59J11k3m77k94P7J5J81Jl6q9m9K0Q0n4j30J5j42k13K66L95K83L69L65
$$ plain form
-17137 461 377 106 7 8 -188 -283 -274 -363 -563 -689 -592 -425 -443 -662 -675 -652 -745 -705 -552 -381 -338 -586 -853 -972 -981 -1221 -1541 -1582 -1510
-17108 -1510 -929 -286 -111 -77 -160 -382 -450 -263 -142 -169 -270 -330 -225 -255 -305 -449 -479 -450 -811 -990 -867 -629 -701 -937 -826 -657
-17082 -657 -563 -428 -517 -828 -1097 -1190 -963 -658 -578 -703 -780 -957 -938 -918 -861 -627 -436 -279 -250 -248 -28 -121 -550 -880 -890 -699 -663
-17055 -663 -726 -874 -722 -500 -314 -116 -114 -380 -864 -1241 -1079 -458 65 210 181 -97 -270 -308 -342 -67 -157 -335 -171 -339 -696
-17030 -696 -844 -772 -609 -415 -240 -358 -623 -691 -700 -634 -570 -599 -544 -511 -451 -293 -254 -251 -248 -145 149 452 428 157 -31 -190 -118 -201 -347
-17001 -347 -93 233 -45 -513 -691 -875 -1044 -926 -839 -920 -922 -686 -413 -104 107 33 -157 -344 -484 -362 -157 -171 -451 -830 -768
-16976 -768 -836 -951 -871 -851 -735 -621 -509 -563 -584 -799 -864 -634 -432 -454 -729 -814 -584 -429 -426 -325 -176 -55 -109 16 82 -125 -293
-16949 -293 -362 -438 -457 -809 -930 -827 -865 -1199 -1138 -440 -150 -288 -406 -329 -228 -415 -497 -283 -102 17 162 115 118 83 4 -387 -859
$$ packed form
-17137D61q4k71r9Jj96r5Rq9k00j26R7J67j8k19j3K3r3M0J53J71M3k48k67j19rk40l20m1P2
-17108a510N81O43J75L4q3k22o8J87J21k7j01o0J05l0n0j44l0K9l61j79J23K38p2k36J11J69
-17082f57R4J35q9l11k69r3K27L05Q0j25p7j77J9K0N7K34J91J57K9KK20r3m29l30j0J91L6
-17055f63o3j48J52K22J86J98Kk66m84l77J62O21N23J45k9k78j73l8l4K75r0j78J64j68l57
-17030f96j48P2J63J94J75j18k65o8rO6O4k9N5L3O0J58L9LLJ03K94L03k4k71j88j59P2q3j46
-17001c47K54L26k78m68j78j84j69J18Q7q1kK36K73L09K11p4j90j87j40J22K05j4k80l79O2
-16976g68o8j15Q0K0J16J14J12n4k1k15o5K30K02k2k75q5K30J55LJ01J49J21n4J25O6k07j68
-16949b93o9p6j9l52j21J03l8l34O1O98K90j38j18P7J01j87q2K14J81J19J45m7Ll5p9l91m72
$$ plain form
-16922 -859 -881 -899 -1095 -1123 -871 -708 -581 -438 -464 -781 -955 -1146 -1178 -876 -398 -369 -299 74 134 -37 -140 -560 -936 -731 -565
-16897 -565 -661 -555 -544 -691 -652 -607 -683 -546 -273 -74 66 -147 -686 -981 -924 -678 -690 -865 -1023 -804 -651 -521 -369 -530 -663
-16872 -663 -755 -892 -946 -1001 -1029 -688 -427 -193 -95 -195 -416 -599 -641 -627 -711 -696 -473 -210 228 389 405 214 -54 -199 -282 -327 -514
-16845 -514 -765 -669 -520 -341 -204 -302 -653 -764 -624 -462 -212 -571 -952 -618 -173 -345 -611 -840 -882 -683 -706 -741 -489 -122
-16821 -122 -41 -158 -372 -524 -520 -285 -98 97 327 158 -116 194 503 304 75 -81 -387 -587 -845 -880 -379 26 -15 -256
-16797 -256 -373 -219 -22 47 53 -284 -731 -956 -939 -1017 -1061 -1066 -974 -912 -897 -705 -469 -376 -524 -635 -780 -501 -92 -42 24 -253 -343 -390
-16769 -390 -776 -1155 -1076 -807 -351 -37 209 205 -128 -439 -503 -469 -237 -5 -116 -414 -363 -338 -204 225 492 468 385 275 17 -326
-16743 -326 -432 -347 -283 -461 -435 -400 -393 -366 -255 -344 -578 -792 -901 -703 -577 -643 -635 -796 -834 -835 -723 -729 -720 -704 -861 -897 -802 -658 -514 -150
$$ packed form
-16922h59k2j8j96k8K52J63J27J43k6l17j74j91l2L02M78K9P0L73O0j71j03m20l76K05J66
-16897e65r6J06J1j47L9M5p6J37K73J99J40k13n39k95N7K46j2j75j58K19J53J30J52j61j33
-16872f63r2j37n4n5k8L41K61K34R8j00k21j83m2J4q4J5K23K63M38J61J6j91k68j45q3m5j87
-16845e14k51R6J49J79J37r8l51j11J40J62K50l59l81L34M45j72k66k29m2J99k3l5K52L67
-16821a22Q1j17k14j52MK35J87J95K30j69k74L10L09j99k29j56l06k00k58l5N01M05m1k41
-16797b56j17J54J97O9Ol37m47k25J7p8m4nR2O2J5J92K36R3j48j11j45K79M09N0O6k77r0m7
-16769c90l86l79P9K69M56L14K46ml33l11o4L4K32K32j11k98N1K5J34M29K67k4q3j10k58l43
-16743c26j06Q5O4j78K6L5PK7J11q9k34k14j09J98J26o6Qj61l8jJ12oRJ6j57l6R5J44J44L64
$$ plain form
-16713 -150 57 119 208 174 103 -49 -112 -104 -192 -164 -75 -200 -240 -315 -585 -549 -342 -387 -332 -9 -112 -439 -558 -708 -777 -724 -596 -530 -716
-16684 -716 -956 -991 -923 -734 -492 -333 -191 -295 -263 -180 -285 -380 -81 476 595 421 74 -300 -428 -260 -263 -608 -789 -627 -504
-16659 -504 -662 -785 -940 -825 -571 -443 -469 -545 -742 -836 -556 -110 -144 -492 -493 -419 -297 16 -6 -316 -654 -811 -691 -679 -805 -433
-16633 -433 -131 -404 -707 -634 -505 -541 -519 -289 -180 -190 -180 -206 -451 -429 -207 -566 -1007 -855 -339 -80 74 116 135 243 163 -462
-16607 -462 -1010 -853 -381 -64 -314 -638 -399 -262 -200 -87 -210 -502 -651 -225 118 383 232 -369 -805 -1037 -952 -623 -777
-16584 -777 -1155 -1232 -828 -678 -878 -911 -896 -1013 -1055 -702 -361 -296 -493 -701 -661 -498 -329 -513 -706 -532 -435 -464 -354 -512 -826
-16559 -826 -983 -722 -528 -562 -651 -946 -881 -671 -811 -810 -709 -786 -847 -773 -705 -471 -258 -380 -804 -776 -493 -191 -205 -622 -834 -612
-16533 -612 -328 -337 -246 -281 -228 -19 44 -125 -561 -725 -816 -937 -660 -287 -85 206 436 341 109 -306 -410 -128 181 268 -53 -487
$$ packed form
-16713a50K07O2Q9l4p1j52o3Qq8K8Q9j25m0p5k70L6K07m5N5L23j03l27j19j50o9N3J28O6j86
-16684g16k40l5O8J89K42J59J42j04L2Q3j05r5K99N57J19j74l47l74j28J68ll45j81J62J23
-16659e04j58j23j55J15K54J28k6p6j97r4K80M46l4l48jP4J22L13k2l10l38j57J20J2j26L72
-16633d33L02k73l03P3J29l6K2K30J09j0J0k6k45K2K22l59m41J52N16K59J54M2J9J08q0o25
-16607d62n48J57M72L17k50l24K39J37O2J13j23k92j49M26L43K65j51o01m36k32Q5L29j54
-16584g77l78p7M04J50k00l3J5j17m2L53L41O5j97k08M0J63J69j84j93J74R7k9J10j58l14
-16559h26j57K61J94l4q9k95O5K10j40JJ01p7o1P4O8K34K13j22m24K8K83L02j4m17k12K22
-16533f12K84rR1l5N3K09O3j69m36j64r1j21K77L73K02K91K30r5k32m15j04K82L09Q7l21m34
$$ plain form
-16507 -487 -553 -523 -459 -436 -642 -998 -1201 -1155 -844 -179 327 421 255 113 169 126 -125 -280 -87 -262 -576 -535 -253 -219 -801 -1123
-16481 -1123 -1203 -1315 -1047 -443 -231 -542 -1015 -1198 -1048 -974 -1042 -933 -845 -893 -968 -1058 -1064 -1131 -969 -872 -904 -844 -618 -497 -516 -575 -602 -596
-16453 -596 -732 -614 -390 -255 -20 57 266 565 474 -113 -579 -761 -720 -721 -437 193 453 435 279 167 184 167 111 49 150 179
-16427 179 56 13 -77 -341 -425 -354 -522 -663 -520 -182 -80 -131 -90 -133 -158 -357 -500 -418 -516 -870 -826 -552 -494 -630 -666 -625 -530 -318
-16399 -318 -345 -577 -753 -1067 -1148 -745 -451 -241 174 486 433 163 51 -18 -256 -384 -128 102 101 89 -62 -123 -441 -707 -822
-16374 -822 -828 -935 -1144 -1628 -1732 -1102 -770 -763 -856 -876 -1065 -924 -706 -624 -576 -535 -429 -192 -141 -375 -482 -403 -299 -437 -657 -865
-16348 -865 -863 -728 -546 -197 173 12 -448 -631 -606 -885 -1166 -1345 -1397 -1030 -723 -411 -354 -220 48 -412 -956 -1003 -827 -473 -376
-16323 -376 -451 -635 -775 -615 -528 -438 -381 -217 64 218 -137 -592 -716 -471 -523 -876 -1156 -1231 -928 -618 -726 -1041 -1073 -967 -827
$$ packed form
-16507d87o6L0O4K3k06l56k03M6L11O65N06R4j66j42N6m3k51j55J93j75l14M1K82L4n82l22
-16481a123q0j12K68O04K12l11m73j83J50P4o8J09Q8m8p5r0oo7J62R7l2O0K26J21j9n9k7O
-16453e96j36J18K24J35K35P7K09K99r1n87m66j82M1jK84O30K60j8j56j12J7j7n6o2J01K9
-16427A79j23m3r0k64q4P1j68j41J43L38J02n1M1m3k5j99j43Q2r8l54M4K74N8j36l6M1R5K12
-16399c18k7k32j76l14q1M03K94K10M15L12n3k70j12o9k38j28K56K30jj2j51o1l18k66j15
-16374h22oj07k09m84j04O30L32Pr3k0j89J41K18Q2M8M1J06K37N1k34j07P9J04j38k20k08
-16348h65KJ35J82L49L70j61m60j83K5k79k81j79n2L67L07L12N7J34K68m60n44m7J76L54R7
-16323c76p5j84j40J60Q7R0N7J64K81J54l55m55j24K45n2l53k80p5L03L10j08l15l2J06J40
$$ plain form
-16298 -827 -598 -309 -167 176 230 -109 -261 -35 230 305 276 -10 -227 -117 123 107 258 408 649 1063 1196 1050 644 -60
-16274 -60 -468 -408 -350 -369 -281 -88 113 -6 -265 -408 -664 -752 -600 -405 -74 72 210 185 35 -189 -464 -614 -453 -312 -484
-16249 -484 -620 -898 -1150 -1240 -1124 -910 -826 -851 -636 -491 -678 -631 -458 -73 281 467 319 -253 -624 -777 -646 -556 -440 -181
-16225 -181 -281 -484 -315 -203 -327 -434 -344 -349 -521 -767 -650 -230 -83 -323 -229 -50 -336 -739 -930 -1019 -779 -262 -95 61
-16201 61 304 387 432 501 498 300 36 -102 -435 -555 -406 -481 -684 -563 -371 -460 -636 -641 -508 -343 -223 -374 -384 -347 -400 -547 -532
-16174 -532 -379 -358 -382 -399 -143 36 -146 -322 -266 -205 -189 -57 -115 -337 -549 -479 -426 -331 -379 -472 -442 -441 -185 132 218 391 748 542
-16146 542 -28 -389 -480 -661 -936 -971 -864 -728 -336 46 -102 -737 -1094 -1200 -971 -528 39 105 -197 -364 -547 -791 -749 -683
-16122 -683 -850 -1112 -1284 -1190 -1316 -1343 -1014 -624 -543 -840 -1197 -1271 -822 -635 -576 -418 -609 -921 -853 -483 -76 -41 -336 -615 -811
$$ packed form
-16298h27K29K89J42L43N4l39j52K26K65P5k9k86k17J10K40j6J51J50K41M14J33j46m06p04
-16274f0m08O0N8j9Q8J93K01j19k59j43k56q8J52J95L31J46J38k5j50k24k75j50J61J41j72
-16249d84j36k78k52r0J16K14Q4k5K15J45j87M7J73L85L54J86j48n72l71j53J31R0J16K59
-16225a81j00k03J69J12j24j07R0nj72k46J17M20J47k40R4J79k86m03j91q9K40N17J67J56
-16201F1K43Q3M5O9lj98k64j38l33j20J49p5k03J21J92q9j76nJ33J65J20j51j0L7n3j47J5
-16174e32J53K1k4j7K56J79j82j76N6O1J6J32n8k22k12P0N3R5m8r3L0JK56L17Q6J73L57k06
-16146E42n70l61r1j81k75l5J07J36L92L82j48o35l57j06K29M43N67O6l02j67j83k44M2O6
-16122f83j67k62j72R4j26k7L29L90Q1k97l57p4M49J87N9J58j91l12O8L70M07L5k95k79j96
$$ plain form
-16097 -811 -787 -1025 -1425 -1610 -1563 -1419 -1195 -883 -655 -180 80 -293 -940 -1187 -1197 -1068 -794 -507 -177 -127 -525 -652 -522 -731
-16073 -731 -752 -976 -1112 -916 -1051 -907 -541 -370 -339 -353 -315 -287 -328 -491 -86 49 -251 -535 -605 -964 -1259 -1159 -1019 -1100 -1161 -921
-16047 -921 -537 -543 -981 -1217 -1116 -899 -611 -364 -204 -237 -476 -527 -216 202 396 359 43 -387 -801 -982 -1168 -1433 -1504 -1324 -1050
-16022 -1050 -1037 -1374 -1609 -1482 -1020 -408 -177 -342 -612 -830 -949 -1221 -1381 -1267 -1092 -1221 -1328 -1304 -889 -217 -19 -134 -253
-15999 -253 -348 -359 -33 189 372 401 201 299 596 678 563 242 -168 -496 -755 -705 -369 -258 -238 -186 -444 -595 -463 -84 180
-15974 180 287 323 387 608 511 350 369 147 28 422 953 997 725 326 33 -90 -363 -689 -954 -1103 -1091 -961 -794 -735 -749
-15949 -749 -640 -503 -276 -331 -169 39 292 570 587 333 110 67 -9 232 271 23 -124 -46 -59 -77 -202 -597 -769 -510 -506 -439
-15923 -439 -360 -322 -281 -429 -727 -789 -603 -308 -408 -630 -699 -610 -494 -626 -573 -372 -213 -179 -78 60 -36 -13 -172 -479 -473 -300 60
$$ packed form
-16097h11K4k38m00j85M7J44K24L12K28M75K60l73o47k47j0J29K74K87L30N0l98j27J30k09
-16073g31k1k24j36J96j35J44L66J71L1j4L8K8m1j63M05J35l00k84p0l59k95J00J40q1o1K40
-16047i21L84om38k36J01K17K88K47J60l3k39n1L11M18J94l7l16m30m14j81j86k65p1J80K74
-16022a050J3l37k35J27M62O12K31j65k70k18j19k72j60J14J75j29j07K4M15O72J98j15j19
-15999b53r5j1L26K22J83K9k00R8K97Q2j15l21m10l28k59N0L36J11K0N2k58j51J32L79K64
-15974A80J07L6O4K21r7j61J9k22j19L94N31M4k72l99k93j23k73l26k65j49J2J30J67N9j4
-15949g49J09J37K27n5J62K08K53K78J7k54k23m3p6K41L9k48j47P8j3j8j25l95j72K59MO7
-15923d39P9L8M1j48k98o2J86K95j00k22o9Q9J16j32N3K01J59L4J01J38r6K3j59l07OJ73L60
$$ plain form
-15896 60 235 -78 -506 -801 -1019 -939 -705 -563 -556 -491 -506 -773 -896 -984 -1192 -1206 -1244 -1152 -1104 -904 -497 -196 -209 -371 -444 -601 -863
-15869 -863 -1126 -1272 -995 -730 -478 -115 -73 -202 -360 -707 -932 -732 -902 -1017 -918 -883 -699 -483 -619 -723 -765 -812 -866 -665 -562
-15844 -562 -764 -803 -480 -147 -248 -466 -692 -572 -325 -208 233 502 188 -223 -603 -1014 -1024 -829 -480 -363 -497 -455 -291 -170
-15820 -170 -51 -21 13 101 -40 -67 -153 -205 -21 211 30 -159 -313 -686 -1092 -1069 -1028 -769 -607 -603 -677 -782 -788 -577 -473 -693 -752
-15793 -752 -468 -196 55 24 -44 -46 -242 -228 -373 -469 -422 -644 -932 -744 -492 -539 -775 -832 -837 -1078 -1192 -1199 -936 -442 -236 -118 -257
-15766 -257 -164 124 211 97 126 -80 -244 -199 -324 -308 -146 -119 8 181 40 -243 -447 -884 -1162 -1070 -863 -910 -1136 -1226 -1185 -1040
-15740 -1040 -782 -585 -551 -466 -410 -83 340 671 308 -354 -527 -256 54 359 497 542 415 165 375 314 256 377 162 -136
-15716 -136 -221 -148 -218 -442 -790 -750 -619 -663 -507 -207 -90 -222 -466 -476 -463 -538 -519 -277 102 154 -95 -243 -208 -87 -154 -195 -249
$$ packed form
-15896F0J75l13m28k95k18Q0K34J42PO5j5k67j23q8k08j4l8R2M8K00M07L01j3j62p3j57k62
-15869h63k63j46K77K65K52L63M2j29j58l47k25K00j70j15R9L5J84K16j36j04m2m7n4K01J03
-15844e62k02l9L23L33j01k18k26J20K47J17M41K69l14m11l80m11j0J95L49J17j34M2J64J21
-15820a70J19L0L4Q8j41k7q6n2J84K32j81j89j54l73m06K3M1K59J62Mp4j05oK11J04k20n9
-15793g52K84K72K51l1o8kj96J4j45r6M7k22k88J88K52m7k36n7nk41j14pK63M94K06J18j39
-15766b57R3K88Q7j14K9k06j64M5j25J6J62K7J27J73j41k83k04m37k78R2K07m7k26r0M1J45
-15740a040K58J97L4Q5N6L27M23L31l63o62j73K71L10L05J38M5j27k50K10o1n8J21k15k98
-15716a36q5P3p0k24l48M0J31m4J56L00J17j32k44j0J3p5J9K42L79N2k49j48L5J21o7m1n4
$$ plain form
-15689 -249 -333 -366 -227 -242 -42 124 -72 -411 -640 -681 -735 -719 -940 -1030 -898 -891 -832 -952 -1137 -1342 -1220 -673 -272 -387 -348 -218
-15663 -218 -343 -407 -360 -185 148 320 3 -409 -764 -1236 -1371 -1278 -1045 -827 -543 -210 -74 -199 -308 -510 -923 -1155 -1236 -1091
-15639 -1091 -800 -426 -75 95 112 261 37 -643 -982 -1114 -845 -506 -407 -421 -588 -460 -350 -410 -582 -524 -92 -191 -559 -519 -383
-15614 -383 -65 -97 -337 -644 -1036 -1183 -1376 -1437 -1252 -1215 -1165 -1081 -910 -774 -759 -829 -849 -577 -333 -217 -186 -282 -284 -374 -396 -378 -570 -468
-15586 -468 -361 -278 -191 -49 -302 -424 -665 -800 -687 -934 -1195 -1187 -1517 -1730 -1654 -1558 -1278 -1138 -971 -892 -724 -460 -603 -1068 -1319
-15561 -1319 -989 -679 -747 -971 -788 -370 41 63 -200 -57 223 131 -243 -539 -609 -709 -976 -804 -502 -557 -649 -918 -1339 -1461
-15537 -1461 -1224 -1111 -1019 -815 -1137 -1244 -1031 -922 -1054 -1124 -1015 -1160 -1544 -1585 -1461 -1367 -968 -345 70 -54 -474 -747 -873 -834
-15513 -834 -916 -946 -796 -958 -1604 -1732 -1340 -1120 -1220 -1038 -642 -529 -496 -390 -366 -144 215 303 -36 -558 -784 -807 -721 -567 -363
$$ packed form
-15689b49q4l3J39j5K00J66j96l39k29m1n4J6k21r0J32PN9j20j85k05J22N47M01j15L9J30
-15663b18j25o4M7J75L33J72l17m12l55m72j35R3K33K18K84L33J36j25j09k02m13k32q1J45
-15639a091K91L74L51J70J7J49k24o80l39j32K69L39R9j4j67J28J10o0j72N8M32r9l68M0J36
-15614c83L18l2k40l07l92j47j93o1J85L7N0Q4J71J36J5p0k0K72K44J16L1r6kr0k2J8j92J02
-15586d68J07Q3Q7J42k53j22k41j35J13k47k61Ql30k13P6R6K80J40J67P9J68K64j43m65k51
-15561a319L30L10o8k24J83M18M11K2k63J43K80r2l74k96p0j00k67J72L02n5r2k69m21j22
-15537a461K37J13R2K04l22j07K13J09j32p0J09j45l84m1J24R4L99O23M15j24m20k73j26L9
-15513h34q2l0J50j62o46j28L92K20j00J82L96J13L3J06K4K22L59Q8l39n22k26k3Q6J54K04
$$ plain form
-15488 -363 -239 -52 105 -75 -259 -249 -161 148 129 32 89 232 403 148 -380 -788 -618 -680 -847 -729 -404 125 221 -92 -609
-15463 -609 -867 -716 -676 -931 -491 -212 -538 -426 190 724 869 560 -196 -819 -740 -442 -564 -817 -1203 -1697 -1809 -1320 -602
-15440 -602 -327 -444 -499 -494 -389 -153 -102 -129 -292 -635 -879 -763 -344 -211 26 255 532 626 348 250 41 -202 -208 -271 -269 -344 8
-15413 8 360 462 33 -355 -288 -43 356 326 148 268 580 686 465 147 -264 -573 -682 -651 -666 -559 -416 -473 -451 -501 -702 -393
-15387 -393 -90 -331 -365 57 248 376 141 -126 -132 -170 -456 -1019 -1323 -1323 -1172 -1116 -997 -771 -748 -1010 -1155 -1010 -876 -716 -363
-15362 -363 79 -45 -402 -636 -630 -545 -298 -77 -108 -599 -1141 -1333 -1153 -928 -766 -341 -113 -51 80 237 320 379 10 -365 -670
-15337 -670 -768 -446 -640 -1045 -1354 -1396 -1137 -726 -312 -193 -546 -822 -892 -1185 -1116 -1083 -1382 -1451 -1258 -1319 -1247 -980 -793 -833 -886 -825
-15311 -825 -796 -531 68 210 13 -224 -406 -389 -385 -345 -389 -561 -645 -561 -536 -481 -591 -615 -524 -579 -661 -405 13 36 -149 -300 -542 -542
$$ packed form
-15488c63J24J87J57j80j84J0Q8L09j9r7N7J43J71k55n28m08J70o2j67J18L25N29R6l13n17
-15463f09k58J51M0k55M40K79l26J12O16N34J45l09p56o23P9K98j22k53l86m94j12M89P18
-15440f02K75j17n5NJ05K36N1k7j63l43k44J16M19J33K37K29K77R4k78r8k09k43oo3Kp5L52
-15413HL52J02m29l88O7K45L99l0j78J20L12J06k21l18m11l09j09L1j5J07J43n7K2n0k01L09
-15387c93L03k41l4M22J91J28k35k67ol8k86n63l04%J51N6J19K26K3k62j45J45J34J60L53
-15362c63M42j24l57k34OQ5K47K21l1m91n42j92J80K25J62M25K28O2J31J57Q3N9l69l75l05
-15337f70r8L22j94m05l09m2K59M11M14J19l53k76p0k93O9L3k99o9J93o1P2K67J87m0n3O1
-15311h25K9K65N99J42j97k37j82J7MM0m4j72q4Q4K5N5j10k4R1n5q2K56M18K3j85j51k42%
$$ plain form
-15283 -542 -540 -754 -886 -780 -699 -706 -573 -167 -29 -310 -542 -599 -427 -343 -478 -817 -1124 -1105 -999 -856 -558 -520 -634 -527 -489 -628
-15257 -628 -810 -584 -137 149 -56 -390 -459 -229 -127 -630 -1033 -936 -826 -841 -794 -413 -123 -428 -720 -910 -903 -564 -249 -224 -428
-15232 -428 -828 -1336 -1373 -1129 -857 -691 -651 -601 -702 -986 -1108 -688 -549 -564 -553 -400 -286 -273 -73 173 501 600 388 359 432 409
-15206 409 77 -164 -225 -228 -332 -389 -243 52 230 -31 -539 -1091 -1246 -946 -883 -829 -810 -892 -887 -764 -667 -777 -684 -421 -164 252 537
-15179 537 656 555 -13 -555 -498 -7 186 34 -257 -362 -152 -33 -42 -379 -448 -252 30 245 -102 -603 -866 -1151 -1091 -981
-15155 -981 -902 -709 -487 -556 -454 -201 -158 -300 -515 -688 -744 -629 -879 -1008 -806 -439 -43 -75 -169 -289 -531 -741 -971 -1074 -1081
-15130 -1081 -900 -697 -347 2 117 81 -112 -251 -312 -635 -972 -1275 -1237 -1015 -470 -167 -301 -501 -669 -645 -648 -414 -325 -335 -298
-15105 -298 -561 -584 -481 -694 -923 -897 -708 -392 -90 163 359 516 402 -59 -58 101 211 377 596 679 775 562 291 84 97
$$ packed form
-15283e42Kk14j32J06Q1pJ33M06J38k81k32n7J72Q4j35l39l07J9J06J43K98L8j14J07L8j39
-15257f28j82K26M47K86k05l34o9K30J02n03m03R7J10j5M7L81K90l05k92j90PL39L15K5k04
-15232d28m00n08l7K44K72J66M0N0j01k84j22M20J39j5J1J53J14J3K00K46L28R9k12k9P3k3
-15206D09l32k41o1lj04n7J46K95J78k61n08n52j55L00O3N4J9q2NJ23R7j10R3K63K57M16K85
-15179E37J19j01n68n42N7M91J93j52k91j05K10J19rl37o9J96K82K15l47n01k63k85O0J10
-15155i81P9J93K22o9J02K53M3j42k15j73n6J15k50j29K02L67L96l2r4j20k42k10k30j03p
-15130a081J81K03L50L49J15l6j93j39o1l23l37l03L8K22N45L03j34k00j68K4lK34Q9j0L7
-15105b98k63k3J03k13k29K6J89L16L02K53J96J57j14m61JJ59J10J66K19Q3R6k13k71k07J3
$$ plain form
-15080 97 195 2 -102 -152 -244 -638 -1085 -1379 -1296 -1002 -839 -880 -1237 -1281 -857 -603 -645 -799 -575 -234 -431 -713 -531 -186 -259 -632
-15054 -632 -912 -1174 -1045 -775 -509 -430 -671 -856 -807 -803 -677 -566 -746 -1288 -1752 -1863 -1570 -886 -466 -513 -401 -257 0 30 -179
-15029 -179 -438 -252 -224 -429 -484 -331 -226 -345 -534 -477 -454 -612 -949 -910 -530 -541 -867 -1081 -1117 -1310 -1375 -1173 -950 -797 -708 -622
-15003 -622 -638 -632 -368 -28 27 48 23 -363 -712 -803 -525 -508 -817 -1001 -1148 -1352 -1246 -1062 -770 -710 -669 -495 -615 -836 -904 -645
-14977 -645 -537 -406 -406 -694 -809 -887 -892 -941 -711 -657 -806 -1077 -1111 -895 -876 -861 -738 -561 -169 -461 -896 -1086 -1402 -1515 -1126 -605
-14951 -605 -749 -1183 -1318 -1003 -444 -126 -278 -420 -693 -980 -1013 -995 -894 -528 -191 -2 44 -106 -345 -691 -640 -180 322 564
-14927 564 543 305 200 -23 -162 -132 -231 -393 -561 -673 -469 -246 -138 -124 -103 -165 -211 -319 -412 -499 -526 -526 -544 -237 114 376 398
-14900 398 -18 -546 -578 -512 -875 -785 -539 -527 -181 203 181 -102 -395 -535 -419 -340 -296 -347 -190 184 333 152 -180 -219 109 210
$$ packed form
-15080I7R8j93j04n0r2l94m47k94Q3K94J63m1l57m4M24K54m2j54K24L41j97k82J82L45p3l73
-15054f32k80k62J29K70K66P9k41j85M9MJ26J11j80n42m64j11K93O84M20m7J12J44K57L0k09
-15029a79k59J86K8k05n5J53J05j19j89N7K3j58l37L9L80j1l26k14l6j93o5K02K23J53Q9Q6
-15003f22j6OK64L40N5K1k5l86l49r1K78J7l09j84j47k04J06J84K92O0M1J74j20k21o8K59
-14977f45J08J31%k88j15p8nm9K30N4j49k71l4K16J9J5J23J77L92k92m35j90l16j13L89N21
-14951f05j44m34j35L15N59L18j52j42k73k87l3J8J01L66L37J89M6j50k39l46N1M60N02K42
-14927E64k1k38j05k23j39L0r9j62j68j12K04K23J08J4K1o2m6j08r3q7k7%j8L07L51K62K2
-14900C98m16n28l2O6l63R0K46J2L46L84k2k83k93j40J16P9M4n1J57L74J49j81l32l9L28J01
$$ plain form
-14874 210 102 35 -166 -505 -920 -1305 -1297 -1039 -1149 -1348 -1420 -1373 -1076 -728 -799 -1012 -1120 -1081 -878 -547 -499 -652 -837 -952 -871 -692
-14848 -692 -512 -551 -610 -390 -110 -10 -77 -85 -362 -563 -512 -489 -581 -647 -686 -661 -569 -619 -620 -701 -738 -488 -358 -581 -641 -659 -649 -464 -295
-14819 -295 -271 -287 -523 -961 -962 -654 -145 162 331 556 766 590 293 187 305 458 395 63 -308 -591 -596 -753 -1024 -999 -655
-14794 -655 -340 -410 -554 -413 -480 -857 -1219 -1307 -1104 -860 -757 -452 -209 -309 -290 -315 -532 -715 -820 -763 -601 -563 -628 -750 -940
-14769 -940 -1059 -1151 -1255 -1394 -1444 -1472 -1405 -1197 -1175 -1316 -1499 -1570 -1514 -1302 -1256 -1251 -1163 -891 -561 -457 -509 -437 -282 -43 -215 -326 -358
-14742 -358 -350 -632 -733 -407 -173 -72 -64 -91 -241 -208 -17 14 -26 147 286 421 178 -470 -748 -895 -1075 -1012 -686 -514 -531 -210
-14716 -210 -150 -289 -208 -67 0 -291 -473 -670 -612 -401 -457 -481 -527 -434 -398 -716 -1130 -1256 -786 -424 -509 -626 -695 -762 -797 -1003 -1116
-14689 -1116 -1134 -1029 -951 -909 -912 -1064 -1210 -1104 -895 -951 -1010 -1099 -1327 -1255 -1208 -1037 -791 -782 -890 -941 -1180 -1273 -1188 -1180 -1165 -682 -161 58
$$ packed form
-14874B10j08o7k01l39m15l85QK58j10j99p2M7K97L48p1k13j08L9K03L31M8j53j85j15Q1J79
-14848f92J80l9n9K20K80J00o7qk77k01N1K3r2o6l9K5R2n0jq1l7K50J30k23o0j8J0J85J69
-14819b95K4j6k36m38jL08N09L07J69K25K10j76k97j06J18J53o3l32l71k83nj57k71K5L44
-14794f55L15p0j44J41o7l77l62q8K03K44J03L05K43j00J9k5k17j83j05N7J62L8o5j22j90
-14769i40j19r2j04j39n0k8O7K08K2j41j83p1N6K12M6NQ8K72L30J04n2P2J55K39j72j11l2
-14742c58Qk82j01L26K34J01Qk7j50L3J91L1m0J73J39J35k43o48k78j47j80O3L26J72j7L21
-14716b10O0j39Q1J41O7k91j82j97N8K11n6k4m6R3L6l18m14j26M70L62q5j17o9o7l5k06j13
-14689a116j8J05P8M2lj52j46J06K09n6n9q9k28P2M7J71K46Rj08n1k39r3Q5QJ5M83N21K19
$$ plain form
-14661 58 176 -5 -312 -304 -243 -539 -843 -1130 -1396 -1331 -1294 -876 -312 -424 -512 -557 -570 -589 -447 -412 -462 -466 -628 -638 -882 -1186 -1270 -1292
-14633 -1292 -1206 -792 -437 -449 -656 -740 -845 -1006 -928 -850 -911 -1028 -946 -604 -393 -606 -1064 -1265 -1271 -1175 -1043 -1058 -1105 -986 -953 -852 -580
-14606 -580 -536 -715 -503 -224 -211 -183 -202 -606 -1029 -1177 -1107 -1037 -1193 -1294 -1284 -1254 -1316 -1294 -1288 -1356 -1123 -879 -840 -796 -578 -258 -165 -174 -262
-14577 -262 -494 -594 -530 -561 -491 -347 -260 -208 -154 -53 -209 -449 -586 -864 -1233 -1254 -1431 -1617 -1567 -1201 -573 -434 -529 -512 -371 -286
-14551 -286 -450 -669 -531 -292 -182 -220 -399 -325 -392 -410 -331 -309 -406 -623 -734 -941 -996 -565 -327 -469 -567 -505 -799 -1186 -1237 -1058
-14525 -1058 -686 -557 -545 -760 -720 -516 -568 -638 -568 -576 -582 -700 -664 -797 -831 -584 -485 -429 -94 319 264 -69 20 196 192 -292 -669 -335
-14497 -335 -94 -240 -609 -767 -778 -1012 -897 -624 -462 -396 -689 -1017 -1022 -825 -788 -831 -648 -668 -615 -463 -409 -568 -563 -542 -701 -413 -162
-14470 -162 -66 -191 -586 -836 -756 -719 -818 -1198 -1509 -1435 -1428 -1689 -2014 -2248 -2050 -1714 -1376 -1106 -1053 -911 -718 -758 -851 -846 -766 -801 -754 -762
$$ packed form
-14661E8J18j81l07QO1k96l04k87k66O5L7M18N64j12q8m5j3j9J42L5n0mj62j0k44l04q4k2
-14633a292Q6M14L55j2k07q4j05j61P8P8o1j17Q2L42K11k13m58k01oR6J32j5m7J19L3J01K72
-14606e80M4j79K12K79J3K8j9m04m23j48P0P0j56j01J0L0o2K2Oo8K33K44L9M4K18L20R3rq8
-14577b62k32j00O4l1P0J44Q7N2N4J01j56k40j37k78l69k1j77j86N0L66O28J39r5J7J41Q5
-14551b86j64k19J38K39J10l8j79P4o7j8P9K2r7k17j11k07n5M31K38j42r8O2k94l87n1J79
-14525a058L72J29J2k15M0K04n2p0P0qoj18L6j33l4K47R9N6L35M13n5l33Q9J76mm84l77L34
-14497c35K41j46l69j58j1k34J15K73J62O6k93l28nJ97L7m3J83k0N3J52N4j59NK1j59K88K51
-14470a62R6j25l95k50Q0L7r9l80l11P4Pk61l25k34J98L36L38K70N3J42J93m0r3NQ0l5M7q
$$ plain form
-14442 -762 -835 -766 -707 -1063 -1284 -1244 -1132 -861 -723 -558 -400 -223 55 17 -172 -376 -634 -788 -842 -759 -432 -211 -148 -98 -87 -218
-14416 -218 -76 121 31 186 287 137 -174 -662 -917 -831 -907 -1260 -1549 -1324 -807 -628 -661 -691 -673 -550 -561 -759 -652 -700 -1207
-14391 -1207 -1496 -1482 -1292 -948 -959 -1169 -1091 -967 -798 -654 -730 -1001 -1172 -981 -771 -616 -631 -693 -413 -385 -588 -521 -193 -378 -776
-14366 -776 -748 -510 -544 -773 -879 -848 -775 -767 -581 -284 -69 134 -99 -375 -85 -12 -336 -617 -782 -1015 -1220 -1014 -801 -577 -359
-14341 -359 -367 -673 -1111 -1055 -754 -688 -828 -1017 -1185 -1361 -1258 -844 -774 -884 -867 -937 -710 -686 -978 -938 -681 -663 -1051 -1321 -1547 -1601
-14315 -1601 -1437 -1055 -733 -671 -857 -1298 -1812 -1990 -1928 -1805 -1543 -1525 -1444 -1284 -1310 -1549 -1650 -1579 -1314 -1054 -661 -476 -477 -657 -818
-14290 -818 -1034 -1507 -1635 -1519 -1307 -1182 -996 -919 -1177 -1442 -1356 -744 -143 -82 -461 -700 -864 -1091 -976 -656 -720 -871 -932 -1201
-14266 -1201 -1327 -889 -434 -235 -71 62 -123 -469 -539 -189 30 -203 -542 -631 -810 -998 -932 -1053 -1313 -1393 -1285 -1079 -1217 -1341
$$ packed form
-14442g62p3O9N9l56k21M0J12K71J38J65J58J77K78l8j89k04k58j54n4Q3L27K21O3N0J1j31
-14416b18J42J97r0J55J01j50l11m88k55Q6p6l53k89K25N17J79l3l0J8J23j1j98J07m8n07
-14391a207k89J4J90L44j1k10P8J24J69J44p6k71j71J91K10J55j5o2K80K8k03O7L28j85l98
-14366g76K8K38l4k29j06L1P3QJ86K97K15K03k33k76K90P3l24k81j65k33k05K06K13K24K18
-14341c59ql06m38N6L01O6j40j89j68j76J03M14P0j10J7p0K27K4k92M0K57J8l88k70k26n4
-14315a601J64L82L22O2j86m41n14j78O2J23K62J8Q1J60k6k39j01P1K65K60L93J85jj80j61
-14290h18k16m73j28J16K12J25J86P7k58k65Q6O12O01O1l79k39j64k27J15L20o4j51o1k69
-14266a201j26M38M55J99J64J33j85l46p0L50K19k33l39q9j79j88O6j21k60q0J08K06j38j24
$$ plain form
-14242 -1341 -1244 -1051 -987 -981 -910 -891 -960 -1168 -1149 -1371 -1498 -1297 -1183 -1199 -1107 -1051 -1116 -1373 -1552 -1632 -1717 -1833 -1909 -1712 -1739 -1714 -1527 -1476
-14214 -1476 -1192 -790 -623 -942 -929 -611 -613 -1030 -1085 -1090 -1357 -1375 -949 -510 -680 -941 -1225 -1284 -1248 -1379 -1577 -1599 -1276 -771 -597 -811
-14188 -811 -1110 -1079 -937 -1101 -1169 -834 -385 -183 -612 -989 -933 -941 -906 -945 -1047 -1159 -1152 -1048 -850 -750 -794 -812 -791 -886 -820 -791 -726 -788
-14160 -788 -734 -611 -638 -395 -183 -252 -445 -549 -604 -811 -1032 -1118 -943 -945 -1303 -1517 -1265 -1045 -1042 -925 -712 -557 -613 -697 -709 -878 -846
-14133 -846 -564 -548 -788 -808 -717 -769 -891 -904 -504 224 503 210 11 -143 -145 -77 -470 -903 -1194 -1341 -1288 -718 -555 -730 -458 -105
-14107 -105 -172 -350 -404 -376 -393 -443 -579 -284 46 -6 -150 -517 -693 -710 -967 -1330 -1478 -1352 -1304 -1467 -1417 -1240 -1067 -1182 -1111 -1007
-14081 -1007 -825 -568 -447 -595 -592 -641 -440 -205 -178 31 -16 -261 -366 -376 -207 -528 -721 -478 -223 -154 -449 -893 -831 -406 -352
-14056 -352 -532 -736 -705 -570 -635 -498 -364 -557 -968 -1353 -1493 -1310 -1225 -1565 -1757 -1716 -1833 -1715 -1419 -1211 -1114 -1117 -1115 -1163 -1101 -872
$$ packed form
-14242a341R7J93O4OP1J9o9k08J9k22j27K01J14j6R2N6o5k57j79q0q5j16p6J97k7K5J87N1
-14214a476K84M02J67l19J3L18km17n5nk67j8M26M39j70k61k84n9L6j31j98k2L23N05J74k14
-14188h11k99L1J42j64o8L35M49K02m29l77N6qL5l9j02j12PJ04J98J00m4j8K1r5O6K9O5o2
-14160g88N4J23k7K43K12o9j93j04n5k07k21q6J75kl58k14K52K20LJ17K13J55n6q4j2j69L2
-14133h46K82J6k40k0R1n2j22j3M00P28K79k93j99j54kO8l93m33k91j47N3N70J63j75K72L53
-14107a05o7j78n4K8j7n0j36K95L30n2j44l67j76j7k57l63j48J26M8j63N0J77J73j15P1J04
-14081a007J82K57J21j48Lm9K01K35K7K09m7k45j05j0J69l21j93K43K55O9k95m44O2M25N4
-14056c52j80k04L1J35o5J37J34j93m11l85j40J83Q5l40j92M1j17J18K96K08R7lKm8O2K29
$$ plain form
-14030 -872 -820 -733 -442 -447 -494 -490 -451 -349 -237 -274 -259 -146 -322 -539 -685 -661 -732 -552 -315 -324 -571 -730 -871 -840 -668 -672 -840 -1007
-14002 -1007 -1113 -1130 -1138 -1289 -1535 -1651 -1505 -1385 -1523 -1508 -1151 -922 -810 -997 -1466 -1348 -835 -310 18 -24 -123 -397 -751 -1031
-13978 -1031 -1160 -786 -500 -496 -653 -586 -468 -605 -790 -774 -785 -1025 -1311 -1167 -888 -806 -1111 -1331 -1434 -1075 -517 -167 -358 -668
-13954 -668 -588 -479 -396 -296 -188 109 296 -265 -694 -648 -579 -894 -1168 -1189 -1233 -1171 -1134 -1275 -1316 -1236 -1158 -930 -492 -691 -992 -738
-13928 -738 -457 -649 -1080 -1186 -1068 -799 -389 -25 229 258 -184 -620 -532 -260 -509 -646 -498 -427 -26 158 43 94 126 -40
-13904 -40 -374 -549 -629 -673 -811 -972 -1115 -1393 -1259 -903 -648 -325 -243 -621 -1007 -1173 -1076 -1017 -1005 -1008 -966 -1038 -1111 -1234 -1341 -1409 -1153
-13877 -1153 -883 -873 -948 -1017 -1168 -1037 -681 -687 -895 -923 -776 -671 -749 -1016 -1188 -1237 -1150 -1035 -938 -1174 -1464 -1335 -1441 -1861 -1931 -1626
-13851 -1626 -1439 -1312 -1122 -900 -610 -529 -783 -834 -656 -653 -984 -674 -141 144 237 228 76 -144 -147 -208 -484 -677 -743 -672 -724 -666 -564
$$ packed form
-14030h72N2Q7K91nm7ML9J02J12l7J5J13j76k17j46K4p1J80K37rk47j59j41L1J72mj68j67
-14002a007j06j7qj51k46j16J46J20j38J5L57K29J12j87m69J18N13N25L28m2r9k74l54k80
-13978a031j29L74K86Mj57O7J18j37j85J6j1k40k86J44K79Q2l05k20j03L59N58L50j91l10
-13954f68Q0J09Q3J00J08K97J87n61m29M6O9l15k74k1m4O2L7j41m1Q0P8K28M38j99l01K54
-13928g38K81j92m31j06J18K69M10L64K54K9m42m36Q8K72k49j37J48P1M01J84j15N1L2j66
-13904d0l34j75q0m4j38j61j43k78J34L56K55L23Q2l78l86j66R7N9J2lM2p2p3j23j07o8K56
-13877a153K70J0p5o9j51J31L56ok08k8J47J05p8k67j72m9Q7J15R7k36k90J29j06m20p0L05
-13851a626J87J27J90K22K90Q1k54n1J78Ll31L10N33K85R3rj52k20lo1k76j93o6P1n2N8J02
$$ plain form
-13824 -564 -601 -772 -1206 -1561 -1610 -1658 -1572 -1550 -1803 -1966 -1709 -1268 -1066 -1188 -1236 -959 -891 -776 -887 -954 -672 -783 -1254 -1471 -1389 -1200
-13798 -1200 -1097 -1042 -997 -978 -809 -898 -1050 -1125 -1058 -955 -777 -601 -570 -616 -718 -775 -597 -469 -621 -965 -887 -889 -1167 -1336 -979 -503
-13772 -503 -368 -618 -920 -1035 -929 -757 -741 -657 -666 -724 -964 -1585 -1720 -1461 -1337 -1277 -1124 -883 -785 -789 -926 -871 -650 -571 -791 -829 -664
-13745 -664 -567 -576 -480 -323 -454 -790 -921 -1013 -812 -438 -324 -386 -395 -210 1 -120 -442 -745 -898 -1224 -1431 -1417 -1455 -1623 -1576 -1311
-13719 -1311 -941 -603 -651 -1007 -1408 -1368 -1204 -743 -242 64 185 30 -357 -573 -757 -949 -1061 -818 -759 -1014 -1078 -1054 -1229 -1455
-13695 -1455 -1426 -1277 -1128 -947 -944 -1150 -1327 -1254 -1379 -1352 -1021 -988 -1110 -1418 -1935 -2056 -1932 -1795 -1495 -977 -653 -927 -1133 -1251
-13671 -1251 -1074 -1058 -1214 -1083 -854 -340 -2 -142 -531 -781 -936 -875 -671 -799 -1008 -1202 -1101 -766 -437 -668 -1128 -1242 -1316
-13648 -1316 -1460 -1230 -863 -762 -776 -977 -1043 -813 -445 -464 -611 -729 -759 -938 -1263 -1451 -1300 -1249 -1422 -1118 -806 -494 -318 -524
$$ packed form
-13824e64l7j71m34l55m9m8Q6K2k53j63K57M41K02j22m8K77O8J15j11o7K82j11m71k17Q2J89
-13798a200J03N5M5J9J69q9j52p5O7J03J78J76L1m6j02n7J78J28j52l44P8kk78j69L57M76
-13772e03J35k50l02j15J06J72J6Q4rn8k40o21j35K59J24O0J53K41R8mj37N5K21P9k20l8J65
-13745f64R7rR6J57j31l36j31r2K01L74J14o2rJ85K11j21l22l03j53l26k07J4l8j68M7K65
-13719a311L70L38m8l56m01M0J64M61N01L06J21j55l87k16j84j92j12K43N9k55o4K4j75k26
-13695a455K9J49J49J81Lk06j77P3j25K7L31L3j22l08n17j21J24J37L00N18L24k74k06j18
-13671a251J77J6j56J31K29N14L38j40l89k50j55O1K04j28k09j94J01L35L29k31m60j14p4
-13648a316j44K30L67J01j4k01o6K30L68j9j47j18l0j79l25j88J51N1j73L04L12L12J76k06
$$ plain form
-13624 -524 -521 -608 -713 -954 -1265 -1291 -1419 -1560 -1894 -2159 -2150 -2037 -1846 -1498 -1118 -971 -891 -812 -875 -1219 -1365 -1250 -1361 -1365 -1226 -943
-13598 -943 -961 -1217 -1325 -1240 -1488 -1721 -1519 -1220 -760 -480 -331 -418 -699 -991 -1282 -1450 -1271 -906 -827 -1050 -1120 -955 -735 -461
-13574 -461 -334 -391 -549 -879 -1056 -947 -868 -781 -814 -1215 -1735 -1702 -1021 -472 -398 -641 -888 -815 -581 -754 -943 -972 -1265 -1482 -1555 -1589
-13548 -1589 -1631 -1473 -1089 -730 -603 -911 -1361 -1728 -1952 -1519 -1194 -1285 -1412 -1315 -1060 -971 -926 -953 -860 -512 -248 -485 -1061 -1403 -1309
-13523 -1309 -1454 -1636 -1579 -1558 -1410 -1087 -912 -883 -673 -778 -910 -957 -961 -795 -844 -938 -872 -1032 -1148 -926 -1076 -1645 -1742 -1641 -1529 -1602
-13497 -1602 -1687 -1558 -1552 -1450 -1283 -1385 -1256 -926 -641 -747 -903 -975 -952 -688 -595 -815 -888 -680 -474 -195 83 2 -55 -175 -275
-13472 -275 -309 -518 -690 -700 -564 -624 -858 -1030 -1246 -1416 -1216 -1147 -1063 -910 -982 -1143 -1390 -1499 -1476 -1470 -1417 -1525 -1641 -1502 -1139 -844
-13446 -844 -575 -529 -821 -963 -914 -1125 -1484 -1516 -1353 -1112 -1093 -1216 -1551 -1777 -1367 -851 -530 -550 -715 -710 -816 -987 -854 -588 -459
$$ packed form
-13624e24Lq7j05k41l11k6j28j41l34k65RJ13J91L48L80J47Q0P9o3l44j46J15j11mJ39K83
-13598i43j8k56j08Q5k48k33K02K99M60K80J49q7k81k92k91j68J79L65P9k23p0J65K20K74
-13574d61J27n7j58l30j77J09P9Q7l3m01n20L3O81N49P4k43k47P3K34j73j89k9k93k17p3l4
-13548a589m2J58L84L59J27l08m50l67k24M33L25r1j27R7K55Q9M5k7R3L48K64k37n76l42R4
-13523a309j45j82N7K1J48L23J75K9K10j05j32m7mJ66m9r4O6j60j16K22j50n69r7J01J12p3
-13497a602q5J29OJ02J67j02J29L30K85j06j56p2K3K64R3k20p3K08K06K79K78q1n7j20j00
-13472b75l4k09j72j0J36o0k34j72k16j70K00O9Q4J53p2j61k47j09K3ON3j08j16J39L63K95
-13446h44K69M6k92j42M9k11l59l2J63K41J9j23l35k26M10N16L21k0j65Nj06j71J33K66J29
$$ plain form
-13421 -459 -694 -1042 -1312 -1336 -1388 -1435 -1254 -1077 -892 -1058 -1107 -1055 -1125 -1243 -1224 -1179 -1132 -1070 -963 -1061 -1187 -1135 -1183 -1062 -1030 -1053 -1197 -1468
-13393 -1468 -1290 -871 -1035 -1552 -1787 -1936 -1611 -1344 -1420 -1313 -1322 -1607 -1759 -1829 -1770 -1855 -1845 -1566 -1211 -1096 -1060 -1058 -1199 -1550 -1817 -1940
-13367 -1940 -2046 -1945 -1449 -1104 -1343 -1711 -1736 -2048 -2119 -1657 -1565 -1617 -1718 -1494 -1236 -1296 -1277 -1058 -778 -442 -247 -422 -850 -937 -960
-13342 -960 -1178 -1539 -1678 -1584 -1558 -1432 -1286 -1185 -1296 -1197 -1235 -1293 -1354 -1368 -1413 -1494 -1181 -1004 -909 -1220 -1363 -967 -889 -1054 -1131 -1009 -977
-13315 -977 -1169 -1369 -1504 -1579 -1590 -1569 -1548 -1492 -1241 -1129 -1291 -1195 -1080 -1076 -985 -993 -1074 -1121 -1187 -1101 -1001 -836 -671 -641 -634 -907 -1344 -1724 -1741
-13286 -1741 -1350 -758 -420 -538 -965 -1658 -2383 -2558 -2570 -2421 -1952 -1662 -1624 -1986 -2056 -1697 -1311 -1220 -944 -539 -434 -726 -1047 -1496
-13262 -1496 -1969 -1526 -1000 -1362 -1684 -1667 -1476 -1078 -892 -1182 -1377 -1364 -1308 -1110 -1005 -881 -665 -660 -930 -1325 -1458 -1247 -1037 -860
-13238 -860 -624 -731 -789 -850 -1045 -918 -621 -659 -801 -944 -1052 -996 -787 -1116 -1606 -1702 -1495 -1353 -1534 -1777 -1780 -1868 -1663 -1330 -1201
$$ packed form
-13421d59k35l48k70k4n2m7J81J77J85j66m9N2p0j18J9M5M7O2J07r8j26N2m8J21L2k3j44k71
-13393a468J78M19j64n17k35j49L25K67p6J07rk85j52p0N9q5J0K79L55J15L6Kj41l51k67j23
-13367a940j06J01M96L45k39l68k5l12p1M62R2n2j01K24K58o0J9K19K80L36J95j75m28q7k3
-13342i60k18l61j39R4K6J26J46J01j11R9l8n8o1j4m5q1L13J77R5l11j43L96P8j65p7J22L2
-13315i77j92k00j35p5j1K1K1N6K51J12j62R6J15MR1qq1m7o6Q6J00J65J65L0Pk73m37l80j7
-13286a741L91N92L38j18m27o93p25j75j2J49M69K90L8l62p0L59L86R1K76M05J05k92l21m49
-13262a496m73M43N26l62l22J7J91L98J86k90j95J3N6J98J05J24K16Nk70l95j33K11K10J77
-13238h60K36j07n8o1j95J27K97l8j42j43j08N6K09l29m90r6K07J42j81k43lq8K05L33J29
$$ plain form
-13213 -1201 -1176 -1066 -1269 -1615 -1747 -1802 -1689 -1303 -1220 -1227 -1218 -1096 -1100 -1075 -1010 -1050 -734 -543 -664 -806 -559 -301 -515 -781 -1036 -1283
-13187 -1283 -891 -510 -935 -1330 -1307 -1206 -1087 -1146 -1406 -1578 -1552 -1488 -1281 -1006 -827 -716 -924 -1074 -1083 -1141 -1176 -884 -613 -340 -492
-13162 -492 -985 -1164 -1076 -817 -677 -620 -631 -837 -1081 -1086 -1138 -1189 -1486 -1935 -1980 -1836 -1710 -1308 -837 -505 -449 -462 -688 -808 -948 -1046
-13136 -1046 -998 -869 -674 -706 -1027 -1249 -1252 -967 -606 -630 -823 -708 -674 -960 -963 -848 -979 -1097 -1184 -1254 -1039 -590 -606 -802 -914 -1052
-13110 -1052 -1073 -852 -758 -653 -545 -653 -796 -614 -501 -897 -1140 -1026 -861 -766 -939 -1257 -1136 -913 -718 -832 -1245 -1353 -1088
-13087 -1088 -783 -822 -983 -1153 -1513 -1744 -1603 -1079 -807 -820 -1025 -1442 -1496 -1109 -825 -1005 -984 -1010 -996 -816 -634 -882 -1385 -1574
-13063 -1574 -1270 -1101 -1081 -791 -587 -600 -1013 -1669 -2028 -1893 -1719 -1785 -1660 -1296 -1139 -1062 -994 -789 -775 -1085 -1339 -1258 -1476 -1765 -1615
-13038 -1615 -1372 -1032 -804 -524 -252 -134 -428 -872 -963 -628 -504 -589 -811 -930 -976 -906 -652 -638 -1005 -1405 -1561 -1700 -1961 -1941
$$ packed form
-13213a201K5J10k03l46j32n5J13L86Q3pRJ22mK5O5m0L16J91j21j42K47K58k14k66k55k47
-13187a283L92L81m25l95K3J01J19n9k60j72K6O4K07K75J79J11k08j50rn8l5K92K71K73j52
-13162d92m93j79Q8K59J40N7j1k06k44nn2n1k97m49m5J44J26M02M71L32N6j3k26j20j40r8
-13136a046M8J29J95l2l21k22lK85L61k4j93J15L4k86lJ15j31j18q7p0K15M49j6j96j12j38
-13110a052k1K21R4J05J08j08j43J82J13l96k43J14J65R5j73l18J21K23J95j14m13j08K65
-13087a088L05l9j61j70l60k31J41N24K72j3k05m17n4L87K84j80K1k6J4J80J82k48n03j89
-13063a574L04J69K0K90K04j3m13o56l59J35J74o6J25L64J57P7O8K05J4l10k54Q1k18k89J50
-13038a615K43L40K28K80K72J18k94m44r1L35J24q5k22j19m6P0K54J4l67m00j56j39k61K0
$$ plain form
-13014 -1941 -1658 -1349 -1175 -1226 -1216 -1235 -1397 -1179 -817 -392 -269 -416 -588 -786 -1125 -1251 -1289 -1577 -1522 -1346 -1629 -1874 -1600 -1050
-12990 -1050 -690 -610 -585 -849 -1031 -1390 -1730 -1651 -1458 -1390 -1139 -799 -693 -854 -963 -883 -802 -709 -909 -1246 -1371 -1317 -1407 -1646 -1651 -1475
-12964 -1475 -1352 -1271 -1126 -1101 -1271 -1573 -1877 -1897 -1652 -1316 -1337 -1495 -1608 -1514 -1289 -1238 -1016 -907 -942 -879 -842 -1149 -1201 -1014 -968 -1267
-12938 -1267 -1685 -1683 -1534 -1505 -1475 -1359 -1242 -1238 -1082 -774 -870 -849 -839 -1076 -993 -971 -1116 -1296 -1438 -1726 -1947 -2069 -2123 -1939 -1859 -1640 -848
-12911 -848 -298 -360 -420 -543 -855 -1110 -1320 -1365 -915 -802 -848 -626 -669 -1163 -1670 -1752 -1723 -1683 -1658 -1492 -1484 -1726 -1846 -1766 -1697 -1982 -2051
-12884 -2051 -1736 -1595 -1621 -1713 -1673 -1663 -1827 -1879 -1818 -1745 -1780 -1840 -1637 -1548 -1602 -1697 -1850 -2054 -2187 -2027 -1984 -2207 -2171 -1570 -1209 -1419 -1745
-12857 -1745 -1672 -1525 -1597 -1519 -1459 -1617 -1655 -1647 -2017 -2310 -1872 -1061 -557 -355 -625 -938 -1177 -1130 -807 -628 -845 -1321 -1677 -1851 -1950
-12832 -1950 -1838 -1656 -1722 -1686 -1378 -1405 -1463 -1442 -1322 -1366 -1587 -1802 -1769 -1511 -1325 -1451 -1602 -1544 -1319 -1419 -1713 -1855 -1740 -1288 -1178
$$ packed form
-13014a941K83L09J74n1J0j9j62K18L62M25J23j47j72j98l39j26l8k88N5J76k83k45K74N50
-12990a050L60Q0K5k64j82l59l40P9J93O8K51L40J06j61j09Q0Q1R3k00l37j25N4r0k39nJ76
-12964a475J23Q1J45K5j70l02l04k0K45L36k1j58j13R4K25N1K22J09l5O3L7l07n2J87M6k99
-12938a267m18KJ49K9L0J16J17MJ56L08r6K1J0k37Q3K2j45j80j42k88k21j22n4J84Q0K19P92
-12911h48N50o2o0j23l12k55k10m5M50J13m6K22m3m94n07q2K9M0K5J66Qk42j20Q0O9k85o9
-12884b051L15J41k6r2M0J0j64n2O1P3l5o0K03Q9n4r5j53k04j33J60M3k23L6O01L61k10l26
-12857a745P3J47p2P8O0j58l8Ql70k93M38Q11N04K02k70l13k39M7L23J79k17m76l56j74r9
-12832a950J12J82o6L6L08k7n8K1J20m4k21k15L3K58J86j26j51N8K25j00k94j42J15M52J10
$$ plain form
-12807 -1178 -1251 -1137 -1006 -894 -1021 -1173 -1151 -1409 -1684 -2009 -2104 -2059 -2015 -1873 -1689 -1467 -1197 -1185 -1531 -1766 -1832 -2069 -2036 -1639 -1328
-12782 -1328 -1174 -1146 -1304 -1474 -1672 -1619 -1619 -1786 -1845 -1562 -1499 -1720 -1941 -2323 -2430 -2161 -1864 -1543 -1488 -1606 -1751 -1796 -1601 -1493 -1583
-12757 -1583 -1676 -1618 -1752 -2095 -2099 -1939 -1822 -1717 -1541 -1398 -1501 -1530 -1499 -1421 -1266 -1061 -1185 -1087 -766 -671 -964 -1093 -1070 -942 -972 -1076
-12731 -1076 -1257 -1494 -1536 -1662 -1589 -1503 -1371 -1364 -1472 -1529 -1535 -1641 -1422 -1269 -1395 -1351 -1407 -1516 -1677 -1760 -1550 -983 -732 -952 -1149 -1357
-12705 -1357 -1381 -1232 -1295 -1369 -1617 -1868 -2030 -1799 -1417 -1407 -1270 -1392 -1735 -2025 -2048 -1691 -1300 -1279 -1362 -1422 -1395 -1273 -1124 -873 -951 -1090
-12679 -1090 -1428 -1864 -1941 -1997 -2109 -1820 -1479 -1495 -1466 -1386 -1355 -1541 -2000 -2262 -2186 -1842 -1699 -1722 -1882 -1928 -1623 -1436 -1174 -788 -937
-12654 -937 -1237 -1174 -935 -1213 -1681 -1935 -1918 -1813 -2008 -2234 -2224 -2381 -2233 -2100 -1870 -1661 -1986 -2190 -2080 -1946 -1867 -1604 -1464 -1767
-12630 -1767 -1677 -1382 -1435 -1701 -1893 -2046 -1989 -1787 -2085 -2452 -2385 -1990 -2037 -2263 -2292 -2315 -2112 -1990 -1986 -2124 -2212 -2057 -2078 -2148 -2061 -1765 -1427
$$ packed form
-12807a178p3J14J31J12j27j52K2k58k75l25r5M5M4J42J84K22K70J2l46k35o6k37L3L97L11
-12782a328J54K8j58j70j98N3%j67n9K83O3k21k21l82j07K69K97L21N5j18j45m5J95J08r0
-12757a583r3N8j34l43mJ60J17J05J76J43j03k9L1P8J55K05j24R8L21R5k93j29K3J28l0j04
-12731a076j81k37m2j26P3Q6J32Pj08n7oj06K19J53j26M4n6j09j61q3K10N67K51k20j97k08
-12705a357k4J49o3p4k48k51j62K31L82J0J37j22l43k90k3L57L91K1q3o0K7J22J49K51p8j39
-12679a090l38m36p7n6j12K89L41j6K9Q0L1j86m59k62P6L44J43k3j60m6L05J87K62L86j49
-12654i37l00O3K39k78m68k54J7J05j95k26J0j57J48J33K30K09l25k04J10J34P9K63J40l03
-12630a767R0K95n3k66j92j53N7K02k98l67O7L95m7k26k9k3K03J22Mj38q8J55k1p0Q7K96L38
$$ plain form
-12603 -1427 -1418 -1678 -1750 -1755 -1563 -1248 -1101 -1310 -1447 -1516 -1713 -1784 -2028 -2316 -2116 -1950 -2162 -2278 -1991 -1763 -1845 -2018 -2109 -2226 -2207 -1737
-12577 -1737 -1543 -1643 -1790 -1910 -2049 -2092 -2014 -1813 -1655 -1478 -1190 -1064 -1188 -1316 -1228 -1278 -1464 -1795 -1643 -1343 -1703 -2430 -2656 -2448
-12553 -2448 -2141 -1640 -1306 -1645 -2092 -2169 -1842 -1570 -1378 -1510 -1929 -1948 -1656 -1545 -1911 -1885 -1278 -1174 -1173 -1316 -1733 -1822 -1683 -1564
-12529 -1564 -1581 -1696 -1924 -1882 -1643 -1259 -906 -849 -1044 -1314 -1527 -1378 -1143 -1333 -1629 -1880 -2067 -1888 -1845 -2019 -1952 -1419 -1136 -1168
-12505 -1168 -1186 -1537 -1665 -1323 -1134 -1189 -1251 -1618 -1895 -1722 -1521 -1489 -1585 -1716 -1545 -1274 -970 -884 -1131 -1179 -950 -1033 -1104 -1277 -1428
-12480 -1428 -1579 -1568 -1602 -1526 -1522 -1728 -1669 -1568 -1823 -2036 -2103 -1784 -1570 -1543 -1378 -1296 -1440 -1224 -1184 -1480 -1795 -1966 -2041 -1991 -1901 -1859 -1734
-12453 -1734 -1605 -1754 -2130 -2037 -1600 -1417 -1516 -1385 -1565 -1919 -2418 -2669 -2574 -2489 -2559 -2498 -2176 -2062 -2097 -1980 -1746 -1744 -1819 -1741 -1786 -1905
-12427 -1905 -2099 -2175 -1900 -1337 -1105 -1330 -1732 -1964 -1833 -2017 -2372 -2424 -2108 -1968 -2276 -2505 -2381 -2184 -2220 -2321 -2461 -2502 -2605 -2704
$$ packed form
-12603a427Rk60p2nJ92L15J47k09j37o9j97p1k44k88K00J66k12j16K87K28q2j73r1j17J9M70
-12577a737J94j00j47j20j39m3P8K01J58J77K88J26j24j28Q8n0j86l31J52L00l60p27k26K08
-12553b448L07N01L34l39m47p7L27K72J92j32m19j9K92J11l66K6O07J04Jj43m17q9J39J19
-12529a564j7j15k28M2K39L84L53N7j95k70k13J49K35j90k96k51j87J79M3j74O7N33K83l2
-12505a168j8l51j28L42J89n5o2l67k77J73K01L2r6j31J71K71L04Q6k47m8K29q3p1j73j51
-12480a428j51J1l4P6Mk06N9J01k55k13o7L19K14K7J65Q2j44K16M0k96l15j71p5N0R0M2J25
-12453a734J29j49l76R3M37J83r9J31j80l54m99k51R5Q5p0O1L22J14l5J17K34Kp5P8m5j19
-12427a905j94p6K75N63K32k25m02k32J31j84l55n2L16J40l08k29J24J97l6j01j40m1j03r9
$$ plain form
-12403 -2704 -2545 -2460 -2396 -2125 -1912 -1819 -2031 -2381 -2628 -2792 -2810 -2616 -2349 -2060 -1610 -1298 -1177 -1123 -1337 -1659 -1868 -1928 -1830 -1628 -1635
-12378 -1635 -1867 -1689 -1195 -1005 -1222 -1594 -1874 -1870 -1676 -1641 -1780 -1965 -1892 -1644 -1653 -1762 -1821 -1726 -1537 -1663 -1797 -1714 -1658 -1683 -1571 -1450
-12352 -1450 -1681 -1718 -1652 -1755 -1752 -1886 -2431 -2594 -2104 -1585 -1695 -1772 -2017 -2428 -2474 -2259 -2207 -2353 -2486 -2447 -2089 -1797 -1929 -2217 -2325
-12327 -2325 -2576 -2458 -2414 -2267 -1885 -1712 -1466 -1440 -1500 -1430 -1561 -1521 -1605 -1518 -1426 -1304 -1131 -1507 -2130 -2226 -2322 -2373 -1880 -1479 -1423 -1720
-12301 -1720 -2291 -2517 -2285 -1872 -1652 -1757 -1788 -1669 -1889 -2221 -2370 -2279 -2109 -2071 -2209 -2164 -1904 -1881 -1834 -1906 -1779 -1570 -1447 -1189 -1047
-12276 -1047 -1269 -1510 -1684 -2203 -2626 -2884 -2991 -2670 -2559 -2253 -1843 -1707 -1482 -1313 -1765 -2233 -2222 -1992 -1911 -1882 -1701 -1628 -1655 -1674
-12252 -1674 -1742 -1929 -1943 -1999 -2162 -2468 -2711 -2653 -2393 -2218 -2151 -2024 -1912 -1863 -1572 -1354 -1715 -1876 -2080 -2287 -2440 -2532 -2600 -2979 -3158
-12227 -3158 -3153 -2973 -2760 -2470 -2163 -2045 -2166 -2147 -2291 -2587 -2453 -2231 -2206 -2195 -2222 -2144 -1979 -2267 -2420 -2433 -2290 -2250 -2237 -2156 -2304 -2251
$$ packed form
-12403b704J59Q5O4K71K13R3k12l50k47j64j8J94K67K89M50L12J21N4k14l22k09o0R8K02p
-12378a635k32J78M94J90k17l72k80MJ94L5j39j85P3K48rj09n9R5J89j26j34Q3N6k5J12J21
-12352a450k31l7O6j03Lj34n45j63M90N19j10p7k45m11m6K15N2j46j33L9L58K92j32k88j08
-12327b325k51J18M4J47L82J73K46K6o0P0j31M0q4Q7R2J22J73l76o23r6r6n1M93M01N6k97
-12301a720n71k26K32M13K20j05l1J19k20l32j49R1J70L8j38M5K60K3M7p2J27K09J23K58J42
-12276a047k22k41j74n19m23k58j07L21J11L06M10J36K25J69m52m68J1K30Q1K9J81P3k7j9
-12252a674o8j87j4n6j63l06k43N8K60J75O7J27J12M9K91K18l61j61k04k07j53r2o8l79j79
-12227c158NJ80K13K90L07J18j21J9j44k96J34K22K5J1k7P8J65k88j53j3J43M0J3Q1j48N3
$$ plain form
-12201 -2251 -1932 -1969 -2279 -2466 -2586 -2617 -2492 -2480 -2280 -1749 -1344 -1171 -1156 -1337 -1858 -2252 -2446 -2430 -2477 -2427 -2070 -1624 -1533 -1772 -1914
-12176 -1914 -2007 -1982 -1892 -1739 -1595 -1431 -1599 -1837 -1874 -2079 -2395 -2388 -2143 -2172 -2299 -2387 -2300 -1909 -1750 -1875 -2179 -2726 -2499 -1924 -1758
-12151 -1758 -2050 -2264 -2440 -2550 -2531 -2504 -2292 -2317 -2235 -1971 -1904 -2093 -2358 -2685 -2890 -3171 -3429 -3213 -2726 -2262 -1924 -1643 -1802 -2260
-12127 -2260 -2362 -2282 -2342 -2402 -2111 -1846 -1683 -1587 -1706 -1856 -1688 -1380 -1428 -1380 -1195 -1289 -1895 -2512 -2651 -2455 -2186 -1981 -2053 -2243 -2238 -2231
-12101 -2231 -2152 -2065 -2248 -2545 -2598 -2648 -2513 -2134 -1921 -1724 -1737 -2418 -3102 -3147 -2673 -2434 -2620 -2792 -2644 -2450 -2577 -2655 -2893 -3162 -3060
-12076 -3060 -2752 -2646 -2589 -2609 -2645 -2717 -2748 -2749 -2649 -2701 -2846 -2788 -2402 -2110 -1975 -2089 -2184 -2031 -1827 -1730 -1874 -2362 -2787 -2822 -2635 -2593 -2827
-12049 -2827 -2896 -3018 -2980 -2728 -2471 -2345 -2288 -2493 -2682 -2540 -2480 -2544 -2359 -2442 -2662 -2661 -2500 -2317 -2347 -2326 -2508 -2858 -2805 -2479 -2569 -2891
-12023 -2891 -2968 -3096 -2980 -2681 -2668 -2756 -2466 -2446 -2786 -2984 -2785 -2833 -2881 -2927 -2921 -2602 -2654 -3071 -3367 -3149 -2730 -2595 -3041 -3243 -3241 -3128
$$ packed form
-12201b251L19l7l10j87j20l1J25J2K00N31M05J73J5j81n21l94j94J6m7N0L57M46R1k39j42
-12176a914r3K5R0J53J44J64j68k38l7k05l16PK45k9j27q8Q7L91J59j25l04n47K27N75J66
-12151a758k92k14j76j10J9K7K12k5Q2K64O7j89k65l27k05k81k58K16M87M64L38K81j59m58
-12127b260j02Q0o0o0K91K65J63R6j19j50J68L08m8M8J85r4o06o17j39J96K69K05p2j90NP
-12101b231P9Q7j83k97n3n0J35L79K13J97j3o81o84m5M74K39j86j72J48J94j27p8k38k69J02
-12076c060L08J06N7k0l6p2l1jJ00n2j45N8L86K92J35j14r5J53K04R7j44m88m25l5J87M2k34
-12049b827o9j22L8K52K57J26N7k05j89J42O0o4J85q3k20JJ61J83l0K1j82l50N3L26r0l22
-12023b891p7j28J16K99J3q8K90K0l40j98J99m8m8m6OL19n2m17k96K18M19J35m46k02KJ13
$$ plain form
-11997 -3128 -2794 -2510 -2395 -2425 -2646 -2848 -2682 -2142 -1852 -1855 -1903 -1970 -1934 -1755 -1737 -1994 -2384 -2572 -2665 -2696 -2639 -2360 -1880 -1655 -1825 -1891
-11971 -1891 -1992 -2262 -2442 -2264 -2297 -2641 -3162 -3355 -3149 -2912 -2473 -2122 -2081 -2105 -2224 -2310 -2459 -2762 -2949 -3078 -3328 -3347 -3111 -2679
-11947 -2679 -2538 -2738 -2797 -2674 -2676 -2911 -3108 -3040 -2912 -2866 -2829 -2892 -3097 -3196 -3038 -3077 -3344 -3602 -3451 -3220 -3001 -2954 -3117 -3128 -3162 -3176 -3115
-11920 -3115 -2779 -2533 -2487 -2404 -2246 -2377 -2658 -2618 -2737 -2987 -2914 -2608 -2480 -2386 -2419 -2561 -2734 -2680 -2684 -3010 -3194 -3097 -2865 -2588 -2575 -2499
-11894 -2499 -2214 -2234 -2393 -2564 -2649 -2733 -2982 -2989 -2815 -2376 -2232 -2307 -2308 -2389 -2741 -3044 -2969 -2855 -2642 -2201 -2011 -1949 -2053 -2334 -2483 -2880
-11868 -2880 -3094 -2741 -2593 -2719 -2942 -3174 -3270 -3172 -3094 -3053 -2976 -2982 -3001 -2855 -2790 -2863 -3022 -3594 -3967 -3676 -3170 -3075 -3395 -3558 -3715 -4088
-11842 -4088 -4230 -4181 -4076 -3661 -3530 -3529 -3607 -3664 -3465 -3288 -3246 -3447 -3534 -3530 -3607 -3588 -3514 -3618 -3905 -4211 -3950 -3432 -3406 -3605 -3574 -3539 -3739
-11815 -3739 -3791 -3692 -3917 -3901 -3770 -3478 -3303 -3541 -3598 -3573 -4003 -4270 -4120 -3861 -3609 -3580 -3504 -3331 -3035 -2782 -2875 -3003 -3374 -3705 -3948
$$ packed form
-11997c128L34K84J15l0k21k02J66N40K90lm8o7L6J79J8k57l90j88r3l1N7K79M80K25j70o6
-11971a891j01k70j80J78l3l44n21j93K06K37M39L51M1k4j19q6j49l03j87j29k50j9K36M32
-11947b679J41k00n9J23kk35j97O8J28M6L7o3k05r9J58l9k67k58J51K31K19M7j63j1l4j4O1
-11920c115L36K46M6Q3J58j31k81M0j19k50P3L06J28R4l3j42j73N4ml26j84R7K32K77J3P6
-11894b499K85k0j59j71q5q4k49pJ74M39J44p5jq1l52l03P5J14K13M41J90O2j04k81j49l97
-11868b880k14L53J48j26k23k32r6R8P8M1P7oj9J46O5p3j59n72l73K91N06R5l20j63j57l73
-11842d088j42M9J05M15J31Jp8n7J99J77M2k01q7Mp7J9P4j04k87l06K61N18K6j99L1L5k00
-11815c739n2R9k25J6J31K92J75k38n7K5m30k67J50K59K52K9P6J73K96K53r3j28l71l31k43
$$ plain form
-11790 -3948 -3935 -3596 -3311 -3234 -3346 -3393 -3675 -3958 -4042 -3906 -3875 -3777 -3465 -3356 -3400 -3459 -3472 -3281 -3364 -3579 -3352 -3163 -3301 -3260 -3108 -3284
-11764 -3284 -3381 -3558 -3666 -3662 -3908 -4188 -3877 -3752 -4250 -4370 -4218 -4136 -4216 -4257 -4207 -4335 -4116 -3770 -3514 -3500 -3838 -3874 -3869 -3884 -3618 -3391
-11738 -3391 -3489 -3524 -3362 -3367 -3461 -3686 -3918 -4009 -3852 -3722 -3500 -3317 -3190 -3327 -3763 -4103 -4017 -3653 -3470 -3481 -3454 -3163 -3262 -3622 -3866 -3825
-11712 -3825 -3941 -3850 -3707 -3842 -4106 -4003 -3603 -3383 -3263 -3507 -3957 -4171 -4259 -4285 -4264 -4161 -4002 -3711 -3592 -3769 -3774 -3683 -3435 -3463 -3638
-11687 -3638 -3630 -3921 -4039 -3988 -3955 -3915 -4124 -4615 -4861 -4661 -4437 -4317 -4236 -4175 -4234 -4104 -4034 -3919 -3979 -4315 -4367 -4344 -3988 -3717 -3963 -4172
-11661 -4172 -4204 -3991 -3811 -3932 -4046 -3824 -3833 -4210 -4351 -3947 -3512 -3393 -3698 -3787 -3599 -3643 -3863 -4160 -4029 -3990 -4128 -4157 -4376 -4524 -4316
-11636 -4316 -4281 -4206 -4220 -4125 -3894 -3528 -3329 -3433 -3579 -3843 -3764 -3689 -3841 -4037 -3986 -3820 -3781 -3681 -3719 -3874 -4238 -4680 -4860 -4615 -4452
-11611 -4452 -4518 -4686 -4854 -4826 -4693 -4498 -4280 -4162 -4298 -4661 -4725 -4557 -4357 -4409 -4462 -4477 -4367 -4152 -4005 -3698 -3600 -3685 -3962 -4041 -4131 -4375
$$ packed form
-11790c948J3L39K85P7j12m7k82k83q4J36L1R8L12J09m4n9j3J91q3k15K27J89j38M1J52j76
-11764c284r7j77j08Mk46k80L11J25m98j20J52Q2q0m1N0j28K19L46K56J4l38l6Nj5K66K27
-11738c391r8l5J62nr4k25k32r1J57J30K22J83J27j37m36l40Q6L64J83j1K7K91r9l60k44M1
-11712c825j16R1J43j35k64J03M00K20J20k44m50k14q8k6K1J03J59K91J19j77nR1K48k8j75
-11687c638Qk91j18N1L3M0k09m91k46K00K24J20Q1O1n9J30P0J15o0l36n2K3L56K71k46k09
-11661d172l2K13J80j21j14K22rl77j41M04M35J19l05q9J88m4k20k97J31L9j38k9k19j48K08
-11636d316L5P5j4R5K31L66J99j04j46k64P9P5j52j96N1J66L9J00l8j55l64m42j80K45J63
-11611d452o6j68j68K8J33J95K18J18j36l63o4J68K00n2n3j5J10K15J47L07R8q5k77p9r0k44
$$ plain form
-11585 -4375 -4335 -3934 -3903 -4179 -4337 -4663 -4953 -5024 -4965 -4702 -4673 -4912 -4467 -3712 -3371 -3514 -3766 -4070 -4257 -4460 -4611 -4818 -4821 -4660 -4625
-11560 -4625 -4527 -4384 -4339 -4331 -4311 -4336 -4238 -4126 -3915 -3981 -4132 -4131 -3935 -3857 -3936 -3938 -4180 -4490 -4565 -4658 -4801 -4835 -4748 -4638 -4686 -4724 -4247 -3944 -4231
-11531 -4231 -4522 -4517 -4558 -4720 -4955 -5038 -5052 -5049 -4964 -4840 -4597 -4470 -4554 -5052 -5452 -5586 -5622 -5567 -5418 -5356 -5205 -5381 -5767 -6047 -6105 -6155 -6050
-11504 -6050 -6105 -6505 -6724 -6586 -6465 -6222 -6056 -5947 -6057 -6395 -6236 -5870 -5723 -5480 -5514 -5641 -5529 -5665 -5637 -5290 -5196 -5123 -5179 -5541
-11480 -5541 -5854 -6117 -6268 -6070 -6014 -6015 -5895 -5846 -5835 -5861 -5614 -5533 -5535 -5532 -5687 -5582 -5544 -5256 -5135 -5372 -5338 -5461 -5696 -5814 -5726 -5324 -5165
-11453 -5165 -4958 -4859 -5250 -5782 -6059 -6057 -6263 -6264 -5786 -5680 -5914 -6107 -6249 -6198 -6387 -6672 -6716 -6383 -6046 -6244 -6551 -6594 -6622 -6611 -6681 -6621
-11427 -6621 -6393 -5930 -5843 -5996 -5919 -5879 -5942 -5760 -5683 -5948 -6233 -6554 -6841 -7063 -6864 -6595 -6518 -6633 -6492 -6154 -6142 -6127 -6241 -6503 -6586
-11402 -6586 -6359 -6216 -6452 -6515 -6535 -6624 -6575 -6893 -7276 -7523 -7626 -7613 -7669 -7577 -7220 -6810 -6508 -6621 -7031 -7283 -7495 -7720 -7617 -7365 -7476
$$ packed form
-11585d375M0M01L1k76j58l26k90p1N9K63K9k39M45P55L41j43k52l04j87k03j51k07lJ61L5
-11560d625R8J43M5QK0k5R8J12K11o6j51JJ96P8p9kk42l10p5r3j43l4Q7J10m8l8M77L03k87
-11531d231k91Nm1j62k35q3j4LQ5J24K43J27q4m98m00j34l6N5J49O2J51j76l86k80n8n0J05
-11504f050n5m00k19J38J21K43J66J09j10l38J59L66J47K43l4j27J12j36K8L47R4P3n6l62
-11480e541l13k63j51J98N6jJ20M9J1k6K47Q1kLj55J05L8K88J21k37L4j23k35j18Q8M02J59
-11453e165K07R9l91n32k77Kk06jM78J06k34j93j42N1j89k85m4L33L37j98l07m3k8J1p0O0
-11427f621K28M63Q7j53P7M0o3J82P7k65k85l21k87k22J99K69P7j15J41L38J2J5j14k62q3
-11402f586K27J43k36o3k0q9M9l18l83k47j03J3n6R2L57M10L02j13m10k52k12k25J03K52j11
$$ plain form
-11377 -7476 -7685 -7751 -7377 -6848 -6774 -7205 -7641 -7418 -7372 -7696 -7729 -7832 -7945 -7812 -7845 -8125 -8990 -9661 -9483 -9317 -9101 -8945 -8597 -8013
-11353 -8013 -7696 -7800 -7976 -8040 -7964 -7517 -7101 -7150 -7394 -7670 -7957 -7910 -7543 -7275 -7205 -7202 -6981 -6981 -7463 -7930 -8293 -8350 -8297 -8273 -8148 -7945
-11327 -7945 -7996 -8264 -8411 -8250 -7997 -7927 -8180 -8474 -8785 -8785 -8289 -7978 -7839 -7916 -8182 -8670 -9206 -9499 -9614 -9614 -9591 -9235 -9027 -9177 -9107
-11302 -9107 -9104 -9251 -9242 -9062 -8987 -8893 -8651 -8602 -8756 -9019 -9010 -8982 -9007 -9289 -9757 -10023 -10014 -9952 -9924 -10004 -9878 -9681 -9516 -9473 -9501 -9599 -9717 -9628 -9645
-11273 -9645 -9798 -9666 -9419 -9516 -10013 -10348 -10471 -10488 -10433 -10165 -10046 -10324 -10566 -10618 -10698 -10744 -10837 -10959 -11013 -10813 -10964 -11192 -11050 -10892 -11067
-11248 -11067 -11294 -11493 -11613 -11764 -11786 -11716 -11882 -12099 -12112 -12138 -12269 -12171 -12171 -12319 -12459 -12438 -12552 -12936 -13383 -13570 -13437 -13328 -13313 -13224 -13158 -13356
-11222 -13356 -13524 -13710 -13729 -13275 -13154 -13409 -13546 -13487 -13593 -13828 -13774 -13513 -13627 -13742 -13759 -13857 -13978 -14359 -14586 -14591 -14603 -14841 -14986 -14738 -14556
-11197 -14556 -14741 -14701 -14730 -15038 -15362 -15455 -15966 -16444 -16495 -16273 -15982 -15752 -15755 -16036 -16400 -16934 -17363 -17698 -17817 -18039 -18311 -18399 -18385 -18572 -18971
$$ packed form
-11377g476k09o6L74N29P4m31m36K23M6l24l3j03j13J33l3k80q65o71J78J66K16J56L48N84
-11353h013L17j04j76o4P6M47M16m9k44k76k87M7L67K68P0LK21%m82m67l63n7N3K4J25K03
-11327g945n1k68j47J61K53P0k53k94l11%M96L11J39p7k66m88n36k93j15%K3L56K08j50P0
-11302i107Lj47RJ80P5R4K42M9j54k63RK8k5k82m68k66RO2K8q0J26J97J65M3k8r8j18Q9j7
-11273i645j53J32K47r7m97l35j23j7N5K68J19k78k42n2q0m6r3j22n4K00j51k28J42J58j75
-11248a1067k27j99j20j51k2P0j66k17j3k6j31R8%j48j40K1j14l84m47j87J33J09J5Q9O6j98
-11222a3356j68j86j9M54J21k55j37N9j06k35N4K61j14j15j7r8j21l81k27nj2k38j45K48J82
-11197a4556j85M0k9l08l24r3n11m78n1K22K91K30lk81l64n34m29l35j19k22k72q8J4j87l99
$$ plain form
-11172 -18971 -19644 -20080 -19820 -19667 -19824 -20089 -20214 -20415 -21078 -21563 -21868 -22004 -22220 -22596 -23240 -23773 -24135 -24327 -24271 -24936 -26215 -27104
-11150 -27104 -28004 -28883 -29217 -29173 -28389 -27067 -25474 -23068 -20245 -17370 -14430 -12184 -11057 -10804 -10895 -11144 -11491 -12276 -13227 -13935
-11130 -13935 -14653 -15604 -16731 -17344 -17861 -18843 -19853 -20824 -21562 -21867 -22112 -22388 -23218 -24086 -24423 -24803 -25433 -26278 -27162 -27747 -28073
-11109 -28073 -28887 -29820 -30385 -31208 -32039 -32602 -33251 -34037 -34693 -35689 -36830 -38113 -39430 -40403 -41694 -43747 -45961 -47873 -49564
-11090 -49564 -50640 -50167 -47323 -41809 -33753 -24058 -14028 -5073 2074 6969 9547 10072 8958 7216 5297 3151 861
-11073 861 -1518 -3641 -5636 -7631 -9427 -11156 -12799 -14461 -15969 -17284 -18420 -19387 -20312 -21723 -23165 -24487 -25880 -26990
-11055 -26990 -27734 -28616 -29990 -31228 -32328 -33572 -34931 -36709 -38714 -40334 -41590 -42911 -44758 -46826 -48780 -50807 -53294
-11038 -53294 -56349 -59741 -63813 -68456 -72500 -74824 -74365 -69570 -59365 -43931 -24551 -3744 16083 32536 43984
$$ packed form
-11172a8971o73m36K60J53j57k65j25k01o63m85l05j36k16l76o44n33l62j92N6o65j279q89
-11150b7104r00q79l34M4P84J322J593K406K823K875K940K246J127K53r1k49l47p85r51p08
-11130a3935p18r51j127o13n17r82j010r71p38l05k45k76q30q68l37l80o30q45q84n85l26
-11109b8073q14r33n65q23q31n63o49p86o56r96j141j283j317r73j291k053k214j912j691
-11090d9564j076M73K844N514Q056R695J0030Q955P147M895K578N25j114j742j919k146k290
-11073H61k379k123j995j995j796j729j643j662j508j315j136r67r25j411j442j322j393j110
-11055b6990p44q82j374j238j100j244j359j778k005j620j256j321j847k068j954k027k487
-11038e3294l055l392m072m643m044k324M59M795J0205J5434J9380K0807J9827J6453J1448
$$ plain form
-11023 43984 50161 51699 50247 46991 42558 37912 33330 29076 25221 21826 18709 15718 12829 10091 7490 4994 2659
-11006 2659 794 -832 -2540 -4369 -6279 -8471 -10269 -11446 -12623 -14157 -15988 -17949 -19795 -21340 -22496 -23949 -25664
-10989 -25664 -27513 -29459 -31419 -33588 -35793 -38394 -41495 -44786 -48410 -52874 -57949 -63161 -67890 -70943 -71233 -66902 -56435
-10972 -56435 -39744 -17804 6991 31298 51589 65977 74279 77475 76717 73474 68364 62854 57816 52979 48264
-10957 48264 44012 40012 36273 33024 30386 27724 25060 22757 20556 18297 16172 14744 13304 11441 9705 7962 6369
-10940 6369 4678 3035 1439 -46 -1505 -3024 -4505 -6245 -8244 -10281 -12224 -14182 -15961 -17772 -20256 -23317 -26663
-10923 -26663 -30330 -34212 -38754 -43412 -46340 -46668 -43692 -36227 -23171 -5342 15167 35882 54091 68097 76715
-10908 76715 79999 79749 77233 73157 68671 64246 60107 56282 52753 49279 46052 43121 40335 37988 36064 34682 33330
$$ packed form
-11023D3984O177J538j452l256m433m646m582m254l855l395l117k991k889k738k601k496k335
-11006B659j865j626j708j829j910k192j798j177j177j534j831j961j846j545j156j453j715
-10989b5664j849j946j960k169k205k601l101l291l624m464n075n212m729l053k90M331J0467
-10972e6435J6691K1940K4795K4307K0291J4388Q302L196p58l243n110n510n038m837m715
-10957D8264m252m000l739l249k638k662k664k303k201k259k125j428j440j863j736j743j593
-10940F369j691j643j596j485j459j519j481j740j999k037j943j958j779j811k484l061l346
-10923b6663l667l882m542m658k928l28K976P465J3056J7829K0509K0715J8209J4006Q618
-10908G6715L284k50k516m076m486m425m139l825l529l474l227k931k786k347j924j382j352
$$ plain form
-10891 33330 31909 30397 28801 27599 26468 25381 24232 22733 21666 20926 20028 18813 17544 16529 15331 14152 12954
-10874 12954 11564 10208 9240 8205 6896 5101 3268 1511 -321 -2340 -4368 -6137 -7451 -8012 -7516 -4688 800
-10857 800 8745 18596 28935 38539 46109 51037 53546 53979 53102 51037 48433 45766 43248 41030 39144 37517 36152
-10840 36152 34841 33615 32383 31170 30225 29145 27939 26728 26082 25446 24986 24758 24263 23473 22550 21845 21336 20705 20025 19478
-10820 19478 19012 18793 18222 17558 17150 16436 15827 15411 15043 14772 14472 13973 13323 12636 11716 10730 10264 10565 11460 13001 15157
-10799 15157 18042 21374 24332 26681 28367 29108 28949 28358 27931 27376 26296 25461 24949 24306 23381 22763 22495 21955 21524 21401
-10779 21401 21490 21529 20931 20042 19487 19005 18705 18429 18233 18113 17904 17665 17399 17231 16927 16642 16729 16796 16919 16836 16773 16722 16632 16378 16022
-10754 16022 15835 16112 16322 16059 15412 14838 14402 14120 14067 14018 13960 13732 13627 13668 13312 13176 13489 14096 14435 14216 14086 13990 13806 13592
$$ packed form
-10891C3330j421j512j596j202j131j087j149j499j067p40q98j215j269j015j198j179j198
-10874A2954j390j356r68j035j309j795j833j757j832k019k028j769j314n61M96K828N488
-10857H00P945R851J0339R604P570M928K509M33q77k065k604k667k518k218j886j627j365
-10840C6152j311j226j232j213r45j080j206j211o46o36m60k28m95p90r23p05n09o31o80n47
-10820A9478m66k19n71o64m08p14o09m16l68k71l00m99o50o87r20r86m66L01Q95J541K156
-10799A5157K885L332K958K349J686P41j59n91m27n55j080q35n12o43r25o18k68n40m31j23
-10779B1401Q9L9n98q89n55m82l00k76j96j20k09k39k66j68l04k85Q7O7J23q3o3n1r0k54l56
-10754A6022j87K77K10k63o47n74m36k82n3m9n8k28j05M1l56j36L13O07L39k19j30r6j84k14
$$ plain form
-10730 13592 13487 13334 13067 12798 12698 12952 13166 12890 12565 12572 12818 12724 12663 12592 12230 12088 12231 12309 12152 12108 11874 11710 11901 12252
-10706 12252 12397 12271 12234 12095 11865 11656 11323 11132 11055 11083 11079 11170 11344 11556 11629 11754 11716 11560 11524 11344 11008 10749 10586 10508 10677
-10681 10677 10647 10385 10401 10527 10499 10621 10907 10653 10248 10292 10293 10055 9849 9743 9689 9740 9535 9431 9649 9637 9597 9997 10267 10312 10093 9868
-10655 9868 9621 9488 9492 9412 9349 9269 9055 8961 9152 9142 8935 8621 8455 8752 9051 8849 8458 8516 8857 8990 8800 8725 8998 9086 9004 9027
-10629 9027 8726 8351 8382 8881 9018 8754 8536 8580 8496 8525 8760 8596 8464 8259 7991 7694 7647 7862 8101 8078 7806 7720 8013 7952 7662
-10604 7662 7706 7796 7753 7779 7801 7563 7520 7668 7780 7934 8012 8234 8293 7990 7627 7288 7365 7243 6705 6163 6247 6504 6555 6729 7066 7293
-10578 7293 7128 6974 6880 6942 7064 7247 7095 6617 6659 7147 7352 7520 7733 7361 6838 6775 6897 7283 7556 7524 7218 7165 7312 7081
-10554 7081 7075 7040 6750 6490 6406 6343 6259 5933 5810 5956 6074 6195 6485 6802 7027 6892 6549 6315 6279 6575 7085 7442 7321 7053 6932
$$ packed form
-10730A3592j05j53k67k69j00K54K14k76l25PK46r4o1p1l62j42J43P8j57m4k34j64J91L51
-10706A2252J45j26l7j39k30k09l33j91p7K8mR1J74K12P3J25l8j56l6j80l36k59j63p8J69
-10681A0677l0k62J6J26k8J22K86k54m05M4Jk38k06j06n4N1k05j04K18j2m0M00K70M5k19k25
-10655I868k47j33Mq0o3q0k14r4J91j0k07l14j66K97K99k02l91N8L41J33j90p5K73Q8q2K3
-10629I027l01l75L1M99J37k64k18M4q4K9K35j64j32k05k68k97m7K15K39k3k72q6K93o1k90
-10604G662M4R0m3K6K2k38m3J48J12J54P8K22N9l03l63l39P7j22n38n42Q4K57N1J74L37K27
-10578G293j65j54r4O2J22J83j52m78M2M88K05J68K13l72n23o3J22L86K73l2l06n3J47k31
-10554G081ol5k90k60q4o3q4l26j23J46J18J21K90L17K25j35l43k34l6K96N10L57j21k68j21
$$ plain form
-10529 6932 6579 6095 5994 5965 5828 6031 6542 6628 6284 5946 5707 5667 5790 6020 5939 5748 5814 6080 6289 6505 6710 6322 6104 6384
-10505 6384 6488 6285 6092 6002 5985 6181 6206 5998 5904 6095 6247 6218 6028 5903 6137 6284 6042 5792 5664 5517 5230 5000 5267 5441
-10481 5441 5447 5336 5286 5532 5583 5600 5673 5753 6131 6496 6276 5539 5131 5120 4755 4496 4686 5117 5468 5779 5736 5460 5450 5376 5411 5532
-10455 5532 5510 5479 5279 5248 5362 5553 5304 5052 4990 4805 4491 4197 4178 4678 4899 4788 4818 4882 5175 5427 5676 5540 5309 5210 5029
-10430 5029 4845 4913 5000 4991 5167 5381 5408 5266 5098 5087 5360 5352 5063 4790 4534 4294 4459 5166 5795 6329 6414 5971 5603 5330 5262 5528
-10404 5528 5839 5900 5506 5054 4830 4789 4992 4747 4434 4385 4351 4524 4657 4928 5242 5232 5240 5489 5525 5379 5108 5046 5195 5157 5003 4825
-10378 4825 4811 4751 4448 4377 4308 4296 4177 3890 3871 4055 4365 4413 4484 4630 4979 5265 5386 5375 5325 5109 4911 4790 4452 4019 4184 4213
-10352 4213 3858 3588 3829 4185 4117 4011 4127 4291 4412 4340 4281 4487 4694 4769 4584 4414 4301 4350 4334 4192 4424 4792 4788 4335 4098
$$ packed form
-10529F932l53m84j01k9j37K03N11Q6l44l38k39m0J23K30q1j91O6K66K09K16K05l88k18K80
-10505F384J04k03j93r0j7J96K5k08r4J91J52k9j90j25K34J47k42k50j28j47k87k30K67J74
-10481E441Oj11n0K46N1J7P3Q0L78L65k20p37m08j1l65k59J90M31L51L11m3k76j0p4L5J21
-10455E532k2l1k00l1J14J91k49k52o2j85l14k94j9N00K21j11L0O4K93K52K49j36k31r9j81
-10430E029j84O8Q7rJ76K14K7j42j68j1K73qk89k73k56k40J65P07O29N34Q5m43l68k73o8K66
-10404E528L11O1l94m52k24m1K03k45l13m9l4J73J33K71L14j0QK49L6j46k71o2J49l8j54j78
-10378D825j4o0l03p1o9j2j19k87j9J84L10M8P1J46L49K86J21j1n0k16j98j21l38m33J65K9
-10352D213l55k70K41L56o8j06J16J64J21p2n9K06K07P5j85j70j13M9j6j42K32L68mm53k37
$$ plain form
-10327 4098 4073 4229 4520 4403 4299 4278 4328 4449 4572 4640 4573 4247 4221 4475 4535 4328 4151 4111 4237 4378 4352 4182 3980 3961 4108 4220
-10301 4220 4156 3946 3743 3580 3859 4177 4123 3927 3824 3877 4036 4082 4093 4127 4240 4184 4064 4102 4089 3892 3291 2840 2845 2939 2933 3130 3146
-10274 3146 2944 2804 2734 2975 3204 3374 3278 3156 3161 3220 3390 3646 4054 4198 4089 4005 4122 4419 4569 4494 4355 4242 4263 4292 4566
-10249 4566 4849 4563 4329 4186 4002 4246 4620 4464 4104 3970 3895 3761 3722 3925 4131 3970 3771 3749 3582 2950 2893 3360 3675 4292
-10225 4292 4571 4282 4004 3586 3301 3245 3248 3399 3690 4013 4087 3942 3911 3828 3518 3285 3132 3296 3674 3984 3874 3435 3607 3729
-10201 3729 3594 3527 3778 4041 4310 4772 4553 4071 3737 3509 3511 3507 3500 3643 4009 4079 3493 3234 3535 3769 3530 3336 3535 3780 3992
-10176 3992 3991 3602 3536 3654 3695 3758 3997 3939 3678 3342 2996 2787 3035 3258 3306 3099 3031 3166 2917 2647 2443 2651 3218 3287 3056
-10151 3056 3089 3231 2999 2759 2978 3047 3068 2945 2942 2964 3073 3123 3449 3964 4150 3819 3564 3581 3496 3117 2869 2833 2809 3089 3225 2958
$$ packed form
-10327D098k5J56K91j17j04k1N0J21J23O8o7l26k6K54O0k07j77m0J26J41k6j70k02j9J47J12
-10301D220o4k10k03j63K79L18n4j96j03N3J59M6J1L4J13n6j20L8j3j97o01m51NR4oJ97J6
-10274C146k02j40p0K41K29J70r6j22NN9J70K56M08J44j09q4J17K97J50p5j39j13K1K9K74
-10249D566K83k86k34j43j84K44L74j56l60j34p5j34l9K03K06j61j99k2j67o32n7M67L15O17
-10225D292K79k89k78m18k85n6LJ51K91L23P4j45l1q3l10k33j53J64L78L10j10m39J72J22
-10201C729j35o7K51K63K69M62k19m82l34k28KmpJ43L66P0n86k59L01K34k39j94J99K45K12
-10176C992jl89o6J18M1O3K39n8k61l36l46k09K48K23M8k07o8J35k49k70k04K08N67O9k31
-10151C056L3J42k32k40K19O9K1j23lK2J09N0L26N15J86l31k55J7q5l79k48l6k4K80J36k67
$$ plain form
-10125 2958 2767 2931 3148 3390 3584 3740 3550 3246 3078 3165 3302 3582 3860 4010 3951 3789 3625 3296 2820 2849 2778 2661 2830 3194
-10101 3194 3392 3202 3077 3048 3088 3101 3062 2947 2694 2536 2892 3175 3310 3548 3763 3657 3318 3040 2969 2904 2984 3223 3538 3574 3621
-10076 3621 3701 3549 3305 3332 3412 3460 3403 3229 3406 3635 3500 3211 3083 3091 2901 2778 3005 3245 3243 3204 3431 3672 3660 3546 3310 3456
-10050 3456 3634 3417 3335 3455 3316 3034 3017 3101 2714 2430 2471 2874 3320 3653 3766 3394 3144 2887 2595 2649 2688 2604 2547 2286 2093
-10025 2093 2181 2394 2663 2876 2762 2538 2626 2904 2986 2833 2802 3077 3235 3081 2906 2638 2473 2359 2266 2499 2854 2817 2723 2631 2515
-10000 2515 2602 2449 2396 2516 2704 2988 3150 3143 2882 2776 2738 2674 2662 2678 3014 3331 3106 3107 3342 3330 3125 3023 2826 2603 2506 2449 2238
-9973 2238 1879 2138 2612 2762 2640 2803 3306 3440 3303 2929 2741 2857 2887 3051 2974 3036 3092 2669 2355 2344 2345 2387 2475 2324 2246 2273
-9947 2273 1969 1985 2027 2326 2488 2552 2496 2331 2019 1859 2133 2277 2064 1932 1797 1572 1751 1892 1715 1658 1825 2229 2461 2353
$$ packed form
-10125B958j91J64K17K42J94J56j90l04j68Q7J37K80K78J50n9j62j64l29m76K9p1j17J69L64
-10101C194J98j90j25k9M0J3l9j15k53j58L56K83J35K38K15j06l39k78p1o5Q0K39L15L6M7
-10076C621Q0j52k44K7Q0M8n7j74J77K29j35k89j28Qj90j23K27K40kl9K27K41j2j14k36J46
-10050C456J78k17q2J20j39k82j7Q4l87k84M1M03M46L33J13l72k50k57k92N4L9q4n7k61j93
-10025B093Q8K13K69K13j14k24Q8K78Q2j53l1K75J58j54j75k68j65j14r3K33L55l7r4r2j16
-10000B515Q7j53n3J20J88K84J62pk61j06l8o4j2J6L36L17k25JK35j2k05j02j97k23r7n7k11
-9973B238l59K59M74J50j22J63N03J34j37l74j88J16L0J64p7O2N6m23l14j1JM2Q8j51p8K7
-9947B273l04J6M2K99J62O4n6j65l12j60K74J44k13j32j35k25J79J41j77n7J67M04K32j08
$$ plain form
-9923 2353 2311 2311 2390 2365 2561 2738 2787 2651 2558 2226 2088 2213 2631 2960 2755 2393 1901 1718 1980 2364 2772 2741 2532 2463 2374 2291
-9897 2291 2520 2572 2385 2224 2003 2022 1895 1734 1792 1983 2041 2131 2188 2114 2319 2527 2700 2959 3102 2799 2466 2195 2238 2528 2732
-9872 2732 2813 3098 3290 3579 4018 3857 3495 3285 3209 2910 2443 2233 2565 2842 2750 2567 2647 2712 2502 2255 2194 2213 2271 2472 2629
-9847 2629 2597 2496 2171 1928 2104 2056 1909 2126 2199 2205 2681 3107 3093 2644 2231 2027 2042 2433 2700 2661 2368 2269 2574 2734 2678 2573
-9821 2573 2512 2544 2376 2222 2331 2622 2882 2947 3041 3226 3096 2776 2603 2589 2668 2964 3281 3266 2668 2142 2509 2841 2629 2276 2158
-9796 2158 2336 2381 2223 1987 1795 1886 2250 2211 2036 2157 2317 2227 2113 2083 2380 2744 2821 2955 3149 3153 3058 2833 2779 2960 3211 3319
-9770 3319 3035 2719 2667 2514 2235 2239 2378 2438 2245 2121 1950 1742 1990 2523 2591 2204 2013 2154 2318 2456 2352 2143 2211 2147 1862
-9745 1862 1634 1451 1418 1626 2247 2580 2631 2515 2212 2129 2045 2209 2199 2054 2456 2703 2768 2576 2295 2263 2135 2029 2126 2257 2168 1804
$$ packed form
-9923B353m2%P9k5J96J77M9j36r3l32j38J25M18L29k05l62m92j83K62L84M08l1k09o9q9q3
-9897B291K29N2j87j61k21J9j27j61N8J91N8R0N7p4K05K08J73K59J43l03l33k71M3K90K04
-9872B732Q1K85J92K89M39j61l62k10p6k99m67k10L32K77r2j83Q0O5k10k47o1J9N8K01J57
-9847B629l2j01l25k43J76m8j47K17P3OM76M26j4m49m13k04J5L91K67l9k93r9L05J60n6j05
-9821B573o1L2j68j54J09K91K60O5R4J85j30l20j73j4P9K96L17j5n98n26L67L32k12l53j18
-9796B158J78M5j58k36j92R1L64l9j75J21J60r0j14l0K97L64P7J34J94Mr5k25n4J81K51J08
-9770C319k84l16n2j53k79MJ39O0j93j24j71k08K48N33O8l87j91J41J64J38j04k09O8o4k85
-9745A862k28j83l3K08O21L33N1j16l03q3q4J64j0j45M02K47O5j92k81l2j28j06R7J31q9l64
$$ plain form
-9719 1804 1426 1515 1831 2058 2415 2467 2098 1844 1970 2107 2204 2312 2396 2584 2569 2366 2018 1951 2009 1947 1872 1986 2249 2230 2019 1798
-9693 1798 1982 2208 2397 2531 2635 2392 2013 1998 2066 1750 1492 1753 1874 1825 1925 2163 2165 1928 1660 1372 1196 1313 1813 2184
-9669 2184 2565 3145 3339 2841 2548 2258 1575 1151 1230 1401 1618 1896 2265 2558 2599 2570 2580 2693 2753 2836 2688 2521 2684 3039 3039
-9644 3039 2742 2439 2178 1937 1672 1435 1352 1348 1674 2002 1754 1331 1135 1137 1353 1593 1947 2328 2604 2510 2120 1826 1731 1672 1613 1657
-9618 1657 1974 2319 2275 1829 1376 1165 1427 1499 1819 2002 1654 1380 1458 1532 1816 2019 2038 1860 1683 1992 1876 1120 914 1200
-9594 1200 1385 1442 1543 1956 2451 2862 3046 2955 2396 1985 2177 2449 2502 2268 1964 1837 1842 2021 2038 1639 1322 1189 1103 1169 1517
-9569 1517 1912 2095 1922 1643 1759 2018 2219 2078 1801 1856 2123 2280 2330 2368 2201 1833 1336 814 799 953 1192 1612 1738 1535
-9545 1535 1535 1826 2210 2342 2242 2213 2127 1948 1941 2103 2204 2201 2259 2484 2680 2712 2381 2095 2116 1854 1555 1711 1662 1796 2108 2495 2666
$$ packed form
-9719A804l78Q9L16K27L57N2l69k54J26J37R7J08Q4J88j5k03l48o7N8o2p5J14K63j9k11k21
-9693A798J84K26J89J34J04k43l79j5O8l16k58K61J21m9J00K38Kk37k68k88j76J17N00L71
-9669B184L81N80J94m98k93k90o83m24P9J71K17K78L69K93M1k9J0J13O0Q3j48j67J63L55%
-9644C039k97l03k61k41k65k37q3mL26L28k48m23j96KK16K40L54L81K76r4l90k94r5n9n9M4
-9618A657L17L45m4m46m53k11K62P2L20J83l48k74P8P4K84K03J9j78j77L09j16p56k06K86
-9594A200J85N7J01M13M95M11J84r1n59m11J92K72N3k34l04j27NJ79J7l99l17j33q6O6L48
-9569A517L95J83j73k79J16K59K01j41k77N5K67J57N0L8j67l68m97n22j5J54K39M20J26k03
-9545A535%K91L84J32j00k9q6j79pJ62J01lN8K25J96L2l31k86K1k62k99J56m9J34L12L87J71
$$ plain form
-9518 2666 2536 2389 2287 2305 2425 2394 2200 2205 2231 2004 1688 1541 1747 1990 1945 1710 1652 1745 2277 2720 2471 2033 1847 1993 1859
-9493 1859 1664 1681 1916 2104 1817 1766 1891 2005 1945 1884 1979 2380 2756 2594 2040 1823 2191 2332 2239 1976 1700 1666 1458 1240 1334
-9468 1334 1481 1540 1591 1492 1268 1512 1649 1449 1494 1574 1624 1708 1720 1471 1044 1068 1001 943 1337 1813 2201 2352 2322 2519 2649 2562 2467
-9441 2467 2208 2113 2121 2319 2517 2354 1837 1315 1140 1311 1416 1570 1780 2097 2152 1935 1817 1688 1479 1362 1566 1589 1527 1807 2040
-9416 2040 2047 1993 2053 2111 2110 1775 1269 1205 1323 1480 1514 1685 2171 2435 2112 1698 1491 1623 1905 2046 2083 1964 1779 1570 1479 1705
-9390 1705 2019 2030 1981 1983 1961 1943 1970 2075 2065 2064 2152 2017 1690 1380 1359 1657 2037 2357 2497 2727 2576 2039 1765 1957 1858 1455 1062
-9363 1062 869 679 571 686 984 1411 1863 1702 1438 1508 1547 1545 1505 1531 1768 2071 2106 1943 2041 2106 2148 2125 1997 1929 1918 2019 2037
-9336 2037 1883 1840 1845 1807 1965 2200 2402 2451 2435 2495 2220 1950 2022 2039 1884 1791 1866 2148 2201 2087 1808 1738 1744 1568 1321 1172 1538 2003
$$ packed form
-9518B666j30j47j02J8J20l1j94NK6k27l16j47K06K43m5k35n8R3N32M43k49m38j86J46j34
-9493A859j95J7K35J88k87n1J25J14o0o1R5M01L76j62n54k17L68J41r3k63k76l4k08k18R4
-9468A334J47N9N1r9k24K44J37k00M5Q0N0Q4J2k49m27K4o7n8L94M76L88J51l0J97J30q7r5
-9441B467k59r5QJ98J98j63n17n22j75J71J05J54K10L17N5k17j18j29k09j17K04K3o2K80K33
-9416B040Pn4O0N8jl35n06o4J18J57L4J71M86K64l23m14k07J32K82J41L7j19j85k09r1K26
-9390A705L14J1m9Kk2j8K7J05j0jQ8j35l27l10k1K98L80L20J40K30j51n37k74J92r9m03l93
-9363A062j93j90j08J15K98M27M52j61k64P0L9km0K6K37L03L5j63R8O5M2k3j28o8j1J01J8
-9336B037j54m3Nl8J58K35K02M9j6O0k75k70P2J7j55r3P5K82N3j14k79p0Oj76k47j49L66M65
$$ plain form
-9308 2003 2291 2241 2264 2326 2062 1717 1660 1789 1893 1891 1928 2018 2300 2384 1836 1613 1833 1810 1818 1969 1880 1664 1675 1702 1782 2215 2277 2141
-9280 2141 2294 2312 2040 1896 2039 1929 1661 1538 1588 1834 1819 1729 1654 1551 1432 1402 1381 1244 1007 870 1086 1565 2112 2008 1601
-9255 1601 1637 2025 2149 2019 1973 1790 1490 1104 1138 1534 1686 1481 1382 1024 848 1029 1111 968 807 1076 1460 1460 1033 949 1072
-9230 1072 1076 1159 1304 1294 1377 1735 1822 1658 1557 1826 2242 2425 2334 2013 2060 2381 2142 1593 1314 1218 1046 1222 1720 1937 1612 1309
-9204 1309 1557 1895 1905 1791 1793 1808 1504 1282 1287 1200 897 717 1122 1516 1550 1456 1417 1581 1914 2344 2729 2814 3041 3252 2999 2429
-9178 2429 2034 2147 2368 2256 1924 1671 1465 1446 1203 1204 1365 1511 1505 1468 1548 1764 1835 1653 1330 968 905 758 656 819 1063 1220
-9152 1220 1180 929 1019 1529 1677 1344 1067 1248 1474 1341 1253 1395 1762 1758 1658 1584 1571 1954 2520 2498 1963 1513 1430 1273 1069 1285
-9126 1285 1575 1920 2241 2345 2346 2496 2408 2400 2331 2191 2088 2068 2007 1816 1700 1585 1484 1391 1436 1444 1248 1271 1735 2165 2096 1681 1316
$$ packed form
-9308B003K88n0K3O2k64l45n7J29J04kL7R0K82Q4n48k23K20k3QJ51q9k16J1K7Q0M33O2j36
-9280B141J53J8k72j44J43j10k68j23N0K46j5r0p5j03j19l0k1j37k37j37K16M79N47j04m07
-9255A601L6L88J24j30m6j83l00l86L4L96J52k05r9l58j76J81Q2j43j61K69L84%m27q4J23
-9230A072MQ3J45j0Q3L58Q7j64j01K69M16J83r1l21M7L21k39n49k79r6j72J76M98K17l25l03
-9204A309K48L38J0j14KJ5l04k22Nq7l03j80M05L94L4r4l9J64L33M30L85Q5K27K11k53n70
-9178B429l95J13K21j12l32k53k06j9k43JJ61J46ol7Q0K16P1j82l23l62o3j47j02J63K44J57
-9152A220m0k51R0N10J48l33k77J81K26j33q8J42L67mj00p4j3L83N66k2n35m50q3j57k04K16
-9126A285K90L45L21J04JJ50q8qo9j40j03k0o1j91j16j15j01r3M5Qj96K3M64M30o9m15l65
$$ plain form
-9099 1316 1140 1310 1336 1438 1737 1786 1711 1729 1980 1857 1363 961 816 931 1066 1276 1123 872 881 870 848 1096 1497 1431 1063 910
-9073 910 970 1181 1167 1494 1956 1964 1731 1508 1473 1547 1374 1467 1786 1905 1894 1543 1385 1577 1919 2195 2023 1668 1342 1477 1764 1980
-9047 1980 2035 2013 1945 2003 2147 2101 1997 1863 1787 1756 1640 1306 1031 1192 1210 914 823 1108 1501 1872 1872 1768 1851 1689 1572 1579 1848
-9020 1848 1918 1734 1733 1687 1497 1353 1518 1780 1901 1917 1791 1763 1810 1577 1401 1019 641 702 1052 1269 1407 1325 988 811 712 682
-8994 682 915 1183 1222 1245 1640 1726 1543 1556 1488 1537 1435 1301 1100 1106 1416 1517 1396 1294 1403 1406 1395 1796 2155 2158 2054 1916 1888 1694
-8966 1694 1755 1965 2190 2273 2293 2163 1741 1123 923 1265 1281 1370 1478 1483 1667 1779 1686 1496 1333 1244 1140 837 474 426 452 526 667
-8939 667 1123 1259 1443 1590 1596 1693 1759 1899 1745 1745 1838 1626 1452 1546 1771 1685 1727 1598 1257 1205 1154 963 1060 1490 1918 1678 1345
-8912 1345 1439 1528 1564 1610 1737 1822 1601 1018 759 866 1225 1330 1243 1015 924 1083 1134 1192 1143 1145 1095 857 935 1272 1497 1571 1866 2077
$$ packed form
-9099A316j76J70K6J02K99M9p5J8K51j23m94m02j45J15J35K10j53k51Rj1k2K48M01o6l68j53
-9073I10O0K11j4L27M62Qk33k23l5P4j73R3L19J19j1l51j58J92L42K76j72l55l26J35K87K16
-9047A980N5k2o8N8J44m6j04j34p6l1j16l34k75J61J8k96r1K85L93L71%j04Q3j62j17PK69
-9020A848P0j84jm6j90j44J65K62J21J6j26k8M7k33j76l82l78O1L50K17J38q2l37j77r9l0
-8994F82K33K68L9K3L95Q6j83J3o8M9j02j34k01OL10J01j21j02J09Lj1M01L59Lj04j38k8j94
-8966A694O1K10K25Q3K0j30m22o18k00L42J6Q9J08NJ84J12r3j90j63q9j04l03l63m8K6P4J41
-8939F67M56J36J84J47OR7O6J40j54%R3k12j74R4K25q6M2j29l41n2n1j91R7M30M28k40l33
-8912A345R4Q9L6M6J27Q5k21n83k59J07L59J05q7k28r1J59N1N8m9Kn0k38P8L37K25P4K95K11
$$ plain form
-8884 2077 1969 1813 1595 1582 1682 1670 1556 1618 1495 1553 1776 1752 1577 1260 1137 1335 1549 1548 1618 1748 1637 1766 2057 2057 1937 1847
-8858 1847 1577 1175 1075 1100 1155 1199 1015 823 807 979 1237 1362 1205 916 1106 1685 2288 2493 2342 1926 1475 1134 1000 1109
-8834 1109 1262 1259 1267 1348 1404 1564 1793 2073 2015 1942 1587 1161 971 1194 1578 1412 832 638 750 799 800 828 972 1060 1214 1276 1168
-8807 1168 976 911 792 887 1091 1404 1538 1491 1296 1032 711 798 954 833 934 1193 1411 1410 1172 915 969 1232 1553 1601 1388
-8782 1388 1359 1641 1689 1677 1695 1567 1228 872 1038 1435 1720 1939 2005 1865 1702 1441 1314 1482 1769 1721 1311 1235 1409 1456 1425 1243
-8756 1243 1188 1179 974 794 674 664 779 873 1123 1516 1767 1890 1934 1897 1846 1790 1592 1556 1734 1855 1763 1472 1220 1121 1074 801 808 1165
-8728 1165 1260 1013 857 863 636 688 965 1167 1360 1598 1887 1956 2118 2297 2342 2083 1904 1689 1252 1164 1295 1266 1169 1085 1116 1144 1268
-8701 1268 1459 1371 1045 748 548 786 1470 1660 1663 1755 1568 940 393 327 613 842 995 1374 1636 1741 1672 1559 1322 885 781
$$ packed form
-8884B077j08j56k18j3J00j2j14O2j23N8K23k4j75l17j23J98K14jP0J30j11J29K91%j20r0
-8858A847k70m02j00K5N5M4j84j92j6J72K58J25j57k89J90N79O03K05j51m16m51l41j34J09
-8834A109J53lQQ1N6J60K29K80n8p3l55m26j90K23L84j66n80j94J12M9JK8J44Q8J54O2j08
-8807A168j92o5j19R5K04L13J34m7j95k64l21Q7J56j21J01K59K18jk38k57N4K63L21M8k13
-8782A388k9K82M8j2J8j28l39l56J66L97K85K19O6j40j63k61j27J68K87m8m10p6J74M7l1j82
-8756A243n5rk05j80j20j0J15R4K50L93K51J23M4l7n1n6j98l6J78J21r2k91k52r9m7k73PL57
-8728A165R5k47j56Ok27N2K77K02J93K38K89O9J62J79M5k59j79k15m37q8J31k9r7q4L1K8J24
-8701A268J91q8l26k97k00K38O84J90LR2j87o28n47o6K86K29J53L79K62J05o9j13k37m37j04
$$ plain form
-8676 781 902 981 968 993 1221 1320 1479 1481 1655 1855 1754 1593 1814 1689 1244 1143 1527 1886 2119 1972 1797 1751 1579 1483 1451 1386
-8650 1386 1690 1876 1929 1915 1866 1685 1266 1094 1221 1349 1579 1879 2070 2013 1775 1426 1172 1134 899 805 781 1007 1198 1030 894
-8625 894 727 770 1086 1361 1499 1776 2204 2293 2077 1791 1681 1569 1373 1152 969 1032 1219 1067 657 383 353 299 445 441 595
-8600 595 664 530 413 700 768 770 934 1139 1263 960 815 964 1111 1316 1508 1521 1276 864 500 429 541 440 640 935 1156
-8575 1156 1391 1103 934 923 1048 1155 1139 1300 1496 1664 1701 1716 1792 1790 1598 1442 1435 1192 969 754 427 116 556 1142 1282 1429
-8549 1429 1460 1202 934 777 1014 1069 772 608 477 526 607 799 1050 1292 1107 742 614 575 557 376 316 529 575 539 766 1241
-8523 1241 1256 965 888 852 1111 1219 1199 1050 776 514 407 427 567 546 383 459 491 636 898 1154 1412 1484 1599 1254 1003 965
-8497 965 1062 1118 1226 1467 1675 1988 2064 1729 1536 1599 1439 1284 1155 1367 1584 1563 1655 1841 2080 2185 1787 1635 1516 1252 1212
$$ packed form
-8676G81J21P9j3K5K28R9J59KJ74K00j01j61K21j25m45j01L84L59K33j47j75m6j72r6l2o5
-8650A386L04J86N3j4m9j81m19j72J27J28K30L00J91n7k38l49k54l8k35r4k4K26J91j68j36
-8625H94j67M3L16K75J38K77M28Q9k16k86j10j12j96k21j83O3J87j52m10k74l0n4J46mJ54
-8600E95O9j34j17K87O8KJ64K05J24l03j45J49J47K05J92J3k45m12l64p1J12j01K00K95K21
-8575A156K35k88j69j1J25J07j6J61J96J68L7J5P6kj92j56pk43k23k15l27l11M40N86J40J47
-8549A429L1k58k68j57K37N5k97j64j31M9Q1J92K51K42j85l65j28l9j8j81o0K13M6l6K27M75
-8523A241J5k91p7l6K59J08k0j49k74k62j07K0J40k1j63P6L2J45K62K56K58P2J15l45k51l8
-8497I65R7N6J08K41K08L13P6l35j93O3j60j55j29K12K17k1R2J86K39J05l98j52j19k64m0
$$ plain form
-8472 1212 1145 1239 1602 1925 2006 1613 1442 1446 1540 1842 1759 1381 1041 958 826 773 875 1061 1035 1446 1944 2062 1830 1561 1543 1761
-8446 1761 2069 2193 2123 1884 1875 1872 1752 1428 1295 1252 1114 1200 1318 1052 808 742 777 910 1189 1258 1001 821 756 874 1174 1373
-8420 1373 1249 995 913 947 1038 1004 660 449 690 1004 1011 1156 1246 1061 814 999 1350 1533 1689 1810 1529 927 1001 1134 991
-8395 991 982 1112 1250 1271 1182 996 637 84 136 531 926 1490 1569 1435 1493 1430 1492 1715 1640 1421 1038 950 1074 1321 1514 1360 1515
-8368 1515 1671 1531 1615 1851 1691 1666 1945 2205 2347 2044 1463 810 544 723 1076 1228 1224 1243 973 780 1037 1390 1430 1286 1345
-8343 1345 1587 1483 1197 1082 1037 603 146 366 825 1199 1360 1432 1312 1086 1158 1149 1314 1494 1209 753 908 1506 2178 2410
-8319 2410 2036 1983 2062 1726 1426 1588 1745 1794 1739 1565 1251 1018 762 455 567 948 1347 1707 2122 2226 2115 2036 1917 1602
-8295 1602 1185 1041 1170 1504 1250 910 717 730 1069 1053 1179 1472 1470 1572 2032 1911 1407 1288 1412 1492 1485 1304 1138 1184 1339
$$ packed form
-8472A212o7R4L63L23Q1l93j71MR4L02q3l78l40q3j32n3J02J86k6M11M98J18k32k69j8K18
-8446A761L08J24p0k39rlj20l24j33m3j38Q6J18k66k44o6L5J33K79O9k57j80o5J18L00J99
-8420A373j24k54q2L4R1l4l44k11K41L14PJ45R0j85k47J85L51J83J56J21k81o02P4J33j43
-8395I91rJ30J38K1q9j86l59n53N2L95L95N64P9j34N8o3O2K23p5k19l83q8J24K47J93j54J55
-8368A515J56j40Q4K36j60k5K79K60J42l03n81o53k66J79L53J52mJ9k70j93K57L53M0j44N9
-8343A345K42j04k86j15m5m34m57K20M59L74J61P2j20k26P2rJ65J80k85m56J55N98O72K32
-8319B410l74n3P9l36l00J62J57M9n5j74l14k33k56l07J12L81L99L60M15J04j11p9j19l15
-8295A602m17j44J29L34k54l40j93J3L39j6J26K93kJ02M60j21n04j19J24Q0pj81j66M6J55
$$ plain form
-8270 1339 1279 1224 1462 1606 1548 1322 1241 992 833 619 450 628 948 1102 960 942 1391 1720 2037 1975 1619 1718 1872 1564 1455
-8245 1455 1744 1741 1643 1592 1524 1685 1806 1628 1654 1693 1453 1140 1160 1123 1065 1045 1186 1333 1245 1076 1071 1019 844 1041 1393 1776 2092 1923
-8217 1923 1594 1505 1201 1002 1066 1030 876 859 966 863 844 658 427 265 319 590 1047 1106 913 938 1059 1251 1491 1274 1292 1112
-8191 1112 1009 980 826 561 244 405 812 1308 1484 1166 623 448 681 814 932 759 732 837 750 634 419 293 453 572
-8167 572 606 917 1115 775 661 1022 1257 1323 999 690 556 548 659 662 794 961 890 629 379 598 1035 1073 1024 988 700 373
-8141 373 333 632 788 910 893 1009 1061 1095 1086 1111 1160 917 634 685 611 494 589 979 1291 1315 1129 949 876 568 551 600 644 660 483
-8112 483 361 542 842 877 1012 1124 987 1120 1448 1397 1142 853 752 617 461 488 561 709 1110 1612 1781 1390 1019 858
-8088 858 737 722 658 453 407 513 665 761 952 947 981 1154 1053 864 1032 1374 1293 1034 935 1074 1332 1398 1262 716 369 589
$$ packed form
-8270A339o0n5K38J44n8k26q1k49j59k14j69J78L20J54j42j8M49L29L17o2l56R9J54l08j09
-8245A455K89lr8n1o8J61J21j78K6L9k40l13K0l7n8k0J41J47q8j69nn2j75J97L52L83L16j69
-8217A923l29q9l04j99O4l6j54j7J07j03j9j86k31j62N4K71M57N9j93K5J21J92K40k17J8j80
-8191A112j03k9j54k65l17J61M07M96J76l18n43j75K33J33J18j73k7J05q7j16k15j26J60J19
-8167E72L4L11J98l40j14L61K35O6l24l09j34qJ11LJ32J67p1k61k50K19M37L8m9l6k88l27
-8141C73m0K99J56J22j7J16N2L4rK5M9k43k83N1p4j17R5L90L12K4j86j80p3l08j7M9M4J6j77
-8112D83j22J81L00L5J35J12j37J33L28n1k55k89j01j35j56K7P3J48M01N02J69l91l71j61
-8088H58j21j5o4k05m6J06J52R6J91nL4J73j01j89J68L42q1k59r9J39K58O6j36n46l47K20
$$ plain form
-8062 589 943 1107 1300 1376 1401 1675 1603 1232 1012 857 826 655 696 816 769 874 865 961 1113 987 827 977 1174 1337 1720 2040
-8036 2040 2000 1697 1175 746 481 35 -92 209 516 789 1287 1529 1665 1935 1907 1638 1517 1346 996 550 371 690 1369
-8013 1369 1638 1434 1324 1412 1455 1048 621 445 434 565 668 691 943 869 751 852 942 1056 1040 1092 1199 1202 1154 718 350 436 834
-7986 834 1236 1458 1420 1200 1149 1155 1146 1123 1002 902 782 669 547 607 724 695 798 878 686 674 1113 1221 1231 1380 1317 1286 1431 1355
-7958 1355 1341 1362 1095 882 953 1233 1348 1035 977 1059 1006 730 759 1018 1036 972 1199 1322 1338 1369 1237 1148 1082 967 990 1080 1212 955
-7930 955 946 1260 1544 1547 1215 1069 1153 1107 1036 1043 1004 971 1004 857 500 605 810 767 662 752 681 264 64 270 578 774 853 1106
-7902 1106 1307 1434 1337 1272 969 755 894 964 1135 1301 1334 1193 1304 1454 1565 1696 1804 1617 1194 1161 1399 1296 1106 996
-7878 996 988 1068 1078 993 985 643 488 374 109 187 344 458 606 512 509 823 958 888 696 704 786 682 871 1409 1954 2243 2182 1945
$$ packed form
-8062E89L54J64J93P6K5K74p2l71k20j55l1j71M1J20m7J05rR6J52j26j60J50J97J63L83L20
-8036B040m0l03n22m29k65m46j27L01L07K73M98K42J36K70k8k69j21j71l50m46j79L19O79
-8013A369K69k04j10Q8M3m07m27j76j1J31J03K3K52p4j18J01R0J14j6N2J07Lm8m36l68Q6L98
-7986H34M02K22l8k20n1Ork3j21j00j20j13j22O0J17k9J03Q0j92j2M39J08J0J49o3l1J45p6
-7958A355j4K1k67k13P1K80J15l13n8Q2n3k76K9K59J8o4K27J23J6L1j32q9o6j15K3R0J32k57
-7930I55rL14K84Ll32j46Q4m6p1Pl9l3L3j47l57J05K05m3j05R0p1m17k00K06L08J96P9K53
-7902A106K01J27r7o5l03k14J39P0J71J66L3j41J11J50J11J31J08j87m23l3K38j03j90j10
-7878I96qQ0J0q5ql42j55j14k65P8J57J14J48r4lL14J35p0j92QQ2j04J89N38N45K89o1k37
$$ plain form
-7850 1945 1694 1462 1203 1296 1320 1047 880 760 1053 1511 1743 1877 2200 2556 2280 1743 1422 1271 1293 1316 1467 1604 1502 1374
-7826 1374 1374 1571 1712 1524 1372 1282 1093 972 942 882 923 1510 1968 1914 1524 1171 1045 1190 1406 1512 1472 1590 1627 1556 1483 1119
-7800 1119 858 949 840 472 616 800 579 542 414 520 752 777 782 619 420 329 547 822 890 1256 1308 1108 926 900 1258 1674
-7774 1674 1707 1502 1430 1318 1259 995 1044 1340 1622 1619 1391 1269 1006 1097 1390 1680 1750 1469 870 427 559 835 746 545 466 714
-7748 714 908 848 862 956 992 1051 873 680 504 840 1367 1505 1401 1508 1355 1040 927 781 411 247 372 324 360 480 903
-7723 903 1193 1573 1876 1799 1629 1285 1019 1024 1242 1404 1238 1225 1440 1513 1249 812 332 425 777 672 475 654 869 1138 1154
-7698 1154 807 671 671 603 773 726 612 454 394 576 776 893 693 400 237 241 511 754 645 413 197 220 589 1165 1422
-7673 1422 1442 1314 1119 872 956 1102 1165 1164 1324 1418 1182 935 497 125 257 437 809 1248 1226 1138 1100 1116 1149 969 1016 1133 1061
$$ packed form
-7850A945k51k32k59R3K4k73j67j20K93M58K32J34L23L56k76n37l21j51K2K3J51J37j02j28
-7826A374%J97J41j88j52r0j89j21l0o0M1N87M58n4l90l53j26J45K16J06m0J18L7p1p3l64
-7800A119k61R1j09l68J44J84k21l7j28J06K32K5Nj63j99r1K18K75O8L66N2k00j82k6L58M16
-7774A674L3k05p2j12n9k64M9K96K82lk28j22k63R1K93K90P0k81n99m43J32K76q9k01p9K48
-7748G14J94o0J4R4L6N9j78j93j76L36N27J38j04J07j53l15j13j46l70j64J25m8L6J20M23
-7723I03K90L80L03p7j70l44k66NK18J62j66j3K15P3k64m37m80R3L52j05j97J79K15K69J6
-7698A154l47j36%o8J70m7j14j58o0J82K00J17k00k93j63MK70K43j09k32k16K3L69N76K57
-7673A422K0j28j95k47Q4J46O3jJ60R4k36k47m38l72J32J80L72M39k2q8l8J6L3j80M7J17p2
$$ plain form
-7646 1061 812 954 1034 1143 1138 890 709 794 960 1091 1197 1062 855 987 1208 1471 1655 1564 1148 535 259 397 609 883
-7622 883 959 951 819 625 646 586 670 778 725 473 191 88 -26 488 1067 1348 1359 1053 708 675 766 798 886 823 728 708 732 726 751
-7593 751 710 519 639 979 1145 1199 1238 1361 1143 668 515 513 503 546 543 698 706 746 1075 1304 1094 696 533 433 474 656 953
-7566 953 1279 1676 1816 1790 1788 1629 1481 1440 1307 1372 1568 1353 1167 1329 1599 1526 1237 1434 1560 1403 1154 1209 1460 1551 1285 1045
-7540 1045 988 1126 1287 1230 1313 1213 904 626 890 1203 1257 1011 750 680 766 954 1260 1283 831 796 1138 1340 1410 1313 1137 871
-7514 871 611 587 517 435 730 1097 1257 1140 974 902 1010 1316 1164 973 1112 1155 892 710 919 1191 1552 1939 2195 1946 1142
-7489 1142 562 550 480 243 343 931 1180 1065 952 815 624 746 756 803 1252 1624 1650 1442 1082 997 1041 1126 1135 892 689 801
-7463 801 1231 1334 1012 817 927 1034 1207 1384 1554 1718 1979 1894 1803 1852 1959 1875 1555 1436 1229 917 775 433 326 260 299
$$ packed form
-7646A061k49J42Q0J09nk48j81Q5J66J31J06j35k07J32K21K63J84r1m16o13k76J38K12K74
-7622H83P6qj32j94K1o0Q4J08n3k52k82j03j14N14N79K81J1l06l45l3R1L2Q8o3r5k0K4oK5
-7593G51m1j91J20L40J66N4L9J23k18m75j53kj0M3lJ55QM0L29K29k10l98j63j00M1J82K97
-7566I53L26L97J40k6kj59j48m1j33O5J96k15j86J62K70p3k89J97J26j57k49N5K51R1k66k40
-7540A045n7J38J61n7Q3j00l09k78K64L13N4k46k61p0Q6J88L06K3m52l5L42K02P0r7j76k66
-7514H71k60k4p0q2K95L67J60j17j66p2J08L06j52j91J39M3k63j82K09K72L61L87K56k49q04
-7489A142n80j2p0k37J00N88K49j15j13j37j91J22J0M7M49L72K6k08l60q5M4Q5Rk43k03J12
-7463H01M30J03l22j95J10J07J73J77J70J64K61q5r1M9J07q4l20j19k07l12j42l42j07o6L9
$$ plain form
-7438 299 288 299 345 404 228 63 396 782 761 641 483 607 953 977 1007 845 692 347 0 -348 -580 -498 -783 -946 -515 -92
-7412 -92 410 810 1102 1117 976 529 173 226 392 773 853 651 274 149 337 418 210 -25 40 74 187 530 1000 970 732 729
-7386 729 683 738 722 502 680 1009 1112 947 929 956 886 1199 1480 1443 1288 1086 1107 1057 924 728 800 977 1005 992 1073 1199 1419
-7359 1419 1412 1206 903 947 1176 1236 1047 918 846 866 780 568 483 603 727 799 1036 1150 1115 890 821 948 748 489 659 805
-7333 805 841 1054 985 952 735 725 852 631 603 618 424 292 400 536 667 555 400 615 1025 995 700 669 690 533 347 431
-7307 431 594 662 681 701 794 969 1044 1182 1200 924 810 821 845 805 808 1126 1103 782 826 1059 878 626 481 400 305 376 300 -76 -221
-7278 -221 -44 242 410 522 438 381 363 520 654 556 497 296 189 270 334 319 330 528 594 727 980 956 763 779 1008 1038 886
-7251 886 536 256 313 15 -30 496 893 1051 600 520 1045 1161 1180 1139 1022 873 684 710 917 1041 1006 948 972 877 703 727 909
$$ packed form
-7438B99j1J1M6N9j76j65L33L86k1j20j58J24L46K4L0j62j53l45l47l48k32Q2k85j63M31M23
-7412i2N02M00K92J5j41m47l56N3J66L81Q0k02l77j25J88Q1k08k35O5L4J13L43M70l0k38l
-7386G29m6N5j6k20J78L29J03j65j8K7p0L13K81l7j55k02K1n0j33j96P2J77K8j3Q1J26K20
-7359A419pk06l03M4K29O0j89j29p2K0q6k12q5J20J24P2K37J14l5k25o9J27k00k59J70J46
-7333H05L6K13o9l3k17j0J27k21k8J5j94j32J08J36J31j12j55K15M10l0k95l1K1j57j86Q4
-7307D31J63O8J9K0R3J75P5J38J8k76j14J1K4m0LL18k3l21M4K33j81k52j45q1r5P1p6l76j45
-7278b21J77K86J68J12q4n7j8J57J34r8n9k01j07Q1O4j5J1J98O6J33K53k4j93J6K29L0j52
-7251H86l50k80N7k98m5N26L97J58m51q0N25J16J9m1j17j49j89K6K07J24l5n8K4r5j74K4J82
$$ plain form
-7224 909 1000 840 776 798 1185 1707 1448 993 776 698 890 919 528 492 636 1073 1237 1263 1232 1062 1056 1133 852 432 404 401 281 53
-7196 53 -12 188 473 878 973 671 746 819 831 828 744 681 719 655 585 659 558 330 343 602 655 391 88 -58 150 578 958 920 769
-7167 769 745 787 832 847 660 507 613 699 878 812 990 1077 810 520 492 580 387 116 448 798 692 683 877 789 384 182 81
-7140 81 231 446 712 783 818 816 831 831 1004 1094 1014 990 923 891 693 571 597 630 677 729 944 1047 1152 682 148 4 52 103 268
-7111 268 450 385 272 403 607 699 865 821 722 932 1088 751 460 706 880 781 707 784 1123 1516 1551 1104 577 761 661 276
-7085 276 161 136 432 687 559 219 24 76 358 616 631 552 502 515 548 954 1131 731 488 605 683 362 405 630 727 535
-7059 535 261 462 779 955 720 265 -117 15 721 1123 909 789 841 668 296 345 708 680 813 909 941 630 557 677 625
-7034 625 823 1375 1533 998 315 -6 -113 -6 444 690 732 841 743 533 554 601 781 790 962 1177 856 511 602 680 646 604
$$ packed form
-7224I09R1j60o4K2L87N22k59m55k17p8J92K9l91l6J44M37J64K6l1j70oP7k81m20k8lj20k28
-7196E3o5K00K85M05R5l02P5P3J2lq4o3L8o4p0P4j01k28J3K59N3k64l03j46K08M28L80l8j51
-7167G69k4M2M5J5j87j53J06Q6J79o6J78Q7k67k90k8Q8j93k71L32L50j06rJ94q8m05k02j01
-7140H1J50K15K66P1L5kJ5%J73R0q0k4o7l2j98j22K6L3M7N2K15J03J05m70n34j44M8N1J65
-7111B68J82o5j13J31K04R2J66m4r9K10J56l37k91K46J74r9p4P7L39L93L5m47n27J84j00l85
-7085B76j15k5K96K55j28l40j95N2K82K58J5p9n0J3L3M06J77m00k43J17P8l21M3K25R7j92
-7059E35k74K01L17J76k35m55l82J32P06M02k14j20N2j73l72M9L63k8J33R6L2l11p3J20n2
-7034F25J98N52J58n35o83l21j07J07M50K46M2J09r8k10K1M7J80RJ72K15l21l45R1P8l4m2
$$ plain form
-7008 604 298 -104 -141 152 357 376 464 995 1400 1256 1270 1287 994 921 1232 1217 1127 1359 1117 831 878 915 1378 1947 1783 1407
-6982 1407 948 530 364 394 454 542 516 345 583 607 445 329 478 624 661 772 889 783 556 238 141 323 655 1261 1312
-6957 1312 1113 1066 919 771 598 447 577 654 321 78 18 78 2 -90 -49 14 37 -106 36 315 565 920 1353 1211 676 390
-6931 390 569 859 914 980 1015 1166 1431 1316 1283 997 360 162 110 -29 163 366 487 374 461 647 990 1042 858 896 1114 1174
-6905 1174 1261 1292 1120 627 601 913 693 494 745 891 1003 1119 1036 871 1084 1452 1381 1155 1132 937 510 312 129 135 383
-6880 383 922 1008 682 766 928 725 326 50 112 469 496 365 390 276 339 234 123 356 722 752 608 645 954 1018 683 343
-6854 343 198 280 531 812 904 797 734 530 479 736 977 1342 1595 1289 798 705 798 905 932 891 825 746 798 1140 1371 1222 1323
-6827 1323 1497 1240 756 363 390 435 549 819 905 867 772 966 1124 1018 841 630 292 116 279 399 336 246 328 428 448 191
$$ packed form
-7008F04l06m02l7K93K05J9Q8N31M05j44J4J7k93p3L11j5r0K32k42k86M7L7M63N69j64l76
-6982A407m59m18j66L0O0Q8k6j71K38K4j62j16J49J46L7J11J17j06k27l18r7J82L32O06N1
-6957A312j99m7j47j48j73j51J30P7l33k43o0O0p6r2M1O3K3j43J42K79K50L55M33j42n35k86
-6931C90J79K90N5O6L5J51K65j15l3k86o37j98n2j39J92K03J21j13Q7J86L43N2j84L8K18O0
-6905A174Q7L1j72m93k6L12k20j99K51J46J12J16q3j65K13L68p1k26k3j95m27j98j83OK48
-6880C83N39Q6l26Q4J62k03l99k76O2L57K7j31K5j14O3j05j11K33L66L0j44L7L09O4l35l40
-6854C43j45Q2K51K81R2j07o3k04n1K57K41L65K53l06m91r3R3J07K7m1o6p9N2L42K31j49J01
-6827A323J74k57m84l93K7M5J14K70Q6l8r5J94J58j06j77k11l38j76J63J20o3r0Q2J00K0k57
$$ plain form
-6801 191 -41 48 420 634 905 949 705 528 589 753 985 1152 1030 944 849 878 1224 1470 1378 1066 525 131 -108 96 339
-6776 339 532 701 686 670 1002 1222 933 449 353 760 1181 1226 920 840 1072 959 776 789 797 605 -33 -268 -329 -362 -229 231
-6750 231 953 1202 1187 1008 638 329 309 504 711 977 1094 1382 1559 1189 699 605 515 333 298 375 419 392 479 602 836 1104
-6724 1104 1063 816 716 746 949 990 792 467 404 800 1014 1166 1393 1446 1323 1249 1141 825 664 526 183 11 -129 -32 40
-6699 40 108 201 210 525 815 1003 1010 991 1004 744 427 461 712 878 999 821 529 272 537 813 630 633 730 606 514 631 628 586 853
-6670 853 1032 809 453 505 806 839 603 413 498 1013 1190 804 701 963 1086 717 352 574 1038 1276 1354 1231 665 107
-6646 107 50 275 564 825 774 565 238 88 179 606 970 996 965 985 1162 1037 823 730 834 1006 966 664 331 660 1002 984
-6620 984 986 1171 1232 1232 1063 654 331 208 426 746 446 13 77 250 560 865 1176 1225 991 762 341 104 207 323 542
$$ packed form
-6801A91k32Q9L72K14K71M4k44j77O1J64K32J67j22q6r5K9L46K46r2l12n41l94k39K04K43
-6776C39J93J69j5j6L32K20k89m84r6M07M21M5l06q0K32j13j83J3Qj92o38k35o1l3J33M60
-6750B31P22K49j5j79l70l09k0J95K07K66J17K88J77l70m90r4r0j82l5P7M4k7Q7J23K34K68
-6724A104m1k47j00L0K03M1j98l25o3L96K14J52K27N3j23p4j08l16j61j38l43j72j40R7P2
-6699D0O8R3RL15K90J88Pj9J3k60l17L4K51J66J21j78k92k57K65K76j83LR7j24r2J17lm2K67
-6670H53J79k23l56N2L01L3k36j90Q5N15J77l86j03K62J23l69l65K22M64K38P8j23n66n58
-6646A07n7K25K89K61n1k09l27j50R1M27L64K6l1K0J77j25k14r3J04J72m0l02l33L29L42j8
-6620I84KJ85O1%j69m09l23j23K18L20l00m33O4J73L10L05L11M9k34k29m21k37J03J16K19
$$ plain form
-6595 542 740 738 488 536 554 344 182 94 -66 -160 -123 -78 -18 8 95 367 616 754 878 788 485 134 -76 -24 -70 176 648 886
-6567 886 1219 1125 1140 1169 736 485 494 664 757 748 713 662 473 303 577 964 1388 1787 1758 1272 884 642 384 451 956 1159 1194
-6540 1194 1180 962 528 162 123 276 350 338 377 227 138 414 737 1155 1159 986 770 682 797 780 864 718 394 256 219 237 330
-6513 330 388 637 1033 1094 1094 1090 625 204 457 727 559 204 2 173 463 558 487 545 724 843 667 658 902 1151 1491 1499 1288
-6486 1288 932 832 933 957 1126 912 628 647 831 1007 1102 906 723 549 359 557 590 201 181 497 711 573 345 171
-6462 171 253 519 882 1072 997 625 292 293 506 608 824 451 -26 126 649 874 968 823 659 477 -14 -464 -350 62 79
-6437 79 1 164 204 179 368 527 489 237 292 613 1025 1367 1279 1058 1075 1151 1049 1026 1059 1077 978 979 932 697 513 525 452 261 411
-6408 411 709 1042 1201 1082 807 792 1264 1491 1306 1019 814 606 342 124 194 584 650 421 273 56 -179 20 10 -97
$$ packed form
-6595E42J98kk50M8J8k10j62q8j60r4L7M5O0K6Q7K72K49J38J24r0l03l51k10N2m6K46M72K38
-6567H86L33r4J5K9m33k51RJ70R3rl5n1j89j70K74L87M24L99k9m86l88k42k58O7N05K03L5
-6540A194j4k18m34l66l9J53P4j2L9j50q9K76L23M18Mj73k16q8J15j7Q4j46l24j38l7J8R3
-6513C30N8K49L96O1%mm65m21K53K70j68l55k02J71K90R5p1N8J79J19j76rK44K49L40Qk11
-6486A288l56j00J01K4J69k14k84J9J84J76R5j96j83j74j90J98L3l89k0L16K14j38k28j74
-6462A71Q2K66L63J90p5l72l33JK13J02K16l73m77J52N23K25R4j45j64j82m91m50J14M12J7
-6437G9p8J63M0k5J89J59l8k52N5L21M12L42q8k21J7P6j02k3L3J8r9Jm7k35j84J2p3j91J50
-6408D11K98L33J59j19k75j5M72K27j85k87k05k08k64k18P0L90O6k29j48k17k35J99j0j07
$$ plain form
-6384 -97 237 432 478 623 720 1038 1118 896 935 824 624 613 824 1093 1235 1165 1190 1195 1080 879 860 1012 1207 1224 1032 977 768
-6357 768 648 672 871 1174 1299 1290 927 340 173 339 396 411 473 440 178 -20 165 529 837 947 1095 1252 1166 1178 969 764
-6331 764 779 802 489 501 893 1000 776 776 924 771 790 1048 1091 626 459 633 875 950 852 700 369 -148 -514 -183 138 227
-6305 227 405 420 110 -122 24 521 783 866 478 -105 -508 -670 -225 583 1067 1339 1476 1459 1506 1292 585 101 -80 54
-6281 54 286 406 306 124 -36 -78 -160 59 591 918 842 542 261 268 650 1177 1373 906 247 201 564 842 1209 1524 1479 979
-6255 979 887 1305 1649 1470 883 534 416 672 1035 967 495 -74 -193 -35 295 214 117 257 692 1005 892 558 145 129 248
-6230 248 404 529 632 657 617 717 630 527 573 397 352 523 495 341 566 762 747 564 352 191 302 885 1284 1450 1525 1337
-6204 1337 1099 898 843 810 796 834 646 405 282 175 266 557 454 295 241 245 597 855 980 807 338 275 460 364 294 363 490
$$ packed form
-6384i7L34J95M6J45R7L18Q0k22L9j11k00j1K11K69J42p0K5Nj15k01j9J52J95J7j92n5k09
-6357G68j20K4J99L03J25rl63n87j67J66N7J5O2l3k62j98J85L64L08J10J48J57q6J2k09k05
-6331G64J5K3l13J2L92J07k24%J48j53J9K58M3m65j67J74K42P5r8j52l31n17l66L31L21Q9
-6305B27J78J5l10k32J46M97K62Q3l88n83m03j62M45Q08M84K72J37j7M7k14p07m84j81J34
-6281E4K32J20j00j82j60m2q2K19N32L27p6l00k81PL82N27J96m67o59m6L63K78L67L15m5n00
-6255I79r2M18L44j79n87l49j18K56L63o8m72n69j19J58L30q1r7J40M35L13j13l34m13j6J19
-6230B48J56J25J03K5m0J00q7j03M6j76m5J71k8j54K25J96j5j83k12j61J11N83L99J66P5j88
-6204A337k38k01n5l3j4L8j88k41j23j07R1K91j03j59n4ML52K58J25j73m69o3J85r6p0O9J27
$$ plain form
-6177 490 780 1048 781 188 -4 -208 -277 -62 187 183 79 315 501 434 248 233 562 773 907 1108 1022 928 942 871 477 154
-6151 154 410 486 265 123 407 1031 1450 1672 1933 1752 1238 898 794 651 717 625 387 612 762 850 883 595 476 288 190
-6126 190 309 290 267 347 538 431 318 193 14 -78 -242 -51 121 -62 -57 278 615 866 942 841 643 597 611 707 964 1270
-6100 1270 1196 878 960 895 712 830 1275 1521 1230 799 670 755 603 487 553 583 336 190 117 63 130 40 -508 -827 -655 -525
-6074 -525 -356 85 406 695 782 757 655 605 634 479 83 -249 -358 -377 -130 240 677 1069 1308 1207 1275 1263 1206 1192 984 838
-6048 838 783 581 451 831 1155 1057 754 640 632 691 731 972 1010 934 839 861 1012 988 693 567 375 118 38 67 230 528 827
-6021 827 929 523 -3 -332 -416 -116 278 587 744 702 704 567 231 -104 -240 107 437 489 835 1032 750 571 350 269 122
-5996 122 35 221 484 485 475 397 453 526 582 751 841 876 643 407 443 672 702 488 700 948 970 1126 1177 1297 1278 979 638 257
$$ packed form
-6177D90K90K68k67n93j92k04o9K15K49mj04K36J86o7j86j5L29K11J34K01q6r4J4p1l94l23
-6151A54K56P6k21j42K84O24M19K22K61j81n14l40j04j43O6r2k38K25J50Q8L3k88j19j88r8
-6126A90J19j9k3Q0J91j07j13j25j79r2j64J91J72j83NL35L37K51P6j01j98m6J4R6K57L06
-6100A270p4l18Q2o5j83J18M45K46k91m31j29Q5j52j16O6L0k47j46p3n4O7r0n48l19J72J30
-6074e25J69M41L21K89Q7k5j02n0K9j55l96l32j09j9K47L70M37L92K39j01O8j2n7j4k08j46
-6048H38n5k02j30L80L24r8l03j14qN9M0K41L8p6r5K2J51k4k95j26j92k57q0K9J63K98K99
-6021H27J02m06n26l29q4L00L94L09J57m2Kj37l36l35j36L47L30N2L46J97k82j79k21q1j47
-5996A22q7J86K63Jj0p8N6P3N6J69R0L5k33k36L6K29L0k14K12K48K2J56N1J20j9k99l41l81
$$ plain form
-5968 257 51 -78 -143 -73 81 332 309 165 -39 -21 28 -183 -430 -292 -229 -53 115 256 622 703 326 154 319 205 -19
-5943 -19 84 157 250 527 758 978 1106 939 759 726 524 391 570 981 1435 1805 1899 1822 1553 1416 1321 1307 1227 1063 1025 1007 893
-5916 893 724 707 852 817 566 525 627 767 1049 1479 1600 1198 766 581 334 214 168 -189 -117 323 318 266 507 585 795 1112
-5890 1112 1137 880 303 49 239 277 343 494 515 403 402 267 332 584 691 879 896 832 899 699 422 268 120 118 132 -74 -118
-5863 -118 44 345 748 548 165 -6 169 35 -108 87 210 251 341 599 750 753 923 1226 1344 1173 1063 1001 1054 1044 970 746
-5837 746 281 -146 -383 -583 -499 -36 443 822 894 666 371 -50 -103 -205 -255 -16 234 311 151 -3 -136 143 445 360 3
-5812 3 -146 -16 416 695 691 684 554 551 649 786 826 831 885 899 911 1095 1290 1303 1157 1171 1370 978 435 136 -219 -591 -701 -611 -494
-5783 -494 -533 -625 -552 -261 -72 33 262 777 813 426 331 504 722 887 848 836 839 797 678 635 479 470 639 563 355 261 470 638
$$ packed form
-5968B57k06j29o5P0J54K51k3j44k04J8M9k11k47J38O3J76J68J41L66Q1l77j72J65j14k24
-5943a9J03P3R3K77K31K20J28j67j80l3k02j33J79M11M54L70R4p7k69j37r5j4q0j64l8j8j14
-5916H93j69j7J45l5k51m1J02J40K82M30J21m02m32j85k47j20m6l57P2M40nn2K41P8K10L17
-5890A112K5k57n77k54J90L8O6J51K1j12jj35O5K52J07J88J7o4O7k00k77j54j48kJ4k06m4
-5863a18J62L01M03k00l83j71J75j34j43J95J23M1R0K58J51LJ70L03J18j71j10o2N3j0p4k24
-5837G46m65m27k37k00Q4M63M79L79P2k28k95m21n3j02n0K39K50P7j60j54j33K79L02q5l57
-5812Cj49J30M32K79mpj30lR8J37M0NN4J4J2J84J95J3j46J4J99l92n43k99l55l72j10R0J17
-5783d94l9r2P3K91J89J05K29N15L6l87r5J73K18J65l9j2Lm2j19m3j56rJ69p6k08r4K09J68
$$ plain form
-5755 638 651 702 670 711 890 695 417 203 142 -9 -128 -101 -58 134 281 344 966 1447 1247 1009 739 517 400 519 595 409
-5729 409 299 556 889 1027 1233 1080 673 336 75 2 101 -16 -253 -268 -194 -21 170 0 -48 -56 9 371 472 490 502 363
-5703 363 165 -42 21 313 303 -50 -244 153 428 302 244 286 547 805 464 70 254 254 170 131 145 270 285 203 9 -100 -170
-5676 -170 -202 -145 -20 329 588 711 561 236 387 536 571 548 551 429 25 -49 94 458 711 758 632 810 1312 1441 1068 983
-5650 983 1191 1088 801 694 790 641 425 401 267 401 544 523 654 760 617 242 331 592 665 714 794 647 717 757 652 299
-5624 299 21 243 494 581 698 877 981 938 402 -52 -47 -126 -100 89 254 404 605 603 757 1047 1020 1109 1176 982 905 980 733
-5597 733 523 528 559 653 718 767 756 513 284 458 679 759 866 831 414 50 211 576 667 452 -165 -510 -501 -505 -760 -819 -610 -504
-5569 -504 -582 -590 -268 178 484 396 145 372 845 994 912 960 1397 1701 1676 1293 735 486 539 529 425 415 795 1095 967 893 415
$$ packed form
-5755F38J3N1l2M1J79j95k78k14o1j51j19K7M3J92J47O3O22M81k00k38k70k22j17J19P6j86
-5729D09j10K57L33J38K06j53m07l37k61p3R9j17k37j5P4J73J91j70m8qO5L62J01J8J2j39
-5703C63j98k07O3K92j0l53j94L97K75j26n8M2K61K58l41l94J84%q4l9J4J25J5q2j94j09p0
-5676a70l2N7J25L49K59J23j50l25J51J49L5k3Lj22m04p4J43L64K53M7j26J78N02J29l73q5
-5650I83K08j03k87j07R6j49k16k4j34J34J43k1J31J06j43l75Q9K61P3M9Q0j47P0M0j05l53
-5624B99k78K22K51Q7J17J79J04m3n36m54Np9K6J89J65J50K01kJ54K90k7Q9O7j94p7P5k47
-5597G33k10NL1R4O5M9j1k43k29J74K21Q0J07l5m17l64J61L65R1k15o17l45Rmk55n9K09J06
-5569e04p8qL22M46L06q8k51K27M73J49q2M8M37L04k5l83n58k49N3j0j04j0L80L00j28p4m78
$$ plain form
-5542 415 156 5 151 487 498 352 104 -13 -12 205 391 480 440 427 705 828 514 471 598 409 64 -133 -226 -88 171 259
-5516 259 689 998 1120 1074 816 562 405 207 56 110 210 210 402 478 151 -313 -758 -753 -313 14 -20 132 298 493 694 807
-5490 807 802 754 859 852 919 833 532 290 562 900 1164 1376 1488 1422 1155 859 480 128 -310 -556 -244 280 442 330 203 263
-5464 263 356 330 507 443 -25 -351 -485 -503 -653 -626 -318 -104 -174 -313 -334 -454 -423 -292 -125 -1 -89 -178 178 410 403 477 450 307
-5436 307 309 563 808 894 927 1278 1688 1939 1933 1716 963 323 -9 -79 165 218 337 370 53 -68 100 168 -46 -202 24 81 -91
-5409 -91 15 28 -200 -94 425 788 675 418 102 -306 -416 -361 -148 344 700 684 667 850 553 237 482 675 601 481 467
-5384 467 345 402 676 744 717 910 1008 904 757 741 711 560 693 695 710 866 781 748 694 666 819 1148 1026 757 889 1206 1554
-5357 1554 1673 1397 1067 809 594 458 334 230 197 385 487 691 947 966 910 1048 994 905 703 362 32 -151 -220 -75 4
$$ packed form
-5542D15k59j51J46L36J1j46k48j17JK17J86Q9m0j3K78J23l14m3J27j89l45j97r3J38K59Q8
-5516B59M30L09J22m6k58k54j57j98j51N4J00%J92P6l27m64m45NM40L27l4J52J66J95K01J13
-5490H07nm8J05pO7q6l01k42K72L38K64K12J12o6k67k96l79l52m38k46L12N24J62j12j27O0
-5464B63R3k6J77o4m68l26j34j8j50K7L08K14p0j39k1j20L1J31J67J24q8q9L56K32pP4k7j43
-5436C07KK54K45Q6L3L51M10K51ok17p53o40l32p0K44N3J19L3l17j21J68O8k14j56K26N7j72
-5409i1J06J3k28J06N19L63j13k57l16m08j10N5K13M92L56j6j7J83k97l16K45J93p4j20j4
-5384D67j22N7K74O8k7J93R8j04j47j6l0j51J33KJ5J56q5l3n4k8J53L29j22k69J32L17L48
-5357A554J19k76l30k58k15j36j24j04l3J88J02K04K56J9n6J38n4q9k02l41l30j83o9J45P9
$$ plain form
-5332 4 49 -141 -80 264 592 797 654 406 442 631 698 523 554 509 386 554 964 1173 1308 1445 1575 1564 1275 710 277 467
-5306 467 996 1046 463 -228 -518 -543 -287 88 165 25 -18 48 -104 -149 -279 -347 -83 115 265 187 53 152 426 635 837 856
-5280 856 757 691 539 485 524 249 -334 -488 -322 47 404 425 187 186 430 524 349 79 -141 73 474 775 674 301 -82 -174
-5254 -174 0 384 528 776 1178 1281 1442 1101 557 425 410 410 468 671 935 839 719 721 707 805 729 882 1114 1007 885 624
-5228 624 384 40 -175 -11 348 515 563 617 577 702 851 948 1093 1072 919 695 372 324 527 691 498 165 -65 -179 -86
-5203 -86 285 459 546 304 189 534 835 718 630 611 608 703 611 186 86 293 97 -128 -160 -35 -139 -249 -251 48 478 661 582
-5176 582 329 418 574 609 694 624 538 587 726 1077 1127 764 448 466 552 209 -264 -526 -446 -500 -529 -253 -222 -259 -157 60 621 1220
-5148 1220 1315 1156 1082 855 869 701 95 -17 219 396 670 686 269 425 815 828 706 883 918 824 890 961 646 223 142 168
$$ packed form
-5332DM5j90O1L44L28K05j43k48L6J89O7j75L1m5j23J68M10K09J35J37J30j1k89n65m33J90
-5306D67N29N0n83o91k90k5K56L75P7j40m3O6j52m5j30o8K64J98J50p8j34R9K74K09K02J9
-5280H56r9o6j52n4L9k75n83j54J66L69L57K1k38jK44R4j75k70k20K14M01L01j01l73l83r2
-5254a74J74L84J44K48M02J03J61l41n44j32j5%N8K03K64r6j20Kj4R8p6J53K32j07j22k61
-5228F24k40l44k15J64L59J67M8N4m0J25J49R7J45k1j53k24l23m8K03J64j93l33k30j14R3
-5203h6L71J74Q7k42j15L45L01j17q8j9lR5r2m25j00K07j96k25l2J25j04j10kK99M30J83p9
-5176E82k53Q9J56L5Q5p0q6M9J39L51N0l63l16J8Q6l43m73k62Q0n4k9K76L1l7J02K17N61N99
-5148A220R5j59p4k27J4j68o06j12K36J77K74J6m17J56L90J3j22J77L5r4O6P1l15m23q1K6
$$ plain form
-5122 168 353 677 1129 1348 1368 1143 640 197 20 14 54 181 81 1 -28 155 416 478 180 228 612 1002 1199 1349 1217 816
-5096 816 397 198 218 206 194 524 835 861 651 457 330 315 345 302 67 -297 -251 119 230 326 442 408 445 843 1235 1294 1353
-5069 1353 1186 868 774 763 813 885 949 1005 932 538 322 446 430 784 928 524 320 113 -80 156 436 537 565 589 281 -25
-5043 -25 -103 32 210 309 138 -66 54 99 41 286 498 586 619 505 398 519 576 649 747 462 424 483 194 43 106 407 570
-5016 570 666 677 552 503 485 346 237 395 632 612 403 207 15 173 395 420 498 453 640 1129 1108 825 557 218 179 251 434
-4989 434 650 457 458 809 1110 1294 1293 1158 951 971 1222 1256 1145 831 662 859 1037 1013 795 707 621 635 763 800 499 260 254
-4962 254 415 471 616 693 369 208 279 246 -19 -46 164 125 -139 -88 285 305 326 614 549 335 -16 -240 11 255 259 71 96
-4935 96 372 368 371 215 -27 -236 -417 -365 14 281 237 397 378 149 89 493 724 409 2 66 449 760 709 379 91 -40 119
$$ packed form
-5122A68J85L24M52K19K0k25n03m43j77oM0J27j00q0k9J83K61O2k98M8L84L90J97J50j32m01
-5096H16m19j99K0j2j2L30L11K6k10j94j27j5L0m3k35l64M6L70J11R6J16l4L7L98L92N9N9
-5069A353j67l18r4j1N0P2O4N6p3l94k16J24j6L54J44m04k04k07j93K36K80J01K8K4l08l06
-5043b5p8J35J78R9j71k04J20M5n8K45K12Q8L3j14j07J21N7P3R8k85l8N9k89j51O3L01J63
-5016E70R6J1j25m9j8j39j09J58K37k0k09j96j92J58K22K5P8m5J87M89k1k83k68l39l9P2J83
-4989D34K16j93JL51L01J84jj35k07K0K51L4j11l14j69J97J78k4k18q8q6J4J28L7l01k39o
-4962B54J61N6J45P7l24j61P1l3k65k7K10l9k64N1L73K0K1K88o5k14l51k24K51K44Mj88K5
-4935I6K76mLj56k42k09j81N2L79K67m4J60j9k29o0M04K31l15m07O4L83L11n1l30k88j31J59
$$ plain form
-4908 119 202 506 771 597 208 93 181 305 453 631 640 434 227 519 656 642 633 554 508 539 653 961 898 860 877 1165 1229 1102
-4880 1102 1199 1280 967 547 515 595 538 524 521 478 678 1229 1532 1742 1885 1498 1087 1033 1201 1291 1386 1285 1240 1134 791 769 720 692
-4852 692 680 703 1121 1482 1362 972 549 319 247 277 341 570 1015 1298 1121 641 391 526 673 912 1322 1696 1820 2077 2158
-4827 2158 1610 1143 884 546 341 477 617 430 237 312 590 722 790 1072 1181 940 625 102 -427 -467 -85 455 1105 1336
-4803 1336 1123 1073 1106 1103 1004 1013 899 944 1081 874 824 1031 1044 1004 1147 1226 1219 1303 1186 1324 1369 1187 1149 1151 1003 786 909 1100 1143
-4774 1143 1136 1047 982 1033 847 477 247 458 647 608 468 266 -26 -251 -167 -191 -382 -167 38 -121 -356 -604 -311 124 641
-4749 641 898 823 665 565 380 -46 -308 -166 -70 124 445 635 722 781 610 316 237 499 543 251 374 701 603 623 740 905
-4723 905 1263 1448 1495 1688 1911 2050 2009 1842 1882 1812 1384 1061 990 986 884 806 808 815 814 1094 978 723 589 469 305 274 565 883
$$ packed form
-4908A19Q3L04K65j74l89j15Q8J24J48J78Rk06k07K92J37j4rp9m6L1J14L08o3l8J7K88O4j27
-4880A102R7Q1l13m20l2Q0n7j4lm3K00N51L03K10J43l87m11n4J68R0R5j01m5j06l43k2m9k8
-4852F92j2K3M18L61j20l90m23k30p2L0O4K29M45K83j77m80k50J35J47K39M10L74J24K57Q1
-4827B158n48m67k59l38k05J36J40j87j93P5K78J32O8K82J09k41l15n23n29m0L82N40O50K31
-4803A336k13n0L3lr9Rj14M5J37k07n0K07J3m0J43P9pQ4j17J38M5j82l8Kj48k17J23J91M3
-4774A143pq9o5N1j86l70k30K11J89l9j40k02k92k25Q4k4j91K15K05j59k35k48K93M35N17
-4749F41K57p5j58j00j85m26k62J42R6J94L21J90Q7N9j71k94p9K62M4k92J23L27r8K0J17J65
-4723I05L58J85M7J93K23J39m1j67M0p0m28l23p1mj02p8KPjK80j16k55j34j20j64l1K91L18
$$ plain form
-4695 883 961 912 747 406 204 266 94 -66 -162 -110 371 607 613 604 286 -117 -263 -221 3 351 382 423 754 1180 1192 871 683
-4668 683 982 1181 1070 748 612 785 709 531 286 -42 -122 259 648 820 707 95 28 246 236 -113 -208 172 547 328 162
-4643 162 253 242 144 180 459 529 585 734 883 865 688 698 671 510 272 293 700 833 746 434 20 -125 231 665 857 1103 1108
-4616 1108 933 925 1241 1547 1526 1203 1119 1128 1105 1100 1193 1214 1040 869 751 978 825 670 731 644 660 1018 1515 1332 956 939 845 387
-4588 387 -26 71 468 653 690 772 819 833 626 289 3 304 950 1132 816 445 375 271 339 262 -42 -178 -176 -272 -109 129 313
-4561 313 514 711 1088 1467 1710 1540 1214 786 187 -61 -244 -245 -227 104 503 476 375 145 195 469 589 701 922 933 552
-4536 552 449 886 1015 1106 1030 933 1272 1826 1990 1670 1448 1190 1099 904 490 134 22 -225 -400 -339 -311 -269 -5 415 627
-4511 627 622 716 971 1118 1418 1477 1092 832 845 878 1202 1248 845 553 131 -577 -1104 -1107 -850 -574 -438 -191 303 643 772 660
$$ packed form
-4695H83P8m9j65l41k02O2j72j60r6N2M81K36Orl18m03j46M2K24L48L1M1L31M26J2l21j88
-4668F83K99J99j11l22j36J73p6j78k45l28q0L81L89J72j13o12o7K18j0l49r5L80L75k19j66
-4643A62R1j1r8L6K79P0N6J49J49j8j77J0k7j61k38K1M07J33q7l12m14j45L56M34J92K46N
-4616A108j75qL16L06k1l23q4Rk3nR3K1j74j71j18K27j53j55O1q7J6L58M97j83l76j7r4m58
-4588C87m13R7L97J85L7Q2M7J4k07l37k86L01O46J82l16l71p0j04O8p7l04j36Kr6J63K38J84
-4561C13K01J97L77L79K43j70l26m28n99k48j83jJ8L31L99k7j01k30N0K74J20J12K21J1l81
-4536E52j03M37J29R1p6r7L39N54J64l20k22k58r1j95m14l56j12k47j75O1K8M2K64M20K12
-4511F27nR4K55J47L00N9l85k60J3L3L24M6m03k92m22p08n27lK57K76J36K47M94L40J29j12
$$ plain form
-4485 660 536 697 939 998 902 523 212 16 -75 241 460 274 211 60 0 80 238 324 273 330 461 481 190 -162 -208 109 381
-4458 381 508 1122 1559 1610 1478 1541 1581 1081 959 1091 1109 1090 991 1133 1201 1167 1389 1603 1376 1150 860 672 445 216 135 267
-4432 267 428 234 139 267 56 79 490 773 790 654 472 355 94 28 258 619 876 853 974 974 971 864 524 54 -401 -361
-4406 -361 -218 -405 -473 -128 341 488 398 548 845 892 721 720 664 492 288 111 -52 -192 -347 -131 227 708 1052 1045 1082 1115
-4380 1115 967 714 592 606 838 1259 1314 1064 875 493 244 470 578 438 440 343 400 560 786 806 470 590 1016 1194 1252
-4355 1252 1243 1076 677 87 -102 -155 -192 -232 -248 -232 -123 18 -141 -219 -226 -366 -239 34 201 423 649 861 957 769 528 441 503
-4328 503 334 -112 -284 -184 -30 283 592 783 874 847 800 627 879 1040 888 725 331 -36 -10 145 308 189 315 583
-4304 583 826 914 891 744 677 619 543 466 452 257 93 66 146 339 501 478 436 292 -31 17 207 418 643 731 577 722 716 304
$$ packed form
-4485F60j24J61K42N9r6l79l11j96r1L16K19j86o3j51o0Q0J58Q6n1N7J31K0k91l52m6L17K72
-4458C81J27O14M37N1j32O3M0n00j22J32J8j9r9J42O8l4K22K14k27k26k90j88k27k29q1J32
-4432B67J61j94r5J28k11K3M11K83J7j36j82j17k61o6K30L61K57k3J21%lj07l40m70m55M0
-4406c61J43j87o8L45M69J47r0J50K97M7j71jn6j72k04j77j63j40j55K16L58M81L44pL7L3
-4380A115j48k53j22J4K32M21N5k50j89l82k49K26J08j40Kr7N7J60K26K0l36J20M26J78N8
-4355A252rj67l99n90j89n3l7m0j6J6J09J41j59p8pj40J27K73J67K22K26K12R6j88k41q7O2
-4328E03j69m46j72J00J54L13L09J91R1k7m7j73K52J61j52j63l94l67K6J55J63j19J26K68
-4304E83K43Q8k3j47o7n8p6p7j4j95j64k7Q0J93J62k3m2j44l23M8J90K11K25Q8j54J45om12
$$ plain form
-4276 304 43 110 489 617 548 666 913 963 879 982 974 934 1057 1024 1081 994 584 623 799 625 589 538 344 556 752 944 1073
-4249 1073 682 241 207 299 389 485 625 635 661 322 -350 -826 -1057 -955 -741 -389 -96 271 584 962 1168 1391 1450 1117 1025
-4224 1025 785 551 455 559 643 515 344 358 323 185 348 437 393 574 604 306 134 106 -65 -248 -489 -200 -41 -166 -15
-4199 -15 181 281 360 334 221 420 739 573 577 700 403 360 564 636 570 392 402 800 1286 1148 742 695 1054 1325 1451 1362 1058
-4172 1058 1142 1507 1610 1324 986 821 784 803 517 180 97 -7 -134 -28 -119 -160 -102 -11 282 461 721 496 130 -58 -42 269
-4146 269 331 453 576 477 567 950 1249 1225 893 914 1051 1190 1062 631 624 709 397 257 429 614 762 825 692 467 458 651 740
-4119 740 409 11 221 540 569 569 769 982 1046 843 440 253 289 540 354 24 -195 -405 -279 -44 -116 -182 63 527 948
-4094 948 1057 851 784 676 655 613 399 315 131 42 176 562 957 1266 1085 662 573 829 927 786 677 746 1094 992 621 727
$$ packed form
-4276C04k61O7L79J28o9J18K47N0q4J03qm0J23l3N7q7m10L9J76j74l6n1j94K12J96J92J29
-4249A073l91m41l4R2R0R6J40J0K6l39o72m76k31J02K14L52K93L67L13L78K06K23N9l33r2
-4224A025k40k34r6J04Q4j28j71J4l5j38J63Q9m4J81L0k98j72k8j71j83k41K89J59j25J51
-4199a5J96J00P9k6j13J99L19j66MJ23k97m3K04P2o6j78J0L98M86j38m06m7L59K71J26q9l04
-4172A058Q4L65J03k86l38j65l7J9k86l37q3j04j27J06r1m1N8R1K93J79K60k25l66j88J6L11
-4146B69O2J22J23r9R0L83K99k4l32K1J37J39j28m31pQ5l12j40J72J85J48O3j33k25rJ93Q9
-4119G40l31l98K10L19K9%K00K13O4k03m03j87L6K51j86l30k19k10J26K35p2o6K45M64M21
-4094I48J09k06o7j08k1m2k14q4j84q9J34L86L95L09j81m23q9K56R8j41j09O9L48j02l71J06
$$ plain form
-4068 727 704 349 26 166 104 -220 -246 127 451 679 1035 1169 804 581 608 448 400 342 265 202 299 546 522 301 -94 -178 -7
-4041 -7 96 384 311 -270 -655 -345 138 513 320 -1 -59 15 98 78 52 369 909 1032 880 613 193 236 573 544 381 274
-4015 274 114 -43 8 199 431 702 566 212 319 426 224 -43 -452 -978 -1306 -1120 -739 -345 -90 -115 -18 281 301 37
-3991 37 -26 167 255 49 -106 59 180 477 578 264 106 227 61 -289 -378 52 568 608 537 739 1000 1089 1294 1465 1476 1617
-3965 1617 1309 912 651 268 107 122 -115 -321 -390 -304 -193 34 234 265 370 768 1049 928 872 854 945 1351 1588 1308 805
-3940 805 507 526 513 541 431 120 -219 -402 -283 -144 -37 219 377 273 84 205 431 380 231 31 121 294 161 -69 -234
-3915 -234 -165 95 217 74 103 375 684 541 -67 -210 -306 -517 -413 20 116 -24 211 552 486 96 -293 -316 5 525 686
-3890 686 498 316 242 380 590 434 604 847 699 344 189 418 610 592 493 486 452 649 568 345 136 258 334 254 -35 41
$$ packed form
-4068G27k3l55l23J40o2l24k6L73L24K28L56J34l65k23K7j60m8n8p7o3R7K47k4k21l95q4J71
-4041gJ03K88p3n81l85L10M83L75j93l21n8P4Q3k0k6L17N40J23j52k67m20M3L37k9j63j07
-4015B74j60j57N1J91K32K71j36l54J07J07k02k67m09n26l28J86L81L94K55k5R7K99K0k64
-3991C7o3J93Q8k06j55J65J21K97J01l14j58J21j66l50q9M30N16M0p1K02K61Q9K05J71J1J41
-3965A617l08l97k61l83j61J5k37k06o9Q6J11K27K00L1J05L98K81j21n6j8R1M06K37k80n03
-3940H05k98J9j3K8j10l11l39j83J19J39J07K56J58j04j89J21K26n1j49k00R0J73j33k30j65
-3915b34O9K60J22j43K9K72L09j43o08j43r6k11J04M33R6j40K35L41o6l90l89k3L21N20J61
-3890F86j88j82p4J38K10j56J70K43j48l55j55K29J92j8r9pl4J97q1k23k09J22P6q0k89P6
$$ plain form
-3864 41 417 641 562 382 588 922 988 894 621 428 276 322 323 171 277 183 159 110 235 268 169 187 101 119 314 491 586 486
-3836 486 529 844 688 360 267 220 12 -70 156 590 873 745 659 717 704 576 135 -12 357 696 563 362 -169 -245 19 -13
-3810 -13 -100 -200 -401 -528 -512 -596 -572 -551 -422 -412 -341 -304 -164 -186 -192 -32 -349 -760 -611 -323 -309 -145 -29 -40 -33 -168 -245 -212 -310
-3781 -310 -280 71 379 517 631 689 426 309 296 272 330 228 191 442 888 1006 679 266 154 -7 -224 -215 -359 -545 -865 -1004
-3755 -1004 -921 -739 -384 205 451 565 589 535 310 173 203 329 446 388 230 25 21 90 -14 -134 2 211 217 260 451 345
-3729 345 -16 -75 86 70 -168 -334 -343 -309 -343 -539 -764 -814 -763 336 1839 2235 2201 1943 1637 1265 997 835 674 580 653 893
-3703 893 1252 1152 926 950 797 615 524 519 418 31 -160 23 490 405 254 226 490 1126 1394 1191 715 275 60 200 590
-3678 590 893 819 828 823 549 277 196 235 454 678 685 510 570 492 401 253 8 167 443 489 514 657 771 905 950 763 543 572
$$ packed form
-3864D1L76K24p9j80K06L34O6r4k73j93j52M6Jj52J06r4k4m9J25L3r9J8q6J8J95J77R5j00
-3836D86M3L15j56l28r3m7k08q2K26M34K83j28q6N8j3j28m41j47L69L39j33k01n31p6K64l2
-3810a3q7j00k01j27J6q4K4K1J29J0P1L7J40k2oJ60l17m11J49K88J4J64J16j1Pj35p7L3r8
-3781c10L0L51L08J38J14N8k63j17j3k4N8j02l7K51M46J18l27m13j12j61k17Rj44j86l20j39
-3755a004Q3J82L55N89K46J14K4n4k25j37L0J26J17n8j58k05mO9j04j20J36K09OM3J91j06
-3729C45l61n9J61j6k38j66rL4l4j96k25n0N1J099J503L96l4k58l06l72k68j62j61r4P3K40
-3703H93L59j00k26K4j53j82r1nj01l87j91J83M67q5j51k8K64O36K68k03m76m40k15J40L90
-3678E90L03p4Rnk74k72q1L9K19K24Pj75O0p8r1j48k45J59K76M6K5J43J14J34M5j87k20K9
$$ plain form
-3650 572 553 430 375 295 297 374 325 540 720 838 831 522 612 589 175 -61 -304 -126 100 225 478 520 257 98 -20 -262 -75
-3623 -75 264 222 32 122 211 183 346 398 374 602 741 930 1151 1180 969 526 168 54 -108 -278 19 248 238 338 587 636
-3597 636 506 176 453 748 508 239 74 203 540 840 863 813 811 805 637 537 337 233 552 592 -8 -96 373 674 795 678
-3571 678 563 539 511 465 497 373 -97 -400 -699 -771 -490 -300 -217 50 201 307 520 741 830 840 814 621 509 466 365 467
-3545 467 723 960 1029 621 244 -2 -151 -181 -107 174 352 71 258 858 1074 1111 990 582 254 234 460 478 328 383 640
-3520 640 813 661 521 658 690 901 1266 1338 1291 1203 1039 778 624 211 78 161 227 334 568 363 51 118 13 -46 39 20
-3494 20 11 188 453 583 497 379 449 503 502 361 501 681 722 423 298 499 714 716 743 449 312 265 90 150 -5 -104 266 500
-3466 500 236 77 -159 -349 -49 393 458 186 -26 -40 30 161 484 574 333 -36 -230 -33 132 -136 -148 63 -42 -225 -193
$$ packed form
-3650E72j9j23n5q0KP7m9K15J80J18pl09R0k3m14k36k43J78K26J25K53M2k63j59j18k42J87
-3623g5L39m2j90R0Q9k8J63N2k4K28J39J89K21K9k11m43l58j14j62j70K97K29j0J00K49M9
-3597F36j30l30K77K95k40k69j65J29L37L00K3n0koj68j00k00j04L19M0o00q8M69L01J21j17
-3571F78j15k4k8m6L2j24m70l03k99p2K81J90Q3K67J51J06K13K21Q9J0k6j93j12m3j01J02
-3545D67K56K37O9m08l77k46j49l0P4K81J78k81J87O00K16L7j21m08l28k0K26J8j50N5K57
-3520F40J73j52j40J37L2K11L65P2m7q8j64k61j54m13j33Q3O6J07K34k05l12O7j05n9Q5j9
-3494B0rJ77K65J30q6j18P0N4jj41J40J80M1k99j25K01K15KK7k94j37m7j75O0j55r9L70K34
-3466E00k64j59k36j90L00M42O5k72k12j4P0J31L23R0k41l69j94J97J65k68j2K11j05j83L2
$$ plain form
-3441 -193 58 310 637 1177 1177 841 632 421 114 -170 -467 -493 -307 -333 -374 -277 -87 24 108 146 129 35 296 729 894 899 1053
-3414 1053 1083 769 528 371 369 438 559 498 167 -120 -75 149 227 357 690 795 831 1026 1072 1179 1088 1151 1139 872 548 597 1046
-3387 1046 1313 1289 1304 1043 707 516 345 124 234 519 313 274 343 222 -46 -234 50 363 224 301 508 668 693 637 520
-3362 520 497 562 594 761 899 752 598 575 436 51 -183 47 198 326 418 491 788 963 928 739 407 -36 -254 -49 235
-3337 235 238 31 -103 -41 -45 -3 123 250 427 481 345 90 56 -109 -107 34 78 510 922 697 161 104 321 561 653 542 405
-3310 405 345 603 695 568 776 990 1178 1423 1460 1478 1198 704 284 107 64 324 430 260 165 -22 -182 -252 -172 70 301 339
-3284 339 529 598 490 614 866 1031 1027 895 663 473 446 484 300 105 177 363 444 360 -14 -224 -185 -265 -341 -178 244 628 652
-3257 652 483 229 182 320 507 616 716 725 744 701 688 432 369 400 396 188 -1 -2 194 301 10 -213 -98 1 372 726 914
$$ packed form
-3441a93K51K52L27N40%l36k09k11l07k84k97k6J86k6m1R7J90J11Q4L8j7r4K61M33J65NJ54
-3414A053L0l14k41j57kO9J21o1l31k87M5K24P8J30L33J05L6J95M6J07r1O3j2k67l24M9M49
-3387A046K67k4J5k61l36j91j71k21J10K85k06l9O9j21k68j88K84L13j39P7K07J60K5n6j17
-3362E20k3O5L2J67J38j47j54k3j39l85k34K30J51J28R2P3K97J75l5j89l32m43k18K05K84
-3337B35Lk07j34O2mM2J26J27J77N4j36k55l4j65KJ41M4M32M12k25n36n7K17K40R2j11j37
-3310D05o0K58R2j27K08K14J88K45L7J8k80m94m20j77m3K60J06j70r5j87j60p0Q0K42K31L8
-3284C39J90O9j08J24K52J65mj32k32j90k7L8j84j95P2J86Q1q4l74k10L9q0p6J63M22L84K4
-3257F52j69k54m7J38J87J09J00RJ9m3j3k56o3L1mk08j89jJ96J07k91k23J15R9L71L54J88
$$ plain form
-3230 914 846 620 587 722 752 320 -110 -216 22 324 533 693 417 334 518 851 1186 1048 729 695 661 513 509 510 545 330 221
-3203 221 764 1083 1016 982 845 948 1251 1453 1388 1299 1205 880 717 738 774 564 518 752 855 785 640 883 1205 1187 1166 1271 1338
-3176 1338 1531 1379 1040 1119 1454 1611 1479 1179 754 699 1120 1544 1595 1406 1213 1287 1221 892 204 -463 -669 -272 197 530
-3152 530 369 262 250 199 396 647 821 682 537 847 1186 1268 1224 1193 980 682 428 295 403 582 658 513 381 332 476
-3127 476 595 521 325 260 536 1017 1185 1192 1228 995 695 599 546 630 817 916 960 667 627 592 54 -409 -362 48 278 379 576
-3100 576 814 787 313 -217 -467 -166 209 228 371 381 50 -237 -299 -408 -93 265 252 164 10 77 200 213 597 768 497 501
-3074 501 929 1226 843 296 435 602 375 217 -17 -107 155 374 454 103 -144 -40 130 206 183 110 235 200 79 208 503
-3049 503 668 715 247 9 185 210 163 117 298 761 1161 798 325 130 140 380 370 169 235 479 1008 1281 1106 724 323
$$ packed form
-3230I14o8k26l3J35L0m32m30j06K38L02K09J60k76q3J84L33L35j38l19l4l4j48mJL5k15j09
-3203B21N43L19o7l4j37J03L03K02o5q9r4l25j63K1L6k10m6K34J03p0j45K43L22j8k1J05O7
-3176A338J93j52l39P9L35J57j32l00m25n5M21M24N1j89j93P4o6l29o88o67k06L97M69L33
-3152E30j61j07j2n1J97K51J74j39j45L10L39Q2m4l1k13k98k54j33J08J79P6j45j32m9J44
-3127D76J19p4j96o5K76M81J68PL6k33l00r6n3Q4J87R9M4k93m0l5n38m63M7M10K30J01J97
-3100E76K38k7m74n30k50L01L75J9J43J0l31k87o2j09L15L58j3q8j54O7J23J3L84J71k71M
-3074E01M28K97l83n47J39J67k27j58k34r0K62K19Q0l51k47J04J70P6k3p3J25l5j21J29K95
-3049E03J65M7m68k38J76K5m7m6J81M63M00l63m73j95J0K40j0k01O6K44N29K73j75l82m01
$$ plain form
-3024 323 -27 -219 13 452 620 330 260 364 409 217 110 150 277 571 555 342 390 507 534 694 976 1171 1121 1116 1035 597
-2998 597 80 85 405 729 626 574 438 461 699 746 663 545 422 179 49 107 223 67 -125 -100 345 472 350 172 -60 -131
-2972 -131 140 473 586 547 241 196 491 695 628 454 309 150 230 514 524 466 518 486 355 373 553 719 740 1125 1300 949
-2946 949 936 1254 1299 1281 938 532 672 866 869 954 1392 1470 1211 925 596 289 289 394 382 457 559 597 504 390 471 602 680 947
-2918 947 1339 1550 1410 1232 1296 1496 1300 1005 774 697 886 1017 901 644 604 574 528 308 88 79 90 205 406 490 841 961
-2892 961 535 339 533 1091 1316 1008 896 672 388 296 412 458 158 -39 270 609 710 520 110 -66 90 185 139 226 174
-2867 174 12 -47 -23 -2 -9 169 230 30 -50 60 285 562 721 689 617 536 400 641 752 738 572 469 408 343 335 335 497 724 674
-2838 674 471 427 427 541 459 325 352 475 634 906 1462 1806 1577 1064 601 453 622 515 471 366 228 136 313 462 621
$$ packed form
-3024C23l50j92K32M39J68k90p0J04M5j92j07M0J27K94j6k13M8J17K7J60K82J95n0nq1m38
-2998E97n17NL20L24j03n2j36K3K38M7q3j18j23k43j30N8J16j56j92K5M45J27j22j78k32p1
-2972a31K71L33J13l9l06m5K95K04o7j74j45j59Q0K84J0n8N2l2j31J8J80J66K1L85J75l51
-2946I49j3L18M5j8l43m06J40J94LQ5M38P8k59k86l29l07%J05j2P5J02L8r3j14Q1J31P8K67
-2918I47L92K11j40j78O4K00j96k95k31p7J89J31j16k57m0l0m6k20k20rJ1J15K01Q4L51J20
-2892I61m26j96J94N58K25l08j12k24k84r2J16M6l00j97L09L39J01j90m10j76J56R5m6Q7n2
-2867A74j62n9K4K1pJ78O1k00q0J10K25K77J59l2p2q1j36K41J11j4j66j03o1o5q%J62K27n0
-2838F74k03m4%J14q2j34K7J23J59K72N56L44k29n13m63j48J69j07m4j05j38r2J77J49J59
$$ plain form
-2813 621 855 586 158 132 431 420 219 94 51 77 122 2 -120 -204 -209 -468 -603 -432 -224 -194 -45 22 54 0 183 484 668
-2786 668 951 957 642 258 168 186 144 -17 30 40 70 96 60 49 93 117 415 817 1050 1185 1137 1035 538 11 53 235 441 525
-2758 525 411 -65 -274 -341 -797 -1283 -1278 -1132 -906 -437 -302 -413 -508 -369 60 409 416 300 154 178 95 -178 -276 -284 -62 -74 -223
-2731 -223 -204 205 351 480 613 358 -3 -38 17 -64 -100 193 625 698 416 273 460 539 524 419 453 580 620 237 -386 -551
-2705 -551 -458 -476 -508 -425 -32 348 627 668 501 766 828 666 774 778 758 788 828 564 307 249 143 182 125 -78 -6 399 651 886
-2677 886 545 136 141 280 703 974 830 482 429 641 710 789 1111 1254 1105 1148 1350 1278 1129 964 921 878 749 661 650 775 863
-2650 863 972 1064 1244 1147 860 573 101 -193 111 239 -94 -67 235 361 618 1038 1186 714 322 291 580 749 878 980
-2626 980 893 836 555 82 -190 -41 249 357 201 351 676 712 627 843 1251 1214 937 692 739 1018 1318 1509 1411 1128 920
$$ packed form
-2813F21K34k69m28k6K99j1k01j25m3K6M5j20j22q4nk59j35J71K08L0J49O7L2n4J83L01J84
-2786F68K83Ol15l84r0J8m2j61M7J0L0K6l6j1M4K4K98M02K33J35m8j02m97n27M2J82K06Q4
-2758E25j14m76k09o7m56m86NJ46K26M69J35j11r5J39M29L49Pj16j46K4q3k73r8qK22j2j49
-2731b23J9M09J46J29J33k55l61l5N5q1l6K93M32P3k82j43J87P9j5j05L4J27M0l83o23j65
-2705e51R3j8l2Q3L93L80K79M1j67K65O2j62J08Mk0L0M0k64k57n8j06L9n7k03P2M05K52K35
-2677H86l41m09NJ39M23K71j44l48n3K12O9P9L22J43j49M3K02p2j49j65m3m3j29q8j1J25Q8
-2650H63J09R2J80r7k87k87m72k94L04J28l33K7L02J26K57M20J48m72l92l1K89J69J29J02
-2626I80q7n7k81m73k72J49K90J08j56J50L25L6q5K16M08l7k77k45M7K79L00J91r8k83k08
$$ plain form
-2601 920 801 867 850 514 132 161 145 239 286 345 262 42 -23 27 180 -105 -280 -97 -6 -12 -8 -206 -402 -469 -472 -502 -604 -695 -659 -504
-2571 -504 -138 113 47 57 67 -207 -319 -337 69 362 546 773 765 611 494 574 808 778 718 753 733 529 116 -200 -199 155 668
-2544 668 1175 1102 700 714 932 924 806 759 731 539 278 28 54 103 434 846 766 384 71 209 233 104 -184 -299 -122 37
-2518 37 242 614 710 461 160 275 209 -85 -259 -317 -176 -155 -258 -305 -137 272 544 728 1025 1285 1442 1601 1390 1036 690
-2493 690 424 292 661 1172 1321 964 478 220 398 837 1134 889 534 157 182 473 609 795 1281 1528 1384 1211 1235 774
-2469 774 140 19 293 467 489 695 543 -26 -233 115 243 209 665 895 530 237 74 106 236 161 219 456 595 680 929
-2444 929 1351 1405 850 28 -223 200 583 848 942 503 -22 -180 -259 -44 322 809 1132 1011 774 804 904 888 893 707 750 837
-2418 837 836 650 500 515 297 29 -332 -377 100 738 984 893 859 926 857 361 -25 24 396 710 693 496 601 705 501 376
$$ packed form
-2601I20j19O6j7l36l82K9j6R4M7N9q3k20o5N0J53k85j75J83R1oMj98j96o7ll0j02r1L6J55
-2571e04L66K51o6J0J0k74j12j8M06K93J84K27qj54j17Q0K34l0o0L5k0k04m13l16JL54N13
-2544F68N07p3m02J4K18qj18m7k8j92k61k50K6M9L31M12q0l82l13J38K4j29k88j15J77J59
-2518C7K05L72R6k49l01J15o6k94j74n8J41K1j03m7J68M09K72J84K97K60J57J59k11l54l46
-2493F90k66j32L69N11J49l57m86k58J78M39K97k45l55l77K5K91J36J86M86K47j44j73K4m61
-2469G74o34j21K74J74K2K06j52n69k07L48J28l4M56K30l65k93j63L2J30p5N8K37J39Q5K49
-2444I29M22N4n55q22k51M23L83K65R4m39n25j58p9K15L66M87L23j21k37L0J00j6Nj86M3Q7
-2418H37jj86j50J5k18k68l61m5M77O38K46r1l4O7o9m96l86M9L72L14j7j97J05J04k04j25
$$ plain form
-2392 376 150 -150 -220 169 792 1121 1053 839 713 599 515 143 -239 -107 246 520 198 -15 -20 -106 -78 105 355 373 217 286
-2366 286 467 406 285 480 604 123 -186 -350 -356 -345 -415 -346 -188 292 705 648 463 369 69 -161 -267 -179 25 52 0 100 409
-2339 409 738 1125 1180 1161 1155 710 301 30 -252 -205 -329 -368 -194 -126 -138 -109 -452 -636 -435 -6 345 568 429 -95 -148 283
-2313 283 755 857 948 968 701 605 671 714 321 88 275 279 209 132 313 722 911 871 711 395 251 98 210 369 434 549 574
-2286 574 480 472 332 152 221 394 596 737 715 620 670 641 341 298 418 531 779 933 941 867 872 1046 992 756 669 486 241 76
-2258 76 97 260 409 706 867 650 260 317 759 981 978 977 1130 1119 962 1073 1241 1222 1266 1257 895 817 913 826 480 367 430 541
-2230 541 627 654 439 354 626 823 584 310 153 198 693 1072 908 607 302 193 337 492 616 727 910 1165 1390 1551
-2206 1551 1495 1097 483 -176 -228 -157 -109 93 152 -3 -66 180 668 959 726 257 96 321 500 417 425 309 218 318 580 1009
$$ packed form
-2392C76k26l00p0L89O23L29o8k14j26j14q4l72l82J32L53K74l22k13nq6K8J83K50J8j56O9
-2366B86J81o1j21J95J24m81l09j64oJ1p0O9J58M80M13n7j85r4l00k30j06Q8K04K7n2J00L09
-2339D09L29L87N5j9om45m09k71k82M7j24l9J74O8j2K9l43j84K01M29L51K23j39n24n3M31
-2313B83M72J02R1K0k67r6O6M3l93k33J87Mp0p7J81M09J89m0j60l16j44j53J12J59O5J15K5
-2286E74r4qj40j80O9J73K02J41k2r5N0k9l00m3J20J13K48J54Qp4NJ74n4k36q7j83k45j65
-2258G6K1J63J49K97J61k17l90N7M42K22ljJ53j1j57J11J68j9M4rl62p8R6q7l46j13O3J11
-2230E41Q6K7k15q5K72J97k39k74j57M5M95L79j64l01l05j09J44J55J24J11J83K55K25J61
-2206A551n6l98o14o59n2P1M8K02N9j55o3K46M88K91k33m69j61K25J79q3Qj16r1J00K62M29
$$ plain form
-2180 1009 1389 1316 1187 1053 1094 1035 717 511 351 149 6 -4 175 242 229 379 502 210 -262 -239 202 369 547 734 722
-2155 722 608 683 891 841 1077 1451 1508 1275 1057 903 479 210 310 219 212 331 365 228 284 221 -74 -231 -123 250 494 455
-2129 455 317 414 651 889 839 888 851 745 645 712 601 340 279 472 607 447 198 40 -21 37 224 748 1199 1307 1214 1147
-2103 1147 891 281 160 362 396 370 382 610 773 872 760 432 89 67 171 280 488 463 229 301 575 676 822 896 793
-2078 793 919 983 756 354 97 201 520 752 840 819 796 595 229 224 843 1365 1472 1552 1774 1792 1849 1904 1621 1002 572 692
-2052 692 924 1121 1080 1087 1126 1084 1155 1021 732 666 660 398 78 155 546 537 277 -42 -290 -298 27 337 663 1017 1139 1136 1088 848 252
-2023 252 -314 -427 -171 133 184 427 569 490 799 831 398 103 4 67 344 543 500 412 399 514 723 679 455 453 599 604 624 548
-1995 548 352 445 700 479 286 327 658 874 708 643 706 423 229 102 280 623 895 790 656 521 490 577 498 396 507
$$ packed form
-2180A009L80p3j29j34M1n9l18k06j60k02j43j0J79O7j3J50J23k92m72K3M41J67J78J87j2
-2155G22j14P5K08n0K36L74N7k33k18j54m24k69J00r1pJ19L4j37N6o3k95j57J08L73K44l9
-2129D55j38R7K37K38n0M9l7j06j00O7j11k61o1J93J35j60k49j58o1N8J87N24M51J08r3o7
-2103A147k56o10j21K02L4k6J2K28J63R9j12l28l43k2J04J09K08k5k34P2K74J01J46P4j03
-2078G93J26O4k27m02k57J04L19K32Q8k1k3k01l66nO19N22J07Q0K22J8N7N5k83o19m30J20
-2052F92K32J97m1PL9m2P1j34k89o6ok62l20P7L91rk60l19k48qL25L10L26L54J22lm8k40n96
-2023B52n66j13K56L04N1K43J42p9L09L2m33k95r9O3K77J99m3q8j3J15K09m4k24kJ46NK0p6
-1995E48j96R3K55k21j93M1L31K16j66o5O3k83j94j27J78L43K72j05j34j35l1Q7p9j02J11
$$ plain form
-1970 507 981 1476 1484 1086 783 581 399 310 236 163 224 345 71 35 290 605 931 1101 1361 1283 1065 560 -53 -129 24 -144
-1944 -144 -403 -432 -12 390 275 -89 -389 -122 468 706 645 716 656 461 519 670 462 98 -271 -824 -1069 -696 -251 17 348
-1919 348 681 862 841 473 35 -16 193 307 361 358 448 475 407 530 620 593 700 907 835 511 -34 -232 36 444 667 747 577
-1892 577 621 1009 1192 1050 1145 1187 949 593 316 182 122 89 115 70 -176 -204 -69 219 625 903 933 882 723 756 675 543 334
-1865 334 248 500 573 554 792 649 263 -110 -403 -350 -177 -347 -389 -275 -5 316 465 495 489 480 612 431 199 103 -12 -157 -380
-1838 -380 -509 -362 -266 -205 -93 49 300 360 168 73 -140 -357 -339 6 579 483 306 406 209 -18 185 515 529 400 480 384
-1812 384 178 -71 54 289 266 191 390 577 675 904 1224 1399 1423 1335 1416 1382 1065 581 200 396 631 596 858 938 820 842
-1786 842 902 747 548 650 520 599 792 645 357 401 487 275 107 69 70 -151 -296 -182 -95 139 344 567 689 829 926 800
$$ packed form
-1970E07M74M95Ql98l03k02j82q9p4p3O1J21k74l6K55L15L26J70K60p8k18n05o13p6J53j68
-1944a44k59k9M20M02j15l64l00K67N90K38o1P1o0j95N8J51k08l64l69n53k45L73M45K68L31
-1919C48L33J81k1l68m38n1K09J14N4lR0K7o8J23R0k7J07K07p2l24n45j98K68M08K23Q0j70
-1892E77M4L88J83j42R5M2k38l56k77j34o0l3K6m5k46k8J35K88M06K78L0n1j59L3q1j32k09
-1865C34q6K52P3j9K38j43l86l73k93N3J73j70m2J14K70L21J49L0orJ32j81k32r6j15j45k23
-1838c80j29J47R6O1J12J42K51O0j92r5k13k17J8L45N73r6j77J00j97k27K03L30J4j29Q0r6
-1812C84k06k49J25K35k3p5J99J87R8K29L20J75K4q8Q1l4l17m84l81J96K35l5K62Q0j18K2
-1786H42O0j55j99J02j30P9J93j47k88M4Q6k12j68l8Jk21j45J14Q7K34K05K23J22J40R7j26
$$ plain form
-1760 800 920 988 773 621 553 498 694 862 759 294 3 379 536 301 179 -221 -363 -465 -853 -924 -461 -325 -420 -267 -226
-1735 -226 -192 136 457 303 64 25 -77 -395 -428 -284 -23 350 529 515 284 98 150 160 194 411 311 190 221 407 405 302
-1709 302 321 418 301 582 770 765 536 301 158 -45 -224 -370 -624 -817 -764 -882 -996 -686 -368 -147 -117 -379 -507 -280 -40
-1684 -40 296 634 445 180 53 -278 -437 -166 -58 -35 35 204 155 -75 -194 -197 -482 -712 -519 -287 -155 36 183 159 139 373
-1658 373 565 522 208 -13 -37 32 201 50 -284 -386 -382 -317 -211 98 591 755 601 291 81 78 331 404 400 633 858 1046 880
-1631 880 438 165 -117 -110 273 454 408 186 -292 -645 -730 -701 -604 -541 -151 285 405 459 568 692 1207 1385 1192 961 811 836
-1605 836 1048 1095 1220 1344 1198 1258 1311 1088 1081 879 648 408 -124 -670 -692 -544 -345 186 452 498 132 -357 -424 -104 238 493
$$ packed form
-1760H00J20O8k15j52o8n5J96J68j03m65k91L76J57k35j22m00j42j02l88p1M63J36r5J53M1
-1735b26L4L28L21j54k39l9j02l18l3J44K61L73J79j4k31j86N2J0L4K17j00j21L1J86kj03
-1709C02J9R7j17K81J88nk29k35j43k03j79j46k54j93N3j18j14L10L18K21L0k62j28K27K40
-1684d0L36L38j89k65j27l31j59K71J08K3P0J69m9k30j19lk85k30J93K32J32J91J47k4k0K34
-1658C73J92m3l14k21k4O9J69j51l34j02MO5J06L09M93J64j54l10k10lK53P3mK33K25J88j66
-1631H80m42k73k82PL83J81m6k22m78l53q5K9R7O3L90M36J20N4J09J24N15J78j93k31j50K5
-1605H36K12M7J25J24j46O0N3k23pk02k31k40n32n46k2J48J99N31K66M6l66m89o7L20L42K55
$$ [...]
5339I6
##ENDNTUPLES=	NMRSPECTRUM
##END=	

##TITLE=	20121205-jiatao-1
##JCAMPDX=	6.0	$$ NMR Plug-in 1.4 of MestReNova 6.1.1-6384
##BLOCKID=	2
##DATATYPE=	NMRPEAKTABLE
##DATACLASS=	PEAKTABLE
##.OBSERVEFREQUENCY=	100.61277008056640625
##.OBSERVENUCLEUS=	^13C
##NPOINTS=	16
##FIRSTX=	39.36751667314222658
##LASTX=	146.93656584305708179
##XFACTOR=	1
##YFACTOR=	1
##FIRSTY=	16.415753777399388014
##XUNITS=	PPM
##YUNITS=	ARBITRARY UNITS
##PEAKTABLE=	(XY..XY)
39.36751667314222658, 16.415753777399388014
39.57578884319334378, 51.21929858496651633
39.784696805117881979, 102.1030585584764907
39.993288091444895826, 120.29799118966971605
40.201931660006970048, 102.46927809973736601
40.410773259249829437, 51.014788122254906
40.618366712920987993, 16.085643590468862385
106.01217958923317042, 7.4944462335559647315
118.34643358186868056, 3.5384780591386353343
126.92012839926623258, 26.976207424456099204
129.30330492837524048, 11.930230007315987706
130.88615632704511427, 27.879182326026668903
135.30498524612795563, 7.0722827955867311189
144.06032120442134214, 18.589376505616211688
144.87569057050203014, 11.64346847322128653
146.93656584305708179, 19.749368302138037734
##END=	

##END=	
