##TITLE=	2012130109-jiatao-1
##JCAMPDX=	6.0	$$ NMR Plug-in 1.4 of MestReNova 6.1.1-6384
##DATATYPE=	LINK
##BLOCKS=	2
##ORIGIN=	Bruker BioSpin GmbH
##OWNER=	Administrator

##TITLE=	2012130109-jiatao-1
##JCAMPDX=	6.0	$$ NMR Plug-in 1.4 of MestReNova 6.1.1-6384
##BLOCKID=	1
##DATATYPE=	NMRSPECTRUM
##DATACLASS=	NTUPLES
##NUMDIM=	1
##ORIGIN=	Bruker BioSpin GmbH
##OWNER=	Administrator
##.OBSERVEFREQUENCY=	100.61277008056640625
##.OBSERVENUCLEUS=	^13C
##.SOLVENTNAME=	9
##.PULSESEQUENCE=	zgpg30
##.ACQUISITIONMODE=	SIMULTANEOUS (DQD)
##$ORIGINALFORMAT=	Bruker XWIN-NMR
##$PARAMETERFILE=	(acqus, ASCII, H:/dropbox/Dropbox/IR%20NMR%20MS/2012130109-jiatao-1/2/acqus, 0)
$$ ##TITLE= Parameter file, TOPSPIN		Version 2.1
$$ ##JCAMPDX= 5.0
$$ ##DATATYPE= Parameter Values
$$ ##NPOINTS= 10	$$ modification sequence number
$$ ##ORIGIN= Bruker BioSpin GmbH
$$ ##OWNER= Administrator
$$ $$ 2013-01-09 10:19:24.937 +0800  Administrator@EP-ZH010007
$$ $$ D:/data/Administrator/nmr/2012130109-jiatao-1/2/acqus
$$ $$ process C:\Bruker\TOPSPIN\prog\mod\go.exe
$$ ##$ACQT0= -2.73109243697479
$$ ##$AMP= (0..31)
$$ 100 100 100 100 100 100 100 100 100 100 100 100 100 100 100 100 100 100
$$ 100 100 100 100 100 100 100 100 100 100 100 100 100 100
$$ ##$ANAVPT= -1
$$ ##$AQSEQ= 0
$$ ##$AQ_mod= 3
$$ ##$AUNM= <au_zg>
$$ ##$AUTOPOS= <>
$$ ##$BF1= 100.612769
$$ ##$BF2= 400.13
$$ ##$BF3= 100.612769
$$ ##$BF4= 100.612769
$$ ##$BF5= 100.612769
$$ ##$BF6= 100.612769
$$ ##$BF7= 100.612769
$$ ##$BF8= 100.612769
$$ ##$BYTORDA= 0
$$ ##$CFDGTYP= 0
$$ ##$CFRGTYP= 9
$$ ##$CHEMSTR= <none>
$$ ##$CNST= (0..63)
$$ 1 1 145 1 1 1 1 1 1 1 1 1 1 1 1 1 1 1 1 1 1 1 1 1 1 1 1 1 1 1 1 1 1 1 1
$$ 1 1 1 1 1 1 1 1 1 1 1 1 1 1 1 1 1 1 1 1 1 1 1 1 1 1 1 1 1
$$ ##$CPDPRG= <waltz16>
$$ ##$CPDPRG1= <>
$$ ##$CPDPRG2= <waltz16>
$$ ##$CPDPRG3= <>
$$ ##$CPDPRG4= <mlev>
$$ ##$CPDPRG5= <mlev>
$$ ##$CPDPRG6= <mlev>
$$ ##$CPDPRG7= <mlev>
$$ ##$CPDPRG8= <mlev>
$$ ##$CPDPRGB= <>
$$ ##$CPDPRGT= <>
$$ ##$D= (0..63)
$$ 0 2 0.00345 0 0 0 0 0 0 0.06 0 0.03 2e-005 3e-006 0 0 0.0002 0 0 0 0 0
$$ 0 0 0 0 0 0 0 0 0 0 0 0 0 0 0 0 0 0 0 0 0 0 0 0 0 0 0 0 0 0 0 0 0 0 0 0
$$ 0 0 0 0 0 0
$$ ##$DATE= 1357697964
$$ ##$DBL= (0..7)
$$ 120 120 120 120 120 120 120 120
$$ ##$DBP= (0..7)
$$ 150 150 150 150 150 150 150 150
$$ ##$DBP07= 0
$$ ##$DBPNAM0= <>
$$ ##$DBPNAM1= <>
$$ ##$DBPNAM2= <>
$$ ##$DBPNAM3= <>
$$ ##$DBPNAM4= <>
$$ ##$DBPNAM5= <>
$$ ##$DBPNAM6= <>
$$ ##$DBPNAM7= <>
$$ ##$DBPOAL= (0..7)
$$ 0.5 0.5 0.5 0.5 0.5 0.5 0.5 0.5
$$ ##$DBPOFFS= (0..7)
$$ 0 0 0 0 0 0 0 0
$$ ##$DE= 9
$$ ##$DECBNUC= <off>
$$ ##$DECIM= 832
$$ ##$DECNUC= <off>
$$ ##$DECSTAT= 4
$$ ##$DIGMOD= 1
$$ ##$DIGTYP= 12
$$ ##$DL= (0..7)
$$ 0 120 120 120 120 120 120 120
$$ ##$DP= (0..7)
$$ 150 150 150 150 150 150 150 150
$$ ##$DP07= 0
$$ ##$DPNAME0= <>
$$ ##$DPNAME1= <>
$$ ##$DPNAME2= <>
$$ ##$DPNAME3= <>
$$ ##$DPNAME4= <>
$$ ##$DPNAME5= <>
$$ ##$DPNAME6= <>
$$ ##$DPNAME7= <>
$$ ##$DPOAL= (0..7)
$$ 0.5 0.5 0.5 0.5 0.5 0.5 0.5 0.5
$$ ##$DPOFFS= (0..7)
$$ 0 0 0 0 0 0 0 0
$$ [...]
$$ -1 -1 -1 -1 -1 -1 -1 -1 -1 -1 -1 -1 -1 -1 -1 -1 -1 -1 -1 -1 -1 -1 -1 -1
$$ -1 -1 -1 -1 -1 -1 -1 -1 -1 -1 -1 -1 -1 -1 -1 -1 -1 -1 -1 -1 -1 -1 -1 -1
$$ -1 -1 -1 -1 -1 -1 -1 -1 -1 -1 -1 -1 -1 -1 -1 -1 -1 -1 -1 -1 -1 -1 -1 -1
$$ -1 -1 -1 -1 -1 -1 -1 -1 -1 -1 -1 -1 -1 -1 -1 -1 -1 -1 -1 -1 -1 -1 -1 -1
$$ -1 -1 -1 -1 -1 -1 -1 -1 -1 -1 -1 -1 -1 -1 -1 -1 -1 -1 -1 -1 -1 -1 -1 -1
$$ -1 -1 -1 -1 -1 -1 -1 -1 -1 -1 -1 -1 -1 -1 -1 -1 -1 -1 -1 -1 -1 -1 -1 -1
$$ -1 -1 -1 -1 -1 -1 -1 -1 -1 -1 -1 -1 -1 -1 -1 -1 -1 -1 -1 -1 -1 -1 -1 -1
$$ -1 -1 -1 -1 -1 -1 -1 -1 -1 -1 -1 -1 -1 -1 -1 -1 -1 -1 -1 -1 -1 -1 -1 -1
$$ -1 -1 -1 -1 -1 -1 -1 -1 -1 -1 -1 -1 -1 -1 -1 -1
$$ ##$RG_tabA= (0..255)
$$ 0.25 0.28 0.32 0.35 0.4 0.44 0.5 0.56 0.64 0.7 0.8 0.89 1 1.12 1.28 1.4
$$ 1.6 1.78 2 2.25 2.56 2.8 3.2 3.56 4 4.5 5 5.6 6.35 7.12 8 9 10 11.3 12.7
$$ 14.2 16 18 20.2 22.6 25.4 28.5 32 36 40.3 45.2 50.8 57 64 71.8 80.6 90.5
$$ 101 114 128 144 161 181 203 228 256 287 322 362 406 456 512 575 645 724
$$ 812 912 1030 1150 1290 1440 1620 1820 2050 -1 -1 -1 -1 -1 -1 -1 -1 -1 -1
$$ -1 -1 -1 -1 -1 -1 -1 -1 -1 -1 -1 -1 -1 -1 -1 -1 -1 -1 -1 -1 -1 -1 -1 -1
$$ -1 -1 -1 -1 -1 -1 -1 -1 -1 -1 -1 -1 -1 -1 -1 -1 -1 -1 -1 -1 -1 -1 -1 -1
$$ -1 -1 -1 -1 -1 -1 -1 -1 -1 -1 -1 -1 -1 -1 -1 -1 -1 -1 -1 -1 -1 -1 -1 -1
$$ -1 -1 -1 -1 -1 -1 -1 -1 -1 -1 -1 -1 -1 -1 -1 -1 -1 -1 -1 -1 -1 -1 -1 -1
$$ -1 -1 -1 -1 -1 -1 -1 -1 -1 -1 -1 -1 -1 -1 -1 -1 -1 -1 -1 -1 -1 -1 -1 -1
$$ -1 -1 -1 -1 -1 -1 -1 -1 -1 -1 -1 -1 -1 -1 -1 -1 -1 -1 -1 -1 -1 -1 -1 -1
$$ -1 -1 -1 -1 -1 -1 -1 -1 -1 -1 -1 -1 -1 -1 -1 -1 -1 -1 -1 -1 -1 -1 -1
$$ ##$ROUT14= (0..7)
$$ 0 0 0 0 0 0 0 0
$$ ##$ROUTER= 3
$$ ##$RX22TY= <no>
$$ ##$RXFMAX= (0..7)
$$ 432.5 -1 -1 -1 -1 -1 -1 -1
$$ ##$RXFMIN= (0..7)
$$ 5 -1 -1 -1 -1 -1 -1 -1
$$ ##$RXINTLV= (0..7)
$$ 1 0 0 0 0 0 0 0
$$ ##$RXMSTY= <no>
$$ ##$SCMTY= <no>
$$ ##$SGUC1= (0..15)
$$ 18 19 0 0 0 0 0 0 0 0 0 0 0 0 0 0
$$ ##$SGUC2= (0..15)
$$ 33 256 0 0 0 0 0 0 0 0 0 0 0 0 0 0
$$ ##$SPECTR= 10
$$ ##$SY2FLAG= 0
$$ ##$TFXNUM= 0
$$ ##$TRIPLO2= 0
$$ ##$VTUTY= <tty05>
$$ ##$WBREFAM= (0..15)
$$ 273.4 115.7 100 100 100 100 100 100 100 100 100 100 100 100 100 100
$$ ##$WBREFPH= (0..15)
$$ 81.78 -67.52 0 0 0 0 0 0 0 0 0 0 0 0 0 0
$$ ##$XFAC= 2
$$ ##END=
$$ 
##$DECIM=	832
##$DSPFVS=	20
##NTUPLES=	NMRSPECTRUM
##VARNAME=	FREQUENCY,	SPECTRUM/REAL,	SPECTRUM/IMAG,	PAGE NUMBER
##SYMBOL=	X,	R,	I,	N
##VARTYPE=	INDEPENDENT,	DEPENDENT,	DEPENDENT,	PAGE
##VARFORM=	AFFN,	ASDF,	ASDF,	AFFN
##VARDIM=	65536,	65536,	65536,	2
##UNITS=	HZ,	ARBITRARY UNITS,	ARBITRARY UNITS,
##FIRST=	22080.0350341796875,	-0.49189493060111999512,	0.33331388235092163086,	1
##LAST=	-1958.4259033203125,	-0.60658806562423706055,	0.22415339946746826172,	2
##MIN=	-1958.4259033203125,	-1.6383881568908691406,	-45.88404083251953125,	1
##MAX=	22080.0350341796875,	94.53662872314453125,	54.657703399658203125,	1
##FACTOR=	-0.36680340180819409612,	0.0011817078590393066424,	0.00068322129249572753195,	1
##PAGE=	N=1
##DATATABLE=	(X++(R..R)), XYDATA
$$ [...]
##PAGE=	N=2
##DATATABLE=	(X++(I..I)), XYDATA
-20028D82j44J10k33k94j26j95j60M9Q9k0N0K67j54m20l05j14R8L40K71J35J55k62k48R6k0
$$ 482 338 448 215 -79 -205 -400 -560 -511 -422 -442 -392 -125 -279 -699 -1004 -1118 -1020 -680 -409 -274 -119 -381 -629 -533 -553
-20003e53k60j07k09n78k19K12K35O6J88O7K44J19M2P3J30M9r2K90L08j42j92m6J29k40k62
$$ -553 -813 -920 -1129 -1707 -1926 -1714 -1479 -1413 -1225 -1158 -914 -795 -753 -680 -550 -501 -593 -303 5 -137 -329 -375 -246 -486 -748
-19978g48m5o5l6P3L21L20J49Lj82J28J29R6k87m85j67lL68K99K61M07k12n72j43K05K25j16
$$ -748 -793 -858 -894 -821 -500 -180 -31 -28 -210 -82 47 143 -144 -629 -796 -799 -431 -132 129 536 324 -248 -391 -186 39 -77
-19952g7j83J6j42j93Q6N0K09K7M5K37J99m2l14l12m08j3L55M27L27r9k24L00K21l97j94q0
$$ -77 -260 -244 -386 -579 -493 -443 -234 -207 -162 75 274 232 -82 -394 -802 -815 -460 -33 294 195 -29 271 492 95 -99 -179
-19926a79m8j84j08J98R4r7l51q9K76L27J33J33P6k66o9L9j07k59k96JJ2J0Q5J27J73j07m21
$$ -179 -227 -411 -519 -321 -227 -324 -675 -764 -488 -161 -28 105 181 -85 -154 -115 -222 -481 -777 -776 -764 -754 -669 -542 -369 -476 -897
-19899h97j00L53L08K28K1o07l63J69K38r3j46l7J16J2k69K63K21L6n1j03m2K63J63l09m36
$$ -897 -997 -644 -336 -108 -87 -694 -1057 -888 -650 -743 -889 -926 -810 -798 -1067 -804 -583 -547 -598 -701 -743 -480 -317 -626 -1062
-19874a062j36O5J73m3k98o2J82K93J16j42j02J23K34L87L75J99k4l43k25J55L59K34l69n79
$$ -1062 -1198 -1133 -960 -1003 -1301 -1363 -1181 -888 -772 -914 -1016 -893 -659 -272 103 302 278 -65 -290 -135 224 458 89 -490
-19850d90j11M91K41m31l23M8L39J45k3r5Rq2J25K60J28p0l79n05j43K54J13l59N9K24j68
$$ -490 -601 -110 131 -300 -623 -575 -236 -91 -114 -209 -200 -282 -157 103 231 161 -218 -723 -866 -612 -499 -858 -799 -575 -743
-19825g43j9M91K53Q5K97J66M4j37l46m19J21K26k67l63l4j58o5J15J50L28M86Q2n15l04O1
$$ -743 -762 -271 -18 67 364 530 574 437 91 -328 -207 19 -248 -611 -645 -803 -868 -753 -603 -275 211 293 -222 -526 -465
-19800d65K29J30J20r2j5p8J49K83q9m31k10J59n4n8K72M15J42j38p6j90k88k66k53K4N26
$$ -465 -236 -106 14 -78 -93 -171 -22 261 172 -259 -469 -310 -364 -422 -150 265 407 269 193 3 -285 -551 -804 -780 -254
-19775b54L36j95k50j10p2k74j61K70M00J63J31K26k20n16k44j34J62K82l09n67k35J08J89
$$ -254 82 -113 -363 -473 -545 -819 -980 -710 -310 -147 -16 210 -10 -526 -770 -904 -742 -460 -769 -1336 -1571 -1463 -1274
-19752a274ol10j40K18J33J2L5J7k7r0J08L32J97J13j19K1J27K40L01O8J95J46n8j64j00M26
$$ -1274 -1280 -1590 -1730 -1512 -1379 -1367 -1332 -1315 -1342 -1432 -1324 -992 -795 -682 -801 -780 -653 -413 -112 -44 151 297 239 75 -25 401
-19726D01J30j41l40l95m2M4J26M2j18j03J56K4K25J40l73l90m5K32K32j33K26M01J94J19
$$ 401 531 390 50 -345 -387 -343 -217 -175 -293 -396 -240 -216 9 149 -224 -614 -659 -427 -195 -328 -102 299 493 612
-19702F12j85n93l46j49j20oJ66R5OK04K81K09R1K8J06J5q5J80m6m23J07j48q00k12K77M39
$$ 612 427 -166 -512 -661 -781 -787 -621 -526 -520 -316 -35 174 265 293 399 414 329 509 463 40 147 -1 -801 -1013 -736 -297
-19676b97J46k63m87j62M27M50K69Q8J04l9o1J23j67l22NQ7m04j84M86K90j46q6n7l83q2J77
$$ -297 -151 -414 -901 -1063 -636 -186 83 171 275 236 175 298 131 -191 -186 -99 -503 -687 -201 89 -57 -143 -200 -583 -665 -488
-19650d88j22j33N3K7j26l6J26N6qk25j0J0j17L39K62n4l46k34l08o0K97J40M5j4r8j00M21
$$ -488 -610 -743 -690 -663 -789 -825 -699 -643 -651 -876 -886 -876 -993 -654 -392 -446 -792 -1026 -1334 -1394 -1097 -957 -912 -926 -1024 -1124 -703
-19623g03J93L4J57n0m16k10N2QM5P2O4K07M2j67J54J22J60L87j16k87J47k38m39J91L77j24
$$ -703 -510 -476 -319 -369 -785 -995 -943 -935 -890 -818 -754 -547 -505 -672 -518 -396 -236 151 35 -252 -105 -343 -782 -591 -214 -338
-19597c38k87l26m1J28K9j25j92PM35L83L74k45l59M8N14M92q1p0Q1M7j26l7k49k91k18O8
$$ -338 -625 -951 -992 -864 -835 -960 -1152 -1145 -710 -327 47 -198 -557 -509 5 497 416 346 427 474 348 311 62 -229 -447 -379
-19571c79K60J97k36J88M12p4n26r2L08J90j02k64J60K24K09J94j04q5m0k55j73K7j43l91
$$ -379 -119 78 -158 30 442 368 -158 -250 58 248 146 -118 42 266 475 669 565 480 440 185 12 39 -104 -495
-19547d95RJ77j21l04p6K17O7k9m4j97pJ31L55L38j26k61L12R06M28m81j40K11N26n04j677
$$ -495 -486 -309 -430 -734 -810 -593 -526 -555 -599 -796 -803 -672 -317 21 -105 -366 -54 852 1280 799 659 870 1396 892 -785
-19522g85o99k4J06J74J54J16O12O74J51k06n61k25J25j09J27O4j64p3j0l5m3K96J35l7P5
$$ -785 -1484 -1508 -1402 -1228 -1074 -958 -346 328 479 273 -288 -513 -388 -497 -370 -306 -470 -543 -553 -588 -631 -335 -200 -237 -162
-19497a62o9l08K4R7l15r9j9j87J87J86l06l76k11L3M11O38M63P9j93J31J34k24l7N8j68P
$$ -162 -231 -539 -515 -418 -733 -832 -851 -1038 -851 -665 -971 -1347 -1558 -1525 -1114 -476 -13 66 -127 4 138 -86 -123 -65 -233 -226
-19471b26J31q4j37o2j1j30k38K9M52N0k36Q5Q6j21J44J31l86l84j25l71j3N46O66J28%L43
$$ -226 -95 -179 -316 -378 -389 -519 -757 -728 -276 -226 -462 -377 -291 -412 -268 -137 -523 -907 -1032 -1403 -1416 -870 -204 -76 -76 267
-19445B67n9k53Q7j33O0R1m20o85m96R8M03J01L5o5j99j84K4K82K28L88M74j58r6k81n45k9
$$ 267 208 -45 42 -91 -31 60 -360 -1045 -1541 -1443 -1040 -939 -904 -969 -1168 -1352 -1328 -1046 -818 -430 44 -114 -210 -491 -1036 -1065
-19419a065L03J41L02K20j49k08o4J02J18j2l22j44J63J39mJ54P0P1j24l72k72k07q1J26M03
$$ -1065 -762 -621 -319 -99 -248 -456 -520 -418 -300 -312 -634 -778 -615 -476 -480 -326 -256 -185 -309 -681 -953 -1160 -1241 -1115 -712
-19394g12J42j40L70P7k74M6J45J62Qm6J8k34PL38K7j25j10k22l5R5k1m0L71M62K6k20q4j24
$$ -712 -570 -710 -340 -263 -537 -491 -346 -184 -176 -222 -204 -438 -431 -93 -66 -191 -301 -523 -558 -463 -484 -524 -153 309 335 115 31 -93
-19366i3j99J94J0r2Mj85O9oJ7M68M99R0l66l25m01l32K4j24m31j95K62K83J43K65L29K03
$$ -93 -292 -98 -88 -180 -176 -361 -292 -298 -281 187 686 776 410 85 -316 -648 -624 -748 -1179 -1374 -1112 -829 -686 -421 -92 111
-19340A11K15j49j1q2k62J36P7k40m20j60j34l39l15J20L45J18J9J5K17m9r0L04J00J38q2
$$ 111 326 177 166 84 -178 -42 35 -205 -625 -785 -919 -1258 -1573 -1453 -1108 -990 -971 -956 -739 -788 -878 -574 -474 -336 -418
-19315d18j2L02k6k77J1J33O6R2j19l1M12K55j5j60l71m71k01M8Q9J97K87J83K40N9j81k1
$$ -418 -430 -128 -154 -431 -420 -287 -221 -129 -248 -279 133 388 373 213 -158 -629 -830 -782 -693 -496 -209 -26 214 273 92 71
-19289G1m0QJ79K26K19M61L78k68l12J83N7l90j77M5r6j61J00k1k30j00R9K71j60m51n3J01
$$ 71 31 39 218 444 663 1124 1502 1234 922 1105 1162 772 595 640 544 383 483 462 232 132 231 502 342 -109 -162 -61
-19263f1p6j26k1K30J20Q4N0k5k54l29k63k10l41J26L93K14L4j94l7L59K41J83J08J77K70
$$ -61 -137 -263 -284 -54 66 150 200 175 -79 -408 -671 -881 -1222 -1096 -703 -489 -455 -649 -686 -327 -86 97 205 382 652
-19238F52K93r4n28l65K4j0l99j63nn3k52m5K65q8k26P8J07m5N0K67M36N04N24K20m12m43
$$ 652 945 851 323 -42 -18 -28 -427 -590 -595 -648 -900 -945 -680 -768 -994 -916 -809 -854 -804 -537 -101 403 927 1147 735 292
-19212B92k93m52o3J12K72L81j17k93m02l45p8L3l0L21L71R8l48l10J17Q6K17K26J22j46k52
$$ 292 -1 -453 -516 -404 -132 249 132 -161 -563 -908 -986 -953 -983 -662 -291 -193 -541 -851 -734 -648 -431 -205 -83 -229 -481
-19187d81l56qL7M19L35k31J80k57l92L0J02o9l53k69k42k28M0L82M40M53L07j38q9j28k88
$$ -481 -837 -845 -808 -389 -54 -285 -105 -362 -754 -724 -622 -691 -1044 -1313 -1555 -1783 -1743 -1361 -921 -468 -161 -299 -388 -516 -804
-19162h04j45k6p2o4j3J26J61J96J45j43j37K95J2n28k04P4M0K8J80R9l34l52O2K41J05j83
$$ -804 -949 -975 -1047 -1111 -1124 -998 -837 -641 -496 -639 -776 -481 -469 -997 -1201 -1127 -1087 -1059 -879 -780 -1114 -1466 -1404 -1163 -1058 -1241
-19136a241p9J04L72L81M09L04l72l94rL99K03j55l26n58l2J3L7L04j04k63l9K99J47K94K19
$$ -1241 -1320 -1216 -844 -463 -54 250 -122 -516 -525 -126 77 -78 -404 -962 -994 -981 -944 -640 -744 -1007 -1046 -747 -600 -306 -87
-19111h7%J17j87l26j15j52L0K40K84j57j66K15o3j66J85J93J51K92K10j67R1M03M2l26o38
$$ -87 -87 30 -157 -483 -598 -750 -720 -480 -196 -353 -519 -304 -367 -533 -348 -155 -4 288 498 331 422 825 867 541 -97
-19086i7k90j97j55l8J76L26J64PK35J81k37m59m63k45J31M08L47j46k79j74L9K11J71K06
$$ -97 -387 -584 -739 -777 -601 -275 -111 -104 131 312 75 -384 -847 -1092 -961 -553 -206 -352 -631 -805 -766 -555 -384 -178
-19062a78Mo9K61o0j95Q7J22r3m74l57M8K69P9j76J26N3l87m96K05M52J06OL34J61k4l9O6
$$ -178 -174 -243 18 -42 -237 -150 -28 -121 -595 -952 -904 -635 -556 -732 -606 -553 -940 -1436 -1231 -779 -673 -667 -333 -172 -196 -235 -169
-19035a69J07j48l13l38j87j29j80j13l04o3Q33M14m5L9O6L26J06q7K16J22n0m65n7m3j03
$$ -169 -62 -210 -523 -861 -1048 -1177 -1357 -1470 -1774 -1837 -1004 -590 -635 -596 -530 -204 -98 -185 31 153 103 -362 -419 -462 -565
-19010e65M43N32j19o57l75n1j86NK98Qp2K88M26L45Q2k52M8j52m98J80K22K23pp12m71J56
$$ -565 -122 410 291 -366 -741 -792 -978 -973 -675 -667 -739 -451 -25 320 402 150 198 46 -452 -272 -50 173 166 -546 -1017 -861
-18984h61J98K14K74o1P4L35K29k06m10n0j65n1nq5L09K76k30l50J35N44K87K41K75Mk80n77
$$ -861 -663 -449 -175 -236 -162 173 402 196 -214 -264 -429 -480 -485 -570 -261 15 -215 -565 -430 114 401 642 917 921 641 64
-18958F4r7K18R4j65l96k75j75r8L63N84j39n31k25l12r4L44L05N62N33K32n41l19K39K8j44
$$ 64 -33 185 279 114 -282 -557 -732 -830 -467 117 -22 -553 -778 -1090 -1184 -840 -535 27 560 792 251 -68 171 199 55
-18933E5k28k23l44j48K61J85K5k33k40J71m7j90O4J60k00L2k8k31j46J1J70N9K68K55J18
$$ 55 -173 -396 -740 -888 -627 -442 -417 -650 -890 -719 -766 -956 -892 -732 -932 -900 -928 -1159 -1305 -1294 -1124 -1065 -797 -542 -424
-18908d24n8j76m8j91L40K30M2K60j7k91j41J78L08K01l12r6N05M21j42o58m02j27k19P0M6
$$ -424 -482 -658 -706 -897 -557 -327 -285 -25 -42 -333 -474 -296 12 213 -99 -195 310 731 589 -69 -471 -598 -817 -747 -701
-18883g01L30N07jl07n03k58j91M6J39j3R5j62l57j91J67K50L12K55J35l53p51j94M09K62
$$ -701 -371 136 135 -172 -675 -933 -1124 -1078 -939 -952 -857 -1019 -1376 -1567 -1400 -1150 -838 -583 -448 -801 -1552 -1746 -1337 -1075
-18859a075L94K92j97k55j47j9j06J1J67J71J74Q7p3l53j22N1J18K07K10O1k07j78k86l78
$$ -1075 -681 -389 -586 -841 -988 -1007 -1113 -1102 -935 -764 -590 -503 -576 -929 -1051 -1000 -882 -675 -465 -404 -611 -789 -1075 -1453
-18835a453K64O42K70k43k79k9L9K04K54R6k71n50m9J84J13M32M02m4J17L93O6m84n19j03
$$ -1453 -1189 -547 -277 -520 -799 -828 -789 -585 -331 -235 -506 -1056 -1105 -921 -808 -376 26 -18 99 492 558 74 -445 -548
-18811e48j26m2J91o3j41J92P9j2J42p0J98N8M9j58n08n43l7M52M25K69n4J7J57K4J67l6m0
$$ -548 -674 -716 -525 -588 -729 -537 -458 -470 -328 -398 -200 -142 -93 -251 -759 -1302 -1339 -887 -462 -193 -247 -230 -73 -49 118 82 42
-18784D2J79l9J84K63j25Q4L2k68R1J45J29J43o4l83l17J1n2l35k64k37K61K48o1k99k4J74
$$ 42 221 182 366 629 504 588 620 352 443 588 717 860 796 413 96 107 55 -280 -544 -781 -520 -272 -333 -632 -656 -482
-18758d82p8k83r8M1L18O44K21k61m72k67n3N4K59P5k29l92r5J32j14M8L57k44n49k83M9J29
$$ -482 -560 -843 -941 -900 -582 62 283 22 -450 -717 -770 -716 -457 -382 -611 -1003 -1098 -966 -1080 -1032 -675 -919 -1468 -1751 -1702 -1573
-18732a573M03M78m2j34n6R3L30K38Q0K79R9k27n3J0k94j81L39m0j47L8j29j69j03J75L73
$$ -1573 -1170 -692 -734 -868 -924 -831 -501 -263 -183 96 195 -32 -85 -75 -369 -550 -211 -251 -398 -360 -489 -658 -761 -586 -213
-18707b13K13j57RM59J11j40o9J29j65j78j28k98j0k0M57L73l16r6j18k30J19N23J71k81j93
$$ -213 0 -157 -148 311 422 282 213 342 177 -1 -129 -427 -437 -457 0 373 57 -39 -157 -387 -268 255 426 145 -48
-18682d8k88l56M50L06k39m93Q2L01M3j76n16l86j30J28M10J36M6J79J25m2J35J66j64j87
$$ -48 -336 -692 -242 64 -175 -668 -586 -285 -242 -418 -934 -1320 -1450 -1322 -912 -776 -730 -551 -426 -468 -333 -167 -331 -518
-18658e18q7j71j75N2J31r4m7P3M00K87k27N3j0k02R7L58M44L44l48k93p8N8R8k71m40J33
$$ -518 -605 -776 -951 -899 -768 -862 -909 -836 -436 -149 -376 -323 -333 -535 -438 -80 364 708 360 67 -11 47 145 -126 -566 -433
-18632d33M64J5k28j13k10L6K30J6j72j26Q3L66L9k25j13L1n4k49j08K11J26j10r5j43L0L32
$$ -433 31 46 -182 -295 -505 -469 -239 -223 -395 -521 -438 -72 -33 -258 -371 -340 -394 -643 -751 -540 -414 -524 -619 -762 -732 -400
-18606d00J8K85L15k37j23j38k80k21j45L1R7L89M54O8K3l15o61k74N4J94l2N2K24K27J83
$$ -400 -382 -97 218 -19 -142 -280 -560 -781 -926 -895 -798 -409 45 113 136 -179 -840 -1114 -1060 -866 -898 -846 -622 -395 -212
-18581b12j32k30K4l29l44l7JJ04K77K51L66K16k27n84j12p0pK20L85L25K75M1l5L61K27m13
$$ -212 -344 -574 -550 -879 -1223 -1260 -1259 -1155 -878 -627 -261 -45 -272 -856 -968 -1038 -1045 -825 -440 -115 160 201 166 527 754 341
-18555C41n81r6L77L0l04J67K59O1k80m12l15L3J35P7J75J28J75J82J10j10j73j78j50j09
$$ 341 -240 -336 41 71 -233 -66 193 254 -26 -438 -753 -720 -585 -508 -333 -205 -30 152 262 152 -21 -199 -349 -458
-18531d58j85k06j13P0K05M73K04j75o3j20l86o1K5J11L5M8J21j1j97K00P38L40l06n63l71
$$ -458 -643 -849 -962 -892 -687 -214 -10 -185 -248 -368 -754 -815 -790 -679 -644 -596 -475 -486 -683 -483 255 595 289 -274 -645
-18506f45j37J09K31K06l9m6l06k16K77K18R9K59J07l81n51l67J55M60O9m31l13j95K59L70
$$ -645 -782 -673 -442 -236 -275 -321 -627 -843 -566 -348 -249 10 117 -264 -815 -1182 -1027 -567 -498 -929 -1242 -1437 -1178 -808
-18482h08j34l17o8j56q5K63J96L39L58o4m1J50K78L98J31l02k92j62l80l70k66k85r1L87
$$ -808 -942 -1259 -1327 -1483 -1568 -1305 -1109 -770 -412 -476 -517 -367 -89 309 440 138 -154 -316 -696 -1066 -1332 -1617 -1708 -1321
-18458a321M60M56J88k35l33pj61j73k17M7J47J52M1J35K37L77L43j45l33m09J75L12k2q8
$$ -1321 -861 -405 -217 -452 -785 -792 -953 -1126 -1343 -1296 -1149 -997 -956 -821 -584 -207 136 -9 -342 -751 -576 -264 -286 -374
-18434c74k82k27k17K62L00k9j17j06J87L02Q5m7O2j16J60k04k29l8K12M83L06J15j18j93
$$ -374 -656 -883 -1100 -838 -538 -567 -684 -790 -603 -301 -216 -263 -201 -317 -157 -361 -590 -628 -416 67 373 488 370 177
-18410A77k46j73K24J83N4J41j64l45K8J25k8J30n8l69l15j71J6J52N6j70j88j90K0L14r9
$$ 177 -69 -242 -18 165 219 360 196 -149 -121 4 -24 106 48 -321 -636 -807 -791 -639 -583 -753 -941 -1131 -1111 -797 -896
-18385h96l3J57O4j9J55K55K23m0n10m66j94R3N53K02k71j18J35K09M3j22k9k85l31l35j25
$$ -896 -929 -772 -708 -727 -572 -317 -94 -134 -644 -1110 -1304 -1211 -658 -456 -727 -845 -710 -501 -458 -580 -609 -894 -1225 -1560 -1685
-18360a685K21q0j8K27K1k7J74N4j57j75N23M54K50M25k11l75J4j13n34k83K25l35n79J56
$$ -1685 -1464 -1544 -1562 -1335 -1314 -1341 -1167 -1113 -1270 -1445 -922 -468 -218 207 -4 -379 -365 -478 -1012 -1295 -1070 -1405 -1984 -1828
-18336a828N65Q11L78k21k39J2m9Pl5k75N6j2j33k95n7L57O01j10j17q7l79l15K31L74M4j41
$$ -1828 -1263 -452 -74 -295 -534 -522 -571 -564 -599 -874 -818 -830 -963 -1258 -1315 -958 -357 -467 -584 -671 -1050 -1365 -1134 -760 -716 -857
-18310h57p0j66r6J84L46L79K55j87k74l03j38J19K51J67K79J96j82k14k79o03j42M41N04
$$ -857 -927 -1093 -1189 -1005 -659 -280 -25 -212 -486 -789 -927 -808 -557 -390 -111 85 -97 -311 -590 -1193 -1335 -894 -390
-18287c90M58K28K49K87k35n93m59k52k50j66P7L41j6l5o1J25J70L2J94R6K00j83m77l92K23
$$ -390 68 296 545 832 597 4 -455 -707 -957 -1123 -1046 -705 -721 -756 -817 -692 -522 -490 -296 -200 0 -183 -660 -1052 -829
-18262h29L66L06K25j23j34r7k08k03l2M59M63P9k18l56j61n0j54j43pj9M3J42J28N47L62
$$ -829 -463 -157 68 -55 -189 -286 -494 -697 -729 -270 193 272 54 -302 -463 -513 -667 -810 -817 -836 -793 -651 -523 24 386
-18237C86o6N5O7m6l0j03k57J31J91l17l61l66k26L68N14nm96k27j82J57L25n34l23K17L09
$$ 386 320 375 442 396 366 263 6 137 328 11 -350 -716 -942 -574 -60 -65 -561 -788 -970 -813 -488 -1022 -1345 -1128 -819
-18212h19L8n2Q8M62L50l17m73j84J48K90K87M70M19O7j69j03k38j35j09j4k3L4k1j44J51
$$ -819 -781 -833 -745 -283 67 -250 -723 -907 -759 -469 -182 288 707 774 605 502 264 129 20 6 -17 17 -4 -148 3
-18187Cj26m15o01l84L64M29J81k9J13L05M10K0o16l35j30K0p6j45J19J47J73j1j29OJ3K94
$$ 3 -123 -538 -1139 -1523 -1159 -730 -549 -578 -465 -160 250 270 -346 -681 -811 -791 -867 -1012 -893 -746 -573 -584 -713 -707 -694 -400
-18161d00K48j37J51P1l42l77j26L64j7j93L68L23n2k82l46l99k43L85M67J22k1k81l18j99
$$ -400 -152 -289 -138 -67 -409 -786 -912 -548 -565 -758 -390 -67 -119 -401 -747 -1146 -1389 -1004 -537 -415 -436 -717 -1035 -1234
-18137a234R5J80R6O5L29K46K6J3j07l06j84M09P77M12k97k52j35j86l84m13L96P98J17o2
$$ -1234 -1139 -959 -863 -798 -469 -223 -197 -184 -291 -597 -781 -372 405 817 520 268 133 -53 -437 -850 -454 344 461 399
-18113C99j30k59J01K01J11k0m06L4J81k74m78j06J46K60K70j72l41k79j11k92n82k75J62
$$ 399 269 10 111 312 423 403 -3 31 212 -62 -540 -646 -500 -240 30 -142 -483 -762 -873 -1165 -1747 -2022 -1860
-18090a860N58L33L18n2j32J71r8k96k70k65L99J72k6K43J79K09L1j20K69K47k25l80k49O1
$$ -1860 -1302 -969 -651 -703 -835 -664 -762 -1058 -1328 -1593 -1194 -1022 -1048 -805 -626 -417 -386 -506 -237 10 -215 -595 -844 -783
-18066g83J93j80m35j27J34Km4m5O17Q11J45l53m21m1M88M56j0k26k30j27j32l92j25J03M69
$$ -783 -590 -770 -1205 -1332 -1198 -1196 -1240 -1285 -668 143 288 -65 -486 -527 -39 417 407 181 -49 -176 -308 -700 -825 -722 -253
-18041b53L85J07j02l02J01K17P4J38K29k67k22l19Q9J95j1NK37m7o4N0k65m41k27K4J3j78
$$ -253 132 239 137 -165 -64 153 227 365 594 327 105 -214 -125 70 59 64 301 254 190 240 -25 -466 -693 -669 -656 -834
-18015h34k63m06l8J93K72J5j38j43k41J71L72K49nJ0K78N33L55Ok99m87j27j2m1P3K25l78
$$ -834 -1097 -1503 -1541 -1348 -1076 -1061 -1199 -1342 -1583 -1412 -1040 -791 -796 -786 -508 25 380 386 87 -400 -527 -539 -580 -507 -282 -660
-17989f60n74K85M23J16%n42q18r2N92M36R8L2N7j81n9K26K05K34j16k63M93O35pj91j39j26
$$ -660 -1234 -949 -526 -410 -410 -952 -1770 -1862 -1270 -834 -736 -704 -647 -828 -887 -661 -456 -222 -338 -601 -108 527 520 329 190 64
-17963F4k31m06K2L24K43P6l43m58r6J22L09J60j28j89k25r8k9l6Q9L79K88o7M4J40j3J44
$$ 64 -167 -573 -551 -227 16 92 -251 -709 -805 -683 -374 -214 -342 -531 -756 -854 -883 -919 -830 -451 -163 -230 -186 -46 -59 85
-17937H5m9j28o8J9J50J21j96j7K40J01k47n64K8M9j00J75N31K39j29j25j83l74l04K29N22
$$ 85 36 -92 -160 -141 9 130 -66 -83 157 258 11 -553 -525 -476 -576 -401 130 369 240 115 -68 -442 -746 -517 5
-17912EK75P4m26k80j7L2R7R1K40J52l29j83j11j26l0P2j94J55O32K70j70k7m6j74l76l28
$$ 5 280 354 -72 -352 -369 -337 -240 -149 91 243 -86 -269 -380 -506 -536 -464 -658 -503 129 399 229 202 156 -18 -394 -722
-17886g22L20L38j30j54K46L93j63k52l8m58n75j8L28O55P25J17n07o51j3O7n8M94K36j30
$$ -722 -402 -64 -194 -348 -102 291 128 -124 -162 -620 -1195 -1213 -885 -230 495 612 105 -546 -559 -492 -550 -56 180 50
-17862E0j05p6j35l80m06L7L08p9k45l3K34j37k90J62K04K60M33M9r2j89k41l5N6j03L5J31
$$ 50 -55 -131 -266 -646 -1052 -1015 -707 -786 -1031 -1064 -830 -967 -1257 -1095 -891 -631 -198 -149 -241 -430 -671 -706 -650 -753 -718 -587
-17836e87K07k12k45J26L64M86J45J2Oj35j00O0p3l03l44n0N74M83k71j56O5k82k63K3J6J30
$$ -587 -380 -592 -837 -711 -347 139 284 296 302 167 67 127 54 -249 -593 -643 -69 414 143 -13 52 -230 -493 -470 -454 -324
-17810c24K04L15l1l60k94m77l08J22M23K43j2Q8K71O1l43m10k78J88Q34N45P0j20J04J57
$$ -324 -120 195 164 -196 -490 -967 -1275 -1153 -730 -487 -499 -411 -140 -79 -422 -832 -1110 -922 -88 457 527 407 511 668
-17786F68k17j86j91K22K93j47l32J34M10J71j15qR5Qq9l73k34n06m92J79N67L04J98m1m00
$$ 668 451 265 74 296 589 442 110 244 654 825 710 702 797 805 716 343 109 -397 -889 -710 -143 161 359 318 -82
-17761h2j17K0r6Nk32j10k17m10R0O01L93m4j26r5jK6j04j90j95R3l65k58K88K96k98l73K07
$$ -82 -199 -179 -275 -270 -502 -612 -829 -1239 -1149 -548 -155 -199 -325 -420 -421 -395 -499 -689 -884 -791 -1156 -1414 -1126 -830 -1128 -1501 -1294
-17734a294M87O31M97J79l11k28j46J33N2j5jr0j65j28J39J45N9o7k04j4k42m23j72K9J99
$$ -1294 -807 -176 321 500 189 -39 -185 -52 0 -15 -16 -106 -271 -399 -260 -115 -56 -123 -327 -341 -583 -1006 -1178 -1149 -950
-17709i50k82j96j43k45k7p3K63L34L68L69J47k61l93J26J06K30J81P6k03m74l24p6R0M23
$$ -950 -1232 -1428 -1571 -1816 -1843 -1916 -1653 -1319 -951 -582 -435 -696 -1089 -963 -857 -627 -446 -370 -573 -1047 -1371 -1447 -1357 -934
-17685i34L71J12P3K38r5RM63k3m04j93R7r0l80J3N49L74k06k76Q9P4r3j27k35k44j0rlJ6
$$ -934 -563 -451 -378 -140 -235 -226 237 214 -190 -383 -286 -376 -756 -743 -194 180 -26 -302 -213 -139 -232 -359 -594 -838 -848 -857 -860 -844
-17657h44R2M87L57p0k89j98q2j48j64o2j55R3J27Nk30k58K76L72j45j26K82J48k06n54R0
$$ -844 -752 -265 92 22 -267 -465 -547 -695 -859 -921 -1076 -983 -856 -851 -1081 -1339 -1063 -691 -836 -962 -680 -532 -738 -1292 -1202
-17632a202O20K47j31l3Q9K15M9mK15J41k0M5k50j42p7k28ro8n7j48l34m38P3L00k1q2L39
$$ -1202 -582 -335 -466 -499 -410 -195 -146 -150 65 206 186 231 -19 -161 -238 -466 -475 -543 -600 -748 -1082 -1520 -1447 -1147 -1168 -1250 -911
-17605i11M18j46m83j79n5O1M2oj23k74j87Q3J62J22K71L82K71J2N01M69J65N7j12m07j27
$$ -911 -493 -639 -1122 -1301 -1356 -1295 -1253 -1259 -1382 -1656 -1843 -1760 -1598 -1476 -1205 -823 -552 -540 -39 430 595 652 540 133 6
-17580FM84J11l07k02l83o52j59k36pJ06m5P2j77J57K5l00K7K45K99L24k14n36j02L5l6L18
$$ 6 490 601 294 92 -291 -943 -1102 -1338 -1345 -1239 -1284 -1212 -1389 -1232 -1207 -1507 -1480 -1235 -936 -612 -826 -1362 -1464 -1429 -1465 -1147
-17554a147M92j60l43J09K27N30M19k28n99r23m47K00N19Q57K90l9L8k66m39l31J13J20n3
$$ -1147 -655 -815 -1158 -1049 -822 -292 127 -101 -700 -1623 -2070 -1870 -1351 -494 -204 -243 -205 -471 -910 -1241 -1128 -1008 -1061
-17531a061J29L60M03K65m14n30j42M09K22J4R3J29J40K3Ml53n32k46k37J45J34J25M43J20
$$ -1061 -932 -572 -169 96 -318 -848 -990 -581 -359 -345 -252 -123 17 40 44 -309 -841 -1087 -1324 -1179 -1045 -920 -477 -357
-17507c57K0J9j10k23kL54K15l12o70p3J41j63M5J23J78L68L05j39L4K23M8q0j56n4J46m0
$$ -357 -337 -318 -428 -651 -653 -299 -84 -396 -1066 -1139 -998 -1161 -1116 -993 -815 -447 -142 -281 -247 -24 24 -56 -212 -266 -120 -160
-17481a60k74k68j14O9K64L88L13j02k38k09k22j5q0j75j15m6j03J80n2r9K79L55K78K27J75
$$ -160 -434 -702 -816 -747 -483 -95 218 116 -122 -331 -553 -568 -648 -823 -938 -984 -1087 -907 -959 -1058 -779 -424 -146 81 256
-17456B56j88n51l62m37m25K76N33P9Jk2j56o7J61qk21M9J24O4RK88O52M16N4o0p5J03j90
$$ 256 68 -483 -845 -1282 -1707 -1431 -898 -819 -818 -840 -996 -1063 -902 -910 -1131 -1082 -958 -894 -885 -597 55 471 525 465 390 493 303
-17429C03m64m78k37R3K93K26J58k21j62L03K95j31k12Q0J06k08P0K27l52m01L77p3l66J19
$$ 303 -161 -639 -876 -783 -490 -264 -106 -327 -489 -186 109 -22 -234 -154 -48 -256 -186 41 -311 -712 -335 -408 -774 -655
-17405f55J60J80Q0n1J02j00l75j98j18m7j06K18L96r4j12J87R9l64l29k87r4k9j99o6J67
$$ -655 -495 -315 -235 -286 -184 -284 -659 -857 -975 -1022 -1128 -910 -514 -608 -720 -533 -434 -798 -1127 -1414 -1508 -1537 -1736 -1802 -1635
-17380a635J45P0K33K07K88O3l75L8J01l39j9L1J53K93m5m5j48j5J16j97p1K05M9J68j60k21
$$ -1635 -1490 -1420 -1187 -980 -692 -629 -1004 -966 -865 -1204 -1223 -1192 -1039 -746 -791 -836 -984 -999 -883 -1080 -1151 -946 -897 -729 -889 -1110
-17354a110j76O5M62L89j04k07K58M53MJ3L25j67l47j19K16O8R2K24R4o0j39j33n9n1LK04
$$ -1110 -1286 -1221 -759 -370 -474 -681 -423 30 34 47 372 205 -142 -261 -45 23 115 339 433 373 234 101 42 -9 -6 198
-17328A98l17o87j89J95K49J92j20R6K96K33J02l01l06k12m86K94L29k49n40j65J51Q7L23
$$ 198 -119 -806 -995 -800 -551 -359 -479 -383 -87 146 248 -53 -359 -571 -1057 -763 -434 -683 -1223 -1388 -1237 -1150 -827
-17305h27J39n2j32j50K43K04q5Lj14l23j68M32N32R3m52m02n3Q1q2o8L4J12K70J99K49O1
$$ -827 -688 -740 -872 -1022 -779 -575 -660 -657 -771 -1094 -1262 -830 -298 -205 -657 -1059 -1112 -1031 -1113 -1181 -1147 -1035 -765 -566 -317 -256
-17279b56O0q0j98k24j64K3L08K04J5K13p5n3R3k59m38k55L75M20L63K92j34o71o12k45K09
$$ -256 -196 -276 -474 -698 -862 -839 -531 -327 -312 -99 -174 -227 -134 -393 -831 -1086 -711 -291 72 364 230 -441 -1053 -1298 -1089
-17254a089M73K42K62L75M26K60l48m67k32J97J45n03m65k01%k2O0L52K02J01k94m78l57R2
$$ -1089 -616 -374 -112 263 689 949 601 134 -98 99 244 -259 -724 -925 -925 -947 -887 -535 -333 -232 -526 -1004 -1361 -1269
-17230a269P1l02j10k3j5K67L00O4K8J0J71J35K44K72j79k69j50o0J80n5pk94j45K85K21M68
$$ -1269 -1198 -1500 -1610 -1633 -1648 -1381 -1081 -1017 -989 -979 -808 -673 -429 -157 -336 -605 -755 -815 -635 -690 -697 -991 -1136 -851 -630 -162
-17204a62K15L6R3k85j18J61klp8P1j51m79j33R5K59q1j29J15K44J72k96l45L04N65M7m62
$$ -162 53 89 182 -103 -221 -60 -62 -65 -143 -72 -223 -702 -835 -740 -481 -562 -691 -576 -332 -160 -456 -801 -497 68 115 -347
-17178c47j64P1j31m97J00J70J86L77N0o8k65k68j58q0K29K80nj49j44l87p0O27P20M28J34
$$ -347 -511 -440 -571 -1068 -968 -798 -612 -235 -185 -253 -518 -786 -944 -1024 -795 -515 -520 -669 -813 -1200 -1270 -643 77 505 639
-17153F39l78n15n83m54j24k8N7L13J91N10J93m83k70K14M76K26km5N0K1l56k66j38J15N67
$$ 639 261 -254 -837 -1291 -1415 -1443 -1386 -1073 -882 -372 -179 -662 -932 -718 -242 -16 -18 -63 -13 8 -348 -614 -752 -637 -70
-17128g0K19k55k08m11j19k4l39K4r4j69J98M87K97Q5J54J12j25m20l06j62N3M47K04j86n5
$$ -70 149 -106 -314 -725 -844 -868 -1207 -1183 -1277 -1446 -1248 -761 -464 -379 -225 -113 -238 -658 -964 -1126 -1073 -626 -422 -608 -663
-17103f63j04j63L6L31K72j43P2K31Q2nk04l72j54Oj17j87q3J58K87L8N9J1L68J67k41m6j95
$$ -663 -767 -930 -894 -563 -291 -434 -362 -131 -49 -54 -258 -630 -784 -778 -895 -1082 -1165 -1007 -720 -682 -623 -612 -244 -77 -318 -364 -559
-17076e59k46j00l47j66J64P6j32k23K42N52L34L9j65n01l01J26K50k17p2K90J82L44L05j05
$$ -559 -805 -905 -1252 -1418 -1254 -1178 -1310 -1533 -1291 -739 -405 -366 -531 -1032 -1333 -1207 -957 -1174 -1246 -956 -774 -430 -125 -230
-17052b30j27Q7J40o3K51J3j06O8K3J87o1n49n24q0K25K47j08l05K1L72K39k20l38j25J63
$$ -230 -357 -270 -130 -193 58 71 -35 33 56 243 182 -367 -891 -971 -746 -499 -607 -912 -891 -519 -280 -500 -838 -963 -800
-17027h00L05q0j6j05r2J52l2k79K01M37K58L31J1k35j16K82J60j11m9Nk60k80J25K37L1K29
$$ -800 -495 -575 -591 -696 -788 -636 -668 -947 -746 -309 -51 280 291 56 -60 222 382 271 222 227 -33 -313 -188 49 80 309
-17001C09R8j61k86n60k43n9J72P9j10K34K79M9Q4J55Ol21j18N3K46R0j85j96k06J4K21Q0
$$ 309 407 246 -40 -600 -843 -902 -730 -651 -761 -527 -248 -199 -115 40 46 -275 -393 -340 -94 -4 -189 -385 -591 -577 -356 -276
-16975b76k16j52j12k53J03L55L58r2k84r0J71L29R1n3j47j09L2k9k23J56k40p9L70K53O0
$$ -276 -492 -644 -756 -1009 -906 -551 -193 -285 -569 -659 -488 -159 -68 -121 -268 -377 -345 -374 -597 -441 -681 -760 -390 -137 -77
-16950g7l7j70j02k21k53k60j16L25K41k11k87J36M35L48Q6l3l2m8r7m4L0j94n9K50K64M6
$$ -77 -114 -284 -386 -607 -860 -1120 -1236 -911 -670 -881 -1168 -1032 -597 -249 -163 -196 -228 -276 -373 -417 -387 -581 -640 -390 -126 -80
-16924h0j51r5k57k16j3J83J24k75j11J97J12K4K8K63K79K5j89j10j88K4J61j07j46l55j52
$$ -80 -231 -326 -583 -799 -812 -629 -505 -780 -891 -694 -582 -558 -530 -267 12 37 -152 -262 -450 -426 -265 -372 -518 -873 -1025
-16899a025J49K06k7k09qJ96K4Q3L71K67j62K4K97n5r2p7j14j5l12m09l34m86q7O03O29l5
$$ -1025 -876 -670 -697 -906 -914 -718 -694 -611 -240 27 -135 -111 186 131 39 -38 -152 -167 -479 -888 -1222 -1708 -1795 -1192 -563 -598
-16873e98k29r0N06M43O1l8j77k10k0K98J69J76l2k19k6j35p0rk22m93p8j03k95j34P8K00
$$ -598 -827 -917 -411 32 93 55 -122 -332 -352 -54 115 291 259 40 14 -121 -191 -200 -422 -915 -993 -1096 -1391 -1525 -1447 -1247
-16847a247j15l69J24L49o7KK55M86N91M72M7l02m53o19J44P56K97k91l03m51q9N08L90N7
$$ -1247 -1362 -1731 -1607 -1258 -1325 -1323 -1068 -582 9 481 528 226 -227 -846 -702 54 351 60 -243 -694 -783 -275 115 172
-16823A72J81j00k94l47m1j86k80O84N11k70j83k37l91j51J67r4l74k8K05L84K99k85r6J95
$$ 172 353 253 -41 -388 -429 -615 -895 -211 300 30 -153 -390 -781 -932 -765 -859 -1233 -1261 -1056 -672 -373 -658 -754 -559
-16799e59K18K10j39L35K14k26N7l3J24J10l4J29j84l77r4Qj5J34n8l19k60m1L21J80j79k26
$$ -559 -341 -131 -270 65 279 53 110 77 201 311 277 406 222 -155 -249 -241 -256 -122 -180 -499 -759 -800 -479 -299 -478 -704
-16773g04OK34J41K29J41j08l18j35K83J76j10k9QQ7Jj7k50m14N0L25n2J50j67m50j7P2J49
$$ -704 -698 -464 -323 -94 47 -61 -379 -514 -231 -55 -165 -194 -186 -99 -98 -115 -365 -779 -729 -404 -456 -306 -473 -923 -940 -868 -719
-16746g19Q7L89Mk07j8j33k25P5O8j7K13J57J82P0m6l67l92k29p2J42M7J21R8K3j90o8K44
$$ -719 -632 -243 -239 -446 -464 -597 -822 -747 -679 -696 -483 -326 -144 -74 -120 -487 -879 -1108 -1180 -1038 -991 -870 -772 -749 -939 -1007 -763
-16719g63J66j0n79n70N06O73M07J57m02k41k07n7J02n2j65J14M77K71l94k36L34j41m99m55
$$ -763 -597 -607 -1186 -1756 -1250 -577 -170 -13 -415 -656 -863 -920 -818 -870 -1035 -921 -444 -173 -567 -803 -469 -610 -1109 -1564
-16695a564k22j66k15j11j9L35L72M80O76K95O9Lk9L16J51n11n61k66K0J53oj28j35MK84J68
$$ -1564 -1786 -1952 -2167 -2278 -2297 -1962 -1590 -1110 -434 -139 -70 -67 -96 220 371 -140 -701 -967 -947 -794 -800 -928 -1063 -1059 -775 -607
-16669f07j50j42k20J12R4j16L7J27J36k26l37J2K74J57L34L86j00p6N57L26k45o77l33P7
$$ -607 -757 -899 -1119 -1007 -913 -1029 -992 -865 -729 -955 -1292 -1280 -1006 -849 -515 -129 -229 -305 252 578 333 -344 -677 -600
-16645f00j92n99j56J55M01L54P3j9j59q3k83J16On40l66K11N67M71K37O6o3l21j77K35J26
$$ -600 -792 -1391 -1547 -1392 -991 -637 -564 -583 -742 -825 -1108 -992 -986 -1526 -1892 -1681 -1114 -643 -406 -340 -403 -724 -901 -666 -540
-16620e40j2l02j0N05K27k72l17k22J28k81n04l17J88M32M43L66K48m3J28J80k47l32j90k4
$$ -540 -552 -854 -864 -359 -132 -404 -721 -943 -815 -1096 -1600 -1917 -1729 -1297 -854 -488 -240 -283 -155 25 -222 -554 -744 -768
-16596g68j38o68j45P16O64J37j38m2K31J63j2l33k36K69j63K7M23m7j81k13r7j5K39J54N2
$$ -768 -906 -1574 -1719 -1003 -339 -202 -340 -382 -151 12 0 -333 -569 -300 -463 -436 -13 -60 -241 -454 -551 -566 -327 -173 -121
-16571a21n4j52k0J15J76k06n37k20K07R0K65L77L68l23q79p05j61K39L60J76j27l30J23J90
$$ -121 -175 -327 -347 -232 -56 -262 -799 -1019 -812 -722 -457 -80 288 -35 -914 -1619 -1780 -1541 -1181 -1005 -1132 -1462 -1339 -1149
-16547a149j6J05j26q4L45M49M03J60l5k78l37j86p3p4L30K86P9k43l50j55K9L64L40J65j59
$$ -1149 -1165 -1060 -1186 -1270 -925 -476 -73 87 52 -226 -563 -749 -822 -896 -566 -280 -201 -444 -794 -949 -920 -556 -216 -51 -210
-16522b10o9l4K10K55J58R4nR0j92j13L33J49L8J87M69rn81m11j74j86M3j16k97K82K10q5
$$ -210 -279 -313 -103 152 310 404 399 489 297 184 517 666 704 891 1360 1351 770 359 185 -1 42 -74 -371 -89 121 36
-16496C6k30k10l56l58J29N80K30r7j74m98j3K08J38J54k10q7J1N8o7j74p7J66N66J05l27
$$ 36 -194 -404 -760 -1118 -989 -409 -179 -276 -450 -948 -961 -753 -615 -461 -671 -758 -747 -689 -756 -930 -1007 -841 -275 -170 -497
-16471d97k64k84J66M11j24j43L4k6k33l58J41K47J31J08j67m16j79J94K82P8J60M10K50o1
$$ -497 -761 -1045 -879 -468 -592 -735 -701 -727 -960 -1318 -1177 -930 -799 -691 -858 -1274 -1453 -1259 -977 -899 -739 -329 -79 -140
-16447a40l42k40J30j62k42o7J05K58K34j41j77K62L62k47m73k99R0M17r9n56k48M90R25O09
$$ -140 -482 -722 -592 -754 -996 -1063 -958 -700 -466 -607 -784 -522 -160 -407 -880 -1179 -1089 -672 -771 -1327 -1575 -1085 -160 449
-16423D49j58j90k43n96l8K66K12n0m3m60l40K58N90M98K44P5l15n50l39n6j82k55q6P0K10
$$ 449 291 101 -142 -738 -776 -510 -298 -348 -391 -851 -1191 -933 -343 155 399 474 159 -391 -730 -786 -968 -1223 -1309 -1239 -1029
-16398a029K79R4K01J92J86L57j4j04J51L24L29J03M4m53l10r6k18m64j15j33k12J15ll7j62
$$ -1029 -750 -656 -455 -263 -77 280 266 162 313 637 966 1069 1113 660 350 254 36 -428 -543 -676 -888 -773 -776 -813 -975
-16373i75J03J91K61R9n9k41j70M2K6J67mq5K63J7m52l39K19L29L24J96o6M6M0L02O5k03l31
$$ -975 -872 -681 -420 -321 -380 -621 -791 -749 -723 -556 -560 -645 -382 -365 -817 -1156 -937 -608 -284 -88 -154 -108 -68 234 299 96 -235
-16346b35l00k98l02m85j0K53P0m6j27P6M14J73L8N5l02m43j07j11q4M85O36N86L75R8k5k86
$$ -235 -535 -833 -1135 -1620 -1630 -1377 -1307 -1353 -1480 -1404 -990 -817 -779 -724 -1026 -1469 -1576 -1687 -1771 -1286 -650 -64 311 409 384 98
-16320I8n48j54J61L80J92k51n73k68K21K88M0l31k8J60J60J59K35J64K08j67k62p9j38J54
$$ 98 -450 -604 -443 -63 129 -122 -695 -963 -742 -454 -414 -745 -773 -613 -453 -294 -59 105 313 146 -116 -195 -333 -179
-16296a79O8R5m3J37KQ9l4k39k2J06P4jl89n47j0L30K39k12j49p9o4N03N84J23j20m8k30l19
$$ -179 -111 -16 -59 78 80 169 135 -104 -126 -20 54 53 -336 -883 -893 -563 -324 -536 -685 -764 -828 -325 259 382 262 214 -16 -335
-16268c35l60r7o2j14J12J26N01N34J93l57j46Kl29k6Q8j98l67j77M0J52K36L5q4m69j42K12
$$ -335 -695 -792 -854 -968 -856 -730 -229 305 498 141 -5 -3 -332 -358 -270 -468 -835 -1012 -972 -820 -584 -549 -633 -1102 -1244 -1032
-16242a032J37j3O9O7J33M0o8j70K3k43j51J7J04J06l84l45K69M90J55j55j3K06k33k51K54
$$ -1032 -895 -908 -839 -772 -639 -599 -667 -837 -814 -1057 -1208 -1191 -1087 -981 -1365 -1710 -1441 -951 -796 -951 -964 -758 -991 -1242 -988
-16217i88j16j24lp7J87M01L31J06L56K80m0q2q4m96m21qK07L45K22j92K7M7l33n26l69K87
$$ -988 -1104 -1228 -1231 -1308 -1121 -720 -389 -283 73 353 313 231 147 -349 -770 -778 -571 -226 -4 -196 -169 -122 -455 -981 -1350 -1063
-16191a063J90m53k41L37O02L88k24l08J66M59J83l15n4L56r1k10j21K40N1l12p2n3O3J1j40
$$ -1063 -873 -1326 -1567 -1230 -628 -240 -464 -772 -606 -147 36 -279 -333 23 -68 -278 -399 -159 -108 -420 -492 -545 -482 -471 -611
-16166f11P2K89r2k96K9J86J49Mj79j06J98Q4K37l6n89m88j55q5l85J12M83N8J28K07p9K75
$$ -611 -539 -250 -342 -638 -609 -423 -274 -270 -449 -555 -357 -273 -36 -72 -661 -1149 -1304 -1389 -1774 -1662 -1179 -1121 -993 -786 -865 -590
-16140e90J07l41j12n2l09J0P6J09K02l0R9l4j93k22J25L72J69j5K75P55L37l62j39J7m07
$$ -590 -483 -824 -936 -988 -1297 -1287 -1211 -1102 -900 -930 -831 -865 -1058 -1280 -1155 -783 -614 -629 -354 401 738 376 237 254 -153
-16115a53n38n95j79K11J94J7q0j7L84L03l9J6J7Q3n0mK05L30K15n39m58L03L79P8k72Rj53
$$ -153 -691 -1286 -1465 -1254 -1060 -1043 -1123 -1140 -756 -453 -492 -476 -459 -376 -426 -430 -225 105 320 -219 -677 -374 5 83 -189 -180 -333
-16088c33l53J02Q7P2j00j79Q8k8jJ84n7K17K68k46m37j09p5j97m20n7R8L1K28n4k85R1L86
$$ -333 -686 -584 -497 -425 -525 -704 -616 -644 -645 -461 -518 -301 -33 -279 -716 -825 -900 -1097 -1517 -1574 -1476 -1445 -1217 -1271 -1556 -1465 -1079
-16061a079O1P9M52L28ml1k4k40RK97L77J00k61j42%m1k75j49k3q8l08LL76M68K91k75p20
$$ -1079 -1018 -939 -487 -159 -163 -194 -218 -458 -449 -152 225 325 64 -78 -78 -119 -394 -543 -566 -654 -962 -959 -583 -115 176 -99 -819
-16034h19j21M44N61O0j06q4Q6m2K31K45j72l55j59O1O1M8m05l21l25k0J64m8n4L48K2l46
$$ -819 -940 -496 65 125 19 -65 21 -21 210 455 283 -72 -231 -170 -109 -61 -466 -787 -1112 -1132 -968 -1016 -1070 -722 -700 -1046
-16008a046l05j74K9j10o3L78P9m2K29N77K92L36K85m15k51j62k32k79k80q4K55K41J90J30
$$ -1046 -1351 -1525 -1496 -1606 -1669 -1291 -1212 -1254 -1025 -448 -156 180 465 50 -201 -363 -595 -874 -1154 -1238 -983 -742 -552 -422
-15984d22k39k74J28J57J40M9J01K90J65o0k62p49m89O7L33K58q3M48J30k72j67p9J7J78L48
$$ -422 -661 -935 -807 -650 -510 -461 -360 -70 95 35 -227 -976 -1465 -1398 -1065 -807 -890 -442 -312 -584 -751 -830 -813 -635 -287
-15959b87J50Q1Q4K56K14L5k03o8q5kj15k41M5J82k47m87j33l77l29N53J051M9n02k82r3j4
$$ -287 -137 -56 28 284 498 533 330 262 177 175 60 -181 -136 46 -201 -688 -821 -1198 -1527 -974 77 126 -376 -658 -751 -765
-15933g65K50J62O7O5K18L28K31J22l63k66j52n6L53O2j31o3k96m07k31j70l09M3L55J49M9
$$ -765 -515 -353 -286 -221 -3 325 556 678 315 49 -103 -159 194 256 125 62 -234 -641 -872 -1042 -1351 -1308 -953 -804 -755
-15908g55R3n6j86q3Q2Lj43K48M87j49k06k9k9J95N3j34l99m98K6K75O6J63J99O1J41J22j7
$$ -755 -662 -718 -904 -987 -905 -902 -1045 -797 -310 -459 -665 -694 -723 -528 -475 -609 -1008 -1506 -1480 -1205 -1139 -976 -777 -716 -575 -453 -470
-15881d70l26m2J44j78m90l36n8j75R0j9OK65L25L85K28K29M6k44k3j0J28J41J28n5j47Lj68
$$ -470 -796 -838 -694 -872 -1362 -1698 -1756 -1931 -1841 -1860 -1854 -1589 -1264 -879 -651 -422 -376 -620 -643 -653 -525 -384 -256 -311 -458 -455 -623
-15854f23j39n2l0J73L58Mj44k25j50J99J50J4J70o1j33rL55j02m97k6J19k5k88j66j4j1l0
$$ -623 -762 -814 -844 -671 -313 -309 -453 -678 -828 -629 -479 -465 -295 -356 -489 -498 -143 -245 -742 -768 -649 -674 -962 -1128 -1142 -1153 -1183
-15827a183L46M85j04k23K43L39K41P1l84n52K0K71R7m7K24P3m03k31o2k11P7J54L7N7J38
$$ -1183 -837 -352 -456 -679 -436 -97 144 215 -169 -721 -701 -430 -333 -380 -156 -83 -486 -717 -779 -990 -913 -759 -722 -665 -527
-15802e27m9k18l24K57M17K5j09K80J64n33n15O8L05J40O8J44J63l49m64R1K57K85J10l58
$$ -527 -576 -794 -1118 -861 -444 -419 -528 -248 -84 -617 -1132 -1064 -759 -619 -551 -407 -244 -593 -1057 -966 -709 -424 -314 -672
-15778f72m47J61N26N06j90l48j80j18K42J42M6k24m9K01R2L9L0j18j96j25r7jj5j86l03j28
$$ -672 -1119 -958 -432 74 -116 -464 -644 -762 -520 -378 -332 -556 -605 -404 -312 -273 -243 -361 -557 -682 -779 -780 -795 -981 -1284 -1412
-15752a412M45L94K34L09K28k89n51k73r5k40O6J66J61RK6K76L07n4k80j99p1n6O2M6q5J85
$$ -1412 -967 -573 -339 -30 198 -91 -642 -915 -1010 -1250 -1184 -1018 -857 -848 -822 -546 -239 -293 -573 -772 -843 -899 -837 -791 -876 -691
-15726f91J69o9k71n57n35j08nK21M06j02j98K23N05K18K56J79j07J32K07R7j01p3j25lJ11
$$ -691 -522 -591 -862 -1419 -1954 -2062 -2067 -1846 -1440 -1542 -1740 -1517 -1012 -794 -538 -359 -466 -334 -127 -30 -131 -204 -329 -332 -221
-15701b21j04k23k79l61k42J19J57L3J12K55L58j05m96o01O4N01K73Kp2j21l0K2K4j25k49
$$ -221 -325 -548 -827 -1188 -1430 -1311 -1154 -1121 -1009 -754 -396 -501 -997 -1598 -1534 -1033 -760 -758 -830 -951 -981 -959 -935 -1060 -1309
-15676a309j39K79K03O2M33J96l89o97o14R4K74P9J06K44K26K52K60J4L7qk1k3j03j98m19
$$ -1309 -1448 -1169 -966 -904 -471 -275 -664 -1361 -1975 -1881 -1607 -1528 -1422 -1178 -952 -700 -440 -426 -389 -397 -418 -441 -544 -742 -1161
-15651a161n1L62J26j98m90j78L5k11j26P7J39rQ4M7j5J15K67J18K9M0l2J60L09J04p4l03
$$ -1161 -1212 -850 -724 -922 -1412 -1590 -1555 -1766 -1892 -1815 -1676 -1685 -1601 -1554 -1569 -1454 -1187 -1069 -1040 -1000 -1032 -872 -563 -459 -533 -836
-15625h36n11m86J6N89N04J34J09n7j03K06l7m62m46l03J4K73J98M15K89j9L1o7j03k38l46
$$ -836 -1347 -1833 -1817 -1228 -724 -590 -481 -538 -641 -435 -472 -934 -1380 -1683 -1669 -1396 -1198 -783 -494 -513 -482 -549 -652 -890 -1236
-15600a236j89Q9L38J85N0j51m50k48M6j70L0M1q5j03M54N08J82N69M74N0l32o77j13l07l86
$$ -1236 -1425 -1336 -998 -813 -763 -914 -1364 -1612 -1566 -1736 -1706 -1665 -1750 -1853 -1399 -891 -709 -140 334 384 52 -625 -738 -1045 -1431
-15575a431Q5L38K25O1j97J03K38l46k7K04K12K95j11m5L17J83J65J48o9j10J33j46m62j52
$$ -1431 -1346 -1008 -783 -722 -919 -816 -578 -924 -951 -747 -535 -240 -351 -396 -79 104 269 417 348 238 371 225 -237 -389
-15551c89O3M2m00j12k78l78j50J74M38J07j05n0j76q7L7q0o1j85K13M98J5j15R2N7p3o2J0
$$ -389 -326 -284 -684 -796 -1074 -1452 -1602 -1428 -990 -883 -988 -1038 -1214 -1301 -1264 -1344 -1405 -1590 -1377 -879 -864 -979 -887 -830 -903 -965 -955
-15524i55j00K9L32K65J91k90l48j38m5k33M1J83K21k0j65J59L78K47K64O37J55n61j66Mo6
$$ -955 -1055 -1026 -694 -429 -238 -528 -876 -1014 -1059 -1292 -1251 -1068 -847 -867 -1032 -873 -495 -248 16 653 808 247 81 85 19
-15499A9k51k72k29O7M06L16K18K13om22k77p5K05P4J62Q3j68k53k8J20K03K02O1l53l75n6
$$ 19 -232 -504 -733 -666 -260 56 274 487 481 59 -218 -293 -88 -14 148 231 63 -190 -218 -98 105 307 368 15 -360 -416
-15473d16L11L4j73j3k6n90p96r3K84O42K88m22j08Q6l7J9O7k59j58J05R7k7o0Q3m6J31K64
$$ -416 -105 -71 -244 -257 -283 -873 -1669 -1762 -1478 -836 -548 -970 -1078 -992 -1029 -1010 -943 -1202 -1360 -1255 -1158 -1185 -1245 -1162 -1208 -1077 -813
-15446h13k4l13J51N49J72o9J19J8k25l49k9J84q3k36k79j05k3k0M5j74m7L14K36J60K24k5
$$ -813 -837 -1150 -999 -450 -278 -347 -228 -210 -435 -784 -813 -629 -712 -948 -1227 -1332 -1355 -1375 -1330 -1504 -1551 -1237 -1001 -841 -617 -642
-15420f42M4k08L6Q5j08k58q9j74k03J05J90K64K79L21L9NJ07J86j31k01j11PQ9J63O0L4m9
$$ -642 -598 -806 -770 -685 -793 -1051 -1140 -1314 -1517 -1412 -1222 -958 -679 -358 -319 -314 -207 -21 -152 -353 -464 -457 -368 -205 -145 -111 -160
-15393a60j15j51j6k79l32n4J55O4j0j58k42k90N9R4L10K56m8K47J62j9l10k33q7K93K07J11
$$ -160 -275 -426 -442 -721 -1053 -1107 -952 -888 -898 -1056 -1298 -1588 -1529 -1435 -1125 -869 -917 -670 -508 -527 -837 -1070 -1157 -864 -657 -546
-15367e46J77M0n0r9j19K7p7p8J12M6J01kk31k50j53j23O2P7K07N10N40K47k6k82m58m35k6
$$ -546 -369 -329 -379 -478 -597 -570 -647 -725 -613 -567 -466 -468 -699 -949 -1102 -1225 -1163 -1086 -879 -369 171 418 392 110 -348 -783 -809
-15340h09L36L16l57m49J76K04j16mk44j09J41J26J60J2J04m7j68m72l94j75q8L88L12K12
$$ -809 -473 -157 -514 -963 -787 -583 -699 -703 -947 -1056 -915 -789 -629 -617 -513 -560 -728 -1200 -1594 -1769 -1857 -1469 -1157 -945
-15316i45L44j7m76k41K79M37K72o2l11J3L02N6n94n13J38Q4K22J53k3J68j13j09j62m1O61
$$ -945 -601 -618 -1094 -1335 -1056 -619 -347 -409 -720 -707 -405 -349 -943 -1456 -1318 -1234 -1012 -859 -882 -714 -827 -936 -1098 -1139 -478
-15291d78M56k56j24lj03R2K21K07J3m01L6J09J25L41j58m52m76l48k9L77O30N06L3l44j49
$$ -478 -22 -278 -402 -405 -508 -416 -195 12 25 -376 -340 -231 -106 235 77 -375 -851 -1199 -1228 -851 -221 285 318 -26 -175
-15266a75j32q05n09K2o1J83M45J81p8j29l39j8J25k38r7M82M27K13K03N5j77J6j46l38L7
$$ -175 -307 -1112 -1621 -1599 -1660 -1477 -1032 -851 -929 -1058 -1397 -1415 -1290 -1528 -1625 -1143 -716 -503 -300 -245 -422 -406 -552 -890 -853
-15241h53K12J00j16m5N31N41L43L30l39l56Q1q2l55K0j6k51k22k27K3M52J98m49p00n27j97
$$ -853 -641 -541 -657 -702 -171 370 713 1043 704 348 429 347 -8 12 -4 -255 -477 -704 -681 -229 -31 -480 -1180 -1707 -1904
-15216a904J85M38K11j85j14R3J94K37p7o1Pk49l18j32L3J90p9j79r9K20O40K99J56L93M77
$$ -1904 -1719 -1281 -1070 -1255 -1369 -1276 -1082 -845 -922 -983 -976 -1225 -1543 -1675 -1642 -1452 -1531 -1710 -1809 -1589 -949 -650 -494 -101 376
-15191C76j07m57m23k5J69J9l01m00o10l02N2l07j65K34L26L59N31O7P2j11o39o64J13M62
$$ 376 269 -188 -611 -636 -467 -448 -749 -1149 -1759 -2061 -2009 -2316 -2481 -2247 -1921 -1562 -1031 -964 -892 -1003 -1642 -2306 -2193 -1731
-15167a731J41l4L6N85O53J1l98m57k36L91L71N5J11J82J3m6j76k03J18K30L2J10K18n8o3
$$ -1731 -1590 -1624 -1588 -1003 -350 -339 -737 -1194 -1430 -1039 -668 -613 -502 -320 -307 -353 -529 -732 -614 -384 -352 -242 -24 -82 -145
-15142a45j84j06N88P10J33k84n90l86k17J44r1q1M0K09k40k35l75l71Km3L3Q7o7J13L91j35
$$ -145 -329 -435 153 863 996 712 122 -264 -481 -337 -428 -509 -469 -260 -500 -735 -1110 -1481 -1479 -1522 -1489 -1402 -1469 -1356 -965 -1100
-15116a100k45K05O99N97M89J21p13n00K07J95K72J10n40p26j47j71K52K48J69K95k87m12
$$ -1100 -1345 -1140 -441 156 645 766 53 -447 -240 -45 227 337 -203 -929 -1076 -1247 -995 -747 -578 -283 -570 -982
-15094i82p7j42m57j96m9K22L98K88nk20j34J24N06L31o1n90l72K75K78L20M35K91K95N4J99
$$ -982 -1059 -1201 -1658 -1854 -1903 -1681 -1283 -995 -1000 -1220 -1354 -1230 -724 -393 -454 -1044 -1416 -1141 -863 -543 -108 183 478 532 731
-15069G31K28m1L4J8m19l42k3K35m8l64m99l96k42k12M6K90L92L94J33j65k39K86K41Qk05
$$ 731 959 918 952 970 551 209 186 421 373 9 -490 -886 -1128 -1340 -1294 -1004 -612 -218 -85 -250 -489 -203 38 46 -159
-15044a59k59J1Ok99l83q5K59J99o0r5j35N2l50l63j12K8K27L23P38N28J47j85o61j99K10
$$ -159 -418 -407 -401 -700 -1083 -1168 -909 -710 -770 -865 -1000 -948 -1298 -1661 -1773 -1745 -1518 -1195 -457 71 218 33 -628 -827 -617
-15019f17J60J40K37j04p37l33K01K04m3l62m27j9J19J76qK42M44N5k36j07j07j77k9K97J94
$$ -617 -457 -317 -80 -184 -921 -1254 -1053 -849 -892 -1254 -1681 -1700 -1581 -1405 -1413 -1171 -727 -672 -908 -1015 -1122 -1299 -1328 -1031 -837
-14994h37J30K9j89l68k36n3K93N52M38K99O0K00j21q08j71K36l21n2K06K60j91K06J21j92
$$ -837 -707 -678 -867 -1235 -1471 -1524 -1231 -679 -241 58 118 318 197 -611 -782 -546 -867 -919 -713 -453 -644 -438 -317 -509
-14970e09K24L51J32j77o2Mk86n10k99k29k60j3M15N69K89L30K15k70n57l24j85k54l7j1j5
$$ -509 -285 66 198 21 -41 -37 -323 -833 -1132 -1361 -1621 -1634 -1219 -650 -361 -31 184 -86 -643 -967 -1152 -1406 -1443 -1454 -1469
-14945a469O9O7L0L8K5m8j10J64K75K74L1m07j86m4K7O31N57j36k74l79l04K07J18m6j57L40
$$ -1469 -1400 -1333 -1303 -1265 -1240 -1288 -1398 -1234 -959 -685 -654 -1061 -1247 -1291 -1264 -633 -76 -212 -486 -865 -1169 -962 -844 -890 -1047 -707
-14919g07N56N2k06n51l39K13J55k33k80rN8jnK00L43L53L1j90k2J71J10l98k44L60K38j39
$$ -707 -151 -99 -305 -856 -1195 -982 -827 -1060 -1340 -1349 -1291 -1292 -1297 -1097 -754 -401 -370 -560 -582 -411 -301 -699 -943 -583 -345 -484
-14893d84j12k38l60k3K89J81N6J42P7j70k31k77m8O2J93K72P4N3L39K52k19k95q4j33K06
$$ -484 -596 -834 -1194 -1217 -928 -747 -691 -549 -472 -642 -873 -1150 -1198 -1136 -943 -671 -597 -544 -205 47 -172 -467 -551 -684 -478
-14868d78m3l29n84l58j8L76M53K95k9k83j07j26K6K81R2m57l02J02L07N23L57k83M2K74m7
$$ -478 -521 -850 -1434 -1792 -1810 -1434 -981 -686 -715 -998 -1105 -1231 -1205 -924 -832 -1289 -1591 -1489 -1182 -659 -302 -585 -543 -269 -316
-14843c16k45n2J20r4k63k08K7m9J27L11M7j22p9m03j91j28n63k97L81L72K58P18O47j77n34
$$ -316 -561 -613 -493 -587 -850 -1058 -1031 -1080 -953 -642 -595 -717 -796 -1199 -1390 -1518 -2081 -2378 -1997 -1625 -1367 -649 -2 -179 -713
-14818g13m31P4J87M6O7k66j41k1k64J39L14M07L10m3k17j56j75j17j70J98M33J22L8l08k59
$$ -713 -1144 -1070 -883 -837 -770 -1036 -1177 -1198 -1462 -1323 -1009 -602 -292 -335 -552 -708 -883 -1000 -1170 -972 -539 -417 -379 -687 -946
-14793i46P1J08J69J1K49M8k54j69J8J72L42N48K7R6n2m99m39j20j38mM12L73R6m15p69o21
$$ -946 -875 -767 -598 -587 -338 -290 -544 -713 -695 -523 -181 367 394 490 438 -61 -500 -620 -758 -762 -350 23 119 -296 -1065 -1686
-14767a686j60K88Q0K36K65L8J98n6l76j86M8K37L35J12O0M5P7L99L35J59M6q5m69k37P1m16
$$ -1686 -1846 -1558 -1478 -1242 -977 -939 -741 -797 -1173 -1359 -1311 -1074 -739 -627 -567 -522 -445 -46 289 448 494 409 -60 -297 -226 -642
-14741f42k51l97m26j42J25M06M61K84j01l42L0J98K16K83J46k32m11n27k02p1Lk40k42M56
$$ -642 -893 -1290 -1716 -1858 -1733 -1327 -866 -582 -683 -1025 -995 -797 -581 -298 -152 -384 -795 -1322 -1524 -1595 -1592 -1832 -2074 -1618
-14717a618N29lk76q4J73J67k43l47O7L31o8J30J39J3m5K11LK46Q4J05J84J42j22n30o19K8
$$ -1618 -1089 -1092 -1368 -1452 -1279 -1112 -1355 -1702 -1635 -1304 -1372 -1242 -1103 -1090 -1135 -924 -921 -675 -591 -486 -302 -160 -282 -812 -1431 -1403
-14691a403K72J68M1J9p1m59j00K00k74k48J03J51L47J16J41j38j47K24K31J65J66O6P1p1
$$ -1403 -1131 -963 -922 -903 -974 -1433 -1533 -1333 -1607 -1855 -1752 -1601 -1254 -1138 -997 -1135 -1282 -1058 -827 -662 -496 -430 -359 -430
-14667d30l01n22l17m9l4Q3P32M14l47m03l97L30P70N98J79l52k84j12rk6j52J16Q6j17j29
$$ -430 -731 -1253 -1570 -1619 -1653 -1570 -838 -424 -771 -1174 -1571 -1241 -471 127 306 -46 -330 -442 -451 -477 -629 -513 -427 -544 -673
-14642f73L82L47j3k65k14j3k8j89l67oO1LJ63M30J11l45p73l22P7%rJ71L03K84J51k02o5
$$ -673 -291 56 43 -222 -436 -449 -477 -666 -1033 -1039 -978 -975 -812 -382 -271 -616 -1389 -1711 -1634 -1634 -1643 -1472 -1169 -885 -734 -936 -1001
-14615a001J53L81L55R5l47n39k87K37l4j65J78L04P6o45k30J72K27K59K26Q6J87Q7j03L9
$$ -1001 -848 -467 -112 -17 -364 -903 -1190 -953 -987 -1152 -974 -670 -594 -1239 -1469 -1297 -1070 -811 -585 -499 -312 -225 -328 -289
-14591b89L9J10p9l79o59q91o24n3O03P56pk31k4LJ14K27K07K65j56m71j79J46N01N85M7k17
$$ -289 -250 -140 -219 -598 -1257 -2148 -2772 -2825 -2222 -1466 -1473 -1704 -1728 -1725 -1611 -1384 -1177 -912 -1068 -1539 -1718 -1572 -1071 -486 -439 -656
-14565f56J31J06p3l30j31J46J56J77k17j80K26K4k24k78P7L16K58j20m65J02L70J06k60j29
$$ -656 -525 -419 -492 -822 -953 -807 -651 -474 -691 -871 -645 -621 -845 -1123 -1046 -730 -472 -592 -1057 -955 -585 -479 -739 -868
-14541h68O8P1j9k51l21n3K40L93j2j58K2J46L01K12N7k87o88m99j18K75L07n7j35l8l5l53
$$ -868 -800 -729 -748 -999 -1320 -1373 -1133 -740 -752 -910 -888 -742 -441 -229 -172 -459 -1147 -1646 -1764 -1489 -1182 -1239 -1374 -1412 -1447 -1800
-14515a800Q4L63j57m0L13J8NK07K28q5j66m27k28J99J63Lk44J0K14O1M9p3k10k50l9L81L83
$$ -1800 -1716 -1353 -1510 -1550 -1237 -1219 -1214 -1007 -779 -864 -1030 -1457 -1685 -1486 -1323 -1320 -1564 -1554 -1340 -1279 -1230 -1303 -1513 -1763 -1802 -1421 -1038
-14488a038o8K4Q3l30q3J60M5k12j19K39L21N50M96K6k2j84m64l30l5j6j19J75K33J45R3R7
$$ -1038 -1106 -1082 -999 -1329 -1412 -1252 -1207 -1419 -1538 -1299 -978 -428 68 94 72 -112 -576 -906 -941 -957 -1076 -901 -668 -523 -430 -333
-14462c33LJ23N0J97L22l56l19n9j5j9k62k87l2j08k3M22L54J71rn20l01M1K85o0r5qJ91J4
$$ -333 -330 -207 -157 40 362 6 -313 -372 -387 -406 -668 -955 -987 -1095 -1118 -696 -342 -171 -180 -700 -1001 -960 -675 -735 -830 -838 -647 -633
-14434f33P7J25j07k30j45J39L44J26N5m2k46k2qr2O5J45L9j36j50J5j4k64J9K30J82p5J7
$$ -633 -556 -431 -538 -768 -913 -774 -430 -304 -249 -291 -537 -559 -567 -659 -594 -449 -410 -546 -696 -681 -695 -959 -940 -710 -528 -603 -586
-14407e86l26m20K00Q81O16j53l26l44Rj42k14K14Q6j80J01K36m42r63l97M17L87L36K97k60
$$ -586 -912 -1332 -1132 -251 365 212 -114 -458 -449 -591 -805 -591 -505 -685 -584 -348 -790 -1753 -2150 -1733 -1346 -1010 -713 -973
-14383i73k09L24K7m38n40j24L17K42j83J48K35J6M3L8M85K64l82l72L55J40j25l0K06n1l88
$$ -973 -1182 -858 -831 -1269 -1809 -1933 -1616 -1374 -1557 -1409 -1174 -1158 -1115 -1077 -592 -328 -710 -1082 -727 -587 -712 -742 -536 -587 -975
-14358i75j58l3J20R7l9N5j58OK08M17Nk25N3N0kJ02Q5r8o0L06L24j51j08L0r1j83pJ39J15
$$ -975 -1133 -1166 -1046 -949 -988 -933 -1091 -1085 -877 -460 -455 -680 -627 -577 -579 -477 -392 -490 -550 -244 80 -71 -179 -149 -240 -423 -430 -291 -176
-14329a76L57K58J15j78m48n72k88J93j40k8K87pj94M9L64J19j95j49j83k10l39K00N47n7
$$ -176 181 439 554 376 -72 -644 -932 -739 -879 -907 -620 -627 -821 -772 -408 -289 -484 -633 -816 -1026 -1365 -1165 -618 -675
-14305f75j90k02N7K02K19P8N4J30K44n3r5Q6J17o7P0K0r3o1k12j66k68p2L75J4j50M5o7j16
$$ -675 -865 -1067 -1010 -808 -589 -511 -457 -327 -83 -136 -231 -145 -28 -95 -25 -5 -98 -159 -371 -537 -805 -877 -502 -488 -638 -593 -660 -776
-14277g76o6p5M2M2m2j27J80K40l93k50j59N3L37L96j1P6J06J08l3l74l62j21m8k70m26q7
$$ -776 -842 -917 -875 -833 -875 -1002 -822 -582 -975 -1225 -1384 -1331 -994 -598 -609 -533 -427 -319 -352 -726 -1088 -1209 -1257 -1527 -1953 -2040
-14251b040K11J74L67L35qP5K42M06K95j1j07r5m07m97l05j6L16M62qm49k66K87N37M03J36
$$ -2040 -1829 -1655 -1288 -953 -961 -886 -644 -238 57 46 -61 -156 -563 -1060 -1365 -1381 -1065 -603 -611 -1060 -1326 -1039 -502 -99 37
-14226C7k89l44k93m06l47j32P5l8K92K54l35j33L62K01j39k0L99Q29L75j1j62j75k16o8k06
$$ 37 -252 -596 -889 -1295 -1642 -1774 -1699 -1737 -1445 -1191 -1526 -1659 -1297 -1096 -1235 -1255 -856 -27 348 337 175 0 -216 -284 -490
-14201d90r1M80M45j73l63j18N45L5m53j21K16R9j66j26o1k77n48k23m3p3J2J07J74L00L09
$$ -490 -581 -101 344 171 -192 -310 235 270 -183 -304 -88 11 -155 -281 -342 -619 -1167 -1390 -1433 -1506 -1494 -1387 -1213 -913 -604
-14176f04K72j06j41j66m98K32K05j26J9K63J27j88k07o45m66L34O73O45L62J10j68l69l94
$$ -604 -332 -438 -579 -745 -1243 -1011 -806 -932 -913 -650 -523 -711 -918 -1563 -2029 -1695 -1022 -377 -15 95 -73 -442 -836
-14153h36j98j35k75j52k85%J60K32K33r9j53o1L1J57m5j10j04o3J47J81Jj62K57N04J43j93
$$ -836 -1034 -1169 -1444 -1596 -1881 -1881 -1721 -1489 -1256 -1355 -1508 -1569 -1538 -1381 -1426 -1536 -1640 -1703 -1556 -1375 -1374 -1536 -1279 -775 -632 -825
-14127h25j19K22N75K91K15K69k24l13K69K9o71k56M1k96l92n67l79R6J74m1j50j78K21O31
$$ -825 -944 -722 -147 144 359 628 404 91 360 389 -282 -538 -497 -793 -1185 -1752 -2131 -2035 -1861 -1902 -2052 -2230 -2009 -1378
-14103a378M18J84L7k47o46l40Q4K10J4j69kL21L11R0L0J5k90l97J15O99M63k19l81j53k9
$$ -1378 -960 -776 -739 -986 -1632 -1972 -1888 -1678 -1664 -1833 -1835 -1514 -1203 -1113 -1083 -1068 -1358 -1755 -1640 -941 -478 -697 -1078 -1231 -1260
-14078a260M6L69K90O0P9o2k80k3J41j48k15j52n27p3M06m1n04m50p9J83L01L4l07O8K27J26
$$ -1260 -1214 -845 -555 -495 -416 -478 -758 -781 -640 -788 -1003 -1155 -1682 -1755 -1349 -1390 -1894 -2344 -2423 -2240 -1939 -1905 -2212 -2144 -1917 -1791
-14052a791j73l71JJ83L16N20J91j20m1J02K80Q3J55K35m37k07P6j9j71n09k83K95L74l68
$$ -1791 -1964 -2335 -2334 -2151 -1835 -1315 -1124 -1244 -1285 -1183 -903 -820 -665 -430 -867 -1074 -998 -1017 -1188 -1697 -1980 -1685 -1311 -1679
-14028a679p5K18R0o2j24M1j56O5L83M7O8L41O63N48j30o58k75k63k67j62l12k45M03L39n8
$$ -1679 -1754 -1536 -1446 -1508 -1632 -1591 -1747 -1682 -1299 -1252 -1184 -843 -180 368 238 -420 -695 -958 -1225 -1387 -1699 -1944 -1541 -1202 -1260
-14003a260N8n4m7P0k31l58J4L78K40r5n86j25K54J44K61M19M98J98J43m09l33k41j80r6k4
$$ -1260 -1202 -1256 -1303 -1233 -1464 -1822 -1808 -1430 -1190 -1285 -1871 -1996 -1742 -1598 -1337 -918 -420 -222 -79 -488 -821 -1062 -1242 -1338 -1362
-13978a362K75L64n9j52J55J87k3M11K50l63j68j03l35j61m8k03J42L03K09J10P4L89J72m63
$$ -1362 -1087 -723 -782 -934 -779 -592 -615 -204 46 -317 -485 -588 -923 -1084 -1132 -1335 -1193 -890 -681 -571 -497 -108 64 -399
-13954c99o12l11j44Q7j22l28m09j60M3J84L72O5P6N89L20j51k33R1l6k18M6M4K06N67M77
$$ -399 -1011 -1322 -1466 -1379 -1501 -1829 -2238 -2398 -2355 -2171 -1799 -1734 -1658 -1069 -749 -900 -1133 -1042 -1078 -1296 -1250 -1206 -1000 -433 44
-13929D4l88o94k18J87K25N71M78m01m90j78K17L43L04j81l46J15l5j60K12J80J36j10m37
$$ 44 -344 -1038 -1256 -1069 -844 -273 205 -196 -686 -864 -647 -304 0 -181 -527 -412 -447 -607 -395 -215 -79 -189 -626
-13906f26k81n09k78M48M21j60l42o1L00K22L25M06J04l14l36j01n5j23R2K67K11k7q0L31
$$ -626 -907 -1416 -1694 -1246 -825 -985 -1327 -1388 -1088 -866 -541 -135 -31 -345 -681 -782 -837 -960 -868 -601 -390 -417 -497 -166
-13882a66K22m56m34J04J40j37r1J41k51n69l0L92N41P65M64N5j61m29l20k71k49p4K31L22
$$ -166 56 -400 -834 -730 -590 -727 -818 -677 -928 -1497 -1527 -1135 -594 171 635 690 529 100 -220 -491 -740 -814 -583 -261
-13858b61R8j69l87l28R5K89j19k83l11q3K42J33k1j48k05l0o4k1N9k29o3K51nq8J60J8pK44
$$ -261 -163 -332 -719 -1047 -952 -663 -782 -1065 -1376 -1459 -1217 -1084 -1105 -1253 -1458 -1488 -1552 -1573 -1514 -1743 -1806 -1555 -1560 -1648 -1488 -1470 -1477 -1233
-13830a233J76o4k15J49O2j84l8L13K26j30m5R4j71J00J00l64j79K1j96k00J32l4k78k55J46
$$ -1233 -1057 -1121 -1336 -1187 -1125 -1309 -1347 -1034 -808 -938 -983 -889 -1060 -960 -860 -1224 -1403 -1382 -1578 -1778 -1646 -1680 -1958 -2213 -2067
-13805b067K55M39M56J34J72K51l44l68k97m67J00J77j5J02N0J1j54pJ71k96j87k79m08L10
$$ -2067 -1812 -1373 -917 -783 -611 -360 -704 -1072 -1369 -1836 -1736 -1559 -1574 -1472 -1422 -1411 -1565 -1572 -1401 -1697 -1884 -2163 -2571 -2261
-13781b261Q98J019N85l43k75J04l6Q4k64n83j23J83R9L8K25J41K22P9J32j19o30n44j08P4
$$ -2261 -1363 -344 241 -102 -377 -273 -309 -225 -489 -1072 -1195 -1012 -913 -875 -650 -509 -287 -208 -76 -195 -825 -1369 -1477 -1403
-13757a403M7k7K36J89n4J9M9k15l79M1L00K25n1n26n83j91J85K32j83j32j51lK73L02K66
$$ -1403 -1356 -1383 -1147 -958 -1012 -993 -944 -1159 -1538 -1497 -1197 -972 -1023 -1549 -2132 -2323 -2138 -1906 -2089 -2221 -2372 -2375 -2102 -1800 -1534
-13732a534J01k48n1J68J12R6J43M14O09J13l29j37k2j72j29j81j75k41j15J01n2M3j07k28
$$ -1534 -1433 -1681 -1732 -1564 -1452 -1356 -1213 -799 -190 -77 -406 -543 -565 -737 -866 -1047 -1222 -1463 -1578 -1477 -1529 -1486 -1593 -1821
-13708a821j43J8J70L05N99mk38J47J31k08j91L9K37ln3j2m1q7j38l71k39L3M51L46J25k45
$$ -1821 -1964 -1946 -1776 -1471 -872 -876 -1114 -967 -836 -1044 -1235 -1196 -959 -962 -1015 -1027 -1068 -1155 -1293 -1664 -1903 -1870 -1419 -1073 -948 -1193
-13682a193k04J65K54K76K09M9j03l58k92m8j2j46J59J94Lq3k70j70P2M30k42n29k39n2L59
$$ -1193 -1397 -1232 -978 -702 -493 -444 -547 -905 -1197 -1245 -1257 -1403 -1244 -1050 -1047 -1130 -1400 -1570 -1498 -1068 -1310 -1839 -2078 -2130 -1771
-13657a771N16L89K0k30k46P6o1m80k9N39K6J25L55R6P1O93J82k53k7Q5k81n24m98l3J61j26
$$ -1771 -1255 -866 -846 -1076 -1322 -1246 -1307 -1787 -1816 -1277 -1251 -1126 -771 -675 -604 89 271 18 -9 76 -205 -729 -1227 -1260 -1099 -1225
-13631a225j67qJ21J31k03l33r8J14M42M19J8r6J24j45J4l37k14K58K31r6j78rJ81n6Pj40
$$ -1225 -1392 -1400 -1279 -1148 -1351 -1684 -1782 -1668 -1226 -807 -789 -885 -761 -906 -892 -1229 -1443 -1185 -954 -1050 -1228 -1237 -1056 -1112 -1105 -1245
-13605a245m33J00N30L21r6m23l65N8J71p5J52L50P3m37m41J11K70j2k45M9o1j42J67M73J61
$$ -1245 -1678 -1578 -1048 -727 -823 -1246 -1611 -1553 -1382 -1457 -1305 -955 -882 -1319 -1760 -1649 -1379 -1391 -1636 -1587 -1648 -1790 -1623 -1150 -989
-13580i89n23k95K7k9n6P4K18L61N8j28k3M9M96K69K34K40k18k08l6k05k66j35k62K6J42j26
$$ -989 -1512 -1807 -1780 -1809 -1865 -1791 -1573 -1212 -1154 -1282 -1305 -1256 -760 -491 -257 -17 -235 -443 -479 -684 -950 -1085 -1347 -1321 -1179 -1305
-13554a305Q1L1P8P9k34k67l17k45J13K22J95J49R3j99j45R8K41J25O6M34J81j36j70P1J03
$$ -1305 -1224 -1193 -1115 -1036 -1270 -1537 -1854 -2099 -1986 -1764 -1569 -1420 -1327 -1526 -1671 -1573 -1332 -1207 -1141 -707 -526 -662 -832 -761 -658
-13529f58l7k6n3l89l20o4j01L26k1m73o9J03J3J7L00kn32K1L23J64J61K7q4K17N6j46k69
$$ -658 -695 -721 -774 -1163 -1483 -1547 -1648 -1322 -1343 -1816 -1885 -1782 -1769 -1752 -1452 -1454 -1986 -1965 -1642 -1478 -1317 -1290 -1374 -1157 -1101 -1247 -1516
-13502a516j35k60j37k8j65J67L77J1l43j31M23K77Q1J1j60k93J80O9Q3L45J26j9l11j7O5
$$ -1516 -1651 -1911 -2048 -2076 -2241 -2074 -1697 -1686 -2029 -2160 -1737 -1460 -1379 -1368 -1528 -1821 -1641 -1572 -1489 -1144 -1018 -1037 -1348 -1365 -1300
-13477a300j2O6p5J72J07l29m75q4K09M4k3l12n9M49L29J6QJ48n2k74J9P7r8o7J47J09k3P2
$$ -1300 -1312 -1246 -1321 -1149 -1042 -1371 -1846 -1930 -1721 -1677 -1700 -2012 -2071 -1622 -1293 -1277 -1269 -1121 -1173 -1447 -1428 -1351 -1449 -1516 -1369 -1260 -1283 -1211
-13449a211r2m90l28K7j39l87qk8m66o8L23M16N66N39J40p1j85k41k34k54Q3L3r9N4RJ48K56
$$ -1211 -1303 -1793 -2121 -2094 -2233 -2620 -2628 -2656 -3122 -3190 -2867 -2451 -1885 -1346 -1206 -1277 -1462 -1703 -1937 -2191 -2108 -2075 -2174 -2120 -2111 -1963 -1707
-13422a707K2P2j66q1J94j10l68Q5J94R6P8r6J48P2n7J50k40k28j85k63m48L3M86L50K97L19
$$ -1707 -1685 -1613 -1779 -1860 -1666 -1776 -2144 -2059 -1865 -1769 -1691 -1787 -1639 -1567 -1624 -1474 -1714 -1942 -2127 -2390 -2838 -2805 -2319 -1969 -1672 -1353
-13396a353k65l02o7J24J80L18o7o1J99L68m17o74j76J79K20M19L70k07l75JQ3k01p3J35n
$$ -1353 -1618 -1920 -1987 -1863 -1683 -1365 -1432 -1493 -1294 -926 -1343 -2017 -2193 -2014 -1794 -1375 -1005 -1212 -1587 -1586 -1503 -1704 -1777 -1642 -1647
-13371a647q0MR4k40k54k92k11K89J52K8M66K17m4J6m23j81l0m5j61k09K0j25K10M19L3k17
$$ -1647 -1727 -1723 -1629 -1869 -2123 -2415 -2626 -2337 -2185 -2157 -1691 -1474 -1518 -1502 -1925 -2106 -2136 -2181 -2342 -2551 -2531 -2656 -2446 -2027 -1994 -2211
-13345b211qk03k32M04N47J3l45K6N03K73j60j39%J35K42O3j32l35j29n7o8l9o9l65n72J29
$$ -2211 -2219 -2422 -2654 -2250 -1703 -1690 -2035 -2009 -1506 -1233 -1393 -1532 -1532 -1397 -1155 -1092 -1224 -1559 -1688 -1745 -1813 -1852 -1921 -2286 -2858 -2729
-13319b729N83O34L81j24m74l03n7j18l10l36k39j63M19P04N23K57m3m05j99m23k45rN1j93
$$ -2729 -2146 -1512 -1131 -1255 -1729 -2032 -2089 -2207 -2517 -2853 -3092 -3255 -2836 -2132 -1609 -1352 -1395 -1800 -1999 -2422 -2667 -2676 -2625 -2818
-13295b818p0O02M00j52k53l14l24l2l00k12J53j49k58lk0m88l08k21j49M26j6k82j05j1q2
$$ -2818 -2888 -2286 -1886 -2038 -2291 -2605 -2929 -2961 -3261 -3473 -3320 -3469 -3727 -3730 -3750 -4238 -4546 -4767 -4916 -4490 -4506 -4788 -4893 -4904 -4986
-13270d986J5k12n55n25o30L4N64P74J569K654L084K133P64k39p51p61m84l41k89J32J21j54
$$ -4986 -4971 -5183 -5738 -6263 -6893 -6859 -6295 -5521 -3952 -1298 1786 3919 4683 4444 3693 2932 2448 2107 1818 1950 2071 1917
-13248A917j01j46L22L73k44k90o0k32j44K29J64O5mk75o91r72k59K6j67J2L93J34m2k04m72
$$ 1917 1816 1670 1992 2365 2121 1831 1771 1539 1395 1624 1788 1853 1849 1574 883 -89 -348 -322 -489 -477 -84 50 8 -196 -668
-13223f68k37L3L54L33k50k8J24n6o8j27k30j8K46nj91K2L52L83Rj40K68j58n77k62J87m6
$$ -668 -905 -872 -518 -185 -435 -463 -339 -395 -463 -590 -820 -838 -592 -597 -788 -766 -414 -31 -22 -162 106 -52 -629 -891 -704 -750
-13197g50m92j64K31M91N09j7k74k16N3l51p56j31M17L93L03L81J88k87n52j87L35K70o4j88
$$ -750 -1242 -1406 -1175 -684 -175 -192 -466 -682 -629 -980 -1736 -1867 -1450 -1057 -754 -373 -185 -472 -1024 -1211 -876 -606 -670 -858
-13173h58k13k42k65J59K47j20R3J4l38k21M99N62k71o28P3rN1L78R4q5k31R6J56J96l61l25
$$ -858 -1071 -1313 -1578 -1419 -1172 -1292 -1199 -1185 -1523 -1744 -1245 -683 -954 -1582 -1509 -1518 -1467 -1089 -995 -1080 -1311 -1215 -1059 -863 -1224 -1549
-13147a549L0J48J46N9O8J09L2J33K57k6k88j46J18m3Q2J97J22l05m17l68p3p9m6J79J94L42
$$ -1549 -1519 -1371 -1225 -1166 -1098 -989 -957 -824 -567 -593 -881 -1027 -909 -952 -870 -673 -551 -856 -1273 -1641 -1714 -1793 -1839 -1660 -1466 -1124
-13121a124L10K95K61l6k64j00k53j38j2k88K28J00J3K47M3j53Qm1m06k74j78p7j56j08M2
$$ -1124 -814 -519 -258 -294 -558 -658 -911 -1049 -1061 -1349 -1121 -1021 -1008 -761 -718 -871 -863 -904 -1310 -1584 -1762 -1839 -1995 -2103 -2061
-13096b061M10P23O76L4j77m02k82L8J34L4k25l74K00K66m43m50N8M06M82o0l41j27L25K00
$$ -2061 -1651 -928 -252 -218 -395 -797 -1079 -1041 -907 -873 -1098 -1472 -1272 -1006 -1449 -1899 -1841 -1435 -953 -1013 -1354 -1481 -1156 -956
-13072i56k83j39K48R8%k0m8M9K11L4k24j37j94O1j31j62K6J39L14L73Q1J07K13L87O1o14
$$ -956 -1239 -1378 -1130 -1032 -1032 -1052 -1100 -1051 -840 -806 -1030 -1167 -1361 -1300 -1431 -1593 -1567 -1428 -1114 -741 -660 -553 -340 47 108 -506
-13046e06o68j70o3L4p3k35K93J46O8K42P1l14k93j91P4J54k9N3M58J41k25n8K5r0N9j85K41
$$ -506 -1174 -1344 -1407 -1373 -1446 -1681 -1388 -1242 -1174 -932 -861 -1175 -1468 -1659 -1585 -1431 -1460 -1407 -949 -808 -1033 -1091 -1066 -1156 -1097 -1282 -1041
-13019a041K91l20n29k94RN33K43M8r7j61J16jl34J12P01N18M1m78r9K48j41k93J96M08J88
$$ -1041 -750 -1070 -1599 -1893 -1884 -1351 -1108 -1060 -1157 -1318 -1202 -1203 -1537 -1425 -724 -206 -165 -643 -742 -494 -635 -928 -732 -324 -136
-12994a36rl29l81j63l19l01l0K63L22K48L90O70p7o80m68k97l46k81O3J6L92K47j48M4J44
$$ -136 -145 -474 -855 -1018 -1337 -1638 -1668 -1405 -1083 -835 -445 225 148 -532 -1000 -1297 -1643 -1924 -1861 -1845 -1453 -1206 -1354 -1310 -1166
-12969a166J18M33k5k15l90l64oj08j4O0R0P0R4K76L19j61k45m0M4k0K34K17P4r3l49J15N59
$$ -1166 -1048 -615 -640 -855 -1245 -1609 -1615 -1723 -1737 -1677 -1587 -1517 -1423 -1147 -828 -989 -1234 -1274 -1230 -1250 -1016 -799 -725 -818 -1167 -1052 -493
-12942d93O09N8m93l58k65k56M0l9J14J84r5l60O4O1l24J7R7MJ57k42l48K15L30L85L58J2
$$ -493 116 174 -319 -677 -942 -1198 -1158 -1197 -1083 -899 -994 -1354 -1290 -1229 -1553 -1536 -1439 -1435 -1278 -1520 -1868 -1653 -1323 -938 -580 -568
-12916e68k98j67j16n7q4r7J25J91j0lN5l57K7L85j04k44r9L1K5Q9L24Pl47k78l56J2L57K20
$$ -568 -866 -1033 -1149 -1206 -1290 -1387 -1262 -1071 -1081 -1084 -1029 -1386 -1359 -974 -1078 -1322 -1421 -1390 -1365 -1276 -952 -945 -1292 -1570 -1926 -1914 -1557 -1337
-12888a337J05r3k20L7J90k00j44M38R0k17p4R1j5k53m43j11K58J54J23j85l44j40Q4N38M76
$$ -1337 -1232 -1325 -1545 -1508 -1318 -1518 -1662 -1224 -1134 -1351 -1425 -1334 -1349 -1602 -2045 -2156 -1898 -1744 -1621 -1806 -2150 -2290 -2206 -1668 -1192
-12863a192K19J01k97k63j43L6Q7J73O0j82n60m99K94K95j3R8K6L9Q8K94K39q1k74p2l7j50
$$ -1192 -973 -872 -1169 -1432 -1575 -1539 -1452 -1279 -1219 -1401 -1961 -2460 -2166 -1871 -1884 -1786 -1760 -1721 -1633 -1339 -1100 -1181 -1455 -1527 -1564 -1714
-12837a714m4R9J35K7k6p0j10k31l0K18L67L93k03n61n47RK99n0k20j14K09J94M74K46l05
$$ -1714 -1758 -1659 -1524 -1497 -1523 -1593 -1703 -1934 -1964 -1746 -1379 -986 -1189 -1750 -2297 -2288 -1989 -2039 -2259 -2373 -2164 -1970 -1496 -1250 -1555
-12812a555l95l35r3K42J56J30k7j95o2l5p2n7J53K22M06K65q8m4p8k74l36l6M39K29j20n9
$$ -1555 -1950 -2285 -2378 -2136 -1980 -1850 -1877 -2072 -2134 -2169 -2241 -2298 -2145 -1923 -1517 -1252 -1340 -1384 -1462 -1736 -2072 -2108 -1669 -1440 -1560 -1619
-12786a619p5k04J2P1N8J32L13N56M44j0o75q99m03L6J23n8q7j5l09M4L01L37L22N7o7J45
$$ -1619 -1694 -1898 -1886 -1815 -1757 -1625 -1312 -756 -312 -322 -997 -1896 -2299 -2263 -2140 -2198 -2285 -2300 -2609 -2565 -2264 -1927 -1605 -1548 -1615 -1470
-12760a470M4k11j79L80M26J80k58k87k12l50q6J33L44m3l48k68q3kK9J78K33j36p4K60k3
$$ -1470 -1426 -1637 -1816 -1436 -1010 -830 -1088 -1375 -1587 -1937 -2023 -1890 -1546 -1589 -1937 -2205 -2288 -2290 -2261 -2083 -1850 -1986 -2060 -1800 -1823
-12735a823J55K83K01J90Jq5k07qK67K22ll79m18m21j59L10N68L03J63l8r5k63k10j53L1J24
$$ -1823 -1668 -1385 -1184 -994 -993 -1078 -1285 -1293 -1026 -804 -807 -1186 -1604 -2025 -2184 -1874 -1306 -1003 -840 -878 -973 -1236 -1446 -1599 -1568 -1444
-12709a444P7m3N7jj74k32j26p1j7K9J96O3n0J23J31J33Mj02L36J54l88o51j20J13J72M1J20
$$ -1444 -1367 -1410 -1353 -1354 -1528 -1760 -1886 -1957 -1974 -1945 -1749 -1686 -1736 -1613 -1482 -1349 -1345 -1447 -1111 -957 -1345 -1996 -2116 -2003 -1831 -1790 -1670
-12682a670j52m88j62J0R0N09M99j64k02k2m7O3p3l00k52M1M23N42M86P5k43m68n62l50r8
$$ -1670 -1822 -2310 -2472 -2462 -2372 -1863 -1364 -1528 -1730 -1752 -1799 -1736 -1809 -2109 -2361 -2320 -1897 -1355 -869 -794 -1037 -1505 -2067 -2417 -2515
-12657b515lL09J39j06L04K00P8Q8p9j73j17K47M61L86K15m6m27m81n65r5N23L08P5q7l61
$$ -2515 -2518 -2209 -2070 -2176 -1872 -1672 -1594 -1506 -1585 -1758 -1875 -1628 -1167 -781 -566 -612 -1039 -1520 -2085 -2180 -1657 -1349 -1274 -1361 -1722
-12632a722k07L44K62j91j9R4O2Nk53o04l50K62K64K4jK40L35K94m8k26n6R2k9m03n20j28
$$ -1722 -1929 -1585 -1323 -1514 -1533 -1439 -1377 -1372 -1625 -2229 -2579 -2317 -2053 -2029 -2030 -1790 -1455 -1161 -1209 -1435 -1491 -1399 -1428 -1831 -2351 -2479
-12606b479R6Q6j8l8L13K88K0J55J38k0m88l60L03j78l36L13K92O5K40J76K73K26j78o49n00
$$ -2479 -2383 -2297 -2315 -2353 -2040 -1752 -1732 -1577 -1439 -1459 -1947 -2307 -2004 -2182 -2518 -2205 -1913 -1848 -1608 -1432 -1159 -933 -1111 -1760 -2260
-12581b260k22M1M83M77j78l55j93j50O4J21n9n7N00L92j45j12j19n94l51J79M26M90L61J24
$$ -2260 -2482 -2441 -1958 -1481 -1659 -2014 -2207 -2357 -2293 -2172 -2231 -2288 -1788 -1396 -1541 -1653 -1772 -2366 -2717 -2538 -2112 -1622 -1261 -1137
-12557a137k43k71j23m4J71J18J74jm63k79k5K2K55J90l45m41k28j85o5J07L29M11N1o0J7
$$ -1137 -1380 -1651 -1774 -1818 -1647 -1529 -1355 -1356 -1819 -2098 -2123 -2101 -1846 -1656 -2001 -2442 -2670 -2855 -2920 -2813 -2484 -2073 -2022 -2082 -2065
-12532b065k31j25L91L76O2n4l41m81L5K02K49j81L5M09j77l91O1J67K49j49m17j62l21p8
$$ -2065 -2296 -2421 -2030 -1654 -1592 -1646 -1987 -2468 -2433 -2231 -1982 -2163 -2128 -1719 -1896 -2287 -2226 -2059 -1810 -1959 -2376 -2538 -2859 -2937
-12508b937K1J29N47N81N35R4j51j74m5J48j20m19n1K76J33j07k51J71J04r8l8k88P1N9m9
$$ -2937 -2916 -2787 -2240 -1659 -1124 -1030 -1181 -1355 -1400 -1252 -1372 -1791 -1842 -1566 -1433 -1540 -1791 -1620 -1516 -1614 -1652 -1940 -1869 -1810 -1859
-12483a859l9k38k92k47j11K03L17N30L90n1m1j28J74O5j58J59J39K55jk46k52l34j80K14
$$ -1859 -1898 -2136 -2428 -2675 -2786 -2583 -2266 -1736 -1346 -1397 -1438 -1566 -1392 -1327 -1485 -1326 -1187 -932 -933 -1179 -1431 -1765 -1945 -1731
-12459a731j06m19n36l17K66L21K96N57K45L0j30k52k7o3j75j85jM4J17R2J15K88K55K09M8
$$ -1731 -1837 -2256 -2792 -3109 -2843 -2522 -2226 -1669 -1424 -1394 -1524 -1776 -1803 -1866 -2041 -2226 -2227 -2183 -2066 -1974 -1859 -1571 -1316 -1107 -1059
-12434a059k26q8K2k64k33k54o19l57J62O72O42J60k80m37l39P4M54L68m9n16m12J48K69K38
$$ -1059 -1285 -1373 -1351 -1615 -1848 -2102 -2721 -3078 -2916 -2244 -1602 -1442 -1722 -2159 -2498 -2424 -1970 -1602 -1651 -2167 -2579 -2431 -2162 -1924
-12410a924L29L0j66l16L8L44k3m60k93j3K90J1l22q2P6j30k63K1K69J98j06j83k70m7K27
$$ -1924 -1595 -1565 -1731 -2047 -2009 -1665 -1688 -2148 -2441 -2454 -2164 -2153 -2475 -2557 -2481 -2611 -2874 -2853 -2584 -2386 -2492 -2675 -2945 -2992 -2765
-12385b765L41K79n7J08P4j0Q7J92N7j62k49l62m29n9k17m69J07K97M21L16J40q0k44j04M4
$$ -2765 -2424 -2145 -2202 -2094 -2020 -2030 -1943 -1751 -1694 -1856 -2105 -2467 -2896 -2955 -3172 -3641 -3534 -3237 -2816 -2500 -2360 -2440 -2684 -2788 -2744
-12360b744m8K47J67mK02J14L16L25k68l67j23L6k36M2K04j57k73j09J28L77J67r7j38K81
$$ -2744 -2792 -2545 -2378 -2382 -2180 -2066 -1750 -1425 -1693 -2060 -2183 -2147 -2383 -2341 -2137 -2294 -2567 -2676 -2548 -2171 -2004 -2101 -2239 -1958
-12336a958L68O9j78j82K39J29l21j74J5J40j24k62o4O0j03r9J35J91L2p5j81J06L74J6N2
$$ -1958 -1590 -1521 -1699 -1881 -1642 -1513 -1834 -2008 -1993 -1853 -1977 -2239 -2303 -2243 -2346 -2445 -2310 -2119 -2087 -2162 -2343 -2237 -1863 -1847 -1795
-12311a795J2n8o3k11k91o40m14P3N6nJ9J74L68K75K82K52j27p6K87L03J34k19n68k61J25
$$ -1795 -1783 -1841 -1904 -2115 -2406 -3046 -3460 -3387 -3331 -3336 -3317 -3143 -2775 -2500 -2218 -1966 -2093 -2169 -1882 -1579 -1445 -1664 -2232 -2493 -2368
-12286b368K44L11n1j54l06k04K47K24j32k1N14N17J60J12J30m9j48n58o83j26O1m31k77M1
$$ -2368 -2124 -1813 -1864 -2018 -2324 -2528 -2281 -2057 -2189 -2210 -1696 -1179 -1019 -907 -777 -826 -974 -1532 -2215 -2341 -2280 -2711 -2988 -2947
-12262b947J40J1Q1K73J27N5P9r8k92n28j51J94J93J78K43q8M2K68K27l6m63m70o0L82L81
$$ -2947 -2807 -2796 -2715 -2442 -2315 -2260 -2181 -2279 -2571 -3099 -3250 -3056 -2863 -2685 -2442 -2530 -2488 -2220 -1993 -2029 -2492 -2962 -3022 -2640 -2259
-12237b259N8j18R6J31L7j12k63k07J88P5l61m49mK02K82K69M99M87J41Q2n09o45k44M64K72
$$ -2259 -2201 -2319 -2223 -2092 -2055 -2167 -2430 -2637 -2449 -2374 -2735 -3184 -3188 -2986 -2704 -2435 -1936 -1449 -1308 -1226 -1735 -2380 -2624 -2160 -1888
-12212a888p8j09K4j39J00J01j86Q3K14P6j69o4J10o4k50m33l17J24K39J56L12J12j78l99
$$ -1888 -1966 -2075 -2051 -2190 -2090 -1989 -2175 -2092 -1878 -1802 -1971 -2035 -1925 -1989 -2239 -2672 -2989 -2865 -2626 -2470 -2158 -2046 -2224 -2623
-12188b623k51K1L19K46p1j77J30K32K00k32o63m74J80L79L6l7P8L19n7p3R1o3m38LK87L65
$$ -2623 -2874 -2853 -2534 -2288 -2359 -2536 -2406 -2174 -1974 -2206 -2869 -3343 -3163 -2784 -2748 -2785 -2707 -2388 -2445 -2518 -2427 -2490 -2928 -2925 -2638 -2273
-12162b273J57j6K46K26r8k62k28k06n1o7kJ47J78K70j54l03j21K2J83o1p1o8j13k8L9N4m9
$$ -2273 -2116 -2132 -1886 -1660 -1758 -2020 -2248 -2454 -2505 -2572 -2574 -2427 -2249 -1979 -2133 -2436 -2557 -2535 -2352 -2413 -2484 -2552 -2665 -2693 -2654 -2600 -2649
-12135b649l74l22J15K49N93O96r8n90k62j06k11L32J46k01k19j87q0L2Km12l2L89O87M91
$$ -2649 -3023 -3345 -3230 -2981 -2388 -1692 -1790 -2380 -2642 -2748 -2959 -2627 -2481 -2682 -2901 -3088 -3168 -3136 -3134 -3546 -3578 -3189 -2502 -2011
-12111b011j77p4k76n29j20L02L24R1M4L48J97m19m66k51J34M52lm26L7p8j34j15lL15M10
$$ -2011 -2188 -2262 -2538 -3067 -3187 -2885 -2561 -2470 -2426 -2078 -1881 -2300 -2766 -3017 -2883 -2431 -2434 -2860 -2823 -2901 -3035 -3150 -3153 -2838 -2428
-12086b428Qk61q9k76j29j92m15j6L10K02K61r3k73J3P9J64J14j18l02K64N71J52J4k15j68
$$ -2428 -2420 -2681 -2770 -3046 -3175 -3367 -3782 -3798 -3488 -3286 -3025 -3118 -3391 -3378 -3299 -3135 -3021 -3139 -3441 -3177 -2606 -2454 -2440 -2655 -2823
-12061b823j04k28k3q9N2L44L32j14K26L11M68M21k25m62n92o98m02J99K54K21O7O4J06j19
$$ -2823 -2927 -3155 -3178 -3267 -3215 -2871 -2539 -2653 -2427 -2116 -1648 -1227 -1452 -1914 -2506 -3204 -3606 -3407 -3153 -2932 -2865 -2801 -2695 -2814
-12037b814p2q9N0R4J50p0l22N5K26j10n70o1J30J29J16J45M12n9l27k99j24K04M33J60l07
$$ -2814 -2886 -2975 -2925 -2831 -2681 -2751 -3073 -3018 -2792 -2902 -3472 -3533 -3403 -3274 -3158 -3013 -2601 -2660 -2987 -3286 -3410 -3206 -2773 -2613 -2920
-12012b920j9L26K59J49j20k72k05o7k00k32J19L61M03l8j88j46j1J01Q3M3J13L37K91J86
$$ -2920 -2939 -2613 -2354 -2205 -2325 -2597 -2802 -2869 -3069 -3301 -3182 -2821 -2418 -2456 -2644 -2790 -2801 -2700 -2617 -2574 -2461 -2124 -1833 -1647
-11988a647m6k31k42j00p2j2m4N8K46k42l47n4K19L77J00r%k81j78j09L2J64n3m27l52K92
$$ -1647 -1693 -1924 -2166 -2266 -2338 -2350 -2394 -2336 -2090 -2332 -2679 -2733 -2514 -2137 -2037 -2046 -2046 -2327 -2505 -2614 -2582 -2418 -2471 -2898 -3250 -2958
-11962b958J93KK33p5m14k33l33l01N8K69M06L85N26K36j24l5p2l60n22l44q3M66N09p0r2
$$ -2958 -2765 -2763 -2530 -2605 -3019 -3252 -3585 -3886 -3828 -3559 -3153 -2768 -2242 -2006 -2130 -2165 -2237 -2597 -3119 -3463 -3546 -3080 -2571 -2641 -2733
-11937b733j82n05m01O0jQ7M44L54Q8j00K43L55j2k83l90l31l52k20pK41L06J90J97j77l40
$$ -2733 -2915 -3420 -3821 -3761 -3762 -3675 -3231 -2877 -2789 -2889 -2646 -2291 -2303 -2586 -2976 -3307 -3659 -3879 -3886 -3645 -3339 -3149 -2952 -3129 -3469
-11912c469j28L39K50O1l34L9K71L0m8M7l56q5M61j17k94K20J97k35k33pn3j88k0L80K32J23
$$ -3469 -3597 -3258 -3008 -2947 -3281 -3242 -2971 -2941 -2989 -2942 -3298 -3383 -2922 -3039 -3333 -3113 -2916 -3151 -3384 -3391 -3444 -3632 -3652 -3272 -3040 -2917
-11886b917k33j0K09j24j69j02p69l48L77M20M41J71J92k21l91n8p7j12J12K30K59K49J60
$$ -2917 -3150 -3160 -2951 -3075 -3244 -3346 -4115 -4463 -4086 -3666 -3225 -3054 -2862 -3083 -3474 -3532 -3609 -3721 -3609 -3379 -3120 -2871 -2711
-11863b711k50l23k60k71j99J0J62N4l43l38K57O27L93rj89j0K61j27q0j3j07o3oL23L34L00
$$ -2711 -2961 -3284 -3544 -3815 -4014 -4004 -3842 -3788 -4131 -4469 -4212 -3585 -3192 -3201 -3390 -3400 -3139 -3266 -3346 -3359 -3466 -3529 -3535 -3212 -2878 -2578
-11837b578K81N1j74Q2J04K0L0j95k87M0L10jm79j09L81R6oK64K08R2l58p96l51J76L98L21
$$ -2578 -2297 -2246 -2420 -2338 -2234 -2214 -2184 -2379 -2666 -2626 -2316 -2317 -2796 -2905 -2524 -2428 -2434 -2170 -1962 -1870 -2228 -3024 -3375 -3199 -2801 -2480
-11811b480j12j81K4Pk6M3j20k91J36K17l6l10l67k07J6j16o5q0l5P0J41M21J03m58o29j20
$$ -2480 -2592 -2773 -2749 -2742 -2768 -2725 -2845 -3136 -3000 -2783 -2819 -3129 -3496 -3703 -3687 -3803 -3868 -3948 -3983 -3913 -3772 -3351 -3248 -3706 -4335 -4455
-11785d455N67L94K74L71J70l92k59l49m86L04N34L12k37j23L57j67k62K43K07J77qm66j11
$$ -4455 -3888 -3494 -3220 -2849 -2679 -3071 -3330 -3679 -4165 -3861 -3327 -3015 -3252 -3375 -3018 -3185 -3447 -3204 -2997 -2820 -2828 -3294 -3405
-11762c405J86j27n97o34k10J69N93J67l26k66J15J30K04K36Mq2r7k43k58k8j1j75l6j0Q2
$$ -3405 -3219 -3346 -3943 -4577 -4787 -4618 -4025 -3858 -4184 -4450 -4335 -4205 -4001 -3765 -3761 -3843 -3940 -4183 -4441 -4469 -4480 -4655 -4691 -4701 -4619
-11737d619K29K63J69L7l05k12L39M87kl81m44J51K50J9m15j03L69M25j62k92J38J40mj00
$$ -4619 -4390 -4127 -3958 -3921 -4226 -4438 -4099 -3612 -3614 -3995 -4439 -4288 -4038 -4019 -4434 -4537 -4168 -3743 -3905 -4197 -4059 -3919 -3923 -4023
-11713d023M2L43K34k67m74l09L18M38K50L29L5J25j20l30m47n3N29L20j43j72j57o76q0j0
$$ -4023 -3981 -3638 -3404 -3671 -4145 -4454 -4136 -3698 -3448 -3119 -3084 -2959 -3079 -3409 -3856 -3909 -3380 -3060 -3203 -3375 -3532 -4208 -4288 -4298
-11689d298l24J39K28j54m7L04N48J30j85p6j62j33M6J92K88J49m14n38L8M74n9n58m87k02
$$ -4298 -4622 -4483 -4255 -4409 -4456 -4152 -3604 -3474 -3659 -3735 -3897 -4030 -3984 -3792 -3504 -3355 -3769 -4307 -4269 -3795 -3854 -4412 -4899 -5101
-11665e101n8J85M90N63K3k06l49k43N0K04N04L87j5k74l60k70k37j42j2K22J08K43N47J53
$$ -5101 -5159 -4974 -4484 -3921 -3898 -4104 -4453 -4696 -4646 -4442 -3938 -3551 -3566 -3840 -4200 -4470 -4707 -4849 -4861 -4639 -4531 -4288 -3741 -3588
-11641c588k45k34mk99m25k54n1N74J93k39n11o67j77O9K9M98M07m1n7p1p8M82M55R7k29p12
$$ -3588 -3833 -4067 -4071 -4370 -4795 -5049 -5100 -4526 -4333 -4572 -5083 -5750 -5927 -5858 -5829 -5331 -4924 -4965 -5022 -5093 -5171 -4689 -4234 -4137 -4366 -5078
-11615e078m97l70K65O77L94J00j50l17M1L73L63Q5P3K59Q3K96r6n91l16k63l33OL74K32k29
$$ -5078 -5575 -5945 -5680 -5003 -4609 -4509 -4659 -4976 -4935 -4562 -4199 -4114 -4041 -3782 -3699 -3403 -3499 -4090 -4406 -4669 -5002 -4996 -4622 -4390 -4619
-11590d619j70K97J43k80M1J11r7k0l47k69J0l82l91n3k48K46O40J62Q4K33j24j69j75K2K30
$$ -4619 -4789 -4492 -4349 -4629 -4588 -4477 -4574 -4594 -4941 -5210 -5200 -5582 -5973 -6026 -6274 -6028 -5388 -5226 -5142 -4909 -5033 -5202 -5377 -5355 -5125
-11565e125O2N8j12k2J27k46o7k53k49K15O8J31M38K86O8j69j29O7J21k74r0M81r8k38j75
$$ -5125 -5063 -5005 -5117 -5139 -5012 -5258 -5325 -5578 -5827 -5612 -5544 -5413 -4975 -4689 -4621 -4790 -4919 -4852 -4731 -5005 -5095 -4614 -4712 -4950 -5125
-11540e125j44Q4k53m52m58m07j39n4K45L31N5J3K24J63K05L79K49m7p6j59%j15k89K7K32
$$ -5125 -5269 -5185 -5438 -5890 -6348 -6755 -6894 -6948 -6703 -6372 -6317 -6304 -6080 -5917 -5712 -5333 -5084 -5131 -5207 -5366 -5366 -5481 -5770 -5743 -5511
-11515e511P4L55N75n10o35J99L87Km08J64N44j15m93r9J22k66l32J49K80r0j13k48J44L68
$$ -5511 -5437 -5082 -4507 -5017 -5652 -5453 -5066 -5064 -5472 -5308 -4764 -4879 -5372 -5471 -5349 -5615 -5947 -5798 -5518 -5608 -5721 -5969 -5825 -5457
-11491e457m4J0k11k89J49m5j39J59J57n9k92j83%QR4K9m4O8nN3M82L39j21l22J20K22l98
$$ -5457 -5501 -5491 -5702 -5991 -5842 -5887 -6026 -5867 -5710 -5769 -6061 -6244 -6244 -6236 -6142 -6113 -6157 -6089 -6094 -6041 -5559 -5220 -5341 -5663 -5543 -5321 -5719
-11464e719m25j85M5J68k7k34OK97J42k75j78j52m03J04K74O6K98M6m11k88k6L69L94K21j93
$$ -5719 -6144 -6329 -6284 -6116 -6143 -6377 -6371 -6074 -5932 -6207 -6385 -6537 -6940 -6836 -6562 -6496 -6198 -6152 -6563 -6851 -6877 -6508 -6114 -5893 -6086
-11439f086j91l46n36pN29L29J54k13l64P2K50L7kQo1k2k45l7j9k55j15N0J26O20N96J03j83
$$ -6086 -6277 -6623 -7159 -7166 -6637 -6308 -6154 -6367 -6731 -6659 -6409 -6372 -6374 -6366 -6427 -6449 -6694 -6731 -6750 -7005 -7120 -7070 -6944 -6324 -5728 -5625 -5808
-11412e808P3k15o24j33q2q5J58N0J06R5Q4J4k74r8j09n24m48O1L42K97R9L9J53P3KJ09n31
$$ -5808 -5735 -5950 -6574 -6707 -6789 -6874 -6716 -6666 -6560 -6465 -6381 -6367 -6641 -6739 -6848 -7372 -7820 -7759 -7417 -7120 -7021 -6982 -6829 -6756 -6754 -6645 -7176
-11385g176n01j92q6L0J58J30J9j62k99l37J8M66J73m9l2n1J98K26l7j70J58M3m60j27K76
$$ -7176 -7677 -7869 -7955 -7925 -7767 -7637 -7618 -7780 -8079 -8416 -8398 -7932 -7759 -7808 -7840 -7891 -7693 -7467 -7504 -7674 -7516 -7473 -7933 -8060 -7784
-11360g784j04j30J30k77k79K6J77J37J22l45M5N29P8r7k0N7P7J56j90m12l64k9J02r5m40
$$ -7784 -7888 -8018 -7888 -8165 -8444 -8418 -8241 -8104 -7982 -8327 -8282 -7753 -7675 -7772 -7792 -7735 -7658 -7502 -7692 -8104 -8468 -8497 -8395 -8490 -8930
-11335h930j90K90J54p0k77l41j35J22K83k60NJ26N6J18jK70K11j40n04j74J64k53n04n6J26
$$ -8930 -9120 -8830 -8676 -8746 -9023 -9364 -9499 -9377 -9094 -9354 -9349 -9223 -9167 -9049 -9050 -8780 -8569 -8709 -9213 -9387 -9223 -9476 -9980 -10036 -9910
-11310i910M29M65L39R6K01Ml11l59o1J32j79k51k22k27j59k68j20K44M79K77m0j34P2J81
$$ -9910 -9481 -9016 -8677 -8581 -8380 -8376 -8687 -9046 -9107 -8975 -9154 -9405 -9627 -9854 -10013 -10281 -10401 -10157 -9678 -9401 -9441 -9575 -9503 -9322
-11286i322m1n4k48o16p00k86k93l39Q9L56J49N0J48J53K74J02p1k23j65K3j75r2J02J28J24
$$ -9322 -9363 -9417 -9665 -10281 -10981 -11267 -11560 -11899 -11810 -11454 -11305 -11255 -11107 -10954 -10680 -10578 -10649 -10872 -11037 -11014 -11189 -11281 -11179 -11051 -10927
-11261a0927J28l53l19M1j0m15o0M37L20oj41Mj97j79J17P5j69j30n02k49K20M01K37o7l81
$$ -10927 -10799 -11152 -11471 -11430 -11440 -11855 -11915 -11478 -11158 -11164 -11305 -11301 -11498 -11677 -11560 -11485 -11654 -11784 -12286 -12535 -12315 -11914 -11677 -11744 -12125
-11236a2125o0K46j14k42k31j46k14M9K16J44j6j15j03l11l61k00J39K05r5q1L9K58m3l28
$$ -12125 -12185 -11939 -12053 -12295 -12526 -12672 -12886 -12837 -12621 -12477 -12493 -12608 -12711 -13022 -13383 -13583 -13444 -13239 -13334 -13415 -13376 -13118 -13161 -13489
-11212a3489k26l8j99N4l00l95j56l10l61r2O4k48O1N03K54j86p42o94Jk9k98k37p3O4J47
$$ -13489 -13715 -13753 -13952 -13898 -14198 -14593 -14749 -15059 -15420 -15512 -15448 -15696 -15635 -15132 -14878 -15064 -15806 -16500 -16499 -16528 -16826 -17063 -17136 -17072 -16925
-11187a6925K22K5l25l91m8o7R1K4j65l57m09m15m35l49j73j67N7M22J27l39k98l13k22l16
$$ -16925 -16703 -16678 -17003 -17394 -17442 -17509 -17418 -17394 -17559 -17916 -18325 -18740 -19175 -19524 -19697 -19864 -19807 -19385 -19258 -19597 -19895 -20208 -20430 -20746
-11163b0746p00p13n53j35k52n73l11r5K05j61q08r93p24m82l17l40j49j6K88O45J229K035
$$ -20746 -21446 -22159 -22712 -22847 -23099 -23672 -23983 -24078 -23873 -24034 -24842 -25835 -26559 -27041 -27358 -27698 -27847 -27863 -27575 -26930 -25701 -23666
-11141b3666K365K629K676K143J579J000L58o3n03p89r58r87q18n31q55r08m41n52m26k03
$$ -23666 -21301 -18672 -15996 -13853 -12274 -11274 -10916 -10979 -11482 -12271 -13229 -14216 -15034 -15565 -16420 -17328 -17769 -18321 -18747 -18950
-11121a8950m61p16j157r47o29k80l20m27n95o83l46n21r57q70q49r46q55q40p26q80r33n68
$$ -18950 -19411 -20127 -21284 -22231 -22860 -23140 -23460 -23887 -24482 -25165 -25511 -26032 -26989 -27859 -28708 -29654 -30509 -31349 -32075 -32955 -33888 -34456
-11099c4456r13j371j167j075j045j034j469j452j486j496q72N56K290M361O357P825Q706
$$ -34456 -35369 -36740 -37907 -38982 -40027 -41061 -42530 -43982 -45468 -46964 -47836 -47280 -44990 -40629 -34272 -26447 -17741
-11082a7741Q367P302N946L698J849L11j220j587j823k104j949k013j952k018j735j651j921
$$ -17741 -9374 -2072 3874 7572 9421 9732 8512 6925 5102 2998 1049 -964 -2916 -4934 -6669 -8320 -10241
-11065a0241j641j377j534j411j247j690j840j485r13l69p88j301j642j759j309r08q65j293
$$ -10241 -11882 -13259 -14793 -16204 -17451 -19141 -20981 -22466 -23379 -23748 -24536 -25837 -27479 -29238 -30547 -31455 -32320 -33613
-11047c3613j274j525k123j634j209j434j835j942k040k375k686k997l129k994k687j661J83
$$ -33613 -34887 -36412 -38535 -40169 -41378 -42812 -44647 -46589 -48629 -51004 -53690 -56687 -59816 -62810 -65497 -67158 -66975
-11030f6975L256P505J1722J5012J7664J8057J6038J2657Q575M962J881q36k610l709m204
$$ -66975 -63719 -56214 -44492 -29480 -11816 6241 22279 34936 43511 48473 50354 49518 46908 43199 38995
-11015C8995l991l599l110l401l651l238k842k430k236k062k092k278k229j905j746j827j735
$$ 38995 35004 31405 28295 24894 21243 18005 15163 12733 10497 8435 6343 4065 1836 -69 -1815 -3642 -5377
-10998e377j743j881j471j619k012j736j740k231k154k015k058j870k018k070k417k383k524
$$ -5377 -7120 -9001 -10472 -12091 -14103 -15839 -17579 -19810 -21964 -23979 -26037 -27907 -29925 -31995 -34412 -36795 -39319
-10981c9319k669l135l898m026l625l012k175m73K716P758J2923J7264K0174K1279K0221J6575
$$ -39319 -41988 -45123 -49021 -53047 -56672 -59684 -61859 -62332 -59616 -51858 -38935 -21671 -1497 19782 40003 56578
-10965E6578J1693O493K139r24k906l856m531m712m597m005l553l410l518l500l147k851k473
$$ 56578 68271 74764 76903 75979 73073 69217 64686 59974 55377 51372 47819 44409 40891 37391 34244 31393 28920
-10948B8920k548k507k063j909k012j954j909j820k081k006j876j621j580j902j285j283j842
$$ 28920 26372 23865 21802 19893 17881 15927 14018 12198 10117 8111 6235 4614 3034 1132 -153 -1436 -3278
-10931c278j950j780j765k161k342k094k109k307k901l406l202l016k495k092q03J869N597
$$ -3278 -5228 -7008 -8773 -10934 -13276 -15370 -17479 -19786 -22687 -26093 -29295 -32311 -34806 -36898 -37701 -35832 -30235
-10914c0235J0021J4037J7058J8095J7206J4455J0568O423K372m66j941k934l358l597l796
$$ -30235 -20214 -6177 10881 28976 46182 60637 71205 77628 80000 79534 77593 74659 71301 67704 63908
-10899F3908l788l464l272l424l152k775k316k069k085j630j482j818j936j386j337j499r59
$$ 63908 60120 56656 53384 49960 46808 44033 41717 39648 37563 35933 34451 32633 30697 29311 27974 26475 25516
-10882B5516j044j237j259j090j268j398r61p59j107j329j031j138j346j487j359j344j441
$$ 25516 24472 23235 21976 20886 19618 18220 17259 16500 15393 14064 13033 11895 10549 9062 7703 6359 4918
-10865D918j356j618j665j824j623k67J047K115L947O230P710Q532Q516P423N731L907J715
$$ 4918 3562 1944 279 -1545 -3168 -3435 -2388 -273 3674 9904 17614 26146 34662 42085 47816 51723 53438
-10848E3438k1q63j294j901j900k146j959j907j593j651j649j341r27n93p67r12p79j024j537
$$ 53438 53417 52554 51260 49359 47459 45313 43354 41447 39854 38203 36554 35213 34286 33693 32926 32014 31235 30211 28674
-10829B8674j414p18o17q45n83j58l51o59o52q87q91o23k38k53o69p86r25q63n74l72n7m7
$$ 28674 27260 26542 25925 25080 24497 24339 23988 23329 22677 21790 20899 20276 20038 19785 19116 18330 17405 16542 15968 15596 15539 15492
-10807A5492k38m17n88m66l60o9L44J018J651K013K627K538K473J808Q18N19L13m6n37n07
$$ 15492 15254 14837 14249 13783 13423 13354 13698 14716 16367 18380 21007 23545 26018 27826 28644 29163 29476 29430 28893 28386
-10787B8386l07n13p55o09m52m44j112j274m92l26j55j42k32j48m6m15p33m16J08nm47m61
$$ 28386 28079 27566 26811 26202 25750 25306 24194 22920 22428 22102 21947 21805 21573 21425 21379 20964 20231 19815 19923 19918 19471 19010
-10765A9010m68o19j23J36l46l11L6R6Rj11l64j60K68k55l52l30L8K93J39K01K83l08q12o09
$$ 19010 18542 17923 17800 17936 17590 17279 17315 17411 17420 17309 16945 16785 17053 16798 16446 16116 16154 16447 16586 16787 17070 16762 15950 15341
-10741A5341k57J16pr2m7J04l8j0K2k14n57n38J6K92L06k85l04O7l03k36J54N4j74j28j17
$$ 15341 15084 15200 15193 15101 15054 15158 15120 15110 15132 14918 14361 13823 13839 14131 14437 14152 13848 13915 13612 13376 13530 13584 13410 13282 13165
-10716A3165n2l1j90n52m09j59PJ42K18L15K79j34n06M6M42J49o2j11l10l08j68j90l24J75
$$ 13165 13113 13082 12892 12340 11931 11772 11779 11921 12139 12454 12733 12599 12093 12139 12581 12730 12668 12557 12247 11939 11771 11581 11257 11432
-10692A1432M40J72l47k72p2k80L2K3p2j89j89k82m42l93J87L3l08J24L86K61j50m47j27L43
$$ 11432 11872 12044 11697 11425 11353 11073 11105 11128 11056 10867 10678 10396 9954 9561 9748 9781 9473 9597 9983 10244 10094 9647 9520 9863
-10668I863K90M0j18M8M04J85l7N1j78k73m86k34L48M03J58p2J59L07N3l68p44l61j14M3Q8
$$ 9863 10153 10193 10075 10123 10527 10712 10675 10726 10548 10275 9789 9555 9903 10306 10464 10392 10551 10858 10911 10543 9799 9438 9324 9367 9455
-10643I455L53M37L67r0n60m62j8Q4K43N8j98j04J17J44R1l98n03j15J61M22M71k31o03l83
$$ 9455 9808 10245 10612 10522 9962 9500 9482 9566 9809 9867 9669 9565 9682 9826 9917 9519 9016 8901 9062 9484 9955 9724 9121 8738
-10619H738n8p4p7K2J78jj39k7k00j94M4P0O2L59J61m49j62K47l23m79l46K59O87j40k99j27
$$ 8738 8680 8606 8529 8551 8729 8728 8589 8562 8362 8168 8212 8282 8344 8703 8864 8415 8253 8500 8177 7698 7352 7611 8298 8158 7859 7732
-10593G732M23M16J51q5j11k6J25K07l10j75J56l5l29j10q7l8J53J50O0M3j06m4l25m18k94
$$ 7732 8155 8571 8722 8637 8526 8500 8625 8832 8522 8347 8503 8468 8139 8029 7942 7904 8057 8207 8267 8310 8204 8160 7835 7417 7123
-10568G123k8j36j73m3L58M20J18j46n56m57j95j75K1J47J49R9J90O82L77r7j0J19k91l68
$$ 7123 7095 6959 6786 6743 7101 7521 7639 7493 6937 6480 6285 6110 6131 6278 6427 6526 6716 7398 7775 7678 7668 7787 7496 7128
-10544G128j52J69k7j97l74k48k7L38L19j04K7q7m8L03M07K99J48j3l09l58l13k17j53l77
$$ 7128 6976 7145 7118 6921 6547 6299 6272 6610 6929 6825 6852 6765 6717 7020 7427 7726 7874 7861 7552 7194 6881 6664 6511 6134
-10520F134o0M03J39K21M92J58OQ7j13l90m6J21M2J67k78m36j58j95J61J49J09m2j4J78J48
$$ 6134 6074 6477 6616 6837 7329 7487 7493 7580 7467 7077 7031 7152 7194 7361 7083 6647 6489 6294 6455 6604 6713 6671 6657 6835 6983
-10495F983J3J09L49K66k9n91q25k87L35J46j5k09p3J1N2j49M2M31K68L25j96m47l53k71j44
$$ 6983 6996 7105 7454 7720 7691 7100 6275 5988 6323 6469 6454 6245 6172 6183 6235 6086 6128 6559 6827 7152 6956 6509 6156 5885 5741
-10470E741n77k89K94M56O9L4K38K74K77j27k41N8J66j31j11m3q9N5k22j70j24P3L43J39q1
$$ 5741 5164 4875 5169 5625 5694 5728 5966 6240 6517 6390 6149 6207 6373 6242 6131 6088 5999 6054 5832 5662 5538 5611 5954 6093 6012
-10445F012l11k81K45K22J21J05J83K16k05k48k84k89l9K01J98J18K44j25l78m5L12J23k60
$$ 6012 5701 5420 5665 5887 6008 6113 6296 6512 6307 6059 5775 5486 5447 5648 5846 5964 6208 6083 5705 5660 5972 6095 5835
-10422E835j23J5l36K6K52K59r7n66K0L00Pr7K30M4l29l26m0J6K32K2M7J63K29K67J52l9n14
$$ 5835 5712 5727 5391 5417 5669 5928 5831 5265 5285 5585 5592 5495 5725 5769 5440 5114 5074 5090 5322 5344 5391 5554 5783 6050 6202 6163 5649
-10395E649l58L3J86j32k90j49J14p3k41K49K28j36l48m40k55J37l6j9K27J36j13k57p3j28
$$ 5649 5291 5324 5510 5378 5088 4939 5053 4980 4739 4988 5216 5080 4732 4292 4037 4174 4138 4119 4346 4482 4369 4112 4039 3911
-10371C911l02K01N6K42L19Jj97J79J74K81M22m4j24n5J68ln13j69J05j20l9Q1K83j5l51j7
$$ 3911 3609 3810 3866 4108 4427 4428 4231 4410 4584 4865 5287 5243 5119 5064 5232 5229 4716 4547 4652 4532 4493 4574 4857 4842 4491 4474
-10345D474O59N65m4k79l76k15M0j77l07J30R5J39K48l52k00L45o4m81j52N6M7K63K19L19
$$ 4474 5133 5698 5654 5375 4999 4784 4824 4647 4340 4470 4565 4704 4952 4600 4400 4745 4681 4200 4048 4104 4151 4414 4633 4952
-10321D952J81n9J13K83J78j38k50L6J96M08J79k30m09m30k34j04J51L72L09k86j19J96l6
$$ 4952 5133 5074 5187 5470 5648 5510 5260 5296 5492 5900 6079 5849 5440 5010 4776 4672 4823 5195 5504 5218 5099 5295 5259
-10298E259R9L20K2l28J29J48j49k95o29m59m39k02J9L95P58M82j83n19l47j55n9k16pK74
$$ 5259 5358 5678 5700 5372 5501 5649 5500 5205 4576 4117 3678 3476 3495 3890 4648 5130 4947 4428 4081 3926 3867 3651 3644 3918
-10274C918L49O2L19J91k68l78m5P5N6J21L14M84L06l47k91p5j94n6M9J76k06l96j36j55k24
$$ 3918 4267 4329 4648 4839 4571 4193 4148 4223 4279 4400 4714 5198 5504 5157 4866 4791 4597 4541 4590 4766 4560 4164 4028 3873 3649
-10249C649K0J87Mk61j65K79M29Q0j01K00O8q3m73m19j35l5l00k28K28J92L16O29O43J8n03
$$ 3649 3669 3856 3860 3599 3434 3713 4142 4222 4121 4321 4389 4306 3833 3414 3279 3244 2944 2716 2944 3136 3452 4081 4724 4742 4239
-10224D239j94QL7j72j02J77K34L7K25k25n94l81j24J03L26J36k94R8O81J66j12M30O61j55
$$ 4239 4045 4053 4090 3918 3816 3993 4227 4264 4489 4264 3670 3289 3165 3268 3594 3730 3436 3534 4215 4381 4269 4699 5360 5205
-10200E205r03k11J58K45m8n84m79Ll10l27j00k02o3M14K46l5l7J78p9n60j69O24L79n2k49
$$ 5205 4302 4091 4249 4494 4446 3862 3383 3386 3076 2749 2649 2447 2384 2798 3044 3009 2972 3150 3071 2511 2342 2966 3345 3293 3044
-10175C044J7j10k30J75O68K49j61j29l70m8Q1k89n5M28L54L85L86k0j27k30k13m7L76K28
$$ 3044 3061 2951 2721 2896 3564 3813 3652 3523 3153 3105 3186 2897 2842 3270 3624 4009 4395 4375 4248 4018 3805 3758 4134 4362
-10151D362m02k76J56L83M20L88J28k07l96m81m48l89n4J2o6k60n50MO65K72j83j30N09R12
$$ 4362 3960 3684 3840 4223 4643 5031 5159 4952 4556 4075 3627 3238 3184 3196 3130 2870 2320 2324 2989 3261 3078 2948 3457 4369
-10127D369N43j7l63m76k79l48RL03Q3K56Q9l38j4Pk58j43K97L28k43m65k25Q5L17l1n28k38
$$ 4369 4912 4895 4532 4056 3777 3429 3438 3741 3824 4080 4169 3831 3817 3824 3566 3423 3720 4048 3805 3340 3115 3200 3517 3486 2958 2720
-10101B720L90K17J05J35K05J89m1j9P8l14j52N5Q4J49j02k2o6K9L6j13K2K69P6jM7l32o38
$$ 2720 3110 3327 3432 3567 3772 3961 3920 3901 3979 3665 3513 3568 3652 3801 3699 3677 3611 3640 3676 3563 3585 3854 3930 3929 3976 3644 3006
-10074C006J06N4J20j64m92K06J94j24k21r2j85Q6L60J92j2j91l28O0N64J06k26K95j05j64
$$ 3006 3112 3166 3286 3122 2630 2836 3030 2906 2685 2593 2408 2494 2854 3046 3034 2843 2515 2575 3139 3245 3019 3314 3209 3045
-10050C045J08J39j70m73P0J73K56K03j6l05j02L11j04k81j25j98l20K07M63j20j65J02O3
$$ 3045 3153 3292 3122 2649 2719 2892 3148 3351 3335 3030 2928 3239 3135 2854 2729 2531 2211 2418 2881 2761 2596 2698 2761
-10027B761K20K18j02q1k94l23oN5m07l73K07N82M85j4k35j85j05K4O8L32j8l02r1k1q9M7
$$ 2761 2981 3199 3097 3016 2722 2399 2393 2448 2041 1668 1875 2457 2942 2928 2693 2508 2403 2427 2495 2827 2809 2507 2416 2395 2306 2353
-10001B353L21K99LM7j11k36n15K14N20K80M14O20j69m39m73m54n3n1J5LK1m21k43P1k2J71
$$ 2353 2674 2973 2976 3023 2912 2676 2161 2375 2895 3175 3589 4209 4040 3601 3128 2674 2621 2570 2585 2588 2609 2188 1945 2016 1994 2165
-9975B165pL72L55J75j79m70j82K21L52K39J25J54K7k09j41K78J76k3l00l81l90l12L78L13
$$ 2165 2158 2530 2885 3060 2881 2411 2229 2450 2802 3041 3166 3320 3347 3138 2997 3275 3451 3428 3128 2747 2357 2045 2423 2736
-9951B736J8j10J44K93k0p8jm71K0N79M35J19j58o00n62j20P5LJ52K10l60n77j19J62K7K55
$$ 2736 2754 2644 2788 3081 3061 2983 2982 2511 2531 3110 3545 3664 3506 2906 2344 2224 2299 2302 2454 2664 2304 1727 1608 1770 1797 2052
-9925B052K96K29R8LL1k7K53L43l5k26k73J8l4p36j88K76kK05J41l94N0L94Q1k74j84j42J95
$$ 2052 2348 2577 2675 2678 2709 2682 2935 3278 3243 3017 2744 2762 2728 1992 1804 2080 2078 2283 2424 2030 2080 2474 2555 2281 2097 1955 2150
-9898B150L78L0K26J09r9j9L39O05K27m52k81l70m57J45o4J6l7o8M4P9K5K29m3m72k28l08
$$ 2150 2528 2558 2784 2893 2794 2775 3114 3719 3946 3494 3213 2843 2386 2531 2467 2483 2446 2378 2422 2501 2526 2755 2712 2240 2012 1704
-9872A704j13M04L75M31L86J2k22R4K96J08l49n39l88Q3K30O7J42J68j15l49j2l2j13j06K74
$$ 1704 1591 1995 2370 2801 3187 3199 2977 3071 3367 3475 3126 2587 2199 2282 2512 2579 2721 2889 2774 2425 2413 2381 2268 2162 2436
-9847B436L68l3j55l81M9M47M93O1l90l74j92K28K22j14ko0K05R8k41pm6j67o9k15R5J72J8
$$ 2436 2804 2771 2616 2235 2284 2731 3224 3285 2895 2521 2329 2557 2779 2665 2663 2603 2808 2906 2665 2658 2612 2445 2376 2161 2256 2428 2446
-9820B446q9m29m08k1J99KM2L81L55K67J1j28J01j32j41K05L20Qo2j59k61n9P3m0Q6l5k13
$$ 2446 2357 1928 1520 1499 1698 1700 1742 2123 2478 2745 2756 2628 2729 2597 2456 2661 2981 2989 2927 2768 2507 2448 2521 2481 2567 2532 2319
-9793B319o3rL64N27n8m84k57j10q8o7j30j34O4M63K73j75k41j4k29J99P41N87L35J57k93
$$ 2319 2256 2247 2611 3138 3080 2596 2339 2229 2141 2074 1944 1810 1874 2337 2610 2435 2194 2180 1951 2150 2891 3478 3813 3970 3677
-9768C677k23n5j62l27j91mK7j35l24j25K13K23j35l1K30J84l6k7K38K17j12j22J62J89l04
$$ 3677 3454 3399 3237 2910 2719 2715 2742 2607 2283 2158 2371 2594 2459 2428 2658 2842 2806 2779 3017 3234 3122 3000 3162 3351 3047
-9743C047m30L6R9L32P0o2k32m34j17j51k19l63J46J8Q1j21k40L96J47q5n4K4K71N60K1m7
$$ 3047 2617 2653 2752 3084 3154 3092 2860 2426 2309 2158 1939 1576 1722 1740 1821 1700 1460 1856 2003 1918 1864 1888 2159 2719 2740 2693
-9717B693K14p6k12J32L8o3l32l28J29J23o9o2N4J19K88p2j93k0J3n1M67N29J27n98m98R8
$$ 2693 2907 2831 2619 2751 2789 2726 2394 2066 2195 2318 2249 2187 2241 2360 2648 2576 2383 2363 2376 2325 2792 3321 3448 2850 2352 2450
-9691B450J27K25mk43l00j08J11M8J04K46L0j05J70L3k80o8K6o2J61M33J33m06m17k47k0k0
$$ 2450 2577 2802 2798 2555 2255 2147 2258 2306 2410 2656 2686 2581 2751 2784 2504 2436 2462 2400 2561 2994 3127 2721 2304 2057 2037 2017
-9665B017r1j28r6j47k59K76M08J57J95M04M22L1j77k37q0K97L14qk41j02L46j3m45l55l5
$$ 2017 1926 1798 1702 1555 1296 1572 1980 2137 2332 2736 3158 3189 3012 2775 2695 2992 3306 3298 3057 2955 3301 3288 2843 2488 2453
-9640B453ON1L40K37N3l64n83l37j17K7L41j75J51M91m8j75L8J02K11Mk46l34k11K9l69l14
$$ 2453 2459 2510 2850 3087 3140 2776 2193 1856 1739 1766 2107 1932 2083 2574 2526 2351 2389 2491 2702 2706 2460 2126 1915 1944 1575 1261
-9614A261K31L22K08K86Q9j34p0j25L8L88L42J62pk39m41n33l55J58P12L41k89l14K7P7k80
$$ 1261 1492 1814 2022 2308 2397 2263 2193 2068 2106 2494 2836 2998 2991 2752 2311 1778 1423 1581 2293 2634 2345 2031 2058 2135 1855
-9589A855k56R4L27Kl3J40J88K03m3k67l03l8Ok47k92o4J35M49M21M1q3K31K64l27l99J66
$$ 1855 1599 1693 2020 2022 1989 2129 2317 2520 2477 2210 1907 1869 1875 1628 1336 1272 1407 1856 2277 2318 2235 2466 2730 2403 2004 2170
-9563B170K43l93n52q0J89K44R3K5K57J95j43R5K68ll70p71k25L83L01k56m32k51j39l26k34
$$ 2170 2413 2020 1468 1388 1577 1821 1914 1939 2196 2391 2248 2343 2611 2608 2238 1467 1242 1625 1926 1670 1238 987 848 522 288
-9538B88M26P30M29J37K16J55K34K5j83l79j11J55R2M8K30L96J85L1n4k3J52K52j51m53l27
$$ 288 714 1444 1873 2010 2226 2381 2615 2640 2457 2078 1967 2122 2214 2262 2492 2888 3073 3104 3050 3027 3179 3431 3280 2827 2500
-9513B500O7k11l04O5On7L02L80K17l19k02K06K98K36p5k31k52j47j48o83m60J50R8K66J74
$$ 2500 2567 2356 2052 2117 2123 2066 2368 2748 2965 2646 2444 2650 2948 3184 3109 2878 2626 2479 2331 1648 1188 1338 1436 1702 1876
-9488A876k1j55k85l17j48M23N23J95j13M4O00M30K33l4k32k59l69k25j11M14N03j73l95l26
$$ 1876 1855 1700 1415 1098 950 1373 1896 2091 1978 2022 2622 3052 3285 3251 3019 2760 2391 2166 2055 2469 2972 2799 2404 2078
-9464B078j43P6J59K27j07m59m02j91K7J78K57K62J0q3j76J28L11O11M34l00k08J27l2k22
$$ 2078 1935 2011 2170 2397 2290 1831 1429 1238 1265 1443 1700 1962 1972 1889 1713 1841 2152 2763 3197 2897 2689 2816 2784 2562
-9440B562j81j65m40l94Q2j19j11L92K16o5l90j8M91O65M04j37j67j43k00J64K66k55o31k48
$$ 2562 2381 2216 1776 1382 1464 1345 1234 1626 1842 1777 1387 1369 1860 2525 2929 2792 2625 2482 2282 2446 2712 2457 1826 1578
-9416A578Q8J51J85j03j01J07k92j36R1j02k52l18L44M48K88P9j76q7n6p8j1J46K56L81M57
$$ 1578 1666 1817 2002 1899 1798 1905 1613 1477 1568 1466 1214 896 1240 1688 1976 2055 1879 1792 1736 1658 1647 1793 2049 2430 2887
-9391B887K03m99m33l28k11J42L35L43J41o29o81L3K26L8OL69P6RQ1q1j64o4L8K08J76L5M97
$$ 2887 3090 2591 2158 1830 1619 1761 2096 2439 2580 1951 1270 1303 1529 1567 1573 1942 2018 2027 2108 2027 1863 1799 1837 2045 2221 2256 2753
-9364B753L01j37m24k62N1K4j58m10k2J91K13k35l82kJ90J25J52LL3K99J50m76n81m56k61
$$ 2753 3054 2917 2493 2231 2282 2306 2148 1738 1716 1907 2120 1885 1503 1501 1691 1816 1968 1971 2004 2303 2453 1977 1396 940 679
-9339F79J16L42L23Q0l64l63k3j83O7M2Q9L31L52L03j4J01J15p3k58j98l29R5M45K04J6j6
$$ 679 795 1137 1460 1540 1176 813 790 607 674 716 805 1136 1488 1791 1777 1878 1993 1920 1662 1464 1135 1230 1675 1879 1895 1879
-9313A879l55k69j52J46M42O7o88l85L53R4l19j69K11L83J07R2M45M7j95j20K05lm3n9K9K07
$$ 1879 1524 1255 1103 1249 1691 1758 1070 685 1038 1132 813 644 855 1238 1345 1437 1882 1929 1734 1614 1819 1816 1773 1714 1743 1950
-9287A950J81k35k82p3L82O18K86r5m88n56j88K0K90J19O6pl70m10m43O9L23J10K40J41L1
$$ 1950 2131 1896 1614 1541 1923 2541 2827 2732 2244 1688 1500 1520 1810 1929 1995 1988 1618 1208 765 834 1157 1267 1507 1648 1679
-9262A679N7k84j54J45j35j29m1N3l7R5M69J4q2K90L18P6p8J07K42j48n15l57J78J32J47n2
$$ 1679 1736 1452 1298 1443 1308 1179 1138 1191 1154 1249 1718 1732 1650 1940 2258 2334 2256 2363 2605 2457 1942 1585 1763 1895 2042 1990
-9236A990j6K24l35n63J95J52j89k62j89K24J26L6n2j6J73J46J29J9L6M19L11k28k73j96k10
$$ 1990 1974 2198 1863 1300 1495 1647 1458 1196 1007 1231 1357 1393 1341 1325 1498 1644 1773 1792 1828 2247 2558 2330 2057 1861 1651
-9211A651N4L40K31K03j47k43m45m21j23J68O77O75L39k03q0p3j78l81j17k72k09O6J90J36
$$ 1651 1705 2045 2276 2479 2332 2089 1644 1223 1100 1268 1945 2620 2959 2756 2676 2603 2425 2044 1927 1655 1446 1512 1702 1838
-9187A838k80J7j32k20j41n26j43K82J47L46L14J76o0j13l6j48j45M2Q8J98K4j28L5K61j45
$$ 1838 1558 1575 1443 1223 1082 556 413 695 842 1188 1502 1678 1618 1505 1469 1321 1176 1218 1306 1504 1528 1400 1435 1696 1551
-9162A551l31j06k43l0J73O8q1P6L70J92J58L54J44j50p2J8j01k83j38j33j68O4p4rj17j82
$$ 1551 1220 1114 871 841 1014 1082 1001 1077 1447 1639 1797 2151 2295 2145 2073 2091 1990 1707 1569 1436 1268 1332 1258 1249 1132 950
-9136I50L65K17K81K62nk2n93q65k34K24K36M09K88l32l93l31K15K13j78k38j47j27o9M92
$$ 950 1315 1532 1813 2075 2070 2048 1455 590 356 580 816 1225 1513 1181 788 457 672 885 707 469 322 195 126 618
-9112F18M16K11k4k02N95O21j63m48j70Qj8k73j41L38N74L85k77l5K71j21k71j33M99N66r2
$$ 618 1034 1245 1221 1019 1614 2235 2072 1624 1454 1462 1444 1171 1030 1368 1942 2327 2050 2015 2286 2165 1894 1761 2260 2826 2734
-9087B734n20l34l0n5O2n0j00K60L2k68j97j68k21RJ28JL01N19k3l40m52m13n96l30K55M51
$$ 2734 2214 1880 1850 1795 1857 1807 1707 1967 1999 1731 1534 1366 1145 1154 1282 1283 1584 2103 2080 1740 1288 875 279 -51 204 655
-9061F55N58J95j63j52k26L01K71k17m44j03J46j82r9J45o6p5K25L12K60L27M01l09o86l77
$$ 655 1213 1408 1245 1093 867 1168 1439 1222 778 675 821 639 540 685 619 544 769 1081 1341 1668 2069 1760 1074 697
-9037F97o0J40J09J67L48M13j14m18j62J44k68l46J36M83M62N5J46j59j56K54k0j41k87m09
$$ 697 637 777 886 1053 1401 1814 1700 1282 1120 1264 996 650 786 1269 1731 1786 1932 1773 1617 1871 1851 1710 1423 1014
-9013A014l51m38J53N93k60n40l1k43qN30N93L80L75J65L01k8l35k14K2q8k76q3K78M52K6
$$ 1014 663 225 378 971 711 171 140 -103 -111 419 1012 1392 1767 1932 2233 2205 1870 1656 1678 1590 1314 1231 1509 1961 1987
-8988A987J39L1k47J49P5j98l16n8L20n9j46K5Qn9J0L31O5o8l28m36j80j14lJk22p2pK47J56
$$ 1987 2126 2157 1910 2059 2134 1936 1620 1562 1882 1823 1677 1702 1710 1651 1661 1992 2057 1989 1661 1225 1045 931 928 929 707 635 628 875 1031
-8959A031K92K08j90p4L46M12K8l97j03N7j75j82K92K78k77k81J16M23N99J55l58l58k51O2
$$ 1031 1323 1531 1341 1267 1613 2025 2053 1656 1553 1610 1435 1253 1545 1823 1546 1265 1381 1804 2403 2558 2200 1842 1591 1653
-8935A653l55m77j92j78KQ3M19M60K67J60l05l26j06K0r8l1k07j45J39J44L57K38m9J06r1
$$ 1653 1298 821 629 451 453 536 955 1415 1682 1842 1537 1211 1105 1125 1027 996 789 644 783 927 1284 1522 1473 1579 1488
-8910A488j67p8K23M0m47j05K63M08J18QJ13j53o59n80j01J74L66J23r7k89j85L23L94J19
$$ 1488 1321 1243 1466 1506 1059 954 1217 1625 1743 1751 1864 1711 1052 472 371 545 911 1034 937 648 463 786 1180 1299
-8886A299J99j18k64q7L4J82J28K74j11j33J6J78M23K10P8j51k59r5j54j00KJ69k8j46Ql2
$$ 1299 1498 1380 1116 1029 1063 1245 1373 1647 1536 1403 1419 1597 2020 2230 2308 2157 1898 1803 1649 1549 1551 1720 1692 1546 1554 1522
-8860A522k46r7p3l51j16k5l07j61L49O07N84L59n3J19K48L0J78P6J54j02l53k46l42o31k16
$$ 1522 1276 1179 1106 755 639 614 307 146 495 1102 1686 2045 1992 2111 2359 2389 2567 2643 2797 2695 2342 2096 1754 1123 907
-8835I07K45K14m2r8k92J4L06R3J49M41K58L9j98r0j65p6K0k06L6K59J72q9r6l60n20k92j02
$$ 907 1152 1366 1324 1226 934 948 1254 1347 1496 1937 2195 2234 2036 1946 1781 1705 1725 1519 1555 1814 1986 1897 1801 1441 921 629 527
-8808E27J52M03M12K2k22k33K55K80m12j52K22M19j61m44j16P8j26k56j75k3K7K16M34J96
$$ 527 679 1082 1494 1516 1294 1061 1316 1596 1184 1032 1254 1673 1512 1068 952 1030 904 648 473 450 477 693 1127 1323
-8784A323k7K65M6Rj41k29R3M53M83J11k11m15J70L68j19l81l41k58K67O44K40j98l14J99
$$ 1323 1296 1561 1607 1616 1475 1246 1339 1792 2275 2386 2175 1760 1930 2298 2179 1798 1457 1199 1466 2110 2350 2152 1838 2037
-8760B037L86j94m78L52K34l94n14j91K30M43N36M24m77o34k21j53P0K31k07q9K19J36k8n38
$$ 2037 2423 2229 1751 2103 2337 1943 1429 1238 1468 1911 2447 2871 2394 1760 1539 1386 1456 1687 1480 1391 1610 1746 1718 1180
-8736A180k92L33l7j89j09m48p1J11M24J04l16O2K70n9j28J45J27j75J8N52L95j72o78k74
$$ 1180 888 1221 1184 995 886 438 367 478 902 1006 690 752 1022 963 835 980 1107 932 950 1502 1897 1725 1047 773
-8712G73K80L45K95J73o7l19j66j47o2j75k47q0M50O49q9N9O20M92j50o51n17o11j37N42J56
$$ 773 1053 1398 1693 1866 1799 1480 1314 1167 1105 930 683 603 1053 1702 1613 1672 2292 2784 2634 1983 1466 855 718 1260 1416
-8687A416M7j1m26l00J95K01p4j76j49j60M7N40N17k12n22J88K64K6QJ23K42k55l27j32P9
$$ 1416 1463 1452 1026 726 921 1122 1048 872 723 563 610 1150 1667 1455 933 1121 1385 1411 1419 1542 1784 1529 1202 1070 1149
-8662A149L09J79k78o6J68n9n9l3o8J05K01o0l28q5n5n1O0J19K77R1j44O1K05j31m30m38P2
$$ 1149 1458 1637 1359 1293 1461 1402 1343 1310 1242 1347 1548 1488 1160 1075 1020 969 1029 1148 1425 1516 1372 1433 1638 1507 1077 639 711
-8635G11L42N5p8r6j38L31N34L48k42p4K92o4k46k69j95J17J34j77l58k07K9J08m5J55K55
$$ 711 1053 1108 1030 934 796 1127 1661 2009 1767 1693 1985 1921 1675 1406 1211 1328 1462 1285 927 720 749 857 812 967 1222
-8610A222J91J51R4J28L66M23j33l18l43n42n63l40r5L4K74o9k09l16K5L22M38M25K26m9%
$$ 1222 1413 1564 1658 1786 2152 2575 2442 2124 1781 1239 676 336 241 275 549 480 271 -45 -20 302 740 1165 1391 1342 1342
-8585A342O9J52o2OPl19M7J89KQ3N62K84l2r9r4j62j95l0L49P2j46L45K14j46o83p36j7L22
$$ 1342 1411 1563 1501 1507 1514 1195 1242 1431 1433 1516 2078 2362 2330 2231 2137 1975 1780 1750 2099 2171 2025 2370 2584 2438 1755 1019 1002 1324
-8557A324K20J93O15M73R9n40p32k95j17j93k72l02P1L83L68n1l91j15K86l6k65O2J83j7p8
$$ 1324 1544 1737 2352 2825 2924 2384 1652 1357 1240 1047 775 473 544 927 1295 1244 853 738 1024 988 723 785 968 951 873
-8532H73K56L80k2m15l88j84L14J80J12R4l8K0N7J71J7O2P7M06L7o12l18N8K40o33m92K2J46
$$ 873 1129 1509 1487 1072 684 500 814 994 1106 1200 1162 1182 1239 1410 1427 1489 1566 1972 2009 1397 1079 1137 1377 744 252 274 420
-8505D20O34O10r3l45k91l93k24J55K87L02L20n4n52n65k14j43k5L60N22K15m58k42L41J69
$$ 420 1054 1664 1571 1226 935 542 318 473 760 1062 1382 1328 776 211 -3 -146 -171 189 711 926 468 226 567 736
-8481G36J30L37K36M23N75M2p15n25j25K94L36J3k1K77J8l63L0j64j72k94k47l25l50l62j24
$$ 736 866 1203 1439 1862 2437 2479 1764 1239 1114 1408 1744 1757 1736 2013 2031 1668 1698 1534 1362 1068 821 496 146 -216 -340
-8456c40L47N10K18N2J07K13N5K25J21r6l8M9Mj78j04kL0J65J28j43L9J21j78k00jk35j21
$$ -340 7 517 735 787 894 1107 1162 1387 1508 1412 1374 1423 1427 1249 1145 1143 1173 1338 1466 1323 1362 1483 1305 1105 1104 869 748
-8429G48Q7L42K59K00L52R8k65o04k29m1j90J39L3j77l66m20L32N51K60N9j8k86k19r7ML4
$$ 748 835 1177 1436 1636 1988 2086 1821 1217 988 947 757 896 929 752 386 -34 298 849 1109 1168 1150 864 645 548 552 586
-8403E86M12P05M3l95k65K0J69l5k08j48j49P9K40K05K46J56j26l92m32P2K58M7Q7j73J6K16
$$ 586 998 1703 1746 1351 1086 1106 1275 1240 1032 884 735 814 1054 1259 1505 1661 1535 1143 711 783 1041 1088 1175 1002 1018 1234
-8377A234J93n3j22qn01j46J98M00L04J34j41n2K86N3k29j33R3K61k87o03p1m3n1k0K58M74
$$ 1234 1427 1374 1252 1244 743 597 795 1195 1499 1633 1492 1440 1726 1779 1550 1417 1510 1771 1484 881 810 767 716 696 954 1428
-8351A428K59o1k29J29M3k04J44J7o2n1J1J22P4k0j9k74l57l83m95M8N02L04j1j8J84M21K73
$$ 1428 1687 1626 1397 1526 1569 1365 1509 1526 1464 1413 1424 1546 1620 1600 1581 1307 950 567 72 120 622 926 915 897 1081 1502 1775
-8324A775l5K13M14J72J86L25r0j41m1n52n36l06k25K00M94N8n29l38Q1K44J23j24k10k31
$$ 1775 1740 1953 2367 2539 2725 3050 2960 2819 2778 2226 1690 1384 1159 1359 1853 1911 1382 1044 1125 1369 1492 1368 1158 927
-8300I27k91K70L93p2q9j49q9J50J51O0m6l18j67k06j50J57P1%N24N28J38p6K62O62K47jk57
$$ 927 636 906 1299 1227 1138 989 900 1050 1201 1261 1215 897 730 524 374 531 602 602 1126 1654 1792 1716 1978 2640 2887 2886 2629
-8273B629l00m90n36j40J26M94N89j8n76m18k80l92N6K52J30N5J62J33k05j39K81M2k67q6
$$ 2629 2329 1839 1303 1163 1289 1783 2372 2354 1778 1360 1080 688 744 996 1126 1181 1343 1476 1271 1132 1413 1455 1188 1102
-8249A102M12j4k52JK00N69K12n58p53p3K16L68J38j94No9j50o8K18N8qR9M9k2r5K70K43K45
$$ 1102 1514 1500 1248 1249 1449 2018 2230 1672 919 846 1062 1430 1568 1374 1379 1310 1160 1092 1310 1368 1360 1459 1508 1486 1391 1661 1904 2149
-8221B149m9o09j74M70L03j5j91l00Q1k15j52J11J32R7k90l8Qk70j17r6L33P42K42m28o13
$$ 2149 2100 1491 1317 1787 2090 2075 1884 1584 1665 1450 1298 1409 1541 1638 1348 1310 1318 1048 931 835 1168 1910 2152 1724 1111
-8196A111m17m46k62MN7k0Oj89L4N60M84J92k24j57K68M77K56k9j20j00m80l12J59J2J44J84
$$ 1111 694 248 -14 -10 47 27 33 -156 -122 438 922 1114 890 733 1001 1478 1734 1705 1585 1485 1005 693 852 864 1008 1192
-8170A192J13L55K19k18m36p5K47Q6j11k5j98j25k2j41m51m10n15m19N26P07J23k31j36l17
$$ 1192 1305 1660 1879 1661 1225 1150 1397 1483 1372 1347 1149 1024 1002 861 410 0 -515 -934 -408 299 422 191 55 -262
-8146b62r2L21L21K38K04K05J59J8j23l15k9K33P9L92L01l05m20j16j11k15k68l35Q2K07K00
$$ -262 -354 -33 288 526 730 935 1094 1112 989 674 645 878 957 1349 1650 1345 925 809 698 483 215 -120 -38 169 369
-8121C69N29N56J27M8Q7k48j19P4j86j41k68j66q2J02n7J20J36M0%O4L38N52J90k8k88J31
$$ 369 898 1454 1581 1629 1716 1468 1349 1423 1237 1096 828 662 580 682 625 745 881 921 921 985 1323 1875 2065 2037 1749 1880
-8095A880Q6j37j01Q4K5l94l32j05K44L74M3J45N85K36l33n19m30m9j83k60k57p2K64L79J29
$$ 1880 1966 1829 1728 1812 1837 1443 1111 1006 1250 1624 1667 1812 2397 2633 2300 1781 1351 1302 1119 859 602 530 794 1173 1302
-8070A302j22j97L31K93J19L7l13k35J80J03k39n09o34l59K92N80K53J41Q1Q1K0L6j1m07k19
$$ 1302 1180 983 1314 1607 1726 1763 1450 1215 1395 1498 1259 750 116 -243 49 629 882 1023 1104 1185 1205 1241 1230 823 604
-8045F04J7K23K73n8j01K27J74K15P1Lq9l16k21l18K0K46kK39L22N5l80k49L06J57j9N2N8
$$ 604 621 844 1117 1059 958 1185 1359 1574 1645 1648 1559 1243 1022 704 724 970 968 1207 1529 1584 1204 955 1261 1418 1399 1451 1509
-8018A509N0k45r7j35K78O43p4k63n2J10j35j76k77O7L21Q9l67n29n31O7K59L30o9j95L69
$$ 1509 1559 1314 1217 1082 1360 2003 1929 1666 1614 1724 1589 1413 1136 1203 1524 1613 1246 717 186 253 512 842 773 578 947
-7993I47K25k28k85j00n0M59M02k7r2K42J63j08J09l94m01K54R5K27L42M6l62k65n10o23n0
$$ 947 1172 944 659 559 509 968 1370 1343 1251 1493 1656 1548 1657 1263 862 1116 1211 1438 1780 1826 1464 1199 689 66 16
-7968A6N57K98J26K71K43J15K70J30l12j86J7m5q1j88j4K04j13Q6J26j79m79k25J7J42K93
$$ 16 573 871 997 1268 1511 1626 1896 2026 1714 1528 1545 1500 1419 1231 1217 1421 1308 1394 1520 1341 862 637 654 796 1089
-7943A089L50j52j99J57j00k18K85L37j52P4K26L73J56k2L7j20l72l75o3K09l8j51K24M5J37
$$ 1089 1439 1287 1088 1245 1145 927 1212 1549 1397 1471 1697 2070 2226 2204 2241 2121 1749 1374 1311 1520 1482 1331 1555 1600 1737
-7918A737J49K98R6l9p1j77j51k90k86L3j6l5J64j01k67k04k98p0l93n83j18L28J23M75L87
$$ 1737 1886 2184 2280 2241 2170 1993 1842 1552 1266 1299 1283 1248 1412 1311 1044 840 542 472 79 -504 -622 -294 -171 304 691
-7893F91k60K01O59J79N5p0k21k11j41j44K53J50j34L2M88K15r3k49l64j35LJ31J32R7%J54
$$ 691 431 632 1291 1470 1525 1455 1234 1023 882 738 991 1141 1007 1039 1527 1742 1649 1400 1036 901 904 1035 1167 1264 1264 1418
-7867A418K24k57m39k34K5J34M33O0k58k49k74k13m7L20P7M4K43N1L0r2J97J14j58J7J72K24
$$ 1418 1642 1385 946 712 737 871 1304 1364 1106 857 583 370 323 643 720 764 1007 1058 1088 996 1193 1307 1149 1166 1338 1562
-7841A562qk81m3M23J60J27O4m38l04k05j85n3lK8J9L7J6j57q9j49q9o5J31Q7j01J55K57L56
$$ 1562 1554 1273 1230 1653 1813 1940 2004 1566 1262 1057 872 819 816 844 863 900 916 759 670 521 432 367 498 585 484 639 896 1252
-7813A252n1m02j29R9n3r0j07M9K0no3P5J26m2j63j86m17k24j06J06J07M3J32N0k7L66N77
$$ 1252 1201 799 670 769 716 626 519 568 588 583 520 595 721 679 516 330 -87 -311 -417 -311 -204 -161 -29 21 -6 360 937
-7786I37K78L21M7n38m59K35J28Q7J37R1o9M3L31M21rk93j82l53k58m7O6K19k7m9k11l21O
$$ 937 1215 1536 1583 1045 586 821 949 1036 1173 1264 1195 1238 1569 1990 1981 1688 1506 1153 895 848 914 1133 1106 1057 846 525 531
-7759E31L51M24j10l22l38r0P2j25K25L41J78mj18k83m09p6K7O4k0K06N69P5k80m23l10q9
$$ 531 882 1306 1196 874 536 446 518 393 618 959 1137 1133 1015 732 323 247 274 338 318 524 1093 1168 888 465 155 66
-7733F6J49J43L46K11P3J30j52l11j71K44L14j32M0L50J79j93n05m29m25L1L70N07K85k22
$$ 66 215 358 704 915 988 1118 966 655 484 728 1042 910 950 1300 1479 1286 781 352 -73 -42 328 835 1120 898
-7709H98l96k86R8J99J86K15L4j08k01n7n1j33m01l96l81J4P60L04n42q25j92O92N63K72n3
$$ 898 502 216 314 513 699 914 948 840 639 582 531 398 -3 -399 -780 -766 -6 298 -244 -1069 -1261 -569 -6 266 213
-7684B13J50L59J32l68o7L18Oj25K15P8l5J07k16L6J05NJ21n2J4k17j94K33J67l44J44K48
$$ 213 363 722 854 486 419 737 743 618 833 911 876 983 767 803 908 913 1034 982 996 779 585 818 985 641 785 1033
-7658A033k6Jq7o8k28p7K16j4j39J16L81P0M0J91R4j12m20l35q0L9k7N6J81j66m82k1J73J05
$$ 1033 1007 1008 921 853 625 548 764 750 611 727 1108 1178 1218 1409 1503 1391 971 636 556 595 568 624 805 639 157 136 309 414
-7630D14L80L85q7m04j23J70K69L26K07l0RK72j33l26k99j30k79j82J16J05j27O3J14j81j1
$$ 414 794 1179 1092 688 565 735 1004 1330 1537 1507 1516 1788 1655 1329 1030 900 621 439 555 660 533 596 710 529 518
-7605E18K35j91n14j67K74J40j21K11K47o6k62J04K07k2m18k28N6K92L08l95MM69M9L3M9j96
$$ 518 753 562 48 -119 155 295 174 385 632 566 304 408 615 593 175 -53 3 295 603 208 212 681 730 763 812 616
-7579F16k0L82M22J84k45l99m8OL14L45p9k86j73J3j2j2%j1k82j81o0j09j3j0l14J72M28J86
$$ 616 596 978 1400 1584 1339 940 892 898 1212 1557 1478 1192 1019 1032 1020 1008 1008 997 715 534 474 365 352 342 28 200 628 814
-7551H14K42K81L09j23l77q2Q0m49m28L15P45J99l31j23N0K03k0j91MK09O1k4m99k52M85K62
$$ 814 1056 1337 1646 1523 1146 1064 1144 695 267 582 1327 1526 1195 1072 1122 1325 1305 1114 1118 1327 1388 1364 865 613 1098 1360
-7525A360k56l72k69pK48R4n6j07K3K22M7l07l72l1K91P60M87k20o76m21Q2L23J95K43K87
$$ 1360 1104 732 463 456 704 798 742 635 658 880 927 620 248 217 508 1268 1755 1535 859 438 520 843 1038 1281 1568
-7500A568P4K87K00k49k92j95k23L2j77R0K84l7j26l6K85J46q4J11J94J26J7l3k75l15q8P
$$ 1568 1642 1929 2129 1880 1588 1393 1170 1202 1025 1115 1399 1362 1236 1200 1485 1631 1547 1658 1852 1978 1995 1962 1687 1372 1284 1291
-7474A291QK1M0j76j43L6k21k00J83P0j42j46k21R5J68L65L20q5j41Po48p36j88K69J90N15
$$ 1291 1299 1320 1360 1184 1041 1077 856 656 839 909 767 621 400 495 663 1028 1348 1263 1122 1129 481 -255 -443 -174 16 531
-7448E31N52N9J53J20Q0P5m43l62L5J08M85M20p8j9j19J15L34j65l94k10j22pj24j81K21O11
$$ 531 1083 1142 1295 1415 1495 1570 1127 765 800 908 1393 1813 1735 1716 1597 1712 2046 1881 1487 1277 1155 1148 1024 843 1064 1675
-7422A675L87p3j43l07n84n86j56J08n7o0k29j23J12J84M64K89j58k04k9k35l4K63K80J29
$$ 1675 2062 1989 1846 1539 955 369 213 321 264 204 -25 -148 -36 148 612 901 743 539 510 275 241 504 784 913
-7398I13L19J46j19r1K3Q3J31R8j33RJ76k26q7M9j36K68K02j39n55k28M4J34J20k75L2L11
$$ 913 1232 1378 1259 1168 1191 1274 1405 1503 1370 1379 1555 1329 1242 1291 1155 1423 1625 1486 931 703 747 881 1001 726 758 1069
-7372A069J45j60J25K79O9L14J85k06l93l28M3N7J07Kj69j19m4j04l11k43l5K15J30O2P8J11
$$ 1069 1214 1054 1179 1458 1527 1841 2026 1820 1427 1099 1142 1199 1306 1308 1139 1020 976 872 561 318 283 498 628 690 768 879
-7346H79M1J40J16K75J60K01L39o3P6j01m75n87r7L84M43K9q1j17j07L6k28k53J4l2q6K00
$$ 879 920 1060 1176 1451 1611 1812 2151 2088 2164 2063 1588 1001 904 1288 1731 1760 1679 1562 1455 1491 1263 1010 1024 992 906 1106
-7320A106K38l10l25k05N4J97O2k06k22j94J67K86n6m5K09O49N34J21j77o4P6l13m99k72L92
$$ 1106 1344 1034 709 504 558 755 817 611 389 195 362 648 592 547 756 1405 1939 2060 1883 1819 1895 1582 1083 811 1203
-7295A203K92k09k84r0K61j23l38j44J57L84K76r8l21j06kk9L74L46J04o9n30l00Q6K13K09
$$ 1203 1495 1286 1002 912 1173 1050 712 568 725 1109 1385 1287 966 860 858 829 1203 1549 1653 1584 1054 754 840 1053 1262
-7270A262m1k16n07o05j10M89M72K51K03K51q4k93J42nj47l61l70J48L54J20k35k41J17K71
$$ 1262 1221 1005 498 -107 -217 272 744 995 1198 1449 1365 1072 1214 1209 1062 701 331 479 833 953 718 477 594 865
-7246H65M66M14K55j49P2J30j79m13l43m8k75n03O7K17O3j45RK52J53J05J38k60k14J70J53
$$ 865 1331 1745 2000 1851 1923 2053 1874 1461 1118 1070 795 292 359 576 639 494 503 755 908 1013 1151 891 677 847 1000
-7221A000M1k58l26j29M61L84j86l63k94m4K95L10J98M24N61J56l45l85J43K47j60l29K1N
$$ 1000 1041 783 457 328 789 1173 987 624 330 286 581 891 1089 1513 2074 2230 1885 1500 1643 1890 1730 1401 1422 1427
-7197A427J24j65m05j63J95k65l75K5L19L30K24Jm90l28o5n2N1K69M84J73j65rJ4l19k32L97
$$ 1427 1551 1386 981 818 1013 748 373 398 717 1047 1271 1272 782 454 389 337 388 657 1141 1314 1149 1140 1154 835 603 1000
-7171A000P43K74l37j65K14j82k70m20m43j58J72J83j40k66K30M43L58M71K75o7k77l70l22
$$ 1000 1743 2017 1680 1515 1729 1547 1277 857 414 256 428 611 471 205 435 878 1236 1707 1982 1915 1638 1268 946
-7148I46r7L11M41M4k66K5n2j65L4q4k30J68L52m0J04n1J66L43k64l05K19K63l1P5K07J18
$$ 946 849 1160 1601 1645 1379 1404 1352 1187 1221 1137 907 1075 1427 1387 1491 1440 1606 1949 1685 1380 1599 1862 1831 1906 2113 2231
-7122B231O8j21j54K2k10j88J34J20n8n7m06n60k18J43N06J84M9K6Kl5k28l97l70l13J73L35
$$ 2231 2299 2178 2024 2046 1836 1648 1782 1902 1844 1787 1381 821 603 746 1252 1436 1485 1511 1513 1478 1250 853 483 170 343 678
-7096F78P7j30J35J71L92J19k36k58n76J52Q11K77K9k67j87j01m67m05L71O34R2l94m00K6
$$ 678 755 625 760 931 1323 1442 1206 948 372 524 1335 1612 1641 1374 1187 1086 619 214 585 1219 1311 917 517 543
-7072E43O93N73P9J0J15L6j66l19k6K40R2m70p63p46kP02O01J89K13j39j19k27l99k78j65
$$ 543 1236 1809 1888 1898 2013 2049 1883 1564 1538 1778 1870 1400 637 -109 -111 591 1192 1381 1594 1455 1336 1109 710 432 267
-7047B67J54L7L22J07KL04k62k17L50j0J13m1l59m13J76N33O3J08J38k09k99J93J79j57m34
$$ 267 421 458 780 887 889 1193 931 714 1064 1054 1167 1126 767 354 530 1063 1126 1234 1372 1163 864 1057 1236 1079 645
-7022F45j98J56n6j89k52K1J28Q4Q8K75J13K21L82j05m05k54l76Qj75q8K12K51M67M14j78
$$ 645 447 603 547 358 106 127 255 339 427 702 815 1036 1418 1313 908 654 278 286 111 23 235 486 953 1367 1189
-6997A189j52L92L81J89k76m9J97j93o02l47J46l14l66k04r0J38L33L34J30K60L47J24mj88
$$ 1189 1037 1429 1810 1999 1723 1674 1871 1678 1076 729 875 561 195 -9 -99 39 372 706 836 1096 1443 1567 1563 1375
-6973A375J55l3m68m3j43m49J40L91k1j93J42J56J97K51k40l84J89J9m29k97P1J9K0J90q1
$$ 1375 1530 1497 1029 986 843 394 534 925 904 711 853 1009 1206 1457 1217 833 1022 1041 612 315 386 405 425 615 534
-6948E34K3N16M17l95m56J01N9M1k24n14m18j94N43M45N38L59j07k12j28R1K67J16N7k45m44
$$ 534 557 1073 1490 1095 639 740 799 840 616 102 -316 -510 33 478 1016 1375 1268 1056 928 1019 1286 1402 1459 1214 770
-6923G70k79j57r2Q3J80J34J01k88j1N61J54n76n16j44j69j09j82k0Q58P70K77J86j48o45
$$ 770 491 334 242 325 505 639 740 452 441 1002 1156 580 64 -80 -249 -358 -540 -560 298 1068 1345 1531 1383 738
-6899G38k82j7j98j72L07M62M04K85k86j83l87p12k10L60K90J69Q0k12n8K47K35K07L71n9
$$ 738 456 439 241 69 376 838 1242 1527 1241 1058 671 -41 -251 109 399 568 648 436 378 625 860 1067 1438 1379
-6875A379j72J58N4k46j43l0o8K17J62j52m72k27J40J66K3K88P21R4n14k07r6qq0o9K15k7
$$ 1379 1207 1365 1419 1173 1030 1000 932 1149 1311 1159 687 460 600 766 789 1077 1798 1892 1378 1171 1075 1067 987 918 1133 1106
-6849A106n5j76J8L46J69o9Q6O5rj32k95q8k54k10N2k00l84N3N58L85n7m5L2k9j3m8j92l35
$$ 1106 1051 875 893 1239 1408 1339 1425 1490 1481 1349 1054 966 712 502 554 354 -30 23 581 966 909 864 896 867 854 806 614 279
-6821B79k79n6N71P27M5k59l89m30k28L77O59K31RK76J27k68P6N06K63j04l48l95k25m73j87
$$ 279 0 -56 515 1242 1287 1028 639 209 -19 358 1017 1248 1257 1533 1660 1392 1468 1974 2237 2133 1785 1390 1165 692 505
-6796E05N86N68M9m58k73j03M3J60O1J04J63K77P7l58m70j69J45N01pl60k04j78O6J82m6j63
$$ 505 1091 1659 1708 1250 977 874 917 1077 1138 1242 1405 1682 1759 1401 931 762 907 1408 1401 1041 837 659 725 907 861 698
-6770F98n0j95l63P4K56j1j85n5j8j50j6M92N01Jk13j70L02K05N6j19j67p8l0j93LL44K06
$$ 698 648 453 90 164 420 409 224 169 151 1 -15 477 978 979 766 596 898 1103 1159 1040 873 795 765 572 575 919 1125
-6743A125j9m10k11m43j23K79J51J57J64K0K38L06q7k44j01k05q9K56M6k13K35N77j3n01p0
$$ 1125 1106 696 485 42 -81 198 349 506 670 690 928 1234 1147 903 802 597 508 764 810 597 832 1409 1396 895 825
-6718H25R1n9J6J62n5j17J23j7j23P0M13K44q8Oo1k93n4L0P5m53o4J14l15M1q7N9M80K57j8
$$ 825 916 857 873 1035 980 863 986 969 846 916 1329 1573 1485 1491 1430 1137 1083 1113 1188 735 671 785 470 511 424 483 963 1220 1202
-6689A202k17M7l9m51j35RJ27J33j4K11Oj36j90k87O8K24J56J16P0j41k79j29O99R17J26n56
$$ 1202 985 1032 993 542 407 416 543 676 662 873 879 743 553 266 334 558 714 830 900 759 480 351 1050 1967 2093 1537
-6663A537m35j95j81J46K9m37n03l99q2N20M74k4l7J80K01Jr3n7n5k36j18p8j29j10L0K33
$$ 1537 1102 907 726 872 901 464 -39 -438 -520 0 474 450 413 593 794 795 702 645 590 354 236 158 29 -81 -51 182
-6637A82M13M17j96k68K83Q0j30k55j51q4N1O0p5m0m3M80M39K1l4m6q4N2J32k69m0k43m74
$$ 182 595 1012 816 548 831 911 781 526 375 291 342 402 327 287 244 724 1163 1184 1150 1104 1020 1072 1204 935 895 652 178
-6610A78M5O4nk20K81L56l9J21L2j73k70N1J96R7j11O0J60K20J09k49q9N8Nj09K7L7J73l3
$$ 178 223 287 282 62 343 699 660 781 813 640 370 421 617 714 603 663 823 1043 1152 903 814 872 877 768 795 832 1005 972
-6582I72q3L00N62km31k33K6K32K64J50M54J5m83l56l64m11j89J92K01K20K41j3p32m16K72
$$ 972 889 1189 1751 1749 1318 1085 1111 1343 1607 1757 2211 2226 1743 1387 1023 612 423 615 816 1036 1277 1264 532 116 388
-6557C88L52J28Po3k62j44K59K81o2j1q3P1K3K75K85K93j1j35p3j08j26n21l25J11j80j48
$$ 388 740 868 875 812 550 406 665 946 884 873 790 861 884 1159 1444 1737 1726 1591 1518 1410 1284 763 438 549 369 221
-6531B21K29J31J0J81R7j02J92K96j44l80l4N96K99l86o01n27m57k03R3L08M05J71M09k73
$$ 221 450 581 591 772 869 767 959 1255 1111 731 697 1293 1592 1206 605 78 -379 -582 -489 -181 224 395 804 531
-6507E31l26o1j0K60J82n9K24K80j19m37k21l2k11j61j53O4O69N53J3m61k94j99j89l4L57
$$ 531 205 144 134 394 576 517 741 1021 902 465 244 212 1 -160 -313 -249 420 973 986 525 231 32 -157 -191 166
-6482A66J47P7L84L29L00M59o1n95n17J06L12J23o6k02j89n14j39L61L63J11q7Op6k03JL16
$$ 166 313 390 774 1103 1403 1862 1801 1206 689 795 1107 1230 1164 962 773 259 120 481 844 955 868 874 798 595 596 912
-6456I12J22j94l64n05l7O63N57L32k31N4K37j38k22k66N7J37j66M4K25N7K19L25j39n83k08
$$ 912 1034 840 476 -29 -66 597 1154 1486 1255 1309 1546 1408 1186 920 977 1114 948 992 1217 1274 1493 1818 1679 1096 888
-6431H88J54J09N0O3M1Q1K27K09k39j15o9J10l0n75j49K2m33J13J83M90K79j23k6K8j40l19
$$ 888 1042 1151 1201 1264 1305 1386 1613 1822 1583 1468 1399 1509 1479 904 755 777 344 457 640 1130 1409 1286 1260 1288 1148 829
-6405H29m27k06j36J69K12P2J45J35J00M15K46p5k76n7l2P8Q2m89m40R7p1k13j8RM24P21J04
$$ 829 402 196 60 229 441 513 658 793 893 1308 1554 1479 1203 1146 1114 1192 1274 785 345 442 371 158 140 149 573 1294 1398
-6378A398l7o3o42q76q06j64Q19O18J19K73k7k20j89k87n2l3J67R5j57j28K68M16L47L30M0
$$ 1398 1361 1298 656 -220 -1026 -1190 -371 247 366 639 612 392 203 -84 -136 -169 -2 93 -64 -192 76 492 839 1169 1209
-6353A209j0r2O2n6k78k33j89L38M76l46k74O5k87l58k73O4M07N40K19j08o3L49O28N89l51
$$ 1209 1199 1107 1169 1113 835 602 413 751 1227 881 607 672 385 27 -246 -182 225 765 984 876 813 1162 1790 2379 2028
-6328B028o58k75j97j24j31r7q2k24k24q1j38L73L73r8k15q7n2l7j5K41M08L83l0l74q6j9
$$ 2028 1370 1095 898 774 643 546 464 240 16 -65 -203 170 543 445 230 143 91 54 39 280 688 1071 1041 667 581 562
-6302E62j15K7K35K03M91R0l37p4r9m5L8J43k85l81k76p4J29J71n8O1L37N38N6j75J37j77
$$ 562 447 474 709 912 1403 1493 1156 1082 983 938 976 1119 834 453 177 103 232 403 345 406 743 1281 1337 1162 1299 1122
-6276A122l32l39q16k91J66P2J38M40N35L37j21m48l53J9L31K33J39mP5lJ93O4q6O1mn6L80
$$ 1122 790 451 -365 -656 -490 -418 -280 160 695 1032 911 463 110 129 460 693 832 828 903 900 1093 1157 1071 1132 1128 1072 1452
-6249A452M0l57l31m20K07M78j14l09R2k41l19P5j06p4J32m5k38k77J21J95qJ58o7j85J67
$$ 1452 1492 1135 804 384 591 1069 955 646 738 497 178 253 147 73 205 160 -78 -355 -234 -39 -47 111 44 -141 26
-6224B6L35L90K96J87Q7j66j93k68k14k44J32M83M42K52n92p28l45n0l1J03M78R7j15l03o21
$$ 26 361 751 1047 1234 1321 1155 962 694 480 236 368 851 1293 1545 953 225 -120 -170 -201 -98 380 477 362 59 -562
-6199e62qN47M9J34K31k72J82J82J7K41j3m06K5L34q0j73J59O4l93j56L46J50j74J69M7M8
$$ -562 -570 -23 26 160 391 119 301 483 500 741 728 322 347 681 601 428 587 651 258 102 448 598 424 593 640 688
-6173F88o0l55Q1K90m82m87J40K89J71p1j88j34l2K13K64k27j22K90K98K30K10J44k5K3J70
$$ 688 628 273 354 644 162 -325 -185 104 275 204 16 -118 -150 63 327 100 -22 268 566 796 1006 1150 1125 1148 1318
-6148A318J16k95k9J26j72j18q7l15j76K16K96K56j21nL32K36l46j27r6m38l77j10j5K69K36
$$ 1318 1434 1139 1110 1236 1064 946 859 544 368 584 880 1136 1015 1010 1342 1578 1232 1105 1009 571 194 84 69 338 574
-6123E74o5l96o7K68J11j98j89k61r7K29L05N9J00L18K22m9o7M62K35j86m91n38l15J24n0
$$ 574 509 113 46 314 425 227 38 -223 -320 -91 214 273 373 691 913 864 797 1259 1494 1308 817 279 -36 88 38
-6098C8lk82k54J01L06J61K54K84N9j54n25L78N95J5l31k18n8j26n2Q9p8k26J82J55j32K58
$$ 38 35 -247 -501 -400 -94 67 321 605 664 510 -15 363 958 973 642 424 366 240 188 277 199 -27 155 310 178 436
-6072D36M07j68k37m0R9O40P05K94k97l42j80N1k97m21R5L76J30j2J57n18o00o1N8j96k58
$$ 436 843 675 438 398 497 1137 1842 2136 1839 1497 1317 1368 1071 650 745 1121 1251 1239 1396 878 278 217 275 79 -179
-6047a79J49K43J36R7J23L95k4m15K0L80j49l73j8L64Q6k74n99n19l20k0J69K36L24R5o6O81
$$ -179 -30 213 349 446 569 964 940 525 545 925 776 403 385 749 835 561 -38 -557 -877 -897 -728 -492 -168 -73 -139 542
-6021E42N47j26l50j27P7k36k34n0N51P08J95m00l65l21n9M2k4j06Q9L07L4J70K44r3K6M39
$$ 542 1089 963 613 486 563 327 93 43 594 1302 1497 1097 732 411 352 394 370 264 353 660 694 864 1108 1015 1041 1480
-5995A480J10m30m29k07m4L25L51n4m15k74o8M2j97k16K97Q2j34L57J83q5j92M6K27q9rk58
$$ 1480 1590 1160 731 524 480 805 1156 1102 687 413 345 387 190 -26 271 353 219 576 759 674 482 528 755 666 657 399
-5969C99l2J41m0j99m23K36P03K5m0k8n2j0o8l17M5M06L72Q1k63m32k37J40J64j33l55RK38
$$ 399 367 508 468 269 -154 82 785 810 770 742 690 680 612 295 340 746 1118 1199 936 504 267 407 571 438 83 92 330
-5942C30PO6r9J3K08J81ok28j19j50k25RJ34J82P2K08K72j1L68M82M06j86n05l7L7M2J23l78
$$ 330 337 403 304 317 525 706 700 472 353 203 -22 -13 121 303 375 583 855 844 1212 1694 2100 1914 1409 1372 1409 1451 1574 1196
-5914A196o55j99J63q6j14J14L73M28N1q5j4J27P4j21R8J47n6k45m86l35m2l33l10R1L38L2
$$ 1196 541 342 505 419 305 419 792 1220 1271 1186 1172 1299 1373 1252 1350 1497 1441 1196 710 375 333 0 -310 -219 119 151
-5888A51K95O78J20j47l09l04L9M2j30J04Q2J71L88j2j48k96k87p1L08K70o2J1l12m78k46
$$ 151 446 1124 1244 1097 788 484 523 565 435 539 621 792 1180 1168 1020 724 437 366 674 944 882 893 581 103 -143
-5863a43J25q4l65K26M43J69Ll18m56j40N95L90j10j91l24J5K88J97j41l54J6M39O5j57J4
$$ -143 -18 -102 -467 -241 202 371 374 56 -400 -540 55 445 335 144 -180 -165 123 320 179 -175 -159 280 345 188 202
-5838B02r4O4P8J97J26LJ33k57l2q3n38K7L94Q3n8r3mK71Q2j07k21m37k79L52P04J10l05k20
$$ 202 108 172 250 447 573 576 709 452 420 337 -201 -174 220 303 245 152 148 419 501 394 173 -264 -543 -191 513 623 318 98
-5810I8n22J35K80K11L27K25M0k2K33L6k19k60r2l3k62j75J67j57j7M91M31J57j72k76k14
$$ 98 -424 -289 -9 202 529 754 794 772 1005 1041 822 562 470 437 175 0 167 10 -7 484 915 1072 900 624 410
-5785D10J6J45k74l43J84mJ29M63J36J18J81k7j55N0K20k11n07J62L86k43k79J67P6Q5K03
$$ 410 426 571 297 -46 138 134 263 726 862 980 1161 1134 979 1029 1249 1038 531 693 1079 836 557 724 800 885 1088
-5760A088m9j03l94k92k20l20j18J97j49K8N27M63L64L3l65l02J66J67M34L99j41m02l75j13
$$ 1088 1039 936 542 250 30 -290 -408 -211 -360 -332 195 658 1022 1055 690 388 554 721 1155 1554 1413 1011 636 523
-5736E23O86L69m45k21J32K90R7r9k59l07n62k86N5L4QJ90K97O1N0K10K97k7j79j3k38l95
$$ 523 1209 1578 1133 912 1044 1334 1431 1332 1073 766 204 -82 -27 7 15 205 502 563 613 823 1120 1093 914 901 663 268
-5710B68p3L00L64R0k65j03K83M58N9l03K3J67j5m1j30l38n00l29qP53P85K72k82j24K9k49
$$ 268 195 495 859 949 684 581 864 1322 1381 1078 1101 1268 1253 1212 1082 744 244 -85 -93 660 1445 1717 1435 1311 1340 1091
-5684A091j59K01J62k27p4j12l74n7K06j54l59k50O6M03N3o8Q0m12j81K84O93K30m19NJ87
$$ 1091 932 1133 1295 1068 994 882 508 451 657 503 144 -106 -40 363 416 348 428 16 -165 119 812 1042 623 628 815
-5659H15r3n4J16j38k65J46J31k89k85j51J6K85N8J21L17j52m65j25k3n8jk34l64K10O76K54
$$ 815 722 668 784 646 381 527 658 369 84 -67 -51 234 292 413 730 578 113 -12 -35 -93 -94 -328 -692 -482 194 448
-5633D48k74J69K08L46P6jlk3J08l3j73k93q3M2M0L25M06L6j41j54Qn9l12m98m36L92O60P7
$$ 448 174 343 551 897 973 972 969 946 1054 1021 848 555 472 514 554 879 1285 1321 1180 1026 1034 975 663 165 -271 121 781 858
-5605H58l1j36l06p6j44j67O1K75N01N40M1l76j14kl17n5N9k22j78j92O5P75P19m7n56n17
$$ 858 827 691 385 309 165 -2 59 334 835 1375 1416 1040 926 924 607 552 611 389 211 19 84 859 1578 1531 975 458
-5579D58o2J08p1j64n3o2j19k34k53J96O28M19j72l58k84L22M58K39P1k61n34l85J23M24M46
$$ 458 396 504 433 269 216 154 35 -199 -452 -256 372 791 619 261 -23 299 757 996 1067 806 272 -113 10 434 880
-5554H80L37J86l10m25Q1Rl10r3o8j49k18J72L98L57oj50K12N1l00n43qL44K58K74o0j51J94
$$ 880 1217 1403 1093 668 749 758 448 355 287 138 -80 92 490 847 841 691 903 954 654 111 103 447 705 979 919 768 962
-5527I62K62j8k95j47j85j31K3J69j03R1n6j22K69L49J83m19n08J76K58J0j13o8Q8m68n80
$$ 962 1224 1206 911 764 579 448 471 640 537 628 572 450 719 1068 1251 832 324 500 758 768 655 587 675 207 -373
-5502c73r2j74k30L39Q39N82J34m8j23o1l4L9k80l24K38N19M03j32l36ol28k82M2J4K0J15
$$ -373 -465 -639 -869 -530 309 891 1025 977 854 793 759 798 518 194 432 951 1354 1222 886 880 552 270 312 326 346 461
-5476D61K42L57j46j84%k1J43P0j22m07j81J53m1n6j49J79J63J88o3l83j27j4j61K34N03J43
$$ 461 703 1060 914 730 730 709 852 922 800 393 212 365 324 268 119 298 461 649 586 203 76 62 -99 135 638 781
-5450G81K10J14k88l09j3j01J2J66K34l6m51l04K55M14J80O8q4j42k04N0M49P31O70Nl82l56
$$ 781 991 1105 817 508 495 394 406 572 806 770 319 15 270 684 864 932 848 706 502 552 1001 1732 2402 2407 2025 1669
-5424A669j46O1o9o6k60l88n0N3J01P7L3M32Q5l39m17o35j88K2L5J19m6j46n7J8J61M60J48
$$ 1669 1523 1584 1515 1449 1189 801 751 804 905 982 1015 1447 1532 1193 776 141 -47 -25 10 129 83 -63 -120 -102 59 519 667
-5397F67k43j77J10K46J80J37J5j10j95k56m5n1J10O5l29o0J60K23K82k27k85J16J20P2K61
$$ 667 424 247 357 603 783 920 935 825 630 374 329 278 388 453 124 64 224 447 729 502 217 333 453 525 786
-5372G86K75J57R4L00P4n03k0L59J04j15k0J12N0P6J32k41l61j60j35j03j39j73J39K3k63
$$ 786 1061 1218 1312 1612 1686 1183 1163 1522 1626 1511 1491 1603 1653 1729 1861 1620 1259 1099 964 861 722 549 688 711 448
-5347D48j37R3K46Q2k6j02l08l26j0K18K97m7J62K75o9j84k32p4L84L38O5j36n82k07L06K90
$$ 448 311 404 650 732 706 604 296 -30 -40 178 475 428 590 865 796 612 380 306 690 1028 1093 957 375 168 474 764
-5321G64q9k30l43q1K86K39J45L07R7k16k69p0Q7J03O6k2k07l94l94l86O6M43l4l78j53M46
$$ 764 675 445 102 21 307 546 691 998 1095 879 610 540 627 730 796 774 567 173 -221 -607 -541 -98 -132 -510 -663 -217
-5295b17N92K37m46j57J42k13m11o0J23J55J0j71J19L65j58k34J97J10j24p9M15M18K23j03
$$ -217 375 612 166 9 151 -62 -473 -533 -410 -255 -245 -416 -297 68 -90 -324 -127 -17 -141 -220 195 613 836 733
-5271G33k44MK40k03o37m95L9L88K40K11L11K32p2L4K39J59k29j70p7L47L83j54n4k10j52
$$ 733 489 493 733 530 -107 -602 -563 -175 65 276 587 819 747 781 1020 1179 950 780 703 1050 1433 1279 1225 1015 863
-5246H63O3k63m10k10J7K82L79K07J62k6m86n08p8J26n1J04p2M8O5J46J13J19M26K31l5o2
$$ 863 926 663 253 43 60 342 721 928 1090 1064 578 70 -8 118 67 171 99 147 212 358 471 590 1016 1247 1212 1150
-5220A150j5p2l81m31J60N58L39N9R3J99L42K3l05k1J69k25k90J73L49j25m03m22l35l2P1
$$ 1150 1135 1063 682 251 411 969 1308 1367 1460 1659 2001 2024 1719 1698 1867 1642 1352 1525 1874 1749 1346 924 589 557 628
-5195F28m2K45K30m9o6k39j03L54L53J43k15n47m98N2J16J22K11K38J6k19k33j70J18K43M02
$$ 628 586 831 1061 1012 946 707 604 958 1311 1454 1239 692 194 246 362 484 695 933 949 730 497 327 445 688 1090
-5170A090K45O9m11o28l49k34m22k13L61M4m28l18NK22M14M19M82M04K2o3j54l83J54L44J76
$$ 1090 1335 1404 993 365 16 -218 -640 -853 -492 -448 -876 -1194 -1189 -967 -553 -134 348 752 774 711 557 174 328 672 848
-5145H48M4K0j8l97l92k11r2L04K29k22r0J52L09j33J45J52m10q0L69K69L02K0j8J07rk03
$$ 848 892 912 894 497 105 -106 -198 106 335 113 23 175 484 351 496 648 238 158 527 796 1098 1118 1100 1207 1198 995
-5119I95n8l63m55k67J70N02J62m19k7K98J08j60N0M52K64n37o25o1j34L3M30K75j01R5Q9
$$ 995 937 574 119 -148 22 524 686 267 240 538 646 486 536 988 1252 715 90 29 -105 -72 358 633 532 627 716
-5094G16j78k02L0J00l9j27k32L34M28J35K00K10K99J17j99k23k60J34L21j31l17l1r2j18
$$ 716 538 336 366 466 427 300 68 402 830 965 1165 1375 1674 1791 1592 1369 1109 1243 1564 1433 1116 1085 993 875
-5070H75L2j49k91ML14K56j76k81k56k43k76L23K22J94K63L76o5k43K31L53O2n43l25K02l2
$$ 875 907 758 467 471 785 1041 865 584 328 85 -191 132 354 548 811 1187 1122 879 1110 1463 1525 982 657 859 827
-5045H27k49l22j9J63j60j51l64l25K61K51K31J75L91N44K24M6k86n69l93l17p4j3k43k24
$$ 827 578 256 237 400 240 89 -275 -600 -339 -88 143 318 709 1253 1477 1523 1237 668 275 -42 -116 -129 -372 -596
-5021e96k7J09J53M55n9j97M41M45P2m29m49K53L79K75L32N3m94j28K85L19k57j79P0j15k92
$$ -596 -623 -514 -361 94 35 -162 279 724 796 367 -82 171 550 825 1157 1210 716 588 873 1192 935 756 826 711 419
-4996D19o1k60j61o8K62N80O5j48K69L58j32l89j76l39k08R8L93L86J64J0j22k28j54J27%
$$ 419 358 98 -63 -131 131 711 776 628 897 1255 1123 734 558 219 11 109 502 888 1052 1062 940 712 558 685 685
-4971F85j96J31J26j01j87k91mJ38L5O4M47M4k15l11n80k55K24O04J50O2L02J29l12l08n8
$$ 685 489 620 746 645 458 167 163 301 336 400 847 891 676 365 -215 -470 -246 358 508 570 872 1001 689 381 323
-4946C23L9L2K82L15J14o5J68M8l51l08j46j93K0K86J83L02L57k02j00K8q9k35m66j55J32
$$ 323 362 394 676 991 1105 1040 1208 1256 905 597 451 258 278 564 747 1049 1406 1204 1104 1132 1043 808 342 187 319
-4921C19R3j5K65RJ32L80K4k74k95l65m96l84q2N08O66L13l5l1j87N8K78K0O3K38j58k86o1
$$ 319 412 397 662 671 803 1183 1207 933 638 273 -223 -607 -689 -181 485 798 763 732 545 603 881 901 964 1202 1044 758 697
-4894F97J44K73rQ1K35k00n60j83L47Q07K13j72m4k87q09o25JKj67k17j1J9J69K14L55K34
$$ 697 841 1114 1105 1186 1421 1221 661 478 825 1632 1845 1673 1629 1342 533 -92 -91 -89 -256 -473 -484 -465 -296 -82 273 507
-4868E07L66L58K20m3m43l54L7L81M05K14R1L8j78m48m28m74j75J80K28Q2K01J6M8K10j50
$$ 507 873 1231 1451 1408 965 611 648 1029 1434 1648 1739 1777 1599 1151 723 249 74 254 482 564 765 781 829 1039 889
-4843H89J37J56J11L9k29k52j4L00K1m15k85j12O8N46N21j66M3J04j30n53m95j1r7l63J10
$$ 889 1026 1182 1293 1332 1103 851 837 1137 1158 743 458 346 414 960 1481 1315 1358 1462 1332 779 284 273 176 -187 -77
-4818g7N32J80k89m67L5R7p0j75r6R2n3j00Q2K73L25J45k65n38j65L08J19K33K58l5n8J57
$$ -77 455 635 346 -121 -86 11 -59 -234 -330 -238 -291 -391 -309 -36 289 434 169 -369 -534 -226 -107 126 384 349 291 448
-4792D48JJ21J75M49L17J04J2n1l96l88j7k3J16j12p7j15k33m8J92L9k8L61J40j3k81k65j29
$$ 448 449 570 745 1194 1511 1615 1627 1576 1180 792 775 752 868 756 679 564 331 283 475 514 486 847 987 974 693 428 299
-4765B99K7J34J26J12l07k36P8Q2J03K11j16k9Rp6L1O8K37rn5l9N3J75K4rJ78ok85j42j79
$$ 299 326 460 586 698 391 155 233 315 418 629 513 484 493 417 448 516 753 744 689 650 703 878 902 893 1071 1065 780 638 459
-4736D59n75m05j48K60N65N79K19m3K08M2n7l2m32k13l91k92K20K33N69K96j91k33l12q5J4
$$ 459 -116 -521 -669 -409 156 735 954 911 1119 1161 1104 1072 640 427 36 -256 -36 197 766 1062 871 638 326 241 255
-4711B55J62L37P7q3l13o61j39K26J90j07j4M6L5p1j16j04l72J41K19K83J95k10l87J3Q4l07
$$ 255 417 754 831 748 435 -226 -365 -139 51 -56 -70 -24 11 -60 -176 -280 -652 -511 -292 -9 186 -24 -411 -398 -314 -621
-4685f21o92l71J52O45N30K90J32k04k89k14m25K9N19O27J86j82k82r0M29J1l05J35L26K80
$$ -621 -1313 -1684 -1532 -887 -357 -67 65 -139 -428 -642 -1067 -1038 -519 108 294 112 -170 -260 169 180 -125 10 336 616
-4661F16J71N3k36m75m89K13O33J72j05m4j52Q7L79J06m0K28J29j84n34j25L69J14k80j63
$$ 616 787 840 604 129 -360 -147 486 658 553 509 357 444 823 929 889 1117 1246 1062 528 403 772 886 606 443
-4637D43j93K58L75N4j43j73j24O5N1jK22J36l00l77j31k68q9K25M34N0j77j11r8o2L13K56
$$ 443 250 508 883 937 794 621 497 562 613 612 834 970 670 293 162 -106 -195 30 464 514 337 226 128 66 379 635
-4611F35l3k48j77P0O2N1l02j78K69Q2O3nk80j45L0k7j46k55N9k8k49p8J14L13J82J55M64
$$ 635 602 354 177 247 309 360 58 -120 149 231 294 289 9 -136 -106 -133 -279 -534 -475 -503 -752 -830 -716 -403 -221 -66 398
-4584C98K92J34j6j7L21l3n4m33k86O06N39j37l59n59k67J71%k32k4K87J48j9k08j78j85J02
$$ 398 690 824 808 791 1112 1079 1025 592 306 912 1451 1314 955 396 129 300 300 68 44 331 479 460 252 74 -111 -9
-4558iL15L36K3Q6K80L8k98k54qko9J31M25L06L1L11L12m4j73m09q31n03j66J0J63L42K40
$$ -9 306 642 665 751 1031 1069 771 517 509 507 438 569 994 1300 1331 1642 1954 1910 1737 1328 497 -6 -172 -162 1 343 583
-4531E83J61q3l13m89j84M57L35l04o4K38J88K48N5J12K58l55o86j81q3j1L1j37J05p8K49
$$ 583 744 661 348 -141 -325 132 467 163 99 337 525 773 828 940 1198 843 157 -24 -107 -118 -87 -224 -119 -197 52
-4506E2K14J98M95M41J05k10j9N1J01q3j36l46l05J34N39K04j00m18j86M7k78j66N0J96j14
$$ 52 266 464 959 1400 1505 1295 1276 1327 1428 1345 1209 863 558 692 1231 1435 1335 917 731 778 500 334 384 580 466
-4481D66k6J42J10K18Pk52J29O57J61Q0L69k37p19l34K72l5j58j50p9n7J3j58k74j62l16o2
$$ 466 440 582 692 910 917 665 794 1451 1612 1692 2061 1824 1105 771 1043 1008 850 700 621 564 577 419 145 -17 -333 -395
-4455c95K41L86J18l00k80j1N26O13j33m64l71p8o5J03L52L10Q3k21l96j12M54L52J75J99
$$ -395 -154 232 350 50 -230 -241 285 898 765 301 -70 -148 -213 -110 242 552 635 414 18 -94 360 712 887 1086
-4431A086j26l35k34q8L62J22k51k81m00k04J40K82k5rK57K95K83J80m9j1Q5o0j18o9M1J3
$$ 1086 960 625 391 303 665 787 536 255 -145 -349 -209 73 48 39 296 591 874 1054 1005 994 1079 1019 901 832 873 886
-4405H86r2J29p4p2K2j30q6k47n08j72p8J94K20K48L26J12k29p06l00N9K49N01K35r6q8q6
$$ 886 794 923 849 777 799 669 583 336 -172 -344 -422 -228 -8 240 566 678 449 -257 -557 -498 -249 252 487 391 303 217
-4379B17j20J54K19o7m5L57L67K18K32J08Oj6m9j31l17l31j18j44k31l3JqJ29L26M21J88m9
$$ 217 97 251 470 403 358 715 1082 1300 1532 1640 1646 1630 1581 1450 1133 802 684 540 309 276 277 269 398 724 1145 1333 1284
-4352A284k34j66J38K55K82j85k67k36l30l56P0K43K72K33j17n06n46r7J5J34K95M34K64l42
$$ 1284 1050 884 1022 1277 1559 1374 1107 871 541 185 255 498 770 1003 886 380 -166 -263 -248 -114 181 615 879 537
-4328E37m40N7K06JLJ11k0m4l0J81k52l09k19m9k26j7k7m0l3J01Q9m03j79J61L77L56j58m44
$$ 537 97 154 360 361 364 475 455 411 381 562 310 1 -218 -267 -493 -510 -537 -577 -610 -509 -420 -823 -1002 -841 -464 -108 -266 -710
-4300g10m4K73L47J06n6L36J25l25l55k07J74J58K06J99J55k8or0Q0j14l82k89L2J66j21m22
$$ -710 -754 -481 -134 -28 -84 252 377 52 -303 -510 -336 -178 28 227 382 354 348 258 338 224 -158 -447 -415 -249 -370 -792
-4274g92l2L50L54q8q1M17L15M08O2l33l06j20j21%O3N5R9J85J56m0m0J85p7l24j68o4M57
$$ -792 -824 -474 -120 -208 -289 128 443 851 913 580 274 154 33 33 96 151 250 435 591 551 511 696 619 295 127 63 520
-4247E20N43L04k21n35m44l50l59l3N3K57L58K89q0k61j73lJ21J06L70K50J46K05J35m3m22
$$ 520 1063 1367 1146 611 167 -183 -542 -575 -522 -265 93 382 302 41 -132 -135 -14 92 462 712 858 1063 1198 1155 733
-4222G33k99P4R2l7j26j79o7j78l02P2M31K13j16j52L38N31L62L3m86j89K09j69k14j22l19
$$ 733 434 508 600 563 437 258 191 13 -289 -217 214 427 311 159 497 1028 1390 1423 937 748 957 788 574 452 133
-4197A33r7J09o8%L22L08j53j40J85J32K35k4k96l13k69m1K67R3k18l99m21K85N99j05j05
$$ 133 36 145 77 77 399 707 554 414 599 731 966 942 646 333 64 23 290 383 165 -234 -655 -370 229 124 19
-4172A9K18n7j32L5M2k74l68oL87N27M07j0j7Q4l39k99K8l4J84J46k27q7L17J00J62L86p6
$$ 19 237 180 48 83 125 -149 -517 -523 -136 391 798 788 771 855 516 217 245 211 395 541 314 227 544 644 806 1192 1116
-4145A116l23n4m62o04j29O02N63m09o41j37M53K11l81m53M1K01J53L18K30j02k11J8O8j89
$$ 1116 793 739 277 -327 -456 146 709 300 -341 -478 -25 186 -195 -648 -607 -406 -253 65 295 193 -18 0 68 -121
-4121a21j35K10N1olk90k05K30J79J66M8K13N9k70k20K7J78L40K76kK26J68j6l35m92j24N4
$$ -121 -256 -46 5 -1 -4 -294 -499 -269 -90 76 124 337 396 126 -94 -67 111 451 727 725 951 1119 1103 768 276 152 206
-4094B06L04K39J9n44o44l58K77O57K97L13K51J28j93J93K36l7J08L5j22k86k06p1J96K70
$$ 206 510 749 768 224 -420 -778 -501 156 453 766 1017 1145 952 1145 1381 1344 1452 1487 1365 1079 873 802 998 1268
-4070A268Q9q3Q7J03j42m7j48l07r4K29P5j19k13j93q2l4o3l89j87J48K37J2rL06j1P7P36
$$ 1268 1357 1274 1361 1464 1322 1275 1127 820 726 955 1030 911 698 505 423 389 326 -63 -250 -102 135 147 138 444 433 510 1246
-4043A246M29r7k88m84l71n81n1J67K78K60J93j87l57m5L02L53P7l4l09l69J27M76L67K20
$$ 1246 1675 1578 1290 806 435 -146 -197 -30 248 508 701 514 157 112 414 767 844 810 501 132 259 735 1102 1322
-4019A322Ol02j8K7q2k26j66j40N4J0l13k57PK5m5L08M75L49K64j38m28j00L11L13L9j28j22
$$ 1322 1328 1026 1008 1035 953 727 561 421 475 485 172 -85 -78 -53 -98 210 685 1034 1298 1160 732 632 943 1256 1295 1167 1045
-3992A045K09m7j50k71j11L9j93m6M1P1%j67l70n0R6N6M32K66j84k93m08k58J33L56J90R5
$$ 1045 1254 1207 1057 786 675 714 521 475 516 587 587 420 50 0 96 152 584 850 666 373 -35 -293 -160 196 386 481
-3966D81m60o69j70J53M92K80j20M6J93N47K90k88j48L7j37m02j92K39k6P2k43m54n6K11K95
$$ 481 21 -648 -818 -665 -173 107 -13 33 226 773 1063 775 627 664 527 125 -67 172 146 218 -25 -479 -535 -324 -29
-3941b9M29J83j37p4R9o4k05m41k78K00M1r3N09M61K17LJ62N3k56k18J49m4k46k50m1j6l7
$$ -29 400 583 446 372 471 407 202 -239 -517 -317 -276 -369 140 601 818 821 983 1036 780 562 711 667 421 171 130 114 77
-3914G7K21L76K8l18J47J41k4O7o4n04l54k25k62J20K42J32m8j31J2K31L85K48J7j34K18K46
$$ 77 298 674 702 384 531 672 648 715 651 147 -207 -432 -694 -574 -332 -200 -248 -379 -367 -136 249 497 514 380 598 844
-3888H44j00k37pK46K46j31k88j45l27l77l15j68K3M55N65M60O2l49l58j12N1K19M29J31J0
$$ 844 744 507 500 746 992 861 573 428 101 -276 -591 -759 -736 -281 284 744 806 457 99 -13 38 257 686 817 827
-3863H27lP1Q6pj42J86J00k17n77l15K85J48n2J47J46J00J30L8j73k17j74M38M2k04J4m53
$$ 827 824 895 981 974 832 1018 1118 901 324 9 294 442 390 537 683 783 913 951 778 561 387 825 867 663 677 224
-3837B24l80M23N93J15l10o9K84J60J93J02J36k58m29k48J67M14j17k31RK13k5k69k07k31
$$ 224 -156 267 860 975 665 596 880 1040 1233 1335 1471 1213 784 536 703 1117 1000 769 778 991 966 697 490 259
-3813B59k18j23K4L3K96M14O7Pj67k55n0N54N6k60P3J97J02j20pJ89qk79k89l59k21J75L59
$$ 259 41 -82 -58 -25 271 685 752 759 592 337 287 841 897 637 710 907 1009 889 882 1071 1063 784 495 136 -85 90 449
-3786D49P0l5K59J36j95j17l14k84K04J21L0J79k8J75M02R6k54j11J35J35j60k6k59l70O5
$$ 449 519 484 743 879 684 567 253 -31 173 294 324 503 475 650 1052 1148 894 783 918 1053 893 867 608 238 303
-3761C03K88J54J03J38J55j46LJ39j35j35j24K48K94j1P3j2m9O1j16j52j02k64q9J64p1n8
$$ 303 591 745 848 986 1141 995 998 1137 1002 867 743 991 1285 1274 1347 1335 1286 1347 1231 1079 977 713 624 788 717 659
-3735F59j31j65N2R4j78J1K7k11k69J65L56J40k40l20l88j87M22J93m86k24O32J56rL10L09
$$ 659 528 363 415 509 331 342 369 158 -111 54 410 550 310 -10 -398 -585 -163 30 -456 -680 -48 108 99 409 718
-3710G18K90j06r6Q4L01J38k26l62o21k15J25M01J31j03k03n1n5R0L61j7j58j13m73j45J07
$$ 718 1008 902 806 890 1191 1329 1103 741 120 -95 30 431 562 459 256 205 150 240 601 584 426 313 -160 -305 -198
-3685a98O9Om8L7J14M80L15K0O9K45M5J6j8j98j32k57n0Jj63K48K27l0J45R1o1l46m73m44
$$ -198 -129 -123 -171 -134 -20 460 775 795 864 1109 1154 1170 1152 954 822 565 515 516 353 601 828 798 943 1034 973 627 154 -290
-3657b90nM41K42L1rN57K49n60o98m76J37L74m2j33r5J23o6p2K70M18J60J83Q7l28J04J34
$$ -290 -295 146 388 419 410 967 1216 656 -42 -518 -381 -7 -49 -182 -277 -154 -220 -292 -22 396 556 739 826 498 602 736
-3631G36rj6j30k01J69O0j03M9m04j27K04K32J96j36l91l32k32Q1R2r6P6K46K2P4q4J06L43
$$ 736 727 711 581 380 549 609 506 555 151 24 228 460 656 520 129 -203 -435 -354 -262 -358 -282 -36 -14 60 -24 82 425
-3604D25l36k58j21L6J53K69L40J05k54j53M13K80l48m62J75m9m21K99N43L29K65j01k87r7
$$ 425 89 -169 -290 -254 -101 168 508 613 359 206 619 899 551 89 264 215 -206 93 636 965 1230 1129 842 745
-3580G45k20l51k24j20K81J44j1l23k83M39P37J30j61p0j26K01o2l04n00l79P9K73K66N5m00
$$ 745 525 174 -50 -170 111 255 244 -79 -362 77 814 944 783 713 587 788 726 422 -78 -457 -378 -105 161 216 -184
-3555a84j63M1K88M00m1j67j00N0K46K98K08K72j73j9L15J43l13l35J79k8j31M1l8k37m3L
$$ -184 -347 -306 -18 382 341 174 74 124 370 668 876 1148 975 956 1271 1414 1101 766 945 917 786 827 789 552 509 512
-3529E12j79J29J28k68j06N94lo51n7K13m1j68p5L52O79K67l25n32l28J0J00L34K07J28L5
$$ 512 333 462 590 322 216 810 807 156 99 312 271 103 28 380 1059 1326 1001 469 141 151 251 585 792 920 955
-3504I55j29J78oL8j41n65l5L53M28M37k51n40j96P6J60K30J98M9k26Q5Q9l37p8N5J16J97
$$ 955 826 1004 998 1036 895 330 295 648 1076 1513 1262 722 526 602 762 992 1190 1239 1013 1098 1187 850 772 827 943 1140
-3478A140l0j25K59L25l6m95m05k21P9J32K8N7J25j17k96K01M52k45m31n1O32N77j19j81L
$$ 1140 1110 985 1244 1569 1533 1038 633 412 491 623 651 708 833 716 420 621 1073 828 397 346 978 1555 1436 1255 1258
-3453A258jo08k86J72J68M73L2n29j75r5l94k40p1q5J75M56K38q0l00k59kN78P29k03p15P
$$ 1258 1257 649 363 535 703 1176 1208 679 504 409 15 -225 -296 -381 -206 250 488 408 108 -151 -153 425 1154 951 236 243
-3427B43M43K68k68k25k71m25k79rK8o2J37O52M51M5p3o3j01j56k92k04K83N06L57l4n05k71
$$ 243 686 954 686 461 190 -235 -514 -523 -495 -557 -420 232 683 728 655 592 491 335 43 -161 122 628 985 951 446 175
-3401A75L23J63J57K26j05k61j99L1PK23K99P2l6m09l86j06j52k15r1J86J59K03k3l17p8K67
$$ 175 498 661 818 1044 939 678 479 510 517 740 1039 1111 1075 666 280 174 22 -193 -284 -98 61 264 241 -76 -154 113
-3375A13K15L81M1O7N3K02N34O9k68m75j09K06ok10r5j00k26k82o0K05J2r5o7K5L1j17j02
$$ 113 328 709 750 817 870 1072 1606 1675 1407 932 823 1029 1023 813 718 618 392 110 50 255 267 172 105 130 161 44 -58
-3348e8k9J00K9J07L21L62L44P1m3l5J98J01p2k70l25j81k88P9K44N4l84j82J9m6O0r4j19
$$ -58 -87 13 42 149 470 832 1176 1247 1204 1169 1367 1468 1396 1126 801 620 332 411 655 709 325 143 162 116 176 82 -37
-3321c7M2J11O00N57N1m3j37l15k56j02M6J43L68o6k18J38N0mk93k62n5j88Q4L3J69K65K34
$$ -37 5 116 716 1273 1324 1281 1144 829 573 471 517 660 1028 962 744 882 932 928 635 373 318 130 214 247 416 681 915
-3294I15k88o47k23L56L43J24N0M9P9J3L70M5l00l07l43J17L08o4J48N22J77k03l54j86l17
$$ 915 627 -20 -243 113 456 580 630 679 758 771 1141 1186 886 579 236 353 661 597 745 1267 1444 1241 887 701 384
-3269C84l83L4K57J56J29J27j19n8K36r0l05l28Q9K47N0j80k80j65M28K63Q5J04O4j66k82
$$ 384 1 35 292 448 577 704 585 527 763 673 368 40 129 376 426 246 -34 -199 229 492 577 681 745 579 297
-3244B97k79k63O8K66J18k56J0M88M24J51K04J1n85n45l16j21l2qP9N5K10L01K20n6k21J61
$$ 297 18 -245 -177 89 207 -49 -39 449 873 1024 1228 1239 654 109 -207 -328 -360 -368 -289 -234 -24 277 497 441 220 381
-3218C81M34J48j06J24J43q8k01j17j62J28p7p1J97J50k46l47J5J66M8K83L80K70L29P3l30
$$ 381 815 963 857 981 1124 1036 835 718 556 684 607 536 733 883 637 290 305 471 519 802 1182 1452 1781 1854 1524
-3193A524m27N1L97O9k39J10J33o7n52n09m07o0J96L72K51P9j08l40l03m3J28l4p6j30L92
$$ 1524 1097 1148 1545 1614 1375 1485 1618 1551 999 490 83 23 219 591 842 921 813 473 170 127 255 221 145 15 407
-3168D07P2m77K13K60k89n41KN04K16j28j87O31N79j48O2L01J80m15o96m03K3j9l88j4R2j18
$$ 407 479 2 215 475 186 -355 -353 151 367 239 52 683 1262 1114 1176 1477 1657 1242 546 143 166 147 -241 -255 -163 -281
-3142b81k5J22J12j16NJ32j78L4J55k86k67j9K58Q1J67j27k29L04N53J82j24j03j18j91J78
$$ -281 -306 -184 -72 -188 -183 -51 -229 -195 -40 -326 -593 -612 -354 -273 -106 -233 -462 -158 395 577 453 350 232 41 219
-3117B19N9j62L96J58Q7L95K49R3j40l58k72l72k18O5J11M64L37j98l61m3K71j00l37j84J08
$$ 219 278 116 512 670 757 1152 1401 1494 1354 996 724 352 134 199 310 774 1111 913 552 509 780 680 343 159 267
-3092B67K52nk10o6L80J92j01J26k03n38l76J5L56K80k20l7L34Q0K20J00j44J03J8K87M51
$$ 267 519 514 304 238 618 810 709 835 632 94 -282 -267 89 369 149 112 446 526 746 846 702 805 823 1110 1561
-3067A561l3m15m42k47k25j75J96K70J23K00m4k72m37l22l9K43L67M08L91J34K26J46j66m03
$$ 1561 1528 1113 671 424 199 24 220 490 613 813 769 497 60 -262 -301 -58 309 717 1108 1242 1468 1614 1448 1045
-3043A045l10j60k12j73j88n4J46J07L09M3j83J71L26n3m84l27o8l8J79K18M29K90J81J53
$$ 1045 735 575 363 190 2 -52 94 201 510 553 370 541 867 814 330 3 -65 -103 76 294 723 1013 1194 1347
-3019A347q9N1J40k41o68m02J50j0j98R0J93J66L2OJ49J28k07P8L44Q8j54j67k78k40K4J33
$$ 1347 1258 1309 1449 1208 540 138 288 278 80 170 363 529 561 567 716 844 637 715 1059 1147 993 826 548 308 332 465
-2993D65K77M01L16j6k23m44l97k22L1L63N05L21pq5l65l17p0l35j23K6j60m3J71J6l0J02
$$ 465 742 1143 1459 1443 1220 776 379 157 188 551 1056 1377 1370 1285 920 603 533 198 75 101 -59 -102 69 85 55 157
-2967A57M76O40N6m50o00l80R2K48K08j98j37j57k66j73J21K82L08K12O3j99m6k81m08l3J89
$$ 157 633 1273 1329 879 279 -101 -9 239 447 249 112 -45 -311 -484 -363 -81 227 439 502 303 257 -24 -432 -465 -276
-2942b76n9l04K8J74J36K19N5M6m4J78K74l18k71MJ02n0k55p9P2L16N17n5j07J06M8J0K59
$$ -276 -335 -639 -611 -437 -301 -82 -27 19 -25 153 427 109 -162 -158 -56 -106 -361 -440 -368 -52 465 410 303 409 457 467 726
-2915G26J95j13j02j22j30j4J43j29k86j73Q8p5l51KK08J55J28J1j62K6K56K20j63l25l0M17
$$ 726 921 808 706 584 454 440 583 454 168 -5 83 8 -343 -341 -133 22 150 161 -1 25 281 501 338 13 -17 400
-2889D00L54M1k1j49k34n1J12J49J13J20Q0j85j01k04m13j29L35K20l21n6k7j3K19K75N0k64
$$ 400 754 795 774 625 391 340 452 601 714 834 914 729 628 424 11 -118 217 437 116 60 33 20 239 514 564 300
-2863C00m55O9N02L87J72O1j72k91L1kP8J22k26k82k28l28k93j58K60M10J07K22J02j64o4
$$ 300 -155 -86 416 803 975 1036 864 573 604 602 680 802 576 294 66 -262 -555 -713 -453 -43 64 286 388 224 160
-2838A60k14k18L43L08J58l4j68j53k77j22K54K8k99l16J54M73l2k4J08M7Q1J15J16J97r8
$$ 160 -54 -272 71 379 537 503 335 182 -95 -217 37 65 -234 -550 -396 77 45 21 129 176 257 372 488 685 587
-2813E87m26K1L81k54m37L21K83j59k91J21R4pJn52k23M27K95k1k65l39j49O8J55O11N43J6
$$ 587 161 182 563 309 -128 193 476 317 26 147 241 234 235 -317 -540 -113 182 161 -104 -443 -592 -524 -369 242 785 801
-2787H01j44J65J82k85o22q7L75K40n2j75k00j17K57L77n3k60J10J43j86l38R3M21K09P9j62
$$ 801 657 822 1004 719 97 10 385 625 573 398 198 81 338 715 662 402 512 655 469 131 224 645 854 933 771
-2762G71m98k24J92P2j09m65m00n7m6o8J74J5K45J28L67N77Q9j34l43m28l29l69J9K67L4K89
$$ 771 273 49 241 313 204 -261 -661 -718 -764 -832 -658 -643 -398 -270 97 674 763 629 286 -142 -471 -840 -821 -554 -520 -231
-2736b31N75P6k91J85L58K54j54n20k72K45N71J82k47k88l81m44j24j1k35j96k6K42K15j6
$$ -231 344 420 129 314 672 926 772 252 -20 225 796 978 731 443 62 -382 -506 -517 -752 -948 -974 -732 -517 -533
-2712e33K85J84L0j16j02K52J53k07N3n5K13K13M1M5m14j66l35r3L92N91M08J22J34K64j81
$$ -533 -248 -64 -34 -150 -252 0 153 -54 -1 -56 157 370 411 456 42 -124 -459 -552 -160 431 839 961 1095 1359 1178
-2687A178m82n42j14N4j3K16n7j15K23M97K08O3j52m38k76j89o2K56O40L66k45j93j44k8O2
$$ 1178 696 154 40 94 81 297 240 125 348 845 1053 1116 964 526 250 61 -1 255 895 1261 1016 823 679 651 713
-2662G13j34l03j48K58K17L68r3k71j8k78k12k78l77J06J77J89J41Q8J68K11L38J10l18k46
$$ 713 579 276 128 386 603 971 878 607 589 311 99 -179 -556 -450 -273 -84 57 145 313 524 862 972 654 408
-2638D08j08K03M06n1k50j50J3r5l54k65K04L68j69l34J48L52M8k41p37l45OJ45mj91K73K44
$$ 408 300 503 909 858 608 458 471 376 22 -243 -39 329 160 -174 -26 326 374 133 -604 -949 -943 -798 -802 -993 -720 -476
-2612d76k8K69J75j14J09M16M08K10l4k87o0J59L37J46l41o11m67n6J24l53j85J95R9L08N33
$$ -476 -504 -235 -60 -174 -65 351 759 969 935 648 588 747 1084 1230 889 278 -189 -245 -121 -474 -659 -464 -365 -57 476
-2587D76M35j39r9L20J23J20l4k92m67l66o18m79k8L01O31K07J0j76k15J64M87K54J01J75
$$ 476 911 772 673 993 1116 1236 1202 910 443 77 -541 -1020 -1048 -747 -116 91 101 -75 -290 -126 361 615 716 891
-2563H91q3l36l28l30m11qO1J21J7j08J55J44R5N5J06L92K66M04M20j11p43m51J2J30j0j36
$$ 891 808 472 144 -186 -597 -605 -544 -423 -406 -514 -359 -215 -120 -65 41 433 699 1103 1523 1412 669 218 230 360 350 214
-2537B14q8r8l50l78O2K02j67k34K19N59K07m5j74k85j35j04n4k32J66K03J80%r6K84N93M50
$$ 214 126 28 -322 -700 -638 -436 -603 -837 -618 -59 148 103 -71 -356 -491 -595 -649 -881 -715 -512 -332 -332 -428 -144 449 899
-2511H99K70M28Kp8k46l45l90j39L74M72k23l16m3j65k63o6L95P5j31k52l36j46M9K0j16m7
$$ 899 1169 1597 1599 1521 1275 930 540 401 775 1247 1024 708 665 500 237 171 566 641 510 258 -78 -224 -175 -155 -271 -318
-2485c18j77J24L79j43l1L11J45k44k57JP6j22O4L70J55l30j66j99k54J68O36K82o3p7JK69
$$ -318 -495 -371 8 -135 -166 145 290 46 -211 -210 -134 -256 -192 178 333 3 -163 -362 -616 -448 188 470 407 330 331 600
-2459F00o4k96Qj43l45J98M95L12j10k81j80K13L31K16L00l4k04J11n5m57k40k45j62j03J20
$$ 600 536 240 248 105 -240 -42 453 765 655 374 194 407 738 954 1254 1220 1016 1127 1072 615 375 130 -32 -135 -15
-2434a5J16M20K80l84l78J97M81N40K61p5l5l15l59K62L61l11l23q8n25n47j97K48O01L56
$$ -15 101 521 801 417 39 236 717 1257 1518 1443 1408 1093 734 996 1357 1046 723 635 110 -437 -634 -386 215 571
-2410E71j01k59q3r6k47N2M13L75K13R4Po3k57k55l55K8L36K70k28n96P7N61K41l80l40R4
$$ 571 470 211 128 32 -215 -163 250 625 838 932 939 876 619 364 9 37 373 643 415 -181 -104 457 698 318 -22 72
-2384G2q7k97k94l82j72J11M70M01O3K7N03M88K82J26J88J3j56j44l02j88j57L09K46r5k69
$$ 72 -15 -312 -606 -988 -1160 -1049 -579 -178 -115 -88 415 903 1185 1311 1499 1512 1356 1212 910 722 565 874 1120 1025 756
-2359G56j95L89k6n20k84o6k9M68K61l16l22j13K87L98n6j34J8l22r0J39Q2N6K08J63k14j15
$$ 756 561 950 924 404 120 54 25 493 754 438 116 3 290 688 632 498 516 194 104 243 325 381 589 752 538 423
-2333D23k93k32M03K46Q0L25Kj50j52R2L19L68j9l00%J72n3M3L62K06r3j94j14l70m60m1K48
$$ 423 130 -102 301 547 627 952 954 804 652 744 1063 1431 1412 1112 1112 1284 1231 1274 1636 1842 1749 1555 1441 1071 611 570 818
-2306H18J86J23O7n2M7N5l89o78k36K91M22R5l71R8L59O6Jn5jQ9L1K04j23l23j98l74j6J29
$$ 818 1004 1127 1194 1142 1189 1244 855 177 -59 232 654 749 378 476 835 901 902 847 846 935 966 1170 1047 724 526 152 136 265
-2278B65J31J72K74L70J73N8L1k47j31K90J53J50r5k89l27l21k48k46N1J22N8J3j60k58k86
$$ 265 396 568 842 1212 1385 1443 1474 1227 1096 1386 1539 1689 1594 1305 978 657 409 163 214 336 394 407 247 -11 -297
-2253b97j74r7L30K72R9J02M1J24J24L48J08K07N3k23r1j62l87K5K27r2k61l40r9K11n4N9
$$ -297 -471 -568 -238 34 133 235 276 400 524 872 980 1187 1240 1017 926 764 377 402 629 537 276 -64 -163 48 -6 53
-2227E3M60J52k03n9J6J96K9l25kj61j55j96l7J65q7p2K24J7l58J04L51K01J96K26J82r5k63
$$ 53 513 665 462 403 419 615 644 319 317 156 1 -195 -232 -67 -154 -226 -2 15 -343 -239 112 313 509 735 917 822 559
-2200E59k35k0l0k5j48j02KN2J49L2q0K08Q4o3K99L3j32j93M9k11m31J0J73nj58J84Om66n33
$$ 559 324 304 274 249 101 -1 1 53 202 234 154 362 446 383 682 715 583 390 439 228 -203 -193 -20 -25 -183 1 7 -459 -992
-2171i92K65O23Q8K77J28j04M9j79j63j07J9L68J48m9j63PPo51m24N55P52K58K0J13M6L33
$$ -992 -727 -104 -16 261 389 285 334 155 -8 -115 -96 272 420 371 208 215 222 -429 -853 -298 454 712 732 845 891 1224
-2145A224J87J6J08R2j75n02l65K0K07pk17j0k30n99l79J37N53M14k37o37l24r5l83j09J24
$$ 1224 1411 1427 1535 1627 1452 950 585 605 812 805 588 578 348 -251 -630 -493 60 474 237 -400 -724 -819 -1202 -1311 -1187
-2120a187L48O05N12K47k3j19m13r8J14k97j24K50K12R6Q3J35p5K31M60J73k28l14j73j11
$$ -1187 -839 -234 278 525 502 383 -30 -128 -14 -311 -435 -185 27 123 206 341 266 497 957 1130 902 588 415 304
-2096C04j17k96l82k2N49L85k9K14L55J8n07n04m41k02Q1K35M71O46K47k1j01n4K24J44j04
$$ 304 187 -109 -491 -513 36 421 392 606 961 979 472 -32 -473 -675 -594 -359 112 758 1005 984 883 829 1053 1197 1093
-2071A093k98l40m15m91j53r6JK24K73J99j12m00K26M54l2k16K06K06K21N07L66j31n36m0
$$ 1093 795 455 40 -451 -604 -700 -699 -475 -202 -3 -115 -515 -289 165 133 -83 123 329 550 1057 1423 1292 756 716
-2047G16J77K8J49p0j62j19qO62P39K22k65m04q1k14m0K45j09l21m59j77N6M24N52k8n43m47
$$ 716 893 921 1070 1000 838 719 711 1373 2112 2334 2069 1665 1584 1370 1330 1575 1466 1145 686 509 565 989 1541 1513 970 523
-2021E23k50K20N19k9q2k43J8K7k6J33j58n8Qk22k77L3J10J21k01k70j27n4q4q1j30J64N27
$$ 523 273 493 1012 983 901 658 676 703 677 810 652 594 602 380 103 136 246 367 166 -104 -231 -285 -369 -450 -580 -416 111
-1994A11N43O38K65k11o11l34J1K26J6j29J74K8k3L33M98n5n02m11NK85r2j9L70k4m05R8J28
$$ 111 654 1292 1557 1346 735 401 412 638 654 525 699 727 704 1037 1535 1480 978 567 572 857 765 746 1116 1092 687 785 913
$$ [...]
5339C28
##ENDNTUPLES=	NMRSPECTRUM
##END=	

##TITLE=	2012130109-jiatao-1
##JCAMPDX=	6.0	$$ NMR Plug-in 1.4 of MestReNova 6.1.1-6384
##BLOCKID=	2
##DATATYPE=	NMRPEAKTABLE
##DATACLASS=	PEAKTABLE
##.OBSERVEFREQUENCY=	100.61277008056640625
##.OBSERVENUCLEUS=	^13C
##NPOINTS=	13
##FIRSTX=	39.361677953890499282
##LASTX=	149.0809405503894709
##XFACTOR=	1
##YFACTOR=	1
##FIRSTY=	11.761731007593127174
##XUNITS=	PPM
##YUNITS=	ARBITRARY UNITS
##PEAKTABLE=	(XY..XY)
39.361677953890499282, 11.761731007593127174
39.570371744986964302, 38.747819199910004784
39.779367088026440058, 79.61706918086393614
39.987558333055439164, 94.846207166933595545
40.196344117247150507, 81.738236400953908856
40.405291044100316356, 42.00363836100847692
40.613195909650379178, 14.564586190510182107
48.344483631146609071, 7.9915137264834932296
111.84980394076094967, 8.1966358640165211114
118.81845553209343791, 4.8084839888007957498
142.1123414376004348, 6.0847201796487526693
143.47803033260964867, 5.296905883748618038
149.0809405503894709, 2.4767781970990565554
##END=	

##END=	
