##TITLE=	20121203-jiatao-1
##JCAMPDX=	6.0	$$ NMR Plug-in 1.4 of MestReNova 6.1.1-6384
##DATATYPE=	LINK
##BLOCKS=	2
##ORIGIN=	Bruker BioSpin GmbH
##OWNER=	Administrator

##TITLE=	20121203-jiatao-1
##JCAMPDX=	6.0	$$ NMR Plug-in 1.4 of MestReNova 6.1.1-6384
##BLOCKID=	1
##DATATYPE=	NMRSPECTRUM
##DATACLASS=	NTUPLES
##NUMDIM=	1
##ORIGIN=	Bruker BioSpin GmbH
##OWNER=	Administrator
##.OBSERVEFREQUENCY=	100.61281585693359375
##.OBSERVENUCLEUS=	^13C
##.SOLVENTNAME=	9
##.PULSESEQUENCE=	zgpg30
##.ACQUISITIONMODE=	SIMULTANEOUS (DQD)
##$ORIGINALFORMAT=	Bruker XWIN-NMR
##$PARAMETERFILE=	(acqus, ASCII, H:/NMR/20121203-jiatao-1/2/acqus, 0)
$$ ##TITLE= Parameter file, TOPSPIN		Version 2.1
$$ ##JCAMPDX= 5.0
$$ ##DATATYPE= Parameter Values
$$ ##NPOINTS= 12	$$ modification sequence number
$$ ##ORIGIN= Bruker BioSpin GmbH
$$ ##OWNER= Administrator
$$ $$ 2012-12-03 10:55:14.281 +0800  Administrator@EP-ZH010007
$$ $$ D:\/data/Administrator/nmr/20121203-jiatao-1/2/acqus
$$ $$ process C:\Bruker\TOPSPIN\prog\mod\vtu.exe
$$ ##$ACQT0= -2.73109243697479
$$ ##$AMP= (0..31)
$$ 100 100 100 100 100 100 100 100 100 100 100 100 100 100 100 100 100 100
$$ 100 100 100 100 100 100 100 100 100 100 100 100 100 100
$$ ##$ANAVPT= -1
$$ ##$AQSEQ= 0
$$ ##$AQ_mod= 3
$$ ##$AUNM= <au_zg>
$$ ##$AUTOPOS= <60 >
$$ ##$BF1= 100.612769
$$ ##$BF2= 400.13
$$ ##$BF3= 100.612769
$$ ##$BF4= 100.612769
$$ ##$BF5= 100.612769
$$ ##$BF6= 100.612769
$$ ##$BF7= 100.612769
$$ ##$BF8= 100.612769
$$ ##$BYTORDA= 0
$$ ##$CFDGTYP= 0
$$ ##$CFRGTYP= 9
$$ ##$CHEMSTR= <none>
$$ ##$CNST= (0..63)
$$ 1 1 145 1 1 1 1 1 1 1 1 1 1 1 1 1 1 1 1 1 1 1 1 1 1 1 1 1 1 1 1 1 1 1 1
$$ 1 1 1 1 1 1 1 1 1 1 1 1 1 1 1 1 1 1 1 1 1 1 1 1 1 1 1 1 1
$$ ##$CPDPRG= <waltz16>
$$ ##$CPDPRG1= <>
$$ ##$CPDPRG2= <waltz16>
$$ ##$CPDPRG3= <>
$$ ##$CPDPRG4= <mlev>
$$ ##$CPDPRG5= <mlev>
$$ ##$CPDPRG6= <mlev>
$$ ##$CPDPRG7= <mlev>
$$ ##$CPDPRG8= <mlev>
$$ ##$CPDPRGB= <>
$$ ##$CPDPRGT= <>
$$ ##$D= (0..63)
$$ 0 2 0.00345 0 0 0 0 0 0 0.06 0 0.03 2e-005 3e-006 0 0 0.0002 0 0 0 0 0
$$ 0 0 0 0 0 0 0 0 0 0 0 0 0 0 0 0 0 0 0 0 0 0 0 0 0 0 0 0 0 0 0 0 0 0 0 0
$$ 0 0 0 0 0 0
$$ ##$DATE= 1354503313
$$ ##$DBL= (0..7)
$$ 120 120 120 120 120 120 120 120
$$ ##$DBP= (0..7)
$$ 150 150 150 150 150 150 150 150
$$ ##$DBP07= 0
$$ ##$DBPNAM0= <>
$$ ##$DBPNAM1= <>
$$ ##$DBPNAM2= <>
$$ ##$DBPNAM3= <>
$$ ##$DBPNAM4= <>
$$ ##$DBPNAM5= <>
$$ ##$DBPNAM6= <>
$$ ##$DBPNAM7= <>
$$ ##$DBPOAL= (0..7)
$$ 0.5 0.5 0.5 0.5 0.5 0.5 0.5 0.5
$$ ##$DBPOFFS= (0..7)
$$ 0 0 0 0 0 0 0 0
$$ ##$DE= 9
$$ ##$DECBNUC= <off>
$$ ##$DECIM= 832
$$ ##$DECNUC= <off>
$$ ##$DECSTAT= 4
$$ ##$DIGMOD= 1
$$ ##$DIGTYP= 12
$$ ##$DL= (0..7)
$$ 0 120 120 120 120 120 120 120
$$ ##$DP= (0..7)
$$ 150 150 150 150 150 150 150 150
$$ ##$DP07= 0
$$ ##$DPNAME0= <>
$$ ##$DPNAME1= <>
$$ ##$DPNAME2= <>
$$ ##$DPNAME3= <>
$$ ##$DPNAME4= <>
$$ ##$DPNAME5= <>
$$ ##$DPNAME6= <>
$$ ##$DPNAME7= <>
$$ ##$DPOAL= (0..7)
$$ 0.5 0.5 0.5 0.5 0.5 0.5 0.5 0.5
$$ ##$DPOFFS= (0..7)
$$ 0 0 0 0 0 0 0 0
$$ ##$DQDMODE= 0
$$ ##$DR= 22
$$ ##$DS= 4
$$ [...]
$$ -1 -1 -1 -1 -1 -1 -1 -1 -1 -1 -1 -1 -1 -1 -1 -1 -1 -1 -1 -1 -1 -1 -1 -1
$$ -1 -1 -1 -1 -1 -1 -1 -1 -1 -1 -1 -1 -1 -1 -1 -1 -1 -1 -1 -1 -1 -1 -1 -1
$$ -1 -1 -1 -1 -1 -1 -1 -1 -1 -1 -1 -1 -1 -1 -1 -1 -1 -1 -1 -1 -1 -1 -1 -1
$$ -1 -1 -1 -1 -1 -1 -1 -1 -1 -1 -1 -1 -1 -1 -1 -1 -1 -1 -1 -1 -1 -1 -1 -1
$$ -1 -1 -1 -1 -1 -1 -1 -1 -1 -1 -1 -1 -1 -1 -1 -1 -1 -1 -1 -1 -1 -1 -1 -1
$$ -1 -1 -1 -1 -1 -1 -1 -1 -1 -1 -1 -1 -1 -1 -1 -1 -1 -1 -1 -1 -1 -1 -1 -1
$$ -1 -1 -1 -1 -1 -1 -1 -1 -1 -1 -1 -1 -1 -1 -1 -1 -1 -1 -1 -1 -1 -1 -1 -1
$$ -1 -1 -1 -1 -1 -1 -1 -1 -1 -1 -1 -1 -1 -1 -1 -1 -1 -1 -1 -1 -1 -1 -1 -1
$$ -1 -1 -1 -1 -1 -1 -1 -1 -1 -1 -1 -1 -1 -1 -1 -1
$$ ##$RG_tabA= (0..255)
$$ 0.25 0.28 0.32 0.35 0.4 0.44 0.5 0.56 0.64 0.7 0.8 0.89 1 1.12 1.28 1.4
$$ 1.6 1.78 2 2.25 2.56 2.8 3.2 3.56 4 4.5 5 5.6 6.35 7.12 8 9 10 11.3 12.7
$$ 14.2 16 18 20.2 22.6 25.4 28.5 32 36 40.3 45.2 50.8 57 64 71.8 80.6 90.5
$$ 101 114 128 144 161 181 203 228 256 287 322 362 406 456 512 575 645 724
$$ 812 912 1030 1150 1290 1440 1620 1820 2050 -1 -1 -1 -1 -1 -1 -1 -1 -1 -1
$$ -1 -1 -1 -1 -1 -1 -1 -1 -1 -1 -1 -1 -1 -1 -1 -1 -1 -1 -1 -1 -1 -1 -1 -1
$$ -1 -1 -1 -1 -1 -1 -1 -1 -1 -1 -1 -1 -1 -1 -1 -1 -1 -1 -1 -1 -1 -1 -1 -1
$$ -1 -1 -1 -1 -1 -1 -1 -1 -1 -1 -1 -1 -1 -1 -1 -1 -1 -1 -1 -1 -1 -1 -1 -1
$$ -1 -1 -1 -1 -1 -1 -1 -1 -1 -1 -1 -1 -1 -1 -1 -1 -1 -1 -1 -1 -1 -1 -1 -1
$$ -1 -1 -1 -1 -1 -1 -1 -1 -1 -1 -1 -1 -1 -1 -1 -1 -1 -1 -1 -1 -1 -1 -1 -1
$$ -1 -1 -1 -1 -1 -1 -1 -1 -1 -1 -1 -1 -1 -1 -1 -1 -1 -1 -1 -1 -1 -1 -1 -1
$$ -1 -1 -1 -1 -1 -1 -1 -1 -1 -1 -1 -1 -1 -1 -1 -1 -1 -1 -1 -1 -1 -1 -1
$$ ##$ROUT14= (0..7)
$$ 0 0 0 0 0 0 0 0
$$ ##$ROUTER= 3
$$ ##$RX22TY= <no>
$$ ##$RXFMAX= (0..7)
$$ 432.5 -1 -1 -1 -1 -1 -1 -1
$$ ##$RXFMIN= (0..7)
$$ 5 -1 -1 -1 -1 -1 -1 -1
$$ ##$RXINTLV= (0..7)
$$ 1 0 0 0 0 0 0 0
$$ ##$RXMSTY= <no>
$$ ##$SCMTY= <no>
$$ ##$SGUC1= (0..15)
$$ 18 19 0 0 0 0 0 0 0 0 0 0 0 0 0 0
$$ ##$SGUC2= (0..15)
$$ 33 256 0 0 0 0 0 0 0 0 0 0 0 0 0 0
$$ ##$SPECTR= 10
$$ ##$SY2FLAG= 0
$$ ##$TFXNUM= 0
$$ ##$TRIPLO2= 0
$$ ##$VTUTY= <tty05>
$$ ##$WBREFAM= (0..15)
$$ 273.4 115.7 100 100 100 100 100 100 100 100 100 100 100 100 100 100
$$ ##$WBREFPH= (0..15)
$$ 81.78 -67.52 0 0 0 0 0 0 0 0 0 0 0 0 0 0
$$ ##$XFAC= 2
$$ ##END=
$$ 
##$DECIM=	832
##$DSPFVS=	20
##NTUPLES=	NMRSPECTRUM
##VARNAME=	FREQUENCY,	SPECTRUM/REAL,	SPECTRUM/IMAG,	PAGE NUMBER
##SYMBOL=	X,	R,	I,	N
##VARTYPE=	INDEPENDENT,	DEPENDENT,	DEPENDENT,	PAGE
##VARFORM=	AFFN,	ASDF,	ASDF,	AFFN
##VARDIM=	65536,	65536,	65536,	2
##UNITS=	HZ,	ARBITRARY UNITS,	ARBITRARY UNITS,
##FIRST=	23036.35076904296875,	-0.19409181177616119385,	0.073741443455219268799,	1
##LAST=	-1002.11016845703125,	-0.16769200563430786133,	-0.034788042306900024414,	2
##MIN=	-1002.11016845703125,	-1.2901721000671386719,	-61.570613861083984375,	1
##MAX=	23036.35076904296875,	118.58758544921875,	65.74620819091796875,	1
##FACTOR=	-0.36680340180819409612,	0.0014823448181152344347,	0.00082182760238647459532,	1
##PAGE=	N=1
##DATATABLE=	(X++(R..R)), XYDATA
$$ [...]
##PAGE=	N=2
##DATATABLE=	(X++(I..I)), XYDATA
-20279e20j57K76K54p3j26J05j11j84j07j50M2J65Q2r4j31j17O1J67J33K57L1j91LJ53J24
-20254a08J15J02r6j02P9k9l25j21J71L22J91j6q8k93j19J81J14j19P0P5K6J28N7N2m7p8N3
-20227A95j1j4Lj10rj42j29L99M97J01k63o00k71L49K33k49l63j47o6L45L58K4p6k27j71j68
-20201e12j51k5o4J96K78k9r0N6J5j23Q0K03j02n9J62J53K69K80N2r6k48k80k15K9J35K61
-20175A75J61j85k32kL23J89j5m4%k15j70L5j29M4J06J11k74m78k59l6K53M00K52J6k30j57
-20149c61j24j1K34J77Lj1l8O4K30m4k85k25K0N1Q8N1k5j30j21L1J62P6p3Q2K01R1R8p1j73
-20120c3o2J25j03k12k9J76L40Q1k22k77j82m8J4p0k3J23J12j3M1J88L4j94k8r8J30K07K6
-20093Cj4J13J3l91n3K14k7k67r6J4j80p9jl4J63J35Q7J66l7j52l61k36J19K22P3J32J16j50
$$ plain form
-20279 -520 -677 -401 -147 -220 -346 -241 -352 -536 -643 -793 -751 -586 -504 -598 -729 -846 -785 -618 -485 -228 -197 -388 -385 -232 -108
-20254 -108 7 109 13 -89 -10 -39 -364 -485 -314 8 199 183 95 -198 -317 -136 -22 -141 -71 4 30 158 215 267 220 142 195
-20227 195 184 170 173 63 54 -88 -217 182 679 780 517 -83 -354 -5 228 -21 -384 -531 -597 -252 106 130 54 -173 -344 -512
-20201 -512 -663 -688 -752 -556 -278 -307 -397 -341 -326 -449 -369 -166 -268 -327 -165 -12 257 537 589 493 245 -35 -250 -221 -86 175
-20175 175 336 151 -81 -83 240 429 414 370 370 155 -15 20 -109 -65 41 152 -122 -600 -859 -895 -642 -242 10 26 -204 -361
-20149 -361 -485 -496 -262 -85 -82 -93 -131 -67 163 119 -166 -391 -371 -320 -232 -181 -206 -336 -457 -426 -264 -188 -261 -179 22 113 211 140 -33
-20120 -33 -95 30 -73 -285 -314 -138 202 283 61 -216 -398 -446 -432 -502 -525 -402 -290 -303 -262 -74 -40 -234 -262 -360 -230 -23 3
-20093 3 -11 102 115 -276 -329 -115 -142 -409 -505 -491 -671 -750 -751 -785 -622 -487 -400 -234 -271 -423 -784 -1020 -901 -679 -606 -474 -358 -508
-20065e08m1Rk0q5J82L06J57J76P6k04k62j68k26j19K56J8j50K1j3j26l8R3P1q7j34j66k6
-20038a008K00K78J42P0k0O6J12j32p8n7j03N7K62o2j24L3K37K46j20j87l02k10J7J40J46
-20013c97K42m0r6l6k3M7Q8r0j60J65K05O1j50l67j75j21m7R8K22K05O6J39K64q8k90k76j60
-19986g14P5L29K69j23k07m5P7O0Mql9j77j22JK0QqK77L49K70O4m4o6k05j92j1l7j17j36%
-19956d48k5J74L62%k97j97j52j6J74K7q9j62M1K23P1M7J21J20J02M0J19P7j13n3J33j6j44
-19929A19j41j1Q1J45Q6l14m18j70l3K63K98k8j71j19K57M55J56r6j41p4k85k92o5J50J48
-19904b00l5M9r3m66k27o2L06O32K66p2j45j63J88Q6J4m0l23l15LM9L8K34J1j57J06L01oj07
-19876a28k8k9J71J42k3j1k7m8k10l54k04K56J67j73o3j01q5l2l8m6j15r9P1K04K15J97l8
$$ plain form
-20065 -508 -549 -540 -560 -645 -463 -157 0 176 252 48 -214 -382 -608 -727 -471 -453 -603 -582 -595 -721 -759 -666 -595 -682 -816 -982 -1008
-20038 -1008 -808 -530 -388 -318 -338 -272 -160 -292 -370 -427 -530 -473 -211 -273 -397 -364 -127 119 -1 -188 -490 -700 -683 -543 -397
-20013 -397 -155 -195 -291 -327 -350 -303 -215 -305 -465 -300 -95 -34 -184 -551 -726 -847 -894 -796 -574 -369 -303 -164 100 12 -278 -554 -714
-19986 -714 -639 -310 -41 -164 -371 -416 -339 -279 -275 -283 -322 -499 -621 -620 -600 -592 -600 -323 26 296 360 316 250 45 -147 -158 -195 -312 -448 -448
-19956 -448 -473 -299 63 63 -234 -431 -583 -599 -425 -398 -487 -649 -608 -385 -314 -267 -146 -26 76 116 235 312 199 146 279 263 119
-19929 119 -22 -33 48 193 279 -35 -453 -623 -656 -393 -95 -123 -294 -413 -156 299 455 359 218 144 -141 -433 -498 -348 -200
-19904 -200 -235 -186 -279 -745 -972 -1034 -728 -96 170 98 -47 -210 -22 64 78 38 -285 -600 -597 -548 -510 -276 -265 -422 -316 -15 -21 -128
-19876 -128 -156 -185 -14 128 105 94 67 19 -191 -545 -749 -493 -326 -499 -562 -663 -748 -780 -818 -864 -979 -1078 -1007 -803 -588 -391 -429
-19849d29J13J78j0J77L16N6o2j00k35l30j26K69J50q1n0J55K60J17p6l4j35k70j27J66K86
-19824A78K80P1k38k46r9n3J1j43j07Q3J4j86j96KK06J94O3l8j37J19K28R5k23k85k4K26J38
-19797f7r7m6j6j44k29J15L24J35r1k51j11L03Q1k40j95OJ37K11J83J03J09L6p3j27Ql2q9
-19770e7L9M1j54j9j50n6L8j01J52J97N5j02j16k15j30J00M2L1J35k1j1J13K05N5j0K57J06
-19743D24k02k25k07k08J49L70K62O4k12l28j91k62m4N9Q0O8P9J42K0l7r1n2r6O0R2R8J98
-19716A0J03j66j93K5J41L2m4l5R0Q0N7j08m51j92J26L29J98R5N2L00J16kk3k14k62k46r4
-19689b76j45k09j2O4O2K12J23nO6k2Q4L16R4L0j90l47k67M6n2j55q0K11J32l15r9J5j33j41
-19661i93j6O4Q8R7J54J79M0q3jO3J81J44j94l08l96k51J84L35J71R8kj19j43j4J46m0k85
$$ plain form
-19849 -429 -316 -138 -148 29 345 401 339 239 4 -326 -452 -183 -33 -114 -164 -9 251 368 292 258 123 -147 -274 -108 178
-19824 178 458 529 291 45 -54 -107 -96 -239 -346 -263 -249 -435 -631 -629 -423 -229 -166 -204 -341 -222 6 101 -122 -407 -431 -205 -67
-19797 -67 -164 -210 -226 -370 -599 -484 -160 -25 -116 -367 -478 -175 -94 -334 -529 -523 -386 -175 8 111 220 256 183 56 64 32 -57
-19770 -57 -18 23 -131 -150 -300 -356 -318 -419 -267 -70 -15 -117 -233 -448 -578 -478 -436 -405 -270 -291 -302 -189 16 71 61 318 424
-19743 424 222 -3 -210 -418 -269 101 363 427 215 -113 -304 -566 -610 -551 -471 -403 -324 -182 -162 -199 -290 -342 -438 -378 -286 -188 10
-19716 10 113 -53 -246 -221 -80 -48 -92 -127 -37 43 100 -8 -459 -651 -525 -196 2 97 149 449 565 563 540 326 64 -182 -276
-19689 -276 -421 -630 -642 -578 -516 -304 -181 -186 -120 -142 -58 258 352 382 192 -155 -422 -376 -428 -583 -663 -452 -320 -635 -734 -719 -852 -993
-19661 -993 -1009 -945 -857 -760 -606 -427 -387 -470 -471 -408 -227 -83 -277 -585 -981 -1232 -1048 -713 -542 -444 -446 -565 -708 -722 -576 -616 -901
-19634i01l3K37J27j5J77K63M0j32qJ24J79J44j00r8j79K7r2p4n7k65j48Q0J75Q9R4j39p8
-19607e63J18J36r0m9K50rj77k16j7L21J21q6N3n4k35N5J05j4l63l26P5J34J17j15j54J78
-19581h05O6o4J42J39j18k5R9J60j08m7J20O2m4K5Mk44j51R3M21J92K09O8l34k45k1k07l47
-19554i60k12N0mJ8Q9J49L09M41J13r0J13J31K1Jj89l02m9J30J56O5J09M7q2K6K9r7P4Q2O
-19525A74j97k93j61J52L00J8K1n0k23o8J8k8o8m9K06K79J56k50m07P2K06J12J76j9M8p7k38
-19498a90j70K51M56o7m15j86K55L00J79J99P1l3l5j44k37k15Lk4J39O7j62j72o6J12J6k39
-19472c07k99j30j2R4J84J81O5m6J77L2k68j46J6M5Qj51J79L06j0j26l2M9j85r7O4K57K27
-19445G5o3l33k34K0R8K97J56j64k31PJ80o6K44L70P2j55k95j94J25L32oj70k64k48j48m8
$$ plain form
-19634 -901 -934 -697 -570 -585 -408 -145 -105 -237 -245 -121 58 202 102 4 -175 -148 -240 -314 -371 -636 -784 -704 -529 -440 -346 -485 -563
-19607 -563 -445 -309 -399 -448 -198 -207 -384 -600 -617 -296 -175 -261 -208 -262 -497 -442 -337 -351 -714 -1040 -965 -831 -714 -829 -983 -805
-19581 -805 -739 -803 -661 -522 -640 -665 -566 -406 -514 -561 -441 -379 -423 -398 -394 -638 -789 -696 -275 -83 126 194 -140 -385 -406 -613 -960
-19554 -960 -1172 -1122 -1126 -1108 -1019 -870 -561 -120 -7 -97 16 147 168 169 -20 -322 -371 -241 -85 -20 89 136 54 80 109 12 86 168 174
-19525 174 -23 -316 -477 -325 -25 -7 14 -36 -259 -327 -309 -337 -405 -454 -248 31 187 -63 -470 -398 -192 -80 96 77 125 48 -190
-19498 -190 -360 -109 347 280 -135 -321 -66 234 413 612 683 650 615 471 234 19 22 -2 137 204 42 -130 -196 -84 -68 -307
-19472 -307 -606 -736 -748 -654 -470 -289 -224 -270 -93 -61 -329 -475 -459 -414 -406 -557 -378 -72 -82 -208 -240 -191 -376 -473 -409 -152 75
-19445 75 12 -321 -555 -535 -437 -140 16 -148 -379 -372 -192 -258 -14 356 428 273 -22 -216 -91 241 235 65 -199 -447 -595 -643
-19419f43O1K62P7k20j40J73K29K17n3J11L21l1k34j72K4K4K4L8O7j26j91l0j7k50k45oO2
-19392f68K01J13M1Q7J17l1QP5J71L4k2j0j09l14o7K39mRJ68q3j99k76l41q3M8M8L85N49J61
-19363B47J51J45J6m9k72l24M7Q7j30j86L6L7j78o4N6k0j1J20K13Lj83r0M9Mr3j14j40J5L37
-19334b91K48o7j3L7l7k4N6n5j58n2o8l2J41K17O8L0r4r3R5p3n0j09k16j28O7L05J59M9K82
-19305A94J06k22j34J5K38K0j58Q1K51pk54k91k34J8K01K4k55l54k59k0K98J95J47J62J45
-19280i3L23R6k87j27o3k8J09J88l5j84k40k1K19j07j74M3J07J30O1j19M0L38J88l3n7m9p3
-19253A52M7J04r2j81O8J39J92J50p4j43k26j35j8j08o3L4l8K1J32K38J15j72j65k09q9K59
-19227f2K51j67k55q8j84j72P5J56R8P4R6r7j79j50j53J29L73p2l8J74K7K8P5K9O3L1k12j55
$$ plain form
-19419 -643 -582 -320 -243 -463 -603 -430 -201 16 -37 74 395 364 130 -42 -18 6 30 68 135 9 -182 -212 -229 -479 -724 -730 -668
-19392 -668 -467 -354 -313 -226 -109 -140 -132 -57 114 148 126 116 7 -307 -374 -135 -139 -130 38 -45 -244 -520 -861 -944 -896 -848 -463 86 247
-19363 247 398 543 559 510 238 -86 -39 48 -82 -268 -232 -195 -373 -437 -381 -401 -412 -292 -79 -76 -259 -349 -300 -296 -389 -503 -643 -628 -291
-19334 -291 -43 -110 -123 -86 -123 -147 -91 -146 -304 -356 -424 -456 -315 -98 -30 0 -94 -187 -92 -165 -215 -324 -540 -668 -601 -296 -137 -88 194
-19305 194 300 78 -56 -41 197 217 59 140 391 384 130 -161 -395 -377 -176 -152 -407 -761 -1020 -1040 -742 -547 -400 -238 -93
-19280 -93 230 326 39 -88 -151 -179 -70 118 83 -101 -341 -362 -143 -250 -424 -381 -274 -144 -83 -202 -162 176 364 331 274 225 152
-19253 152 199 303 211 30 98 237 429 579 505 362 136 1 -17 -125 -188 -154 -192 -171 -39 199 314 142 -23 -232 -321 -62
-19227 -62 189 22 -233 -321 -505 -677 -602 -446 -348 -274 -178 -275 -454 -604 -757 -628 -255 -327 -365 -191 -164 -136 -61 -32 31 62 -150 -305
-19199c05M8J28k2k55m1J09j14K7J98K8L2L7n4LL7K11J14k32l77j49m9k44l19J04L09K48J98
-19172c30q9k07l7l1L2J93O6j52J7J16j03l58j71J36K57J77K29K24N2p8p1l3J3l2l4J66J75
-19145A27o3k42k52N7l7K1m2j73k7J58J61J83p1j99Q5L0j54j76QN1J19J26J9j09n2K6qK6o
-19116d14K36J44j81p4o3P9K62L28Nl99l57j54J42K32K24P3k1j10m1J83M9j94q4J53N3nPj5
-19088E8QR2j44j47k5P0j04n1R2q7r7j85j29J04J00L9l4j92o5Lk7OJ04P5P0M4jmr8J03J62
-19057b60q0j82q3O9L52J23J5n7j58r4k0M6l2J99J95k3k81k05L9J80K5p4j11p1l3m1N4j7j95
-19028g20k05J5J24K69J99K59K96L41K09j11j70j09j39j62k31k47j70K76J58j33l2l5K5p8
-19004c71j86R8J55j60r9j4m3j60l04j75r7m5J52N2L8J49J64K47J46M7J01J57J75L59n4l51
$$ plain form
-19199 -305 -257 -129 -151 -406 -447 -338 -452 -425 -227 -199 -167 -130 -184 -181 -144 67 181 -51 -428 -577 -626 -870 -1189 -1085 -776 -528 -330
-19172 -330 -419 -626 -663 -694 -662 -469 -403 -555 -538 -422 -525 -883 -1054 -918 -661 -484 -255 -31 21 -57 -128 -161 -148 -180 -214 -48 127
-19145 127 64 -178 -430 -373 -410 -389 -431 -604 -631 -473 -312 -129 -200 -399 -314 -284 -438 -614 -606 -555 -436 -310 -291 -400 -452 -426 -434 -408 -414
-19116 -414 -178 -34 -215 -289 -352 -273 -11 317 322 -77 -434 -588 -446 -214 10 83 62 -48 -89 94 143 -51 -135 18 71 66 73 58
-19088 58 66 158 14 -133 -158 -88 -192 -243 -151 -238 -335 -520 -649 -545 -445 -406 -440 -632 -697 -694 -721 -715 -611 -536 -466 -422 -423 -427 -525 -422 -260
-19057 -260 -340 -522 -605 -536 -184 -61 -46 -103 -261 -355 -375 -329 -361 -162 33 10 -271 -476 -437 -257 -232 -306 -417 -488 -521 -562 -508 -525 -720
-19028 -720 -925 -910 -786 -517 -318 -59 237 578 787 676 506 397 258 96 -135 -382 -552 -276 -118 -251 -283 -318 -293 -371
-19004 -371 -557 -459 -304 -464 -563 -577 -620 -780 -1084 -1259 -1356 -1401 -1249 -1197 -1159 -1010 -846 -599 -453 -406 -305 -148 27 386 332 -19
-18978a9l70j40n3p2q5j08o8j33N3K67K53N8mL77K88M1j37LJ00J4n5k6L1L2O0j79k71l32k72
-18949g47K1O0J67K50p7L3J94J66r1q8K23N4l0r6j40qJ51J65o7j44QJ43j32l14r4J56K5k15
-18921d27j00K5j0J02L17L13l7k19O4J23j33JQ1L4m4m7j20l58k15J01K70J78L3J63J16k20
-18895il33l2k6p7m7L3KJ75M7J5M2k1k4J03Q3l0j55k6N3L0j10k98j47J09p6n9J27M9j01j28
-18865h31K2Mr0j47JL49L03J41O3l6R4Q0p2J08K61N8l27l97k18J5L51K56P9o3j32M6Jl3R3
-18836b1m4j44k04j64q3J01K18J8n2j80J10K76Q5P5j2l0J46L6m8K3p0k20k37n1o8k31j74R3
-18808h52L27K74O6l4J05N8L2N8O6j9q7j35j4j15m4k9j34JNP3j9Q7J56j0Q8L4k53j41J73J81
-18778a02J57nk91J3K36J87p2k84k28K0O1j17j77M7L48J10p0oj94o8J15r0k3R0k18r9O1J79
$$ plain form
-18978 -19 -389 -529 -582 -654 -739 -847 -915 -1048 -995 -728 -475 -417 -421 -44 244 285 148 151 251 265 210 184 215 247 307 128 -143 -475 -747
-18949 -747 -726 -666 -499 -249 -326 -293 -99 67 -24 -112 111 165 135 39 -101 -109 42 207 140 -4 4 147 15 -299 -393 -237 -212 -427
-18921 -427 -527 -502 -512 -410 -93 220 183 -36 28 151 18 19 100 134 90 43 -77 -435 -650 -549 -279 -101 -68 95 211 -9
-18895 -9 -342 -374 -400 -477 -524 -491 -489 -314 -267 -252 -210 -231 -255 -152 -69 -99 -254 -280 -227 -197 -307 -605 -752 -643 -719 -778 -651 -602 -703 -831
-18865 -831 -809 -805 -895 -1042 -1041 -692 -389 -248 -185 -221 -127 -47 -119 -11 250 308 -19 -416 -634 -619 -268 -12 67 4 -128 -82 -81 -114 -21
-18836 -21 -65 -209 -413 -577 -660 -559 -341 -323 -375 -555 -445 -169 -84 -9 -21 -51 95 131 83 106 36 -184 -421 -472 -540 -771 -945 -852
-18808 -852 -525 -251 -185 -219 -114 -56 -24 34 100 81 -6 -141 -155 -270 -314 -343 -477 -476 -471 -398 -417 -330 -174 -184 -96 -62 -315 -456 -283 -102
-18778 -102 55 50 -241 -228 8 195 123 -161 -389 -369 -308 -425 -602 -555 -207 -97 -167 -173 -367 -435 -320 -410 -433 -343 -561 -660 -599 -420
-18750d20J50M5Nj8m2o9N3J36P4l8k7k5J37OJ0m1j28k71p5K3p7M6l0J42O9Q0J41M2L8j8k22
-18719c04j91p4j04q7Q4K64K58J29K5k15k14J4P5J30K39k3k16j69r7J11Q9r4k00l67k4J58
-18693h03J85J56j8M7K44J64m6O6RM1Q3j50m2J07P7R3q6k26j02L2J96L9k45j95L27K39m6j51
-18665ep8KL6O0Mq3k18j71R2J45k1r5p8j18LQ8P2J31J38P3r3m9n8l8K07K20J46Q1k19j31J54
-18634A97J89r4j18Q8n6k74j94r7r5oK19J36qq2j50l6M4j42j05J46R4K61K42rj56l19j53j55
-18606f33p9J0MJ66J70P7N1k7N5J47r2N1K79J80K40J5m19l61j7L35L98K0k27j33j18j44J6
-18579c6J09o0r6j27j53j92q5j02k8Jq5J91M5J30J56J08K09N9j41j66o6p6N4J78J95R6q2k91
-18551b55k99k01m1Q0N0J78J00j39j21K43K99m4k48k08q0K5Q2nj4J50J9k9K9J61J59k51m45
$$ plain form
-18750 -420 -270 -225 -220 -238 -280 -349 -296 -160 -86 -124 -151 -176 -39 -33 -23 -64 -192 -463 -538 -515 -592 -546 -576 -434 -365 -285 -144 -102 -64 -82 -304
-18719 -304 -495 -569 -673 -760 -676 -412 -154 -25 0 -215 -429 -415 -340 -210 29 6 -210 -379 -476 -365 -276 -370 -570 -937 -961 -803
-18693 -803 -618 -462 -480 -433 -189 -25 -71 -5 4 45 128 -22 -64 43 120 213 127 -99 -201 -169 27 66 -179 -374 -47 192 146 -5
-18665 -5 -83 -81 -45 15 19 -64 -282 -453 -361 -216 -237 -332 -410 -528 -525 -437 -365 -234 -96 -23 -116 -165 -223 -261 -54 166 312 393 174 43 197
-18634 197 386 292 174 262 206 -68 -262 -359 -454 -460 -241 -105 -113 -195 -345 -381 -337 -479 -584 -438 -344 -83 159 150 -6 -325 -478 -633
-18606 -633 -712 -702 -698 -532 -362 -285 -234 -261 -206 -59 -151 -100 179 359 599 614 195 -166 -183 152 550 570 343 210 92 -52 -36
-18579 -36 73 13 -83 -210 -363 -555 -640 -742 -770 -769 -854 -663 -618 -488 -332 -224 -15 44 -97 -263 -329 -405 -351 -173 22 118 36 -255
-18551 -255 -554 -755 -796 -716 -666 -488 -388 -527 -648 -405 -106 -150 -398 -606 -686 -661 -579 -584 -598 -448 -429 -458 -429 -268 -109 -360 -805
-18524h05l06N3K81K70J45r3oM6j46L0R7j72k11K80J43N8K19K07l7j00J01K09N6K6J3r4j28
-18497A36j58j54j28j03K9J47J2o6M3M8J87J14j11j16j11jJ69K92K57J78q7j98l57l12K4J09
-18471a57Pk50l17j00J76J04J81K81q2j35J53J17p0j20k85j24J79L5O5J8l8J24K86K2j85n9
-18445a74p3p2K4K0j6KJ9O0r8j76l2j9r8p3k9R9K49K54j1KK1P7n2j1l0o6k05k42j22j35m1
-18414i48N1J45K42qj80p3J26J07j13o5J56L37o9j55k09O9J74J53J36n8J43K07J3K4J80k6
-18388C59j79j47m5j72l31k67L5N9jJ15N9L0OJ44J38j6q5J30j8k87q5J58R0j55j25J4K88J82
-18360a06K0J9P5j77k38j85k48j38J50K42M2O7K97K71J24J96k5k50j83n4j39l8K50J72M4j09
-18334G9K9J81N6j78l57j93J04J08Q9l4j90l30q3L31K05j58k6L03J88P9K69J20p8j70j08P5
$$ plain form
-18524 -805 -1111 -1058 -777 -507 -362 -455 -461 -415 -561 -531 -434 -606 -817 -537 -394 -336 -117 90 53 -47 54 263 319 345 358 264 136
-18497 136 -22 -176 -304 -407 -378 -231 -219 -285 -242 -194 -7 107 -4 -120 -231 -232 -63 229 486 664 577 379 22 -290 -266 -157
-18471 -157 -150 -400 -717 -817 -641 -537 -356 -75 -157 -292 -139 -22 -92 -212 -497 -621 -442 -407 -342 -324 -362 -238 48 70 -115 -174
-18445 -174 -247 -319 -295 -275 -291 -289 -270 -210 -308 -484 -516 -535 -633 -706 -735 -636 -387 -133 -144 -142 -121 -44 -96 -107 -137 -203 -408 -650 -772 -907 -948
-18414 -948 -897 -752 -510 -518 -698 -771 -645 -538 -651 -716 -560 -223 -292 -447 -656 -587 -413 -260 -124 -182 -39 168 181 205 385 359
-18388 359 180 33 -12 -184 -515 -782 -747 -688 -689 -574 -515 -485 -479 -335 -197 -213 -298 -168 -186 -473 -558 -400 -310 -465 -590 -576 -288 -106
-18360 -106 -86 -67 8 -169 -407 -592 -840 -978 -828 -586 -544 -477 -180 91 215 411 386 136 -47 -101 -240 -278 -28 144 188 79
-18334 79 108 289 345 167 -190 -383 -279 -171 -82 -116 -306 -636 -719 -388 -183 -341 -367 -64 124 203 472 592 514 344 236 311
-18308C11J75k8k79k41J41Q6mK8m0J31J9k1J51n3j12l1mJ5J0QR2k6r9l45l06m8O8O9j10j86
-18278f29j20l2r2P7J81J45O7J24jLJ68K20J0j4j25j16j05o5O4K15J23r8k08j35k18q8K82
-18251c67K61M0j44j33n0j84N0L8q3J06n8j61M8J8P2K00J24k56k41J36J90K14J60R2q6j34
-18225a48k61k2K18K51J72K09N1l97k74r9n8j34o3Q9J51j5j36j17LK65%r0J7j51J2K49L12
-18198C4J16p0j46K5J50r5L7J19M0N8j29l04j74n3j7K9Q7K59J76j06r3r1j49j65j59j4O1Q5
-18170d89J05k6o0J34K56r2k93Q3K40mk67o3J55J0k83l5J41qM8R7nl32j26M36J93M4K1K4K5
-18141g1R5Q2k23l47k18k69j12J73J93M9j47m5k5MK36K82R6k7j69O5L8k9%j85Q9L90J03r5
-18113f7k02j99p0O9m9q3P9K78M18K78M7l00n40j22J10j8M2j39l69p7J35PP0J76J90L1O8K45
$$ plain form
-18308 311 486 458 179 -62 79 165 161 189 149 280 299 278 429 376 264 233 229 244 254 262 354 328 229 -116 -422 -470 -402 -333 -443 -629
-18278 -629 -749 -781 -873 -796 -615 -470 -403 -279 -280 -277 -109 111 121 107 -18 -134 -239 -304 -240 -25 98 0 -208 -343 -561 -649 -367
-18251 -367 -106 -66 -210 -343 -393 -577 -527 -489 -572 -466 -524 -685 -637 -619 -547 -347 -223 -479 -720 -584 -394 -180 -20 72 -14 -148
-18225 -148 -409 -431 -213 38 210 419 470 73 -201 -300 -358 -492 -555 -466 -315 -330 -466 -583 -580 -315 -315 -405 -388 -539 -527 -278 34
-18198 34 150 80 -66 -41 109 14 51 170 210 268 139 -165 -339 -392 -409 -380 -293 -34 142 36 -57 -148 -297 -462 -621 -635 -574 -489
-18170 -489 -384 -410 -470 -336 -80 -172 -465 -382 -142 -146 -413 -476 -321 -311 -594 -629 -488 -496 -448 -351 -356 -688 -814 -378 -185 -141 -120 -96 -71
-18141 -71 24 106 -117 -464 -682 -951 -1063 -890 -697 -648 -795 -840 -865 -861 -625 -343 -247 -274 -443 -378 -340 -369 -369 -554 -465 -75 28 -67
-18113 -67 -269 -468 -538 -469 -518 -601 -522 -244 174 452 499 199 -341 -463 -353 -371 -329 -468 -837 -914 -779 -772 -702 -526 -336 -305 -237 8
-18085Hj11k23J0M3J33K85K10j05k41m17n99l61K43L96J51R5J2N7l3n3K09J90k3O1q4l37j41
-18058f25Q5J58J49j05q3J82K87n2k42n7j02M8L9j36j43p2j38J1K45J01L13L92K08r0q9j9
-18032B65j37j88r1k8k29l08q8MR1M4j79k10J10L54j0k20j17J4L30M52K42L0j41p2p5j70n9
-18005c86R8N2J3j51j09j97k12q0q6P7K48J08L5K09P7l69k62j45R6K70l9l31j37J3M5M7JJ73
-17977i42J86J31j46j92P9J13j2O7M17L41j5k86j76o7N0J04J38Q1j01K6m3k17nJ46l7p5K3
-17950d12M7n6J9J04P8J9j52k06J49K04j80j54O8K4J72J50J19J96L3n5j36j15k50k40p3L8
-17924f09J58Q1J44L6o7j03j04j48j56O4L13M30k1j51J10R4Oo8L3Q7r6K6k6l23j67k59k25
-17897i41j30R3K55K59jk21q4p9m5R5J20J83L01J13j7p8j53j60K68M02Q3O6K17j62k57K3l1
$$ plain form
-18085 8 -103 -326 -316 -273 -140 145 355 250 9 -408 -1007 -1368 -1125 -729 -578 -483 -471 -414 -447 -500 -291 -101 -124 -63 -147 -484 -625
-18058 -625 -540 -382 -233 -338 -421 -239 48 -4 -246 -303 -405 -357 -318 -454 -597 -669 -807 -796 -551 -450 -137 255 463 373 284 265
-18032 265 128 -60 -151 -179 -408 -716 -804 -800 -709 -665 -844 -1054 -944 -590 -600 -820 -937 -923 -593 -141 101 131 -10 -82 -157 -327 -386
-18005 -386 -288 -236 -223 -374 -483 -680 -892 -972 -1058 -981 -733 -625 -590 -381 -304 -673 -935 -1080 -984 -714 -753 -1084 -1221 -1208 -1163 -1116 -1115 -942
-17977 -942 -756 -625 -771 -963 -884 -771 -783 -716 -299 42 27 -259 -435 -502 -452 -348 -210 -129 -230 -204 -247 -464 -469 -323 -360 -435 -412
-17950 -412 -365 -421 -402 -298 -220 -201 -353 -559 -410 -206 -386 -540 -472 -448 -276 -126 -7 189 222 167 31 -84 -334 -574 -647 -609
-17924 -609 -451 -370 -226 -190 -257 -360 -464 -612 -768 -704 -391 39 18 -133 -23 71 77 9 42 129 33 59 33 -290 -457 -716 -941
-17897 -941 -1071 -978 -723 -464 -465 -686 -770 -849 -894 -799 -679 -496 -195 -82 -99 -177 -330 -490 -222 180 263 329 546 384 127 150 119
-17870A19j29j22k18l1J9L0l8N2K50K11P5J35m5k47j17k3O8K8M3m2R6K24K13j67l02j62J09
-17843B9J17k06l87k12K1O0J70L8k15k54j61K05J97K2r5j4J22K0n6q6R5J61M6Q5j81L0J45
-17816c04J43R3l4n7j04K1J85R7j37j2Q2j6Jj31j99j31J48Rp6j23M2K35Nj59j12L8Q2O7N5
-17787b92j85k27j12lK34K63J13O0J06N4n7r0K1op8j1L1R6J63m5l04l41LQ9J90K03K38j11
-17759Bj80J6m7o9k9J97K20K6j25j79j52k36l01r3J55j14q5O9N0J59J36p3k8L9K54L21J01
-17732C4N3J33P8j58j37k30j72K1o5r5J9j34M4J38L9J00M6M9L3j59k24k15n7J56N3j3p6R0
-17704f49P8QO6k6o0j09l7Q3J88M02j5k56n2l6r8P6Pm6J32Q8j3k83l14m6q6J28K68K11J29
-17675b62p1o9L8k2k32j98k8j67k92j21%K09L19K03Q7J99P7j59l4j53j71J53K90J75O6nl7
$$ plain form
-17870 119 -10 -132 -350 -381 -362 -332 -370 -318 -68 143 218 353 308 61 -56 -79 -11 17 60 18 114 338 551 384 82 -80 29
-17843 29 146 -60 -447 -659 -638 -578 -408 -370 -585 -839 -1000 -795 -598 -576 -671 -685 -563 -543 -599 -685 -590 -429 -383 -298 -479 -449 -304
-17816 -304 -161 -68 -102 -159 -263 -242 -57 40 -97 -109 -27 -43 -42 -173 -372 -503 -355 -346 -422 -545 -503 -268 -263 -422 -534 -496 -414 -347 -292
-17787 -292 -477 -704 -816 -819 -585 -322 -209 -149 -43 11 -46 -136 -115 -121 -199 -210 -179 -83 80 35 -269 -610 -607 -518 -328 -125 113 2
-17759 2 -178 -162 -209 -278 -307 -110 110 136 11 -168 -320 -556 -857 -950 -795 -909 -994 -925 -875 -716 -580 -653 -681 -642 -388 -67 34
-17732 34 87 220 298 140 3 -227 -399 -378 -443 -538 -519 -653 -609 -471 -432 -332 -286 -237 -204 -363 -587 -802 -859 -703 -650 -663 -739 -649
-17704 -649 -571 -563 -497 -523 -583 -692 -729 -646 -458 -56 -71 -327 -379 -415 -513 -437 -430 -476 -344 -256 -269 -552 -866 -912 -998 -870 -602 -391 -262
-17675 -262 -333 -402 -364 -386 -618 -816 -844 -1011 -1303 -1424 -1424 -1215 -896 -693 -606 -407 -330 -489 -523 -676 -847 -694 -404 -229 -163 -168 -205
-17648b05n2k8j17j45p0k14j96nJ70M7p2%OJ16L81L05J22mK4Q4k27j83N6L4Oj0p8L9m3o1J37
-17617a83Ql18j96l7J6J31m0k19J51L06J32j00o6R3J35M0j03j42J9L06R4m4j68pK60J03n5
-17590A16j15LM4j86k75k20j70j02N9K10J10j27j44k1J37K55K01J85k9j07O0J19p9j25j71
-17565c72o8J49N0J19R6N0L4j7KK66J5l79l18j08j66n0j1j00N6Q2Q8J31J58o4o0J51J33j1
-17537a44j50j28K5n8p7j27r2J75ol2o0j95J21K50j5n8j22k82j82M0L09L69K9j45Q9J37M4
-17510b85j0K6P2j34k10m6M6m4o0J43K37K04K53K87O7k06n8j22k92j01L0O6p3o2K9Q7R4j09
-17482a71j54j69q7J10J70J34r0J3J65j25m14l12j61P0M10K80K80J32L9l2j42j21lj31j18
-17457d27j44j25j73j53N0J71J02K32J71J3q2N6L5p1j98j01o0J50L07l7j75j67q1O8J42J58
$$ plain form
-17648 -205 -257 -285 -402 -547 -617 -831 -1027 -1032 -862 -815 -887 -887 -881 -765 -384 -79 43 39 63 147 -80 -263 -207 -173 -167 -177 -255 -216 -259 -320 -183
-17617 -183 -175 -493 -689 -726 -710 -579 -619 -838 -687 -381 -249 -349 -415 -322 -187 -147 -250 -392 -373 -67 27 -17 -185 -192 68 171 116
-17590 116 1 4 48 -138 -413 -633 -803 -905 -846 -636 -526 -653 -797 -818 -681 -426 -225 -40 -69 -176 -116 3 -76 -201 -372
-17565 -372 -440 -291 -241 -122 -26 24 58 41 43 309 324 -55 -373 -481 -647 -697 -708 -808 -752 -670 -582 -451 -293 -357 -417 -266 -133 -144
-17537 -144 -294 -422 -397 -455 -532 -659 -751 -576 -582 -614 -674 -869 -748 -498 -513 -571 -693 -975 -1157 -1117 -808 -439 -410 -555 -466 -329 -285
-17510 -285 -295 -269 -197 -331 -541 -587 -541 -585 -645 -502 -265 -61 192 479 546 340 282 160 -132 -233 -203 -137 -210 -272 -243 -156 -62 -171
-17482 -171 -325 -494 -581 -471 -301 -167 -257 -244 -79 -204 -618 -930 -1091 -1021 -611 -331 -51 81 120 88 -54 -175 -178 -309 -427
-17457 -427 -571 -696 -869 -1022 -972 -801 -699 -467 -296 -283 -365 -309 -274 -345 -543 -644 -704 -554 -247 -284 -459 -626 -707 -639 -497 -339
-17431c39kk0J90K23J53j44k37j65j43j07J20J09j40j64J87J79J64p5k15p0j9J3j20p9P3M3
-17405e85J86J71l5N2K36J04J09j32j51P7L8j46j50j64k30j26j35k09O9K56K42P8l7M1q4j5
-17379e40J31L5J83J70m8j44q0k65J03K03r9k5P0n8L5q5j55K9J50J07K4k44j32J08J05J28
-17353b94j25M4M6k27j86J45K01K8o5r5J0LL6N8P2O2o9J08Q8R4J07N7P7K37K9j64q2l08k34
-17324c47j24k06j59Q6J06J48K25J04J30P5j65LJ32p5l41l13O7J53JM9K6J02j25k50l3R1P7
-17297e63p5r2l4l5RK38M03J35rj15k12k28j74l22j71J40L14K74j2l5K66K58K6r8j88l4K1
-17270c13Oj32J6J69J75J3j58l4K24K05P3j94m46l29K7J17k6KL12K21j43j47R6J99n1l00J0
-17243d08R6J5N9o0j69j17o6O9P8r6o6K9N9J40L6j5k25l84j66N2r2p9J03J89J75J0M5J62K10
$$ plain form
-17431 -339 -341 -361 -171 52 205 61 -176 -341 -484 -591 -471 -362 -502 -666 -479 -300 -136 -211 -426 -496 -515 -502 -622 -701 -628 -585
-17405 -585 -399 -228 -263 -211 25 129 238 106 -45 32 70 -76 -226 -390 -620 -746 -881 -1090 -1021 -765 -523 -445 -482 -441 -525 -540
-17379 -540 -409 -374 -191 -21 -69 -213 -293 -558 -455 -252 -351 -376 -306 -364 -329 -414 -569 -540 -390 -283 -259 -503 -635 -527 -422 -294
-17353 -294 -419 -375 -329 -556 -742 -597 -396 -368 -433 -528 -518 -515 -479 -421 -349 -287 -356 -248 -160 -66 41 98 175 412 441 277 195 -113 -347
-17324 -347 -471 -677 -836 -750 -644 -496 -271 -167 -37 38 -127 -124 8 -67 -408 -721 -654 -501 -500 -451 -425 -323 -448 -698 -731 -640 -563
-17297 -563 -638 -730 -764 -799 -790 -552 -149 -14 -23 -138 -350 -578 -752 -1074 -1245 -1105 -791 -517 -529 -564 -298 -40 -14 -112 -300 -334 -313
-17270 -313 -307 -439 -423 -254 -79 -66 -224 -258 -34 171 244 50 -396 -725 -698 -581 -607 -605 -293 -72 -215 -362 -266 -67 -118 -418 -408
-17243 -408 -312 -297 -238 -298 -467 -584 -650 -581 -503 -599 -665 -636 -577 -437 -401 -416 -641 -1025 -1191 -1139 -1231 -1310 -1207 -1018 -843 -833 -788 -626 -416
-17214d16Q2j12nJ97K36%p0m9J02R8J2O7Rm5O6q5l2P5j3j0kj87j30J45J75O8k20o33j86L16
-17184e47L13J54jo5Oj42k94P9K44J43j54LK69k26n18j96J28Lk8J40K53K27L0n1l1P6kk20
-17156d07k35J54J37J50J92N0M5j65k9j55k11r9k18j74J35Pj57m8J45Q0m2J34J60K23M5j37
-17130d20l0M8J33p6j58J4M1J09NN4J22J15J5r2j50oK10pk11j24o1k45l46j07o1K62J94J34
-17102f38J99J0j04l0K6Q6J10L8j19j29L6j2J90L16J19l0j10k80r5J26j05l8M6j08J33J16
-17076b47r7Op4l2K84K07j72k88pJ13j04k34kK1l5J26J42K22J36k32k42K1J23J44K66J43o5
-17049A23j88j83k04q4L16J46o7l5J5L40L2l30k82o2J50J14j34j25k5j31M4M7J72K49j7k67
-17023c86J16L49J58J63m0l08j94j71qJ83J21M8LJ9L3J27K57J36m9k11k66j00J77L3j67O5
$$ plain form
-17214 -416 -334 -446 -451 -254 -18 -18 -88 -137 -35 63 75 142 151 106 172 87 55 130 117 107 105 -82 -212 -67 108 176 -44 -677 -863 -547
-17184 -547 -234 -80 -81 -146 -140 -282 -576 -497 -253 -110 -264 -261 8 -218 -736 -932 -804 -801 -829 -689 -436 -209 -179 -230 -261 -185 -187 -407
-17156 -407 -642 -488 -351 -201 -9 41 86 -79 -108 -263 -474 -573 -791 -965 -830 -823 -980 -1028 -883 -803 -845 -711 -551 -328 -283 -420
-17130 -420 -450 -402 -269 -345 -503 -489 -448 -339 -334 -280 -158 -43 -28 -120 -270 -276 -66 -73 -284 -408 -469 -714 -1060 -1167 -1228 -966 -772 -638
-17102 -638 -439 -429 -533 -563 -537 -451 -341 -303 -422 -551 -515 -527 -337 -21 98 68 -42 -322 -417 -291 -396 -434 -388 -496 -363 -247
-17076 -247 -344 -338 -412 -444 -160 47 -125 -413 -420 -307 -411 -645 -647 -626 -661 -535 -393 -171 -35 -267 -509 -488 -365 -221 45 188 123
-17049 123 -65 -248 -452 -536 -220 -74 -141 -176 -161 179 211 -119 -401 -463 -313 -199 -333 -458 -483 -614 -570 -523 -351 -102 -119 -386
-17023 -386 -270 79 237 400 360 52 -142 -313 -321 -138 -17 31 34 53 86 213 470 606 557 346 80 -20 157 190 23 88
-16997H8J01N8rj04l87m49l10j6J13J56R9L4m8r7o4n7jJ63L46J62Q2J80j30k60j36N2J63K03
-16969f8j01k72k17j47J28m4p5L88K70j23p7P8J54J52q3j52j48l73k22N3J95J62J11M0J6m2
-16943c97QK29K47K1l0N7O5J02j8j93j77K5pk67k16J52K92k7q9N5J26Nk1J01K5k66j83O5P7
-16914b39M3R4N8j43j66j5P2Lp7P4n1q3N1l6j7J8K05M80J65k86k94k72l30LQ4P7K39rn3j08
-16884e13J0J45n1m1Q1J06k12k35O4Pjk7P8L42J14k03j1nj19k79j76J53P1l2J61J26j8j02
-16856e67L9L09N0l79k80N8J84P0L2J13J98O8j57k90j76j2R8jON8k7j05J3P0l9j8K4j8j43
-16827h22K3K36K83K42Nl03j26J52M1p0p5m2qP9J42r8r2Q0J34N9k22l64j15P7J84J39o2k00
-16799g23k9N6J98L05K30J48j40k68o5k6j29r3Q1mqL5K6l1k33l37j60J85L19K39N2L1N2r3
$$ plain form
-16997 88 189 247 238 134 -253 -702 -1012 -1028 -915 -759 -660 -626 -674 -771 -835 -892 -893 -730 -384 -222 -140 40 -90 -350 -486 -434 -271 -68
-16969 -68 -169 -441 -658 -805 -677 -721 -796 -408 -138 -261 -338 -260 -106 46 -37 -189 -337 -710 -932 -879 -684 -522 -411 -371 -355 -397
-16943 -397 -389 -160 87 108 78 135 200 302 284 91 -86 -61 -68 -335 -551 -399 -107 -134 -223 -168 -42 -37 -58 43 68 -198 -381 -316 -239
-16914 -239 -196 -102 -44 -187 -353 -368 -296 -293 -370 -296 -347 -430 -379 -415 -432 -414 -209 271 436 150 -144 -416 -746 -743 -659 -582 -343 -352 -405 -513
-16884 -513 -503 -358 -409 -450 -369 -263 -475 -710 -646 -639 -640 -667 -589 -247 -133 -336 -347 -352 -471 -750 -926 -773 -702 -734 -573 -447 -465 -567
-16856 -567 -528 -219 -169 -548 -828 -770 -586 -516 -484 -371 -173 -105 -262 -552 -728 -740 -642 -643 -637 -579 -606 -711 -698 -628 -667 -685 -661 -679 -822
-16827 -822 -799 -563 -280 -38 -33 -336 -462 -310 -269 -339 -414 -456 -464 -385 -243 -341 -433 -353 -219 -160 -382 -746 -861 -784 -600 -461 -523 -723
-16799 -723 -752 -696 -498 -193 37 185 45 -223 -288 -314 -443 -536 -455 -459 -467 -432 -406 -437 -670 -1007 -1167 -982 -663 -424 -372 -341 -289 -382
-16771c82p9j62J0q5p3m2J03J50k74j49J77P3l3J04j61k96L3K14L75L36K37J94J99j76k14
-16746G9j76j13k5j35J15R1J23L7o1j20o1J51J8j88j04Q9P9M6k9lj91P3L49P8k41j70j03n7
-16718d49K02P7k1k6nj03n8l29k66Q7R8k4q6J53P7k3p8k16o2K3J79K27J10J08M19J78r7j85
-16690i0k74l16j51J55J55J53R0l4q1j37l2J69J12o9j81j33j48j08J36K18Q6L8j42j38J62
-16665e60J73N7J31J4k85k63q1j20o2O1K03J27J40J59L59K87Mk55l70k81oP8O7J82J08oJ6
-16638a23K9L0J52j75k87j28l41k23J88J12j16qJ71J53J40R2J1j10l0K9J59M6n5m6J3J29J22
-16611f6l1j86j64K9j89j59J24J73J89R3R7l2k0O3N1j26j0K46Nl07j87j80j80j36J0k6n0j12
-16583a081K2m0J05K57R4J94K01k8k10j26R4M4ML0k79k65L7K96Lj56m4M5J31J13J97K45l0
$$ plain form
-16771 -382 -461 -623 -613 -698 -771 -813 -710 -560 -834 -983 -806 -733 -766 -662 -823 -1119 -1086 -872 -497 -161 76 270 469 293 79
-16746 79 -97 -210 -235 -370 -255 -164 -41 -4 -65 -185 -246 -95 -77 -265 -369 -280 -201 -155 -184 -187 -378 -305 44 122 -119 -289 -392 -449
-16718 -449 -247 -170 -191 -217 -222 -325 -383 -712 -978 -891 -793 -817 -903 -750 -673 -696 -774 -990 -1052 -1029 -850 -623 -513 -405 14 192 95 -90
-16690 -90 -364 -680 -831 -676 -521 -368 -278 -312 -393 -530 -562 -393 -281 -350 -531 -664 -812 -920 -784 -566 -480 -442 -584 -722 -560
-16665 -560 -387 -330 -199 -185 -470 -733 -814 -934 -996 -935 -732 -605 -465 -306 53 340 344 89 -281 -562 -568 -490 -423 -241 -133 -139 -123
-16638 -123 -94 -64 88 -87 -374 -502 -843 -1066 -878 -766 -882 -890 -719 -566 -426 -334 -323 -433 -463 -434 -275 -229 -284 -330 -317 -188 -66
-16611 -66 -97 -283 -447 -418 -607 -766 -642 -469 -280 -187 -90 -122 -142 -79 -28 -154 -164 82 87 -220 -407 -587 -767 -903 -893 -919 -969 -1081
-16583 -1081 -1059 -1099 -994 -737 -643 -449 -248 -276 -486 -612 -518 -474 -470 -440 -719 -984 -947 -651 -648 -804 -848 -803 -672 -559 -362 -117 -147
-16556a47k16l38m38o8K22Q7o5n2K3L9N8K13J93J20J28M6J3j52j77L6J18L14M03J82J6j71
-16530C87j87j0p6r4j20p5l9R8J96k10l82j68J30J65j46K2K76J26J4ro8q6l44k45J04Q7K4
-16503f30J96K09L3l2Ro2n8n3l0J33J12Q8P1k73k43Q3P8K1k1K1j54L7J9n3j6K48J60%n9k01
-16473c67k24m1oj90P9L29j2j19LM4j09j75n8L1j05N0K01L77K96K9L4j58j16P0r3k40o9l7
-16445e76J62J68Jj74l09k46k8J5J92K86J58K4J82J67j72m07k75k76j57K01L15J19J84K30
-16421b16l5j62o4N0J59N3K54M9n0k5j24N0J1j91j79m6M4N4J06K60ql38k20J42J04L5R8M0
-16393a49nk13k51N5J91J00L8k0j16j49n7jJ08j0m1m5j12N8O1l5rL0j59k70j63J41J23J01
-16365g99K03K06M6l0K33L8k92nj06m30j08L88L22J30L0o0k39j77k30k30L4O8m2K24Q2l8J97
$$ plain form
-16556 -147 -363 -701 -1139 -1207 -985 -898 -963 -1015 -992 -953 -895 -682 -489 -369 -241 -195 -182 -334 -511 -475 -357 -43 360 542 558 387
-16530 387 200 190 114 20 -100 -175 -214 -116 80 -130 -512 -680 -550 -385 -531 -509 -233 -107 -93 -102 -170 -256 -600 -845 -741 -654 -630
-16503 -630 -434 -225 -192 -224 -215 -277 -335 -388 -418 -285 -173 -85 -14 -287 -530 -447 -369 -348 -369 -348 -502 -465 -446 -499 -515 -267 -107 -107 -166 -367
-16473 -367 -591 -632 -638 -828 -749 -420 -432 -551 -548 -504 -613 -788 -846 -815 -920 -870 -669 -292 4 33 67 -91 -207 -137 -230 -470 -539 -576
-16445 -576 -414 -246 -245 -419 -728 -974 -1002 -987 -795 -509 -351 -327 -145 22 -150 -557 -832 -1108 -1265 -1064 -749 -630 -446 -216
-16421 -216 -251 -413 -477 -427 -268 -215 39 88 38 13 -111 -61 -50 -241 -420 -466 -422 -368 -262 -2 -10 -348 -568 -426 -322 -287 -189 -149
-16393 -149 -154 -367 -618 -563 -372 -272 -234 -254 -370 -519 -576 -577 -469 -479 -520 -565 -677 -619 -558 -593 -602 -572 -731 -1001 -1164 -1023 -900 -799
-16365 -799 -596 -390 -344 -374 -141 -103 -395 -400 -506 -936 -1044 -656 -334 -204 -174 -234 -473 -650 -880 -1110 -1076 -1008 -1050 -826 -744 -782 -585
-16338e85K49O8q4o4j23K3J55j17k49K8J38J22j7N4K94J71k5j19m6j87r2j2J76J57p5p6J21
-16311a15J25M5n2J68J17o0%Q7O3j86k56k41k57k16PK38j6j81o1J26mN5K42K66L27J02m9j61
-16283A13j69P2K2k06j43O0R6M9Q3J08j15k19N9J39k28l69j11j33K3L68K21P9M0j21j64P9
-16257c67L9j39L8J71q9l62N1K81P9J02J05o3j49q7j42j13jK5N7Q6p2l4P2J05R6L32L23J31
-16229D75j61k34K2l1K46O3j50o7j75m69k66l8p1j39o8o0J17J44J27J04K8k0p6q1j19J77J66
-16202e56R7J49Q6J55J42l9J43n2j57r2r0j33o0k9J44K76O2QJ48K38l2o7P5k3j65m2k44k39
-16174b97j94%K89k0k31n8J8k63j67J72J28j6j10q6J29K66J11K9J71m2r3r2j18j26m3J05J48
-16147c90pj77o5p3K0J80J52K2J9O0m0j13m20l37k26n1Q0J76J03K19K36%J54J10J01J7k05
$$ plain form
-16338 -585 -336 -268 -352 -416 -539 -516 -361 -478 -727 -699 -561 -439 -456 -402 -108 63 38 -81 -127 -314 -406 -418 -242 -85 -160 -236 -115
-16311 -115 10 55 3 171 288 228 228 315 378 192 -64 -305 -562 -778 -771 -533 -549 -730 -791 -665 -669 -614 -372 -106 221 323 274 113
-16283 113 -56 16 38 -168 -311 -251 -155 -106 -23 85 -30 -249 -190 -51 -279 -648 -759 -892 -869 -501 -280 -201 -161 -282 -446 -367
-16257 -367 -328 -467 -429 -258 -347 -709 -658 -377 -298 -196 -91 -154 -303 -390 -532 -645 -646 -621 -564 -478 -550 -584 -512 -407 -311 21 344 475
-16229 475 314 80 102 71 317 380 230 163 -12 -481 -747 -785 -856 -995 -1063 -1123 -1006 -862 -735 -631 -603 -623 -699 -780 -899 -722 -556
-16202 -556 -459 -310 -224 -69 73 34 177 125 -32 -124 -214 -347 -407 -436 -292 -16 46 54 202 440 408 341 416 393 228 186 -58 -297
-16174 -297 -491 -491 -202 -222 -453 -511 -493 -756 -923 -751 -623 -639 -749 -835 -706 -440 -329 -300 -129 -171 -264 -356 -474 -600 -643 -538 -390
-16147 -390 -397 -574 -639 -712 -692 -512 -360 -338 -319 -259 -299 -412 -832 -1169 -1395 -1446 -1366 -1190 -1087 -868 -632 -632 -478 -368 -267 -250 -455
-16120d55j36J88K25M9j09n5kk9j74j53R5L13L05J79n1j90j68r1o6j45k60N2O8q1L8J49Q6
-16093d18k43j64r5j89K6J99Q1K11K62K8O9J46N9J75j00l02q1o5m1J90L81J78j81k08j81j32
-16067c95J4j36j58j65p1M7%j36P8K59L17r2j41J65K51Rl9K36%k60j86m3%Mj04N3M7q5q7p3
-16037f91l7j56k06L9J65M7K52J49J46qj36n3J0K5K03K86L4k86k45J76L16J90n9j17k37k12
-16011d05O5J46n3L8R6M0oj35j00L6r6j13k8P5r8k66j51j71j90P3R8J37J31l5J17K11J00j60
-15983f44l9N4J19k8J12Q0m6o7L7m5j39J58Q8j15P0J36l1o0n2P0lJ6J26Lk53k44q4O1L02K08
-15953b10J64J74N0K1m7j41l0r8j3j49k04n3l6l3K4K94J55j10j46j62q4K13K74N0m3j64l52
-15926f56j85M1J06P4R8N8q1J7P5J17K30K11j94j44Q5J30M9J17k3k5o0k26O8J50Q8L1k72m10
$$ plain form
-16120 -455 -591 -403 -178 -129 -238 -293 -295 -324 -498 -651 -556 -243 62 241 190 0 -168 -259 -325 -470 -730 -678 -610 -691 -653 -504 -418
-16093 -418 -661 -825 -920 -1109 -1083 -884 -803 -592 -330 -302 -233 -87 -28 147 47 -255 -336 -401 -442 -252 129 307 126 -82 -263 -395
-16067 -395 -381 -517 -675 -840 -911 -864 -864 -1000 -922 -663 -346 -438 -579 -414 -163 -154 -193 43 43 -217 -403 -446 -446 -442 -546 -493 -446 -531 -618 -691
-16037 -691 -728 -884 -1090 -1051 -886 -839 -587 -438 -292 -300 -436 -489 -479 -454 -251 35 69 -217 -462 -286 30 220 161 44 -193 -405
-16011 -405 -340 -194 -247 -209 -113 -73 -79 -214 -314 -278 -374 -487 -515 -440 -538 -804 -955 -1126 -1316 -1243 -1145 -1008 -877 -912 -795 -584 -484 -644
-15983 -644 -683 -629 -510 -538 -426 -346 -392 -459 -422 -467 -606 -448 -360 -475 -405 -269 -300 -360 -412 -342 -345 -329 -203 -200 -453 -697 -781 -720 -418 -210
-15953 -210 -46 128 178 199 152 11 -19 -117 -130 -279 -483 -536 -572 -605 -581 -287 -132 -242 -388 -550 -634 -421 -147 -97 -140 -304 -656
-15926 -656 -841 -800 -694 -620 -522 -464 -545 -528 -453 -336 -106 105 -89 -233 -148 -18 31 148 125 100 40 -186 -118 32 120 151 -121 -531
-15898e31j55o1R4J03k26r1J54K30L26o1j30j29k17k06q8Q5J28J42r0O3R1K46M3j82L1J50
-15872b81J21j84l82k60j41P8K64K66K2mJ96J13j93j84J48J81Q3jj48J9R3m2M6p0k80q6J87
-15845d39j28l04J42L63N1n6k59l27j17J40O2P7Qj65J6K94L90J79n8j69n8Q2L84L49kl14l67
-15818b26q2J37lj75j05l1j20N4K65J16O1k39l25j86j03k5J17K04K50J91nm9j01M3K4j12p3
-15791d98L8K32J91J58L6j54n02n00j37K96N05N9q1r9j04J17J96o2LK96P9j30j03j0n7j7j45
-15764c93k8N3K6Qp3m7k8p5j73j1J94J51J29p8pJ61K4m4j6l87j20L82K48Qq7L0N5K6M3K9O
-15733FO6P1j70j77r0r8J5J86K18j7n0j83j72m8m5mJ46J10k4j15j70k05k31j71J39L28J53
-15706e32j18m2N5m7j86j47M3n2j70j30K12L50J29M9J47R6j36%J86J48j03o6oj37j40j48R9
$$ plain form
-15898 -531 -686 -747 -653 -550 -776 -867 -713 -483 -157 -218 -348 -477 -694 -900 -988 -903 -775 -633 -723 -660 -569 -323 -280 -462 -431 -281
-15872 -281 -160 -344 -726 -986 -1127 -1049 -785 -519 -497 -501 -305 -192 -385 -569 -421 -240 -157 -158 -306 -287 -194 -236 -190 -260 -540 -626 -439
-15845 -439 -567 -871 -729 -366 -315 -371 -630 -957 -1074 -934 -872 -795 -787 -952 -936 -642 -252 -73 -131 -300 -358 -276 108 457 455 141 -226
-15818 -226 -308 -171 -174 -349 -454 -485 -605 -551 -286 -170 -109 -348 -673 -859 -962 -987 -870 -666 -416 -225 -230 -279 -380 -337 -313 -425 -498
-15791 -498 -460 -228 -37 121 157 3 -499 -999 -1136 -840 -335 -276 -357 -456 -560 -443 -247 -309 -306 -10 69 -61 -164 -174 -231 -248 -393
-15764 -393 -421 -368 -342 -334 -407 -454 -482 -557 -730 -741 -547 -396 -267 -345 -352 -191 -167 -211 -227 -614 -734 -352 -104 -96 -183 -153 -98 -72 -29 0 6
-15733 6 72 143 -27 -204 -294 -392 -377 -191 27 10 -40 -223 -395 -443 -488 -492 -346 -236 -260 -375 -545 -750 -981 -1152 -1013 -685 -532
-15706 -532 -650 -692 -637 -684 -870 -1017 -974 -1026 -1196 -1326 -1114 -764 -635 -586 -439 -343 -479 -479 -293 -145 -248 -314 -320 -457 -597 -745 -646
-15679f46J98j27j30M5J20K58J4o3m4P8Q4j19j81r6J6j22j89J17K26K98J33l8K8O4mR3jk47
-15651b35k95q3K13K01R8N2O3L6pP8p4j54l6J7l3j86o6j77k84m4J89M1L3J65J10Jk90j18J51
-15622f34K5n3l8J39Q4L5j31j72n9l7j02k12q4O5J28J03m8k18J58K09Q2K92J23P7R8K0k56
-15595d06k87j09n2Q0L30L09P1j18m2L8j49m9K46M9M5L9%o1j78MJ30J6m8j33j08m2k58l5K05
-15566e13K68mj06m7j58j07J75OOnr7k34k42P5J66Kk55j89J20J44J79J3p2k14k00K40K83R5
-15538f71J11R9j58n2k1j45o9p6j16M7K27P4n0P6M1j89q2R2L3P4J38j4j21m1K50R9j63k33
-15510h40jJ74K72K40j7l9L7l3P2R7J08l9j6R2l21j59o4q1J13J24j54k16r1M2J21K98L85L1
-15482A35q8J06j43l08l16J8K42P3p6j49k3Q5j53j81k7j7N0j32j97L2J57o5J1J59L39L42J05
$$ plain form
-15679 -646 -448 -575 -705 -660 -540 -282 -268 -331 -375 -297 -213 -332 -513 -609 -593 -715 -904 -787 -561 -263 -130 -168 -140 -76 -80 13 12 -235
-15651 -235 -530 -613 -400 -199 -101 -49 14 50 43 121 47 -107 -143 -126 -159 -345 -411 -588 -872 -916 -727 -686 -653 -488 -378 -377 -667 -785 -634
-15622 -634 -609 -662 -700 -561 -477 -442 -573 -745 -804 -841 -943 -1155 -1239 -1174 -1046 -943 -991 -1209 -1051 -842 -760 -468 -345 -268 -170 -150 -406
-15595 -406 -693 -802 -854 -774 -444 -135 -64 -182 -224 -186 -335 -384 -138 -89 -44 -5 -5 -66 -244 -240 -110 -94 -142 -275 -383 -425 -683 -718 -513
-15566 -513 -245 -249 -355 -402 -560 -667 -492 -486 -480 -485 -582 -816 -1058 -983 -817 -815 -1070 -1259 -1139 -995 -816 -803 -875 -1089 -1289 -1049 -766 -671
-15538 -671 -560 -461 -619 -671 -692 -837 -906 -982 -1098 -1051 -824 -750 -800 -724 -683 -872 -954 -862 -829 -755 -617 -631 -752 -793 -543 -444 -607 -840
-15510 -840 -841 -667 -395 -155 -172 -211 -174 -207 -135 -38 70 31 15 107 -214 -373 -437 -518 -405 -281 -435 -651 -742 -700 -579 -281 104 135
-15482 135 47 153 10 -298 -614 -596 -354 -281 -357 -506 -529 -444 -597 -778 -805 -822 -772 -904 -1101 -1069 -912 -977 -966 -807 -468 -126 -21
-15455b1j34l81k11J35K55J89j67l75%j05k86M0K10J72K0j04m5R8J57N1K10J57j7o0k46l59
-15429h17k19m2J8J54R4J44K45kKO0K15K68j6k08l21l9O8Q0l8J04R5j05j85j7L5k03j17M4
-15401g03O4j28j02J79L57K59Nj46l31j91J81J97J4j61J97L09J98J26k0o9l14l19m7J13J43
-15376a89L4k0N8Rj37j31j19K4J57K80j2k21q2k97k16l0N6jOn1O0R5j15j48L6K19J62J87J50
-15347b36k0k45r9n3n2L43L53K2j28N2K5j60r6KM5q1l80l23m9P6K25L32L85K30p6k44k12j94
-15319e58N8J2o5j5J01J62P0m0r4j56j23K1j11l44k12k6J5K05L79J47r1m0M9m4j35K0Mn4J44
-15290g21K90K53J01k28k66j24l5j97j78J05K31J69K62J56pJ69K61J19j78k01j11j23j17K6
-15266c44R3k23l16q9J69K24J85Q0j05k14j11M4j2j5M6J23O5j39j39j65pJ15j1j47j02Q0L14
$$ plain form
-15455 -21 -155 -536 -747 -612 -357 -168 -335 -710 -710 -815 -1101 -1061 -851 -679 -659 -763 -808 -710 -553 -502 -292 -135 -152 -212 -458 -817
-15429 -817 -1036 -1078 -1060 -906 -812 -668 -423 -425 -423 -363 -148 120 104 -104 -425 -464 -396 -316 -354 -250 -155 -260 -445 -462 -427 -630 -747 -703
-15401 -703 -639 -767 -869 -690 -333 -74 -69 -215 -546 -737 -556 -359 -345 -506 -309 0 198 324 304 235 -79 -398 -445 -332 -189
-15376 -189 -155 -175 -117 -108 -245 -376 -495 -471 -314 -34 -46 -267 -349 -646 -862 -892 -836 -837 -831 -882 -822 -727 -842 -990 -954 -735 -573 -386 -236
-15347 -236 -256 -501 -600 -653 -705 -362 -9 13 -115 -63 -38 -198 -294 -292 -247 -328 -708 -1031 -1080 -1004 -779 -447 -62 168 92 -152 -364 -558
-15319 -558 -500 -488 -553 -568 -467 -305 -235 -275 -369 -525 -648 -627 -738 -1082 -1294 -1320 -1305 -1100 -721 -574 -665 -705 -656 -700 -835 -815 -811 -865 -721
-15290 -721 -431 -178 -77 -305 -571 -695 -730 -927 -1105 -1000 -769 -600 -338 -182 -189 -20 241 360 182 -19 -130 -253 -370 -344
-15266 -344 -251 -474 -790 -879 -710 -486 -301 -221 -326 -540 -651 -607 -619 -634 -588 -465 -400 -539 -678 -843 -850 -735 -746 -893 -995 -915 -601
-15239f01J71J44P3j53Q0O6r4m8p8o8r4k28j08J43K53O0K5q5q7K07J4j77n4O0L03K60k20l67
-15211f03o3P0p6p2J9J03R5m8j6p9P8K19K65n8k82j19N2j07J5L5J0nR3J63L5R2j45r2p3J0
-15181d84O2J86K06j48p3J75o7k10n1R4K7p6m2O4J60J58J12j69l71j74J08Q2l53m09j7J35
-15155a075m1J56M33L56J3l16k74n9N2Q7mk55k15K7K89L40k6k42j47m2N0L98L53J90L8k55
-15129a69k22l5j6o3j57JJ0j09q4M2P8J00N5j18k02M4J55J1r5O9m8j9r2l19q5o1J47J91K56
-15100g35J51R2M4q9n1Q4j54k16r2J47J43Q2j57JO8j76j20J30K7j40PP9o2j1M6J38J00o1N4
-15071f71J65jM5o2n2K84Q4k22m1L33N00R5k37j92nJ2j23Q0L3M5M2r4l84j26N3j17j1J61K91
-15042a15k2k46r6L9p0o3k25j00J62K53l2k26p3N8O6rk5PJ55L28r2l14j33P1J80lN6Qkm0k33
$$ plain form
-15239 -601 -430 -286 -213 -366 -286 -220 -314 -362 -440 -508 -602 -830 -938 -795 -542 -482 -457 -542 -629 -422 -408 -585 -639 -579 -276 -16 -236 -603
-15211 -603 -666 -596 -672 -744 -725 -622 -527 -575 -591 -670 -592 -373 -108 -166 -448 -567 -515 -622 -607 -572 -562 -567 -474 -311 -276 -184 -329 -421 -494 -484
-15181 -484 -422 -236 -30 -178 -251 -76 -143 -353 -404 -310 -283 -359 -401 -337 -177 -19 93 -76 -447 -621 -513 -431 -784 -1193 -1210 -1075
-15155 -1075 -1116 -960 -527 -171 -158 -474 -748 -807 -755 -668 -672 -927 -1142 -1115 -826 -486 -512 -754 -901 -943 -893 -495 -142 48 86 -169
-15129 -169 -391 -426 -442 -505 -662 -661 -651 -760 -844 -802 -724 -624 -569 -687 -889 -845 -690 -679 -774 -705 -753 -772 -864 -1183 -1268 -1329 -1182 -991 -735
-15100 -735 -584 -492 -448 -537 -588 -504 -658 -874 -966 -819 -676 -594 -751 -750 -682 -858 -978 -848 -821 -961 -954 -875 -937 -948 -902 -764 -664 -725 -671
-15071 -671 -506 -507 -462 -524 -576 -292 -208 -430 -471 -138 362 457 220 28 23 35 -88 -8 25 70 112 18 -366 -492 -439 -556 -567 -406 -115
-15042 -115 -137 -383 -479 -440 -510 -573 -798 -898 -736 -483 -515 -741 -814 -756 -690 -699 -724 -717 -562 -234 -326 -640 -773 -702 -522 -525 -469 -461 -463 -503 -736
-15011g36j09Q1OP4J14J60J2P4opL4m6j55k18J26J50P9J4P9M4K8J23j5l47k18k34l15o5K62
-14982a011K10j16j25K3J07P9L14K55L6q3j04j74j16J10J1Jl2j14K7L3j18r5n2R9J26J5J26
-14955e68J31m8j06j8J80J30j27m56l85J49R5K3J29L64J90m1L8J46Q2N6P5o0j32L8j07k53
-14929d75r7Q6j9j16k28j69j5K8P9J05J24O6J19N9j4J42J74nl8j44k53k35j7K13K63k6k93
-14902f86j39J01K55P9o9m7j43k56R7L16K23K23J59R8oj90r1M7J10p3k47j57M0o3k11p8l6
-14875g44j6m2M0J25n6J02K52J95K9l8J00l4k54j71j7l5n2j74k29R3K79J15j52j90j30Q9J49
-14848g66K8j3M5J6L9Q1j26n8J63l0j36q6JJ30M9j07q5K30p8k03OR3N2P8J98K14J16r0j0J34
-14818a15K34O1r8J17P9o0l01o20l84mkn7j9j44j88r1n7OM9K66K31L43K33j27R6J99J22l9
$$ plain form
-15011 -736 -845 -764 -758 -684 -570 -410 -398 -324 -330 -337 -303 -349 -504 -722 -596 -446 -367 -353 -274 -230 -202 -79 -94 -441 -659 -893 -1208 -1273 -1011
-14982 -1011 -801 -917 -1042 -1019 -912 -833 -519 -264 -228 -311 -415 -589 -705 -595 -584 -583 -615 -729 -702 -669 -787 -882 -934 -835 -709 -694 -568
-14955 -568 -437 -485 -591 -609 -429 -299 -426 -882 -1267 -1118 -1023 -1000 -871 -507 -317 -358 -320 -174 -92 -36 39 -21 -153 -115 -222 -475
-14929 -475 -572 -486 -505 -621 -849 -1018 -1033 -1005 -926 -821 -697 -631 -512 -453 -467 -325 -151 -156 -194 -338 -591 -826 -843 -630 -367 -393 -686
-14902 -686 -825 -724 -469 -390 -459 -506 -649 -905 -808 -492 -269 -46 113 211 205 15 -76 -29 81 8 -239 -396 -356 -419 -630 -708 -744
-14875 -744 -760 -802 -762 -637 -693 -591 -339 -144 -115 -153 -53 -87 -341 -512 -529 -564 -616 -790 -1019 -926 -647 -532 -684 -874 -1004 -915 -766
-14848 -766 -738 -751 -706 -690 -651 -570 -696 -754 -591 -621 -757 -843 -842 -712 -663 -770 -855 -625 -703 -906 -900 -807 -755 -677 -479 -265 -149 -239 -249 -115
-14818 -115 119 180 82 199 278 218 -83 -703 -1087 -1091 -1093 -1150 -1169 -1313 -1501 -1592 -1649 -1643 -1594 -1328 -1097 -754 -521 -648 -552 -353 -231 -270
-14790b70j23R7J65n5q9O4R7r5k74l30j57j08N8K75J85OO8R9pk14j66Q5K15Q4k11r4q4k38
-14762a017j56n1j09O6K75K78K78K62j0k51j20L3j3R6R0k09j42K9o4j16p1l6J6J31J34r2r8
-14735h67J39K23Q8j57m04j71mO0m0o8K4k9o7L15L47j06k5N1K8R1P3J2k08l34k01K61L18q9
-14707g40j93O9J41j8k17j47J96K1k31Q0L83J17j49k82k67j89J22K24J55M0p1m0JJ41M1lm2
-14680h58n2LN9OJ40Pj50L7j0J41J03K7o5k04M0L75J66k60l13K22M59L31l5j08j29j57k84
-14653e09k33K12J8k16L8K33J24j4j87l4k4j29k13n4R0J45j04j35J15n3j68n2m4r7R3J86K20
-14626g92m5j38K6l2q3O4n2O2K64J73n1k7J39M1OJ17K0l22j02M0K3Qj58l5m0J44J01o2k23
-14597i34k41K99J58j05j04k09k54n6J53m6j89M0L62K64j8n4K04M0q7l4Q1j09k69j30K53J56
$$ plain form
-14790 -270 -393 -296 -131 -186 -275 -211 -114 -209 -483 -813 -970 -1078 -1020 -745 -560 -554 -486 -387 -394 -608 -774 -689 -474 -390 -601 -695 -779 -1017
-14762 -1017 -1173 -1224 -1333 -1267 -992 -714 -436 -174 -184 -435 -555 -522 -535 -439 -349 -558 -700 -671 -735 -851 -922 -958 -942 -811 -677 -769 -867
-14735 -867 -728 -505 -417 -574 -978 -1149 -1153 -1093 -1133 -1201 -1177 -1206 -1273 -958 -611 -717 -742 -691 -663 -572 -499 -487 -695 -1029 -1230 -969 -651 -740
-14707 -740 -933 -864 -723 -741 -958 -1105 -909 -888 -1119 -1039 -656 -539 -688 -970 -1237 -1426 -1304 -1080 -925 -885 -956 -996 -995 -854 -813 -816 -858
-14680 -858 -910 -907 -848 -842 -702 -695 -845 -808 -818 -677 -574 -547 -612 -816 -776 -401 -235 -495 -808 -586 -127 204 169 61 -68 -225 -509
-14653 -509 -742 -530 -512 -728 -690 -457 -333 -347 -534 -568 -592 -721 -934 -988 -898 -753 -857 -992 -877 -930 -1098 -1150 -1194 -1291 -1198 -1012 -792
-14626 -792 -837 -975 -949 -981 -1064 -1000 -1052 -990 -726 -553 -604 -631 -492 -451 -445 -328 -308 -630 -732 -692 -669 -661 -819 -854 -894 -750 -649 -711 -934
-14597 -934 -1175 -876 -718 -823 -927 -1136 -1390 -1446 -1293 -1339 -1528 -1488 -1126 -862 -880 -934 -730 -690 -777 -811 -730 -839 -1108 -1238 -985 -829
-14571h29k41k82k04Q8K09j16j44J9J74K93J94j3R8J54n5j55p1J73j17j33K2j4O2J22J1n7
-14545h12l5p0p9p9K4J49N7j76j69J04Q9K19M02J04kl3j06k12j28q4k57k62J1J2P1K16J90
-14518h56J75K05J1o2l9j1J69J59m4K3K11J04j06j26j70j73q0n1j7j06k58K9J63L14J61j05
-14492d80j58j9n2Nl6OK79J29J13O4QO2J1j57j46j84j86j30n2r5J03M66L93K10lk07k41q1
-14464c78M8q8j69q5R7j8r8m6J02J19O4L0O3o2o2J63Mj72R8L5l02j70J58K89J00J0nk42j55
-14435f72n1o4q4P7O6l8N3Q3k48k40J29J73J09J40L8P6J09n0n8j3n9l1J10J27Q8p6k3J03j38
-14406c64k4K6j7L0k2j12j10J9K2P4m3j47j44P3J21M0q6o8k7M8Pl4k1k8P4j25k81j76K36K98
-14376g61J49J62m9j38J97J50j28j5J16P1j01k77k42m7N5K7o3R3P4J7l5P3P5j07Q3K14M0j74
$$ plain form
-14571 -829 -1070 -1352 -1556 -1468 -1259 -1375 -1519 -1500 -1326 -1033 -839 -852 -754 -600 -655 -810 -881 -708 -825 -958 -936 -950 -888 -766 -755 -812
-14545 -812 -847 -917 -996 -1075 -1051 -902 -845 -1021 -1190 -1086 -997 -778 -376 -272 -274 -307 -413 -625 -753 -837 -1094 -1356 -1345 -1333 -1262 -1046 -856
-14518 -856 -681 -476 -465 -527 -566 -577 -408 -249 -293 -270 -59 45 -61 -187 -357 -530 -610 -661 -678 -784 -1042 -1013 -850 -536 -375 -480
-14492 -480 -638 -657 -709 -704 -740 -734 -455 -326 -213 -149 -141 -79 -68 -225 -371 -555 -741 -871 -923 -1018 -915 -449 -56 154 151 -56 -297 -378
-14464 -378 -330 -418 -587 -672 -575 -593 -691 -737 -635 -516 -452 -422 -359 -421 -483 -320 -316 -488 -390 -355 -657 -827 -669 -380 -280 -270 -275 -517 -672
-14435 -672 -723 -787 -871 -794 -728 -766 -713 -630 -878 -1118 -989 -816 -707 -567 -529 -453 -344 -394 -452 -465 -524 -555 -445 -318 -230 -306 -329 -226 -364
-14406 -364 -388 -362 -379 -349 -371 -483 -593 -574 -552 -478 -521 -668 -812 -739 -618 -578 -664 -732 -759 -711 -704 -738 -759 -787 -713 -838 -1119 -1295 -1059 -761
-14376 -761 -612 -450 -499 -637 -440 -290 -418 -433 -317 -246 -347 -624 -866 -913 -858 -831 -894 -801 -727 -710 -745 -672 -597 -704 -621 -407 -367 -541
-14348e41j08k58k72LM2KN3J57L7p1N7J64ok46J24K68J19j6Q6Oj51J9M2j17j87j10m3k8M7
-14319i28Q9j04rJ45N1L2J39K07j50j90j9O1Q4Pp0n1J6L04J58o0k37l02l1R9r3Q6L34J07m
-14290c29J4j27j06j29o3J2m7n8R2J77M7k15q4n1o4N7J2j09m7J02P2j71j54j5M9J76Q4Q0K32
-14261e63L39J28Mj15j53L6P3J71o7l25j9J18lj35R0J09j26j44m1p2J54K69J7k39j1j63k79
-14234i47k50j58o1R9K73J86M3K1J8k43j82k6k9n8j07N4K95L22L8k23j16L5J49K96K41J02
-14208b28o9r7m9J9P0k6o5k83j49J59K98J07q2j98o6O0P8pM0J36R6j12j86j21l5J08j87q9
-14180h78K18J4R0J01R7q0l31l66j98N4pK1J17K97J89J02j7k7J49J17j21j01k5n3o5j03K3
-14153g83j28j66J96Q4j76k1K15L87J50j14l18j96m1j10k99l15O3o9q3J84J15J34p2n7O6J34
$$ plain form
-14348 -541 -649 -907 -1179 -1176 -1134 -1132 -1079 -922 -885 -956 -899 -735 -741 -987 -863 -595 -476 -492 -406 -400 -551 -532 -490 -607 -794 -904 -947 -975 -928
-14319 -928 -839 -943 -952 -807 -756 -724 -585 -378 -528 -718 -737 -676 -592 -585 -655 -706 -690 -386 -228 -288 -525 -827 -858 -759 -852 -766 -432 -325 -329
-14290 -329 -315 -442 -548 -677 -740 -728 -775 -833 -741 -564 -517 -732 -816 -867 -931 -874 -862 -971 -1018 -916 -844 -1015 -1169 -1184 -1135 -959 -875 -795 -563
-14261 -563 -224 -96 -92 -207 -360 -324 -251 -80 -147 -472 -491 -373 -376 -511 -421 -312 -438 -582 -623 -695 -541 -272 -255 -494 -505 -668 -947
-14234 -947 -1197 -1355 -1416 -1317 -1044 -858 -815 -794 -776 -1019 -1201 -1227 -1256 -1314 -1421 -1367 -1072 -750 -712 -935 -1051 -1016 -867 -571 -330 -228
-14208 -228 -297 -394 -443 -424 -354 -380 -445 -728 -877 -718 -420 -313 -395 -593 -659 -599 -521 -528 -488 -352 -256 -368 -554 -675 -710 -602 -789 -878
-14180 -878 -660 -646 -556 -455 -358 -438 -769 -1135 -1333 -1279 -1286 -1265 -1148 -851 -662 -560 -577 -604 -455 -338 -459 -560 -585 -638 -703 -806 -783
-14153 -783 -911 -1077 -881 -797 -973 -994 -779 -392 -242 -356 -674 -870 -911 -1021 -1320 -1635 -1572 -1641 -1724 -1540 -1425 -1291 -1363 -1420 -1354 -1220
-14127a220K28K32%k17k29j06J2J36J13KJ08Q0K75K40J16n7j46p2O3l3j27n8k11k68JL9o7
-14100a166%N5lj40j70J8K75L57L69L46J71J32n1k70n64m94k80M9K87K03qj08J14K68J57P0
-14074c83p2r3k0N4K1j34P3K76lj06o7j31k28j16Lk07j37J21J57k9J52M51L09n5NM6n6l44
-14046e13k83O4J49n4p9J14N6j85qK33j19j19N6p7o1j25r2O5K20K28j11k14J06J94J40jj16
-14019e32n5K1o2j45p8j40Km5o3j00Q2J25o8O1J36R9J91J00O1j58j43O3j22k00j78j67l0O
-13991a339L1K99L23L6k03j42R1O9p2k62j89J05J47k0k42J88K37J10M2K2j08k58k10N7K80
-13966a008K47J84R2jj85k26j27P3J66K00j61p4P3k5J42P4j48j3k4k4r7p8oj6o0J5J30J53
-13938g24L5J0Q2J32Q9j46j10j4Q7J7q8j55K4O9o3j10J50J30j74l44k13J6J88N6p5Q8Q5O1
$$ plain form
-14127 -1220 -992 -760 -760 -977 -1206 -1312 -1300 -1164 -1051 -1049 -941 -861 -586 -346 -230 -287 -433 -505 -442 -475 -602 -660 -871 -1139 -1138 -1099 -1166
-14100 -1166 -1166 -1111 -1114 -1254 -1424 -1406 -1131 -774 -405 -59 112 244 193 -77 -641 -1135 -1415 -1366 -1079 -876 -884 -992 -878 -610 -453 -383
-14074 -383 -455 -548 -568 -514 -493 -627 -554 -278 -281 -387 -454 -585 -813 -929 -926 -1133 -1270 -1149 -992 -1021 -869 -418 -109 -164 -159 -113 -169 -513
-14046 -513 -796 -732 -583 -637 -716 -602 -546 -731 -739 -506 -625 -744 -688 -765 -826 -951 -1043 -978 -758 -530 -641 -855 -749 -555 -415 -416 -532
-14019 -532 -587 -566 -628 -773 -851 -991 -989 -1034 -1097 -1197 -1115 -990 -1058 -997 -861 -762 -571 -471 -410 -568 -711 -648 -770 -970 -1148 -1315 -1345 -1339
-13991 -1339 -1308 -1009 -686 -650 -853 -995 -904 -835 -907 -1169 -1358 -1253 -1106 -1126 -1368 -1180 -943 -833 -791 -769 -877 -1135 -1345 -1288 -1008
-13966 -1008 -761 -577 -485 -486 -671 -897 -1024 -951 -785 -585 -746 -820 -747 -772 -630 -556 -704 -717 -741 -765 -862 -940 -946 -962 -1022 -1007 -877 -724
-13938 -724 -689 -679 -597 -465 -376 -522 -632 -646 -559 -542 -630 -785 -761 -692 -755 -865 -715 -585 -759 -1103 -1316 -1300 -1112 -1056 -1131 -1043 -958 -897
-13910h97K49K25Jn0p5j17r3q3q4k61n0L05J72K17J9j14OR4j94k60l3Q6J34k9m2K25J08j09
-13882f50l28j96J97J75p0o7N6r6k37j02N5J45K67M36K14j0l29m67j75n5J19L1j80k5J69Q6
-13856a037k2K16J43K1p5j19p3j07n2L38J71n4j76p5J7p0o3j32l0Q7K6r1OJ86K64K24k3k61
-13828g61q9r2q6P0J69kk23l67o0K6pP8J04J61K61L16K3l6m8j30L3J09j00j94J20J15k71j98
-13800a079j9J60K46nL6J24Q6L4P4J27L8j01j77J5J56k75l14Q3kj89k78l2K76J18m5j12j47
-13773a202k02J18L14J59J05nL4J37R8O8J49j31m46j83J32J17o9l5N7J47M6R6J94N2K6L2j95
-13746c87l09l41k41r0J58J97p2O5L78J53j7J16J5n7Q3Q0j92q3Q9R1j16q8Q0l7M8P3q9k15
-13718g08l93j68L56L15j08nJ95M5n9L3j17m9j51k21j46j4R5J00J47O1kP4J70J44J64Q8j15
$$ plain form
-13910 -897 -648 -423 -422 -472 -547 -664 -757 -840 -924 -1185 -1235 -930 -758 -541 -522 -636 -630 -536 -730 -990 -1023 -937 -803 -832 -874 -649 -541 -650
-13882 -650 -978 -1174 -977 -802 -872 -939 -883 -979 -1216 -1318 -1263 -1118 -851 -415 -201 -211 -540 -1007 -1182 -1237 -1118 -1087 -1267 -1292 -1123 -1037
-13856 -1037 -1059 -843 -700 -679 -754 -873 -946 -1053 -1105 -767 -596 -650 -826 -901 -884 -954 -1017 -1149 -1179 -1092 -1066 -1157 -1151 -965 -701 -477 -500 -761
-13828 -761 -850 -942 -1028 -958 -789 -791 -1014 -1381 -1441 -1415 -1422 -1344 -1240 -1079 -818 -502 -479 -515 -563 -693 -660 -551 -651 -845 -725 -610 -881 -1079
-13800 -1079 -1098 -938 -692 -697 -661 -537 -451 -417 -343 -216 -178 -279 -456 -441 -285 -560 -874 -791 -793 -982 -1260 -1292 -1016 -898 -943 -1055 -1202
-13773 -1202 -1404 -1286 -972 -813 -708 -713 -679 -542 -444 -376 -227 -358 -804 -987 -855 -738 -807 -842 -785 -638 -592 -496 -302 -250 -224 -192 -387
-13746 -387 -696 -1037 -1278 -1368 -1210 -1013 -1085 -1020 -642 -489 -506 -390 -375 -432 -349 -269 -461 -544 -455 -364 -480 -568 -488 -525 -477 -404 -493 -708
-13718 -708 -1101 -1269 -913 -598 -706 -711 -516 -471 -530 -497 -614 -663 -814 -1035 -1181 -1195 -1100 -1000 -853 -792 -794 -720 -550 -406 -242 -154 -269
-13691b69k44n2p7k69j61J55K46q0l8J42k3k46j10Q3J61K77J08p9j64Lm7J39J78k5m0J1k41
-13664f62l39k00J20L10J6m6K3%R5m3p6k05k00j31j18J9q0j00j00q2J37M92M16J51n2N6J32
-13637d67o3m3M8j18k16j2j02l05j25K72M56J28J9j16k78j21J99J7q7P1q2j54J01N0j09j64
-13611a201j37O8J15J24R4k57l12J1J09J62K29O6m9L0R0J8j12J4ok00j54N6M04K78l97l97
-13585a354LL41K75J06j17NK41N4j35j08j05j01m0J02J22K52n1l40j78O1K38q2k23m1j0p0
-13559a155j9K43K79j69l10n6J71J53J46J0n8j20j45j05o8J47R9j0P2R2J96J65j63l70k02
-13534a177L65L91R9j35j62j15m37k90K80M00L30J53k93l36j82j41J8L8j49O3K93J61n7j07
-13510i90q4k11R6M06J55q4l32k50J16N2r6j20J95L19m8m8J63R0j07j88Nm9j15j07k11O6K08
$$ plain form
-13691 -269 -513 -565 -642 -911 -1072 -917 -671 -751 -789 -647 -670 -916 -1026 -943 -782 -505 -397 -476 -640 -637 -684 -545 -367 -392 -432 -421 -662
-13664 -662 -1001 -1201 -1081 -771 -755 -801 -778 -778 -683 -726 -802 -1007 -1207 -1338 -1456 -1437 -1517 -1617 -1717 -1799 -1662 -1170 -754 -603 -655 -599 -467
-13637 -467 -530 -573 -525 -643 -859 -871 -973 -1278 -1403 -1131 -675 -547 -528 -644 -922 -1043 -844 -827 -914 -843 -925 -1079 -978 -928 -1037 -1201
-13611 -1201 -1338 -1270 -1155 -1031 -937 -1194 -1506 -1495 -1386 -1224 -995 -929 -978 -948 -858 -840 -952 -938 -944 -1144 -1298 -1242 -838 -560 -957 -1354
-13585 -1354 -1351 -1010 -735 -629 -746 -741 -500 -446 -581 -689 -794 -895 -935 -833 -711 -459 -510 -850 -1028 -967 -729 -811 -1034 -1075 -1085 -1155
-13559 -1155 -1174 -931 -652 -821 -1131 -1187 -1016 -863 -717 -707 -765 -885 -1030 -1135 -1203 -1056 -957 -967 -895 -803 -607 -442 -605 -975 -1177
-13534 -1177 -812 -421 -322 -457 -619 -734 -1171 -1461 -1181 -781 -451 -298 -591 -927 -1109 -1250 -1232 -1194 -1343 -1280 -987 -826 -883 -990
-13510 -990 -1074 -1285 -1189 -783 -628 -712 -1044 -1294 -1178 -1126 -1222 -1342 -1147 -828 -876 -924 -761 -671 -778 -966 -961 -1010 -1125 -1232 -1443 -1377 -1169
-13483a169J12o3j02j52k56j21K37L59n0jO1J07L29J17Mm4m2j48j43L0J73lrR6j73q4K22J70
-13455e43k61k71J58J65l3q6j76p2k5k58o4J87K21J05j24j39R5J44r2j89m5J0k9j0oJ88J92
-13428i58J05J2J41J56N7k47k52k20k2J81K05j0k50j37R3J24l0r5o1j2J30m9k30P1K04J10
-13402i84K82M94P5k20k02k45j29lk3j83r3J52J98R5k50m8j1p7q5p1j7j22O4J66Q8k4P0pl5
-13373a145K37Q7N9J22k13l01n5m2J02K46j72l06Q9J35k63k08l9j4J67L38L88J94j1q5R0m9
-13347f49k04l1j96l66k1M0k29m4J07J8OO3J30R0J01K53Q7k13j90Q7KoJ84K52J35j15j45P3
-13319g81k7q3OJ49q7k18m5J08L0j98k38j02n6m9L82N17J19j16j31j59j79l2R5K56qk30j34
-13292a211l91j56K38K09J61L69K17k25m15j92LJ76R8k71j58P5K83K84K88J97q3l30k71k7
$$ plain form
-13483 -1169 -1057 -1120 -1222 -1374 -1630 -1751 -1514 -1155 -1205 -1206 -1145 -1038 -709 -592 -588 -632 -674 -822 -965 -935 -762 -765 -774 -678 -851 -935 -713 -543
-13455 -543 -804 -1075 -917 -752 -785 -871 -1047 -1119 -1144 -1402 -1466 -1279 -1058 -953 -1077 -1216 -1121 -977 -1069 -1258 -1303 -1293 -1322 -1332 -1338 -1150 -958
-13428 -958 -853 -841 -700 -544 -487 -734 -986 -1206 -1228 -1047 -842 -852 -1102 -1239 -1146 -1022 -1052 -1147 -1208 -1220 -1090 -1139 -1369 -1298 -1094 -984
-13402 -984 -702 -208 -133 -353 -555 -800 -929 -932 -955 -1138 -1231 -1079 -881 -786 -1036 -1084 -1095 -1172 -1257 -1328 -1345 -1467 -1403 -1237 -1149 -1173 -1103 -1110 -1145
-13373 -1145 -908 -821 -762 -640 -853 -1154 -1209 -1251 -1149 -903 -1075 -1381 -1292 -1157 -1420 -1628 -1667 -1681 -1514 -1176 -788 -594 -605 -690 -600 -649
-13347 -649 -853 -884 -1080 -1446 -1467 -1427 -1656 -1700 -1593 -1575 -1569 -1506 -1376 -1286 -1185 -932 -845 -1058 -1248 -1161 -1159 -1165 -981 -729 -594 -709 -854 -781
-13319 -781 -808 -891 -885 -736 -823 -1041 -1086 -978 -948 -1146 -1384 -1486 -1542 -1591 -1209 -692 -573 -689 -820 -979 -1158 -1190 -1095 -839 -847 -1077 -1211
-13292 -1211 -1602 -1758 -1520 -1311 -1150 -781 -564 -789 -1204 -1396 -1393 -1217 -1119 -1390 -1548 -1473 -1190 -906 -618 -421 -504 -834 -1105 -1132
-13268a132J41K06oj20j86j77j43j98K6M0o5q0k68J22K79K33J40J96K77J56nl25l73k25L8
-13243a449J98L5k67l00j79k7J78J44J67K99K07K4j41j25k2k6j15q4l8P0m7k04j52kJ6j31
-13217a971LJ87R4q2m5L2p1o5J15K00K08M2j55k55j06J25J6j6J64L05m4l53k95l72j75pj09
-13190b630k17q1o0j82k21j51k21k53r8j23j74J59J494K389J978Q13N6k00m07l37k09q6ok35
-13166I98l67k1k8r8RL1k88l34o8j65l02j8N9J20J7K6N4l4m1k4P1P3m0n5o8j0J08J43K2p6
-13136c06k75j35l2l9r0k48j13K4J68O5k2J05K08N7j59j50J77K35K05J49q0j85k18r1Q9L1
-13110f30N4K3k09k49OJj27m2J57K23o2j89r6J47K75J27j06l61l17RK71K60N2M2j5M8J38n9
-13082f29j26J2mL6k7j90j59J22J79O1j99j49Q3J55N5l6N3j41k42K6O5j71%K54K03Ok3oj69
$$ plain form
-13268 -1132 -991 -785 -791 -911 -1097 -1274 -1417 -1615 -1589 -1549 -1614 -1694 -1962 -1840 -1561 -1328 -1188 -992 -715 -559 -564 -889 -1262 -1487 -1449
-13243 -1449 -1251 -1216 -1483 -1783 -1962 -1989 -1811 -1667 -1500 -1201 -994 -970 -1111 -1236 -1258 -1284 -1399 -1483 -1521 -1451 -1498 -1702 -1854 -1856 -1840 -1971
-13217 -1971 -1968 -1781 -1687 -1769 -1814 -1782 -1853 -1918 -1803 -1603 -1395 -1353 -1508 -1763 -1869 -1744 -1728 -1744 -1580 -1275 -1319 -1672 -1967 -2339 -2514 -2521 -2630
-13190 -2630 -2847 -2928 -2988 -3170 -3391 -3542 -3763 -4016 -4114 -4237 -4411 -4252 -2758 -369 1609 2422 2478 2278 1871 1534 1325 1239 1233 998
-13166 998 631 610 582 484 493 524 236 -98 -166 -331 -633 -651 -592 -472 -455 -429 -375 -409 -450 -474 -403 -330 -370 -425 -493 -503 -395 -252 -230 -306
-13136 -306 -581 -716 -748 -787 -877 -1125 -1238 -1214 -1046 -981 -1003 -898 -690 -633 -792 -942 -765 -530 -325 -176 -256 -441 -659 -750 -661 -630
-13110 -630 -576 -553 -762 -1011 -1005 -1004 -1131 -1173 -1016 -793 -855 -1044 -1140 -993 -718 -591 -697 -1058 -1375 -1366 -1095 -835 -783 -741 -756 -708 -570 -629
-13082 -629 -755 -743 -747 -711 -738 -928 -1087 -965 -786 -725 -924 -1073 -990 -835 -780 -816 -763 -904 -1146 -1120 -1055 -1226 -1226 -972 -769 -763 -786 -792 -961
-13053i61j25j41K23K33J07J45j97j21r0k68j32N9l3j04n5l8j1J01n5k65j66K47J32O9J57
-13028a289Km6j71k3J32J29pj18J71J44J3Lmk7n0j84j21L09L29n5j67j23k56J94L40K25k6
-13001f76k80l72k01J05O6QJ41m2j09K2J18o6k10j32pr9ON8J94K48L0lJ78K17K39Kl53k41
-12973a159j34l4J16m3l7N8P1m5KR1k6o7r6K1Q4m0l13j22K81J35k4J80r8j55J4K04K73l1r
-12944i03K6k13M6Nj97k3P6J7R8K48L5j92j77k36j13K67J66j77j14k8j6J90L41J56l03m62
-12918a483j81J16J60o6l7N4J25o2rL5O5R5J06J27R6J56K09K02mj15k06J63K89j45m36m06
-12892a152j91K1L3Q5j18j60R0O6L2J93p6j93n6o0J8J30J77J3P0p7j20j9L18M45N0k61j04
-12865h46o8j42j53L2J1p4j20j10m3K65K86m4q3P0P6RK25J52j34m67j52K51J70j42k42j1n5
$$ plain form
-13053 -961 -1086 -1227 -1004 -771 -664 -519 -716 -837 -927 -1195 -1327 -1268 -1301 -1405 -1460 -1498 -1509 -1408 -1463 -1728 -1894 -1647 -1515 -1446 -1289
-13028 -1289 -1287 -1333 -1504 -1527 -1395 -1266 -1273 -1391 -1220 -1076 -1063 -1060 -1064 -1091 -1141 -1325 -1446 -1137 -808 -863 -1030 -1153 -1409 -1215 -875 -650 -676
-13001 -676 -956 -1328 -1529 -1424 -1358 -1350 -1209 -1251 -1360 -1338 -1220 -1286 -1496 -1628 -1635 -1734 -1728 -1670 -1476 -1228 -1198 -1201 -1023 -806 -567 -565 -918 -1159
-12973 -1159 -1293 -1327 -1211 -1254 -1291 -1233 -1162 -1207 -1205 -1114 -1140 -1207 -1303 -1282 -1198 -1238 -1551 -1673 -1392 -1257 -1281 -1101 -1199 -1354 -1340 -1136 -863 -894 -903
-12944 -903 -877 -1090 -1044 -1039 -1236 -1259 -1183 -1166 -1068 -820 -785 -977 -1154 -1390 -1503 -1236 -1070 -1247 -1361 -1389 -1405 -1215 -874 -718 -1021 -1483
-12918 -1483 -1664 -1548 -1388 -1454 -1491 -1437 -1312 -1374 -1383 -1348 -1283 -1188 -1082 -955 -859 -703 -494 -292 -296 -411 -617 -454 -165 -310 -746 -1152
-12892 -1152 -1343 -1322 -1289 -1204 -1322 -1482 -1392 -1326 -1294 -1101 -1177 -1370 -1426 -1486 -1468 -1338 -1161 -1148 -1078 -1155 -1275 -1294 -976 -531 -481 -742 -846
-12865 -846 -914 -1056 -1209 -1177 -1166 -1240 -1360 -1470 -1513 -1248 -962 -1006 -1089 -1019 -943 -934 -709 -557 -691 -1158 -1310 -1059 -889 -1031 -1273 -1284 -1339
-12838a339j23Q2lp0R0Q7m1j87R1J95j29j93J43K09J45L2J09K64L5j20p1q4j36N3O7j14k28
-12811a236k63qJ6k81p6L37L41K9j5K28J0j45K5J41Q1j11j17J44J87p8j10L9J12Q3J39o9k67
-12784h64k02mO1jj56j56PJ6K4K46O0r8K35J97K5n6j06l7q0j24J46K18j08k83m7J01P6j62
-12756a072k42j44j4M1J73J61j39l08P7K95L15L05Q7j52j78n2Qm0j99n6J08j04k4N0j05j43
-12730a352J00j0o1Q4j20j20m4j02M6J77P8L5k55j01M1q3K6Q9J71O4j08j15N2L88J60p4l16
-12703a350l27P8K4r0j62j0R5L61L27J73K6J5P3k5MQoJ22o8k05J03Mk62j92P1J8j12J89K53
-12674h65J3l5l3j17j29k21N0J84P3K12M2Lr6K6o6k00k05j60oL04K90k60l54P7j2l4K0j65
-12646a664K0M08L13j11k41k84k54J2K94K04r1j09p2O6K65J5k32j53o1j3J25m3j41P0J08J90
$$ plain form
-12838 -1339 -1462 -1380 -1383 -1453 -1363 -1276 -1317 -1504 -1413 -1218 -1347 -1540 -1397 -1188 -1043 -1011 -902 -638 -603 -723 -794 -878 -1014 -961 -894 -1008 -1236
-12811 -1236 -1499 -1507 -1491 -1772 -1848 -1511 -1170 -1141 -1156 -928 -918 -1063 -1038 -897 -816 -927 -1044 -900 -713 -791 -901 -862 -750 -667 -528 -597 -864
-12784 -864 -1066 -1070 -1009 -1010 -1166 -1322 -1315 -1299 -1275 -1029 -969 -1067 -832 -635 -610 -666 -772 -809 -889 -1013 -867 -649 -757 -1040 -1087 -986 -910 -1072
-12756 -1072 -1314 -1458 -1472 -1431 -1258 -1097 -1236 -1544 -1467 -1172 -857 -552 -465 -617 -795 -847 -839 -879 -1078 -1134 -1026 -1130 -1154 -1104 -1209 -1352
-12730 -1352 -1252 -1262 -1323 -1239 -1359 -1479 -1523 -1625 -1579 -1402 -1324 -1289 -1544 -1645 -1604 -1687 -1661 -1572 -1401 -1337 -1445 -1560 -1508 -1120 -960 -1034 -1350
-12703 -1350 -1677 -1599 -1575 -1665 -1827 -1837 -1742 -1381 -1054 -881 -855 -840 -767 -792 -788 -780 -786 -664 -732 -937 -834 -830 -1092 -1284 -1213 -1195 -1307 -1118 -865
-12674 -865 -852 -887 -920 -1037 -1166 -1387 -1337 -1153 -1080 -868 -826 -823 -919 -893 -959 -1159 -1364 -1524 -1530 -1226 -936 -1196 -1550 -1473 -1485 -1519 -1499 -1664
-12646 -1664 -1644 -1236 -923 -1034 -1275 -1559 -1813 -1801 -1507 -1303 -1394 -1503 -1575 -1509 -1244 -1229 -1461 -1614 -1675 -1688 -1563 -1606 -1747 -1677 -1569 -1379
-12620a379K76J15p4M5K46K04K0l12k97r2j59n8Q8J56J72n9j10o1j9j29j96J9J92O6o8j76
-12594a590j72K06K01o0J04K75k0l65k19J63K46J24j5p8n9J05K13nj65%L3M2L6R9O9j62j92
-12567a186p3o4n1J6NP8Jk24j79r7J66M21M25J42j56k71l41k64r6l6J29J47L4Q4JL4O0Q1j8
-12538a232n3L3J21J7j23r4r5k78l14j59N2K17Lk70o1K91L26J9NJ26N3q7l12l03L0K95K10
-12511a583kj2J47J82J15lj32j9rn4J64J93LJ7K30K22m9l23m20m34k13K65L14K80Q1j11k04
-12484a355k13k75J4K23n0k51j56J11J23K3l16k64o6O6L93M26%o5J86J1k33j55J47K8k30k13
-12458b091K48K73L5R4J37L7n8m3L6r5m22o7L5MP4M5O4J79K28ml77k01j46J45L19P7jO6K27
-12429a182J67p4j37j13l09o7K88p5m8J1j15m4N1o4j42l3J90M06K88M0k45k05j95j13J43n8
$$ plain form
-12620 -1379 -1103 -988 -1062 -1017 -771 -567 -547 -859 -1156 -1248 -1407 -1465 -1377 -1221 -1049 -1108 -1218 -1279 -1298 -1427 -1623 -1604 -1412 -1346 -1414 -1590
-12594 -1590 -1762 -1556 -1355 -1415 -1311 -1036 -1056 -1421 -1640 -1477 -1231 -1107 -1122 -1200 -1259 -1154 -941 -946 -1111 -1111 -1078 -1036 -1000 -901 -832 -994 -1186
-12567 -1186 -1259 -1323 -1374 -1358 -1353 -1275 -1274 -1498 -1677 -1774 -1608 -1187 -762 -620 -776 -1047 -1388 -1652 -1748 -1784 -1655 -1508 -1474 -1390 -1389 -1355 -1295 -1214 -1232
-12538 -1232 -1285 -1252 -1131 -1114 -1237 -1331 -1426 -1704 -2018 -2177 -2125 -1908 -1905 -2175 -2236 -1945 -1619 -1600 -1595 -1469 -1416 -1503 -1815 -2118 -2088 -1793 -1583
-12511 -1583 -1585 -1597 -1450 -1268 -1153 -1156 -1288 -1307 -1316 -1370 -1206 -1013 -1010 -993 -763 -541 -590 -913 -1333 -1767 -1980 -1715 -1401 -1121 -1040 -1151 -1355
-12484 -1355 -1568 -1843 -1829 -1606 -1656 -1907 -2063 -1952 -1829 -1806 -2122 -2386 -2452 -2386 -1993 -1567 -1567 -1632 -1446 -1435 -1668 -1823 -1676 -1648 -1878 -2091
-12458 -2091 -1843 -1570 -1535 -1441 -1304 -1267 -1325 -1368 -1332 -1427 -1849 -1916 -1881 -1877 -1803 -1758 -1694 -1515 -1287 -1291 -1668 -1869 -2015 -1870 -1551 -1474 -1475 -1409 -1182
-12429 -1182 -1015 -1089 -1226 -1339 -1648 -1715 -1427 -1502 -1550 -1539 -1654 -1698 -1647 -1711 -1853 -1886 -1696 -1290 -1002 -962 -1207 -1412 -1607 -1720 -1577 -1635
-12403a635m1J13k00JK23j6k19J4L89L22M5j14j77j16J60J58J5m6R7Q5j36n1Kj21p1L5j31
-12376a415L3N9k06k70q8j03J25N2K1J89k2j47r1m9J54J31Q0q7l59l50q4L49J79K7L88J61
-12350a323j99n5m2k4J12n9n7j31j17K59J63r2K06K57n8j57j32J39J83r1l14k49K35L24J17
-12325a105R0J51j11l54m44J1K52J11J23R8j70j62o4l3J20J17j07k49j59N3p5j37%J71J13
-12300a760j20o7J83K06j0j64q0O8J7P8M2J56O9j06j12QJ06j2r7N7J6j39j98Qp4oR6r9k64
-12271b198q0K31K78J05J59J51J08k0l25m61l2K03K69K74J57mo9l10k47k0p7j54l4O8j9J48
-12245a899J47N7J60R4p2l77l39M0J57M6K48K18p8j39j75k51k30kK26M7q3R8K8p0n9J37J84
-12218a887q7k87k16l5LK55M29K24m9j20j98p6m7N2l1k32j10K24J60K63J76J35rm01l48n7
$$ plain form
-12403 -1635 -1676 -1563 -1763 -1762 -1539 -1555 -1774 -1760 -1371 -1049 -1004 -1118 -1295 -1411 -1251 -1093 -1078 -1124 -1027 -942 -1078 -1129 -1127 -1248 -1319 -1284 -1415
-12376 -1415 -1382 -1323 -1529 -1799 -1887 -1990 -1865 -1813 -1792 -1603 -1625 -1772 -1863 -1912 -1758 -1627 -1547 -1634 -1993 -2343 -2427 -2078 -1899 -1872 -1484 -1323
-12350 -1323 -1522 -1577 -1619 -1643 -1531 -1590 -1647 -1778 -1895 -1636 -1473 -1565 -1359 -1102 -1160 -1317 -1449 -1310 -1127 -1218 -1532 -1781 -1546 -1222 -1105
-12325 -1105 -1015 -864 -975 -1329 -1773 -1762 -1510 -1399 -1276 -1178 -1348 -1510 -1574 -1607 -1487 -1370 -1477 -1726 -1885 -1832 -1907 -2044 -2044 -1873 -1760
-12300 -1760 -1880 -1947 -1764 -1558 -1568 -1732 -1812 -1744 -1727 -1649 -1607 -1451 -1382 -1488 -1600 -1592 -1486 -1498 -1595 -1538 -1522 -1661 -1859 -1851 -1925 -1931 -1835 -1934 -2198
-12271 -2198 -2278 -2047 -1769 -1664 -1505 -1354 -1246 -1266 -1591 -2052 -2084 -1881 -1612 -1338 -1181 -1185 -1254 -1564 -1811 -1831 -1908 -2062 -2096 -2028 -2047 -1899
-12245 -1899 -1752 -1695 -1535 -1441 -1513 -1890 -2229 -2189 -2032 -1986 -1738 -1520 -1598 -1737 -1912 -2163 -2393 -2395 -2169 -2122 -2205 -2107 -2079 -2149 -2208 -2071 -1887
-12218 -1887 -1974 -2261 -2477 -2512 -2509 -2254 -1825 -1601 -1650 -1770 -1968 -2044 -2091 -2039 -2070 -2302 -2412 -2188 -2028 -1765 -1589 -1454 -1463 -1864 -2212 -2269
-12192b269J77K93J73n2o5j73oJ36N6K4l0k2kR1P5J38J37Q3O1k43l72j70K2P9J69J80R7j00
-12164a513o3k28l71q5mJ65J86J4k10j02O6J0J08J8j19J5L21K46o7M1J22n7l6j9r4k10l0m
-12136a900j88L9K4j22jk32k10J9jP1M7k1pJ02J19q0m2K2j1K1K80R7p6QQ7j33l19j23N5j0
-12106b485r8K9J03J4J72N7j17j3jJ95k1n3J28N7r3J10L29R1J20R8j11m70m63k70j95R6J85
-12079b606J40J2M9J70J26m1k07J14L54J61J8r8j18P0O5j08k76j17J89K22J9k35j40P1P2q8
-12053b182j78j9M8J22J39J6j49j09j32j36j8q6j34j3J77J89P7oP0l1K6J19n4r1p0k0P1R0
-12025b284j78j15J47J17M8N9J22R3n3j54J61J54J5JP4p4r4M1j66n8kj60k43k62Q6L16J97
-11998b212J8p6l35k42OJ62J89Q5J74K91K07l8k29k15j06J1Q6K29K07j14k11k59k13p3J65
$$ plain form
-12192 -2269 -2092 -1799 -1626 -1678 -1743 -1916 -1922 -1786 -1730 -1706 -1736 -1758 -1760 -1669 -1594 -1456 -1319 -1236 -1175 -1418 -1790 -1960 -1938 -1859 -1690 -1510 -1413 -1513
-12164 -1513 -1576 -1804 -2175 -2260 -2264 -2099 -1913 -1899 -2109 -2211 -2145 -2135 -2027 -2009 -2128 -2113 -1792 -1546 -1613 -1572 -1450 -1507 -1543 -1562 -1656 -1866 -1896 -1900
-12136 -1900 -2088 -2049 -2025 -2147 -2148 -2380 -2590 -2571 -2572 -2501 -2454 -2475 -2482 -2380 -2261 -2341 -2383 -2361 -2372 -2351 -2071 -1974 -2050 -2042 -1955 -2088 -2407 -2530 -2475 -2485
-12106 -2485 -2583 -2554 -2451 -2437 -2265 -2208 -2325 -2338 -2339 -2144 -2165 -2218 -2090 -2033 -2126 -2016 -1687 -1596 -1476 -1378 -1489 -1959 -2422 -2692 -2887 -2791 -2606
-12079 -2606 -2466 -2454 -2405 -2235 -2109 -2150 -2357 -2243 -1889 -1728 -1710 -1808 -1926 -1856 -1791 -1899 -2175 -2292 -2103 -1881 -1862 -2097 -2237 -2166 -2094 -2182
-12053 -2182 -2360 -2379 -2331 -2209 -2070 -2054 -2203 -2312 -2444 -2580 -2598 -2684 -2818 -2831 -2654 -2465 -2388 -2394 -2324 -2355 -2329 -2210 -2264 -2355 -2425 -2445 -2374 -2284
-12025 -2284 -2462 -2577 -2430 -2313 -2265 -2206 -2084 -1991 -2044 -2198 -2037 -1883 -1868 -1867 -1793 -1867 -1961 -1920 -2086 -2144 -2146 -2306 -2549 -2811 -2725 -2409 -2212
-11998 -2212 -2194 -2270 -2605 -2847 -2841 -2679 -2490 -2405 -2231 -1940 -1733 -1771 -2000 -2215 -2321 -2310 -2224 -1995 -1788 -1902 -2113 -2372 -2585 -2658 -2493
-11973b493M8K6k6P4O4N7k56n5K24J9j20N6J6j42J25J54P4K04M5k12j31J6LQ7J04P5L3l00
-11945b231m01J0Nj72j4J95K00J70J97J0k31j44l6j60k16q8J18k7J99L92j49j06N5Q7J1R9
-11919b227k6K8J83Q5J03K08Q2o3j31j73L9J22q0j80k10j91J85K58q0k96j99j47k2J22L23
-11894b287J93m6l44k04O9J45J00K2j97K3L46J39l90l86j48K5K05J89K9j7m3Q8K03K87J38
-11869a861k31k68j43R8Q8P4m5k12k01k05qL37J48j2J7j59l48j82n6n0l3O4J97L2n1o7RM6
-11841c022P3L5R8l8j46j96J25K02J95q7q0K02Jj51j59o4l7L1O0K26K18l9j68l6j0L8K7M5
-11813b657J64Q4J7k75l05j01J4L5O9K3o1j15N5Lj90L3R6J0J49L38K43p3r4R4P0K6P5K04Q0
-11784a989k10j98j49k2J24P7j56j20JJ6j06q6lJ8J24L9R4J27j73k73P2K37M3k06K1P6j55
$$ plain form
-11973 -2493 -2445 -2419 -2445 -2371 -2307 -2250 -2506 -2561 -2337 -2318 -2438 -2382 -2366 -2508 -2383 -2229 -2155 -1951 -1906 -2118 -2249 -2233 -2230 -2143 -2039 -1964 -1931 -2231
-11945 -2231 -2632 -2622 -2617 -2789 -2803 -2608 -2408 -2238 -2041 -2031 -2262 -2406 -2442 -2602 -2818 -2906 -2788 -2815 -2616 -2224 -2373 -2479 -2424 -2337 -2326 -2227
-11919 -2227 -2253 -2225 -2042 -1957 -1854 -1646 -1564 -1627 -1758 -1931 -1892 -1770 -1850 -2030 -2240 -2431 -2246 -1988 -2068 -2364 -2563 -2710 -2732 -2610 -2287
-11894 -2287 -2094 -2140 -2484 -2688 -2619 -2474 -2374 -2352 -2549 -2526 -2180 -2041 -2431 -2817 -2965 -2940 -2735 -2546 -2517 -2534 -2577 -2489 -2286 -1999 -1861
-11869 -1861 -2092 -2360 -2503 -2405 -2317 -2243 -2288 -2500 -2701 -2906 -2914 -2577 -2429 -2441 -2424 -2583 -2931 -3113 -3169 -3219 -3252 -3188 -2991 -2959 -3010 -3077 -3068 -3022
-11841 -3022 -2949 -2914 -2816 -2854 -3000 -3196 -3071 -2869 -2674 -2761 -2841 -2639 -2638 -2789 -2948 -3012 -3049 -3018 -2958 -2732 -2514 -2553 -2721 -2757 -2767 -2729 -2702 -2657
-11813 -2657 -2493 -2409 -2392 -2667 -2972 -3073 -3059 -3024 -2955 -2932 -2993 -3108 -3053 -3050 -3240 -3207 -3111 -3101 -2952 -2614 -2371 -2444 -2538 -2444 -2374 -2348 -2273 -2069 -1989
-11784 -1989 -2199 -2397 -2546 -2568 -2444 -2367 -2523 -2643 -2642 -2626 -2732 -2818 -2821 -2803 -2679 -2640 -2546 -2419 -2592 -2865 -2793 -2556 -2513 -2719 -2698 -2622 -2777
-11757b777j46j19M7K98K33k2r8q5j14p2j2k5j96m5J73J08J03l5r7J37Lj00J99M5k49j59o2
-11730c067J6R3Q2J07P2p4j05k0P9l8p2nJ15K35K51M9j69k83k74k00K6J6k07r0j3j5J71l0
-11702c350N3K83K5k34k03J41K87R4N9K50o1k42j66j58j76k00l6J22K34J72J23j75j84K8p2
-11677c386j62%Q7q8j59J18L30L8Qm9j31k7Q4K9o6M4L2J45J33q5k32j46k0j8nP3R4Q5j04j40
-11647c518J1l1o9N1k88j87J10J81J38kJ36M82J24l58k65k18K2K11P8j41q2l4R3K28J2o6j81
-11620c563j00J31Kj31r0K40L41J71k2k30l47m87l30J71L05O0j67P1M09M63J61L7m4k39j84
-11595c372K9n9r7k61k38J43L09K07ln7J1P9J43q3r7J55K6k77k95P0J83J14R8o6l70k05q0
-11568c993M3R6k5p1j11k24j03K32M03K03j28j60p9j37r6k63j80J5O5K72L61J23K06M10K9
$$ plain form
-11757 -2777 -2923 -3042 -2995 -2697 -2464 -2486 -2584 -2669 -2783 -2855 -2867 -2892 -3088 -3133 -2960 -2852 -2749 -2784 -2881 -2744 -2741 -2841 -2642 -2597 -2846 -3005 -3067
-11730 -3067 -3051 -2958 -2876 -2769 -2697 -2771 -2876 -2896 -2817 -2855 -2927 -2932 -2817 -2582 -2331 -2282 -2451 -2734 -3008 -3208 -3182 -3166 -3373 -3463 -3476 -3491 -3320 -3350
-11702 -3350 -3297 -3014 -2989 -3223 -3426 -3285 -2998 -2904 -2845 -2595 -2656 -2898 -3064 -3222 -3398 -3598 -3634 -3512 -3278 -3106 -2983 -3158 -3342 -3314 -3386
-11677 -3386 -3548 -3548 -3461 -3549 -3708 -3590 -3260 -3222 -3214 -3263 -3394 -3421 -3337 -3308 -3374 -3330 -3298 -3153 -3020 -3105 -3337 -3483 -3503 -3521 -3526 -3453 -3359 -3274 -3378 -3518
-11647 -3518 -3507 -3538 -3607 -3556 -3844 -4031 -3921 -3740 -3602 -3604 -3468 -2986 -2862 -3220 -3485 -3703 -3681 -3470 -3392 -3533 -3615 -3649 -3556 -3328 -3316 -3382 -3563
-11620 -3563 -3663 -3532 -3530 -3661 -3751 -3511 -3170 -2999 -3021 -3251 -3598 -4085 -4415 -4244 -3939 -3879 -4046 -3975 -3566 -3103 -2942 -2905 -2949 -3188 -3372
-11595 -3372 -3343 -3402 -3499 -3760 -3998 -3855 -3546 -3339 -3342 -3399 -3388 -3309 -3166 -3249 -3346 -3191 -3165 -3442 -3737 -3667 -3484 -3370 -3272 -3338 -3708 -3913 -3993
-11568 -3993 -3950 -3854 -3879 -3950 -4061 -4285 -4388 -4156 -3753 -3550 -3678 -3838 -3917 -4054 -4150 -4413 -4593 -4578 -4513 -4241 -3880 -3757 -3551 -3141 -3112
-11543c112m10l82j77o9l0K60L00j13k32J25ko1J26L8j19j0K22K49J83Nk5j84k27p5KM5o0
-11516c733p3m7J3J95J61J7q8k48o1J12N6Lm6o7n5j12k07j31n1J43N5N3K08O7j90k19j30k4
-11488d399J60J11m0j1J38j17j72Q9K58J84L06Q5p0j01l33k87k33o3omj01j76P1J38L2K93
-11462d248L89L16J07Kl00k95K5J12j61k63j89j73j56l6k8P9J12J09K91J46k56j31R7j5j01
-11437d567m4KO4J36K0J39K19k6j53j81M4K62J43j06q8j56j62k48k45J22J23m7J17P3k7N1
-11411d535K26J9l39k30oJ55J30n8j06J1m8k25n7J35M8K2k2O3l0K23L43m4j75j18%J35n9j64
-11383d706L2J41L7J43j8j72j98l79j44O7K90K84j47k21oj26j41J3L36J22q0j33p0j07l7R7
-11357e123K9M0R2J86o4j1J75k5j40j91j20n1r2k31j91l6Q0J70j3rk9L0L5k94j47L0J19L81
$$ plain form
-11543 -3112 -3522 -3904 -4081 -4150 -4180 -3920 -3620 -3733 -3965 -3840 -3842 -3903 -3777 -3739 -3858 -3868 -3646 -3397 -3214 -3209 -3234 -3418 -3645 -3720 -3718 -3673 -3733
-11516 -3733 -3806 -3853 -3840 -3645 -3484 -3467 -3555 -3803 -3864 -3752 -3696 -3693 -3739 -3806 -3861 -3973 -4180 -4311 -4362 -4219 -4164 -4111 -3903 -3836 -4026 -4245 -4375 -4399
-11488 -4399 -4239 -4128 -4168 -4179 -4041 -4158 -4330 -4241 -3983 -3799 -3493 -3408 -3478 -3579 -3912 -4199 -4432 -4495 -4501 -4505 -4606 -4782 -4711 -4573 -4541 -4248
-11462 -4248 -3859 -3543 -3436 -3434 -3734 -4029 -4004 -3892 -4053 -4316 -4505 -4678 -4834 -4870 -4898 -4819 -4707 -4598 -4307 -4161 -4417 -4548 -4451 -4466 -4567
-11437 -4567 -4611 -4609 -4545 -4409 -4389 -4250 -4031 -4057 -4210 -4391 -4347 -4085 -3942 -4048 -4136 -4292 -4454 -4702 -4947 -4825 -4702 -4749 -4632 -4559 -4586 -4535
-11411 -4535 -4309 -4290 -4629 -4859 -4865 -4710 -4580 -4638 -4744 -4733 -4781 -5006 -5063 -4928 -4880 -4858 -4880 -4817 -4847 -4624 -4281 -4325 -4500 -4618 -4618 -4483 -4542 -4706
-11383 -4706 -4674 -4533 -4496 -4353 -4371 -4543 -4741 -5120 -5264 -5197 -4907 -4623 -4770 -4991 -4997 -5123 -5264 -5251 -4915 -4793 -4873 -5006 -5076 -5183 -5220 -5123
-11357 -5123 -5094 -5054 -4962 -4776 -4840 -4851 -4676 -4701 -4841 -5032 -5152 -5203 -5295 -5526 -5717 -5753 -5673 -5503 -5516 -5525 -5554 -5524 -5489 -5783 -5930 -5900 -5781 -5400
-11329e400K46J23J53q5j90q5N7J12J12L4l86l19j49p5o3J06K35J32J6k29k03M3Q7K62J92
-11304e274Mj73k19p5j74k00j27J03J75J36J46j0p9k2k9j62j75j15o0J8K4J64J5p7j6J88J96
-11277e818J4j19k11k82j53rK73J92J67K58N9k78l54l53j50O3L70M06J10r1l8m7q0j32k92
-11252f495m8J33j7j36J8O4K10j06k97k74L8L11J15q1j41k34k96m1J12J2j6j38L2R2p9o5M1
-11225g286M5PJ7J7N0J76K03J28j35l11k25J7J34r1q1n6j73o0m1rp9j28j01Q4L4k22q1K27
-11197g940Q2l11k40k07n1M7J88L19O7q9J28L6l04j83L5J05R2M3Q8j06k23j86O0K53K00j53
-11171h250k60j16J41O2p3k97l15k69l17J5J78J26J58Q4j79J66K64J38J9j67k81j85j43K5
-11147i476j15j89O5j09p7R6J19J7j0r6r6K0MJk73k02K10L08j19k52j77k44j30RR5P0j4J45
$$ plain form
-11329 -5400 -5154 -5031 -4878 -4963 -5153 -5238 -5181 -5069 -4957 -4923 -5309 -5628 -5777 -5852 -5915 -5809 -5574 -5442 -5426 -5655 -5858 -5815 -5728 -5466 -5274
-11304 -5274 -5270 -5443 -5662 -5737 -5911 -6111 -6238 -6135 -5960 -5824 -5678 -5688 -5767 -5789 -5818 -5980 -6155 -6270 -6330 -6312 -6288 -6124 -6109 -6186 -6202 -6014 -5818
-11277 -5818 -5804 -5923 -6134 -6416 -6569 -6578 -6305 -6113 -5946 -5688 -5629 -5907 -6261 -6614 -6764 -6701 -6331 -5925 -5815 -5906 -5944 -5991 -6071 -6203 -6495
-11252 -6495 -6543 -6410 -6427 -6563 -6545 -6481 -6271 -6377 -6674 -6948 -6910 -6599 -6484 -6565 -6706 -6940 -7236 -7277 -7165 -7153 -7169 -7307 -7275 -7183 -7262 -7327 -7286
-11225 -7286 -7241 -7234 -7217 -7200 -7150 -6974 -6771 -6643 -6778 -7089 -7314 -7297 -7163 -7254 -7335 -7391 -7564 -7624 -7665 -7674 -7753 -7881 -7982 -7898 -7864 -8086 -8167 -7940
-11197 -7940 -7858 -8169 -8409 -8616 -8667 -8620 -8432 -8113 -8046 -8135 -8007 -7971 -8275 -8458 -8423 -8318 -8226 -8183 -8095 -8201 -8424 -8610 -8550 -8297 -8097 -8250
-11171 -8250 -8510 -8626 -8485 -8423 -8496 -8793 -9108 -9377 -9694 -9679 -9501 -9375 -9217 -9133 -9312 -9146 -8882 -8744 -8725 -8892 -9173 -9358 -9501 -9476
-11147 -9476 -9591 -9780 -9715 -9824 -9901 -9805 -9686 -9669 -9679 -9775 -9871 -9851 -9847 -9846 -10119 -10321 -10111 -9803 -9922 -10174 -10351 -10595 -10725 -10716 -10621 -10551 -10565 -10420
-11119a0420L00J27k92k74j65k4j3n7M3n4j82l95j71j5k94k25J34K25K61J65R9J52K44P8k54
-11094a1007j92m2l6j24l41l15k16j40o0r8p1O4J37m3l69k36J7R6q5k23O4J64O2K3M5k67l68
-11067a3561l38j03K03K82j29n19l06j12q8N6o0j74j43o0L6m2j64k66k49k19j95N8j24l12
-11043a6529l80n61n65l01k97j67J21Jk03k60l85l51q8j00l12j92k77j94P2l20o19n50k47
-11020b2704l48o00q19q93r45p49n02p3O97J468K204L037L365L062K522J888P94L9m85p88
-11000i830j078j193r87r03o96o48o28n58n92m51m44n03m54n96o47n52m21m16l64o40r08o69
-10978b4178p51p29m46o53q81q73o79o01n71q78r50q02q91r88j172j411j575j815k157k484
-10958d5485k332j655o66J156M051P278R906J1137J0593Q686N964L049N56j125k048k484k659
$$ plain form
-11119 -10420 -10120 -9993 -10285 -10559 -10724 -10748 -10761 -10818 -10775 -10829 -11011 -11406 -11577 -11592 -11886 -12111 -11977 -11752 -11491 -11326 -11227 -11075 -10831 -10753 -11007
-11094 -11007 -11199 -11241 -11277 -11401 -11742 -12057 -12273 -12413 -12473 -12571 -12642 -12578 -12441 -12484 -12853 -13089 -13072 -12976 -13061 -13284 -13220 -13056 -12994 -12971 -12926 -13193 -13561
-11067 -13561 -13899 -14002 -13799 -13517 -13646 -14165 -14471 -14583 -14671 -14615 -14675 -14849 -14992 -15052 -15016 -15058 -15222 -15488 -15737 -15956 -16151 -16093 -16217 -16529
-11043 -16529 -16909 -17470 -18035 -18336 -18633 -18800 -18679 -18678 -18881 -19141 -19526 -19877 -19965 -20065 -20377 -20569 -20846 -21040 -20968 -21288 -21907 -22457 -22704
-11020 -22704 -23052 -23652 -24471 -25364 -26309 -27058 -27560 -27633 -26936 -25468 -23264 -20227 -16862 -13800 -11278 -9390 -8596 -8557 -9042 -9830
-11000 -9830 -10908 -12101 -13088 -13991 -14687 -15335 -15963 -16521 -17113 -17564 -18008 -18511 -18965 -19561 -20208 -20760 -21181 -21597 -21961 -22601 -23509 -24178
-10978 -24178 -24929 -25658 -26104 -26757 -27638 -28511 -29190 -29791 -30362 -31240 -32190 -32992 -33883 -34871 -36043 -37454 -39029 -40844 -43001 -45485
-10958 -45485 -47817 -49472 -50138 -48982 -44931 -37653 -27747 -16610 -6017 2669 8633 11682 12238 11113 9065 6581 3922
-10941C922k289k135k200j941j830j800j681j311j052j249j533j235p39r39j383j334j240
-10924b1969r90q57q04n52j033j302j451j402j295j421j238j376j723j944j818j697j738j911
-10906d6521k431l012l660m386m783m612l789j725J911P245J3091J8222K1441K1625J8735
-10891B7351J3698Q071L142o96l087m399m764m592m188l914l725l284l113k967k654k353k301
-10874F225k202k008j845j818j676j388j358j497j671j611j369j204j295j630j609j590j659
-10857b1205j530j610j917k042k303k671k728k746l099l296l655m548n152n438n021k937J106
-10840g0792O888J3732K0161K4626K5844K3485J8200J1223M734p0l207n219o083n762n244
-10825E2516m736m013l566l588l290k804k781k468j976k032k380k341k032j722j444j565j524
$$ plain form
-10941 3922 1633 -502 -2702 -4643 -6473 -8273 -9954 -11265 -12317 -13566 -15099 -16334 -17073 -18012 -19395 -20729 -21969
-10924 -21969 -22959 -23816 -24620 -25172 -26205 -27507 -28958 -30360 -31655 -33076 -34314 -35690 -37413 -39357 -41175 -42872 -44610 -46521
-10906 -46521 -48952 -51964 -55624 -60010 -64793 -69405 -73194 -74919 -73008 -65763 -52672 -34450 -13009 8616 27351
-10891 27351 41049 49120 52262 51566 48479 44080 39316 34724 30536 26622 22897 19613 16500 13533 10879 8526 6225
-10874 6225 4023 2015 170 -1648 -3324 -4712 -6070 -7567 -9238 -10849 -12218 -13422 -14717 -16347 -17956 -19546 -21205
-10857 -21205 -22735 -24345 -26262 -28304 -30607 -33278 -36006 -38752 -41851 -45147 -48802 -53350 -58502 -63940 -68961 -71898 -70792
-10840 -70792 -63904 -50172 -30011 -5385 20459 43944 62144 73367 78101 78031 74824 69605 63522 57760 52516
-10825 52516 47780 43767 40201 36613 33323 30519 27738 25270 23294 21262 18882 16541 14509 12787 11343 9778 8254
-10808H254j423j485j313j006j268j472j645j627j445j706j631j500j880k101k278k554k751
-10791b0831l074l292l762m304m490l983k686j38M391J0307J6151K0364K1894K0490J6370
-10776F3407J0836N183N74k333l798m449m721m350m105l836l520l158k690k354k024j928k001
-10759C4733j890j596j383j437j586j554j390j129r56j150j276j000r65r34j020r69q77j048
-10741A2573j029p98p62r86j414j575j582j858j867k071k273k245k056j493o10J615M490P158
-10723C217R479J1001J0648Q772O026L214Q51j021k299k718k409k294k232j993j630j553j674
-10706C3385j450j060q96j011j148q89o99p85q76p81m10o24o93n50l65k82m65o77n41l60l77
-10685A8446n33o70o04m18n43o36m64n63o03o49o65p73p68q58p49k53J38J105K241L062L355
$$ plain form
-10808 8254 6831 5346 4033 3027 1759 287 -1358 -2985 -4430 -6136 -7767 -9267 -11147 -13248 -15526 -18080 -20831
-10791 -20831 -23905 -27197 -30959 -35263 -39753 -43736 -46422 -46560 -42169 -31862 -15711 4653 26547 47037 63407
-10776 63407 74243 79426 80000 77667 73869 69420 64699 60349 56244 52408 48888 45730 43040 40686 38662 36734 34733
-10759 34733 32843 31247 29864 28427 26841 25287 23897 22768 21812 20662 19386 18386 17421 16487 15467 14498 13621 12573
-10741 12573 11544 10746 9984 8998 7584 6009 4427 2569 702 -1369 -3642 -5887 -7943 -9436 -10046 -8431 -3941 3217
-10723 3217 12696 23697 34345 43117 49143 52357 53208 52187 49888 47170 44761 42467 40235 38242 36612 35059 33385
-10706 33385 31935 30875 29979 28968 27820 26931 26232 25447 24571 23790 23380 22756 22063 21513 21148 20866 20401 19724 19183 18823 18446
-10685 18446 17913 17243 16639 16221 15678 15042 14578 14015 13412 12763 12098 11325 10557 9699 8950 8697 8835 9940 12181 15243 18598
-10664A8598L252K702J956J184K27m93q25p83p47p07o86o47m96n18k82K8j67m28o87p20n82
-10643A9179k55l18k38j86j36l11k50o3q4j10l28k58k09j98k82j68o2J03Q7j53n05q15n63
-10620A3877k66k2O0n3J37K29J10j5MJ0P5j5j57j29k18l78N2Q5n9N2j42j79j08k14j73J15
-10594A2678Q6J7j05l21k52j22j70l57k48JK82K05N5M7k13k33l5M2p1p5m9m5k36k67q2P6J00
-10567A0708p7m78k27R6n1L7R7J89P6K0J85M2j15j10R8j9l16j85j15q1J54K28j96k75O9J32
-10541I886j81m08j53r3l5j7K44L63L25J30j30j47k54j66K4q8k5oK2L9q3j09j08j46k55P7
-10515H706K51j20l71j94MK09K97Q6j68j95j37J5m0j84l7J77J52J07k5Rk7qj46k42n4j56j70
-10488G739l3p5j03J24K4k27r8k3m38j81J63K07M21L32k8k84k0J22J84R7q0j51k10M3N2Q6
$$ plain form
-10664 18598 21850 24552 26508 27692 27919 27426 26601 25818 25071 24364 23678 23031 22535 22017 21735 21763 21596 21168 20481 19761 19179
-10643 19179 18924 18606 18368 18182 18046 17735 17485 17422 17338 17228 16900 16642 16433 16235 15953 15785 15723 15826 15913 15760 15255 14440 13877
-10620 13877 13611 13589 13649 13596 13733 13962 14072 14057 14061 14071 14146 14131 13974 13845 13627 13249 13301 13386 13327 13379 13237 13058 12950 12736 12563 12678
-10594 12678 12764 12781 12676 12355 12103 11981 11811 11454 11206 11207 11489 11694 11749 11796 11583 11350 11315 11357 11286 11211 11162 11117 10881 10614 10532 10608 10708
-10567 10708 10631 10153 9926 10022 9971 10008 10105 10294 10370 10390 10575 10617 10502 10392 10490 10471 10155 9970 9855 9774 9928 10156 9960 9685 9754 9886
-10541 9886 9705 9297 9144 9051 9016 8999 9243 9606 9931 10061 9931 9784 9530 9364 9388 9300 9275 9269 9291 9330 9247 9138 9030 8884 8629 8706
-10515 8706 8957 8837 8466 8272 8276 8485 8782 8868 8700 8505 8368 8383 8343 8159 8122 8299 8451 8558 8533 8542 8515 8507 8361 8119 8065 7909 7739
-10488 7739 7706 7631 7528 7652 7676 7449 7351 7328 6890 6709 6872 7079 7500 7832 7804 7520 7500 7622 7806 7903 7823 7672 7462 7505 7557 7643
-10462G643j3k11k65j22J27K91J08j18k59n0J1k65k43k6j45j92j06k44k0L73L28J53k3Q2j00
-10437F714j50j37R0K02j60j91mJ28K6O3Q9M0R5K43j9p9k3m8prk23k62J55K94M7q2k6k1j36
-10408F609o6J17K27J19M6j49j65L1j99l73j0k8r8l0Q6j89k83j68o2J97K68L6R4K15K6L8K7
-10381F316j59j71k03j35j83q0J69L16J76j55j8N5j07p8R6o4j80k3K38J23j9l05k17k7Q5m8
-10355E402K6J77j78j48K08K2k65j37n7k02k29o1K20L94K81M5j95J2L74M9k66k8Q6j17l02
-10330E111r3L01J9l10k2K29K37n7k58l31q9L46K98k4R6K13n8j65j64j29L7j19k10q9L17L20
-10304E406j41k28l5o0k9N2J00j4j26kk1N8l7O0J01J97L4k04j16p2j83j02P1P4L1j39j04L7
-10276D608K45L48K06q6j91n4j19j18K8J26j12j02M3j00LJ30M6L2m9K2M3ON6q1k76J93J04
$$ plain form
-10462 7643 7630 7419 7154 7032 7159 7450 7558 7440 7181 7131 7142 6877 6634 6608 6463 6271 6165 5921 5901 6274 6602 6755 6732 6814 6714
-10437 6714 6564 6427 6517 6719 6559 6368 6364 6492 6518 6581 6670 6710 6805 7048 7029 6950 6927 6879 6872 6863 6640 6378 6533 6827 6874 6792 6766 6745 6609
-10408 6609 6543 6660 6887 7006 7052 6903 6738 6769 6570 6197 6187 6159 6061 6031 6117 5928 5645 5477 5415 5612 5880 5916 6010 6225 6251 6289 6316
-10381 6316 6157 5986 5783 5648 5465 5385 5554 5870 6046 5891 5873 5928 5821 5743 5839 5775 5595 5572 5810 5933 5914 5609 5392 5365 5450 5402
-10355 5402 5428 5605 5427 5279 5487 5509 5244 5107 5050 4848 4619 4558 4778 5172 5453 5498 5303 5315 5689 5738 5472 5444 5530 5413 5111
-10330 5111 5018 5319 5338 5028 5006 5235 5472 5415 5157 4826 4737 5083 5381 5357 5453 5666 5608 5443 5279 5150 5187 5068 4858 4769 5086 5406
-10304 5406 5265 5037 5002 4942 4913 4965 5065 5051 4925 4923 4902 4960 4923 4983 5084 5281 5315 5111 4995 4923 4740 4638 4709 4783 4814 4675 4571 4608
-10276 4608 4853 5201 5407 5321 5130 5076 4957 4839 4867 4993 4881 4779 4822 4722 4725 4855 4901 4933 4884 4906 4949 4955 5011 4930 4654 4847 4951
-10249D951l10j13L0k20k16J38K39J53j44o2K96L46n2j14L3lj54p6j20k6n5r1k3J42J58Q0
-10223D787J56K8lj32j92p5R1Q9n2J08P4j92m0l4k49k6J71Q6j67j36L9R1m1J3qk10NJ45L04
-10194D630J59j60k16j31K1M5p6j48J7J75J3J07l4pj48k90k4K07K1k2j74k71p1K08J65Q4n4
-10167D026OJ50P1j13j68k9N3J63J73l36m38j12Kk10j55l1J6J16K43J34N0O4K7J2o0k3r6k18
-10139C317r0K20J02n4q7j67p6Q1J83N1j47J26J58n5p1m2J8L17L50K70k0j26j95j25Q7o8j72
-10112C785j46k02j49k2O8p9j33j36J36J67m9j34j65K8P5K75M85L29Nj73j63J30J67j97k53
-10087C649j19ro8o4k1K45o6k37j06j74j49j76l9J14Q9L1j87j81J84K64J20K35Q3J84L34J60
-10061D096O2qk61j22j56l02k43k2J26M2K0j9J01K4l25k59l6r1Q9K45J75Pm8K23K08J08p5
$$ plain form
-10249 4951 4641 4528 4558 4338 4122 4260 4499 4652 4508 4446 4742 5088 5036 4922 4955 4952 4798 4722 4602 4576 4521 4430 4407 4549 4707 4787
-10223 4787 4943 4971 4968 4836 4644 4569 4660 4749 4697 4805 4879 4687 4647 4613 4364 4338 4509 4595 4428 4292 4331 4422 4381 4394 4386 4176 4181 4326 4630
-10194 4630 4789 4629 4413 4282 4303 4348 4272 4124 4141 4316 4329 4436 4402 4395 4247 3957 3933 4140 4161 4139 3965 3694 3623 3831 3996 4080 4026
-10167 4026 4032 4182 4253 4140 3972 3943 3996 4159 4332 3996 3558 3446 3448 3238 3083 3052 3068 3184 3427 3561 3611 3675 3702 3714 3654 3631 3535 3317
-10139 3317 3227 3447 3549 3495 3408 3241 3165 3246 3429 3480 3333 3459 3617 3562 3491 3449 3467 3784 4134 4404 4384 4258 4063 3938 4025 3957 3785
-10112 3785 3639 3437 3288 3266 3334 3255 3122 2986 3122 3289 3240 3106 2941 2969 3044 3319 3804 4133 4138 3965 3802 3932 4099 3902 3649
-10087 3649 3530 3521 3453 3389 3368 3613 3547 3310 3204 3030 2881 2705 2666 2780 2869 2900 2713 2532 2716 2980 3100 3335 3418 3602 3936 4096
-10061 4096 4158 4150 3889 3767 3611 3309 3066 3044 3170 3212 3232 3213 3314 3338 3013 2754 2718 2627 2716 2961 3136 3143 3095 3318 3526 3634 3559
-10034C559M7K90o5j65Q1j96j93n8k53o0K33Q0j26j51mj46j73OM7J02J06M5J05L1o6l3k9J03
-10006C117R8p9l8n6L7J84M10M04j17k27r4pR6P4R4J60Pk58l95k44j19%l3rK3m8K29K41M6
-9977C496R4m7lj06p4J09r1r5kj56j51O2K19j97l0Pk26j89J13L67K80L0J37J29r3j94j91q4
-9949C114p2R2l7j66n7j04q6Oj7j7K11K11k19j20K56K33J57J44k7j50j72o0J19K06L52n4l70
-9922C373j62o7j38j85o4J13J24q8j27j0k31r2L98M0L0j25l66r1j6l4M2J7K13L61J62j96k38
-9895B643k1O9J69P5m8q8l5k4J6j26m6j0o0J58R1O0K9o5j06k4J14P1k7jL7j54q7O2q5r3R0
-9864B584M5N6Q0J32M2r8J75L19o9l62l43p5J93J71m0j48J11L3k48l14P9K34K2k5J16o5j55
-9837B450j11l4J88J13k1J1J62O0q9j9k9K6j39j65P0K10l7j40j33QL06J69j77k68P7R9oj4
$$ plain form
-10034 3559 3606 3896 3831 3666 3747 3551 3358 3300 3047 2987 3220 3300 3174 3023 3019 2873 2700 2706 2753 2855 2961 3006 3111 3142 3076 3043 3014 3117
-10006 3117 3215 3136 3098 3042 3079 3263 3673 4077 3960 3733 3639 3632 3728 3802 3896 4056 4063 3805 3410 3166 3047 3047 3014 3005 3028 2980 3209 3450 3496
-9977 3496 3590 3543 3540 3434 3360 3469 3378 3283 3281 3125 2974 3036 3255 3058 3028 3035 2809 2620 2733 3100 3380 3410 3547 3676 3583 3389 3198 3114
-9949 3114 3042 3134 3097 2931 2874 2770 2684 2690 2673 2656 2867 3078 2859 2739 2995 3228 3385 3529 3502 3352 3180 3120 3239 3445 3797 3743 3373
-9922 3373 3211 3144 3006 2821 2757 2870 2994 2906 2779 2769 2538 2446 2844 2884 2914 2789 2423 2332 2316 2282 2324 2341 2554 2915 3077 2881 2643
-9895 2643 2622 2691 2860 2935 2887 2799 2764 2740 2756 2630 2584 2574 2514 2672 2763 2823 2852 2787 2681 2657 2771 2842 2815 2814 2851 2697 2610 2672 2587 2494 2584
-9864 2584 2629 2685 2765 2897 2939 2841 3016 3335 3266 2904 2561 2486 2679 2850 2810 2662 2773 2806 2558 2244 2323 2557 2579 2554 2670 2605 2450
-9837 2450 2339 2305 2493 2606 2585 2596 2758 2818 2729 2710 2681 2707 2568 2403 2473 2683 2646 2506 2373 2381 2687 2856 2679 2411 2488 2587 2581 2567
-9809B567nq1j79k9J82Q8j14k13O5J94l0j06J08J80K8P1J04J83P4p4j65k83j42J36K07Q2J26
-9782B974j3j70l24j59j77p0M2m8J29K47J79m4j46j04K7J67L72K76mk2n2l6Q8j40l96k27j04
-9755B265QM9q1J28L81J48k29l57j5J02n0j81j19L8J91J76R1j74j54J17Q4Q6Q8m6KJ10K3K3
-9727B704k2rj17l55k32J82K55K54K45L6l2j00k76k9N4r6q5r4O1N2j1J18K61J47j8k0j32m81
-9699B260l09J01M5m1j66j08jO4p3n1J33j40m9L67J46L1K50J77k09k03N3j01k70j53J32L66
-9673B251P1j06j27J8J95L16J83n2l25j74L5o2m2O6j68j44L4N4L1k05k28k57OJ66K47M48J88
-9646B419l9q0n5R4M1l5k12j26Q2J28L8m8j70n1L8N3J57J37K7q2R9N3rL0m8Rm7k72k72J32
-9616A991K60J36m2j99M1o4k50Q1K44J63o2j24j02p4m8l46k23J52J42rN7J22L72K51j74k31
$$ plain form
-9809 2567 2562 2481 2302 2273 2455 2543 2429 2216 2281 2475 2445 2339 2447 2627 2655 2726 2830 3013 3087 3013 2848 2565 2423 2559 2766 2848 2974
-9782 2974 2961 2791 2467 2308 2131 2061 2103 2055 2184 2431 2610 2566 2420 2316 2343 2510 2882 3158 3154 3132 3080 3044 3132 2992 2596 2369 2265
-9755 2265 2273 2322 2241 2369 2750 2898 2669 2312 2297 2399 2349 2168 2049 2087 2278 2454 2545 2371 2217 2334 2418 2504 2592 2546 2548 2658 2681 2704
-9727 2704 2682 2673 2556 2201 1969 2151 2406 2660 2905 2941 2909 2809 2533 2504 2558 2462 2377 2283 2344 2396 2385 2503 2764 2911 2893 2873 2741 2260
-9699 2260 1951 2052 2097 2056 1890 1782 1781 1845 1772 1721 1854 1714 1665 2032 2178 2209 2459 2636 2427 2224 2277 2176 1906 1753 1885 2251
-9673 2251 2322 2216 2089 2107 2302 2618 2801 2749 2424 2250 2285 2223 2181 2247 2079 1935 1969 2023 2054 1849 1621 1364 1370 1536 1783 2231 2419
-9646 2419 2380 2300 2245 2339 2380 2345 2133 2007 2089 2217 2255 2207 2037 1986 2024 2077 2234 2371 2398 2316 2415 2468 2459 2489 2441 2450 2403 2131 1859 1991
-9616 1991 2251 2387 2345 2146 2187 2123 1873 1954 2198 2361 2299 2175 2073 1999 1951 1605 1382 1534 1676 1667 1724 1846 2218 2469 2295 2064
-9590B064j35m8r1J92J88k90l46j59R1K83K30Q7k30j66K70L76j54m04k82J07J06J04J17K9
-9566A939N8J53K36L8j77j15l0K7K1K09pq8J8q7j12l5p8j85q4J6R4j83j49P6n9j8J38K41J37
-9537A994N2m5j77j08j25k4J26J95O8j50k10L3K06J07J25LP0J97J16q1QP8M4M6J1k4n0l8j75
-9508B272n4j15n2L1O8K65K20J4J4j80l13j13R5P7j72o6J1N3K74K28J1k28k30M5j1k68r9K09
-9480A986L19jp9K63K15r4j24q5k1k52l31k11j04M3k9r1R7K46L4l6J81M76K01j54k70j13j02
-9453A964j48p9n4O1J38Q7J15M6J25J08j80l87k46R4J72K02K4Kl1q6J09K66J24j94l19j51
-9427A762m5N9j2J23L20K86q9k61m19k79j70j4J5O3M4k9N8J70L92J89N3o2K6M8q2j69k7J04
-9399B054o9j15J97J73P3O0J78l3q6K5k8k80l49m4j9j8P5P7j48l2R9%m2K4R5J06o2k9R8J35
$$ plain form
-9590 2064 1929 1881 1790 1982 2170 1880 1534 1375 1466 1749 1979 2066 1836 1670 1940 2316 2162 1758 1476 1583 1689 1793 1910 1939
-9566 1939 1997 2150 2386 2424 2247 2132 2102 2129 2150 2359 2352 2264 2282 2195 2083 2048 1970 1785 1701 1717 1811 1628 1479 1555 1496 1478 1616 1857 1994
-9537 1994 2046 2001 1824 1716 1591 1567 1693 1888 1956 1806 1596 1629 1835 1942 2067 2070 2140 2337 2453 2372 2380 2458 2502 2548 2559 2535 2485 2447 2272
-9508 2272 2218 2103 2051 2082 2150 2415 2635 2649 2663 2483 2170 2057 2152 2229 2057 1991 2002 2055 2329 2557 2568 2340 2110 2155 2144 1876 1777 1986
-9480 1986 2305 2304 2225 2488 2703 2609 2485 2400 2379 2127 1796 1585 1481 1524 1495 1404 1501 1747 1781 1745 1926 2402 2603 2449 2179 2066 1964
-9453 1964 1816 1737 1683 1744 1882 1969 2084 2130 2255 2363 2183 1796 1550 1644 1816 2018 2042 2044 2013 1927 2036 2302 2426 2232 1913 1762
-9427 1762 1717 1776 1764 1887 2207 2493 2404 2143 1724 1445 1275 1261 1276 1339 1383 1354 1412 1582 1974 2163 2216 2154 2180 2228 2146 1977 1950 2054
-9399 2054 1985 1870 2067 2240 2313 2373 2551 2518 2432 2457 2429 2149 1800 1756 1737 1719 1794 1871 1723 1691 1790 1790 1748 1772 1867 1973 1911 1882 1980 2115
-9369B115N7pk2J99mk07q6n5j23k31p0j6l8J95K56J17K0K8K6o9n1p8j61LN1J15J93p7o9n0
-9339A961L8K7N7Nj79J31K91J33Q9N2j5j45l25k54J02N3n7L0K1J05j31l4O9nJ56K90o4j94
-9311B207K5Kr6J23J11k38l2O4k02p7q8k19k29m7K72L30J60k4O2J74N1n5M9jj90j32P1j53
-9283A918l96k99j73R4K58K06j4jK7k05P8K38J05L23J61j31j30k24j71j34N9K18J23K5j17
-9258A838Q2J59o5j87m6L5j44R4l2j33m2k45j83K99K34j22l07p7K78K56J26J5n3j51j2n6m8
-9231A513O2J85J11j6N5M6q4J4k4j07M3J59O1o1p7j6J14M8j57l77l56P0J52r7j93k56n2J47
-9203I07K37J59k1J29N1J10J96L2q1P9J26L5j5n5j21J03J07k12L4J29J07P1m9k27j86R2K66
-9176B003Rn1j05N0j0q3L7P4J35L9o5j22r9OK06O4j39k63k00lP8J12P2P9l3j67q0L6J48K25
$$ plain form
-9369 2115 2172 2165 2143 2342 2338 2131 2045 1990 1867 1636 1566 1550 1512 1707 1963 2080 2100 2128 2154 2085 2034 1956 1795 1798 1849 1964 2157 2080 2011 1961
-9339 1961 1999 2026 2083 2088 1909 2040 2331 2464 2553 2605 2590 2445 2120 1866 1968 2021 1964 1994 2015 2120 1989 1955 2024 2019 2175 2465 2401 2207
-9311 2207 2232 2234 2138 2261 2372 2134 2102 2166 1964 1887 1799 1580 1351 1304 1576 1906 2066 2042 2104 2278 2329 2274 2323 2322 2132 2000 2071 1918
-9283 1918 1522 1223 1050 1144 1402 1608 1594 1593 1620 1415 1493 1731 1836 2159 2320 2189 2059 1835 1664 1530 1589 1807 1930 1955 1838
-9258 1838 1920 2079 2014 1827 1781 1816 1672 1766 1734 1601 1559 1314 1131 1430 1664 1542 1235 1158 1436 1692 1818 1833 1780 1629 1617 1561 1513
-9231 1513 1575 1760 1871 1855 1910 1956 1872 1886 1862 1755 1798 1957 2018 1957 1880 1864 1978 2026 1869 1492 1136 1206 1358 1261 1068 812 760 907
-9203 907 1144 1303 1282 1411 1462 1572 1768 1800 1719 1798 1924 1959 1944 1889 1768 1871 1978 1766 1800 1929 2036 2107 2058 1831 1645 1737 2003
-9176 2003 2012 1961 1856 1906 1896 1813 1850 1924 2059 2098 2033 1911 1812 1818 2024 2088 1949 1686 1486 1483 1561 1673 1745 1824 1791 1624 1544 1580 1728 1953
-9146A953q4k72j87k36n2J84o4k02Q9K26J26N7J57N9j15J56L33J67J03nk9L7k51m42j94m4
-9120A470J39J45J1l9r2n1j27O7K45K3j80j2k00k64J53L82L82O4k02K7J19j10q3j9k61k31
-9094A356n0j03N5K37J1OK10Q8j26j78Rn4q2o7j13N5K41J67Q5M0J30j9k21j18LJ30O2j98k32
-9065A324l9m6Q1K54K33R3r1k63LMO0J46o6N7J98P8m3j27k13j63R5J22O3j50q3K4Pm3p9Pk
-9034A441k9J37L5k0R5Q2%m7J21M2jL30K79Rj93o1j21j29k85j69J14J2o6m9O1R2q0OL1K5j0
-9003A652j13r6m5Q1K32Q8J2K5j33j52j37m7K9K20J15j2O6k08j96K39K00l42k59q9j09j1l
-8976A007j06o6k1J67L48J82J30R9R9n1j5o9k37j24J17J84N5l07j82l7n7NL3p3l6J26M2p7
-8948A136M4J91K14j55m34j93L3R3K31J27M9j58MK70P2o1k5M4J0k9J08J90J84J36M9j83j66
$$ plain form
-9146 1953 1869 1597 1410 1174 1122 1306 1242 1040 1129 1355 1481 1538 1695 1754 1639 1795 2128 2295 2398 2393 2364 2401 2150 1708 1514 1470
-9120 1470 1609 1754 1765 1726 1634 1583 1456 1523 1768 1791 1611 1599 1399 1135 1288 1670 2052 2116 1914 1941 2060 1950 1867 1848 1587 1356
-9094 1356 1306 1203 1258 1495 1506 1512 1722 1810 1684 1506 1515 1461 1379 1312 1199 1254 1495 1662 1747 1787 1917 1898 1677 1559 1562 1692 1754 1556 1324
-9065 1324 1285 1239 1320 1574 1807 1900 1809 1546 1549 1553 1613 1759 1693 1750 1948 2026 1983 1856 1643 1480 1575 1697 1760 1610 1527 1551 1558 1515 1436 1443 1441
-9034 1441 1412 1549 1584 1564 1659 1741 1741 1694 1815 1857 1856 2186 2465 2474 2281 2220 2099 1970 1685 1516 1630 1642 1576 1527 1588 1680 1600 1606 1637 1662 1652
-9003 1652 1539 1443 1398 1479 1711 1799 1811 1836 1703 1551 1414 1367 1396 1616 1731 1719 1785 1577 1381 1620 1820 1478 1219 1130 1021 1010 1007
-8976 1007 901 835 814 981 1329 1511 1641 1740 1839 1788 1773 1704 1467 1343 1460 1644 1699 1392 1210 1173 1116 1121 1154 1081 1045 1171 1213 1136
-8948 1136 1180 1371 1585 1430 996 803 836 929 1160 1287 1336 1178 1182 1452 1524 1463 1438 1482 1492 1463 1571 1761 1945 2081 2130 1947 1781
-8921A781q9nMk78k45jp8j1J34J75R9j12j05m2L1J53Q8L06J92k22p3N8j29k74j53k7J70K84
-8893A631J18j27m2j15n0M7J13K00J06j10k22j50k65j06J43P3L4k8P2R8J03K55J80K0j40k14
-8867A624jJ92j21l05n1J55n5p2o0J13M0J0j73k69J8J02Q7J17N4J7J16L5L5J20J16j83j94
-8840A467q5O7K63L56J24k12k95n51k81J33K58M6m5L0J88M5k5Q9R0J33O5mk6l7j03j92k7N2
-8812A523j9L5P1J00j9k11r2J04l5K35K71k7o1KJ52N2k51l21k79j28j1%K7K12Q4o1k2M0J32
-8783A503J00J47J05l2j14j19j74k8j92j81j21K0L14M00Q5r0j04r8RJ84K6k42m49l54R4L24
-8757A013M1Pr8j46o9r1J05J25j30pJ55q6j78K15K82p2m6j2rN6l6j42K31N63K6l08k62l30
-8729G97k46%K34L74J87p9M2Q1J50Qk49l09j70O9J10k0J40K63j17q5J03M8q3L6K00j5lL0j53
$$ plain form
-8921 1781 1692 1687 1691 1413 1168 1167 1089 1078 1212 1387 1486 1374 1269 1227 1258 1411 1499 1805 1997 1775 1702 1760 1631 1357 1204 1177 1347 1631
-8893 1631 1749 1622 1580 1465 1415 1462 1575 1775 1881 1771 1549 1399 1134 1028 1171 1244 1278 1250 1322 1420 1523 1778 1958 1978 1838 1624
-8867 1624 1623 1815 1694 1389 1338 1493 1438 1366 1306 1419 1459 1469 1296 1027 1045 1147 1234 1351 1405 1422 1538 1573 1608 1728 1844 1661 1467
-8840 1467 1382 1449 1712 2068 2192 1980 1685 1134 853 986 1244 1290 1245 1275 1463 1508 1483 1572 1662 1795 1860 1856 1830 1793 1690 1498 1471 1523
-8812 1523 1504 1539 1610 1710 1691 1480 1388 1492 1457 1692 1963 1936 1875 1877 2029 2081 1830 1509 1230 1102 1091 1091 1118 1330 1414 1353 1331 1371 1503
-8783 1503 1603 1750 1855 1823 1709 1590 1416 1388 1196 1015 894 914 1228 1628 1713 1623 1519 1421 1430 1614 1640 1398 949 595 689 1013
-8757 1013 1054 1061 963 817 748 657 762 887 757 750 905 819 641 856 1138 1066 1020 1008 999 1055 1019 877 1108 1671 1697 1389 1127 797
-8729 797 551 551 785 1159 1346 1267 1309 1390 1540 1548 1299 990 820 889 999 979 1119 1382 1265 1180 1283 1331 1248 1284 1484 1469 1466 1496 1343
-8700A343j74J2J12k1j48j48j07L8j4J67K52L8k77j86K10L31L69J8k20k00k34j6J07J07J63
-8675A522M4l4J09J32j04k22j51j9k7J05j15l45jK44J23R1J04j4p2n3L3j39j36J64J93M4N6
-8648A532L4J24J8m7k96l46j85r0N8M29K34j58q7q7K0J80l0K1L2k20j66j25M4M16L40J99j86
-8621A658m37j93J69J40m4J63M18M7m99l69l4N3J62J90J6l25j74J17R4p9j20l0R5J86k74k95
-8595F35O1L76K70n8k22k8J54lJ5K14J81r5m59k18J31J48J03K4J8J92M4j10q2R6J17m4j03
-8568A357P1k2k2j55l62q0K90J98o4p9j04n4Q8Q6nJ62N8j12l2n5n6J91J34l8j19o9mK54J23
-8539A580n3N6J54N1J06q3k10j9j64k5J25K05O5N6j30k35L9j9n0k08r1J17K43J45k62l6J88
-8512A545k7lK92L74j25k30l20l28o9m7k05j60K8J56J46J35j9r4p6L4j64kL78K79k3j94o8
$$ plain form
-8700 1343 1169 1181 1293 1272 1124 976 869 907 893 1060 1312 1350 1073 887 1097 1428 1797 1815 1595 1395 1161 1145 1252 1359 1522
-8675 1522 1566 1532 1641 1773 1669 1447 1296 1277 1250 1355 1240 895 894 1138 1261 1352 1456 1442 1370 1317 1350 1211 1075 1239 1432 1476 1532
-8648 1532 1566 1690 1708 1661 1365 1019 834 744 802 1231 1465 1307 1220 1133 1153 1333 1303 1324 1356 1136 970 845 889 1305 1645 1844 1658
-8621 1658 1221 1028 1197 1337 1293 1456 1874 1921 1422 1053 1019 1072 1234 1424 1440 1115 941 1058 1152 1073 953 923 1018 1204 930 635
-8595 635 696 1072 1342 1284 1062 1034 1188 1185 1200 1414 1595 1500 1041 823 954 1102 1205 1229 1247 1439 1483 1373 1291 1387 1504 1460 1357
-8568 1357 1428 1406 1384 1229 867 787 1077 1275 1211 1132 1028 974 1062 1148 1143 1305 1363 1251 1219 1164 1108 1299 1433 1395 1276 1207 1203 1457 1580
-8539 1580 1527 1583 1737 1788 1894 1811 1601 1582 1418 1393 1518 1723 1788 1844 1714 1479 1518 1499 1449 1241 1150 1267 1510 1655 1393 1357 1545
-8512 1545 1518 1515 1807 2181 2056 1826 1506 1178 1109 1062 857 697 725 881 1027 1162 1143 1049 973 1007 843 841 1219 1498 1475 1281 1213
-8485A213k2O4P1N5K64P2k57l67j1J99J83J43k59l92k51nK03J1J06J54O6j76j26R9J66J4m4
-8458A173l9R3J07Q0n2k24j61n8J2J89J48j03k31j44J1P9J9o6M9J31R6n8q2p3j33q0M7M7K18
-8429I95R2j59j37P2K18J71N9Q8l9p6j71K4J4j49k9N8o0k7L2k9N6J26N5p3j62j94Q7J61O3
-8400A066R4K41L3k92j64R3K00J97K9k48m09j10K9p6j8M0M0J18N7QJ92O9k82j50L15M83J64
-8373A719po8j96j76kJ12J3nj25l20q3J40O6M0R0K78Q4k93k17p1j80M9J46K25K91P9j1n4q4
-8344A440J8N1k7m0j91j73j19j08j15j25j11j60M9J67J22p2o1J67K90R6j60o5J35J74J26K55
-8318A563N0j02M5J4j12o2L5k19j54M8M4P5J31J27J56O6n9p0q3Q7P7J6L3P3l5l41j87j9K94
-8289A491K65j09j81Jk27l46J2R6P3K2J74J03j17J46J50R9J67k6j03j32j04R2p0j78j12l9
$$ plain form
-8485 1213 1191 1255 1326 1381 1645 1717 1460 1093 1082 1281 1464 1607 1348 956 705 700 903 914 1020 1174 1240 1064 938 1037 1203 1217 1173
-8458 1173 1134 1227 1334 1414 1362 1138 977 919 931 1120 1268 1165 934 790 801 880 899 833 882 1013 1109 1051 969 896 763 683 730 777 995
-8429 995 1087 928 791 863 1081 1252 1311 1399 1360 1284 1113 1137 1151 1002 973 1031 971 944 976 947 1003 1129 1184 1111 949 755 842 1003 1066
-8400 1066 1160 1401 1434 1142 978 1071 1271 1468 1497 1249 840 730 759 683 665 705 745 863 920 928 1120 1189 907 757 1072 1555 1719
-8373 1719 1712 1644 1448 1272 1270 1382 1395 1390 1265 945 862 1002 1068 1108 1198 1476 1560 1267 1050 979 799 848 994 1219 1510 1589 1578 1524 1440
-8344 1440 1458 1509 1482 1442 1251 1078 959 851 736 611 500 340 389 556 678 606 545 712 1002 1098 938 873 1008 1182 1308 1563
-8318 1563 1613 1511 1556 1570 1458 1396 1431 1212 1058 1106 1150 1225 1356 1483 1639 1705 1646 1576 1493 1580 1657 1673 1706 1779 1744 1403 1216 1197 1491
-8289 1491 1756 1647 1466 1467 1240 894 906 1002 1075 1097 1271 1374 1257 1403 1553 1652 1819 1793 1690 1558 1454 1546 1476 1298 1186 1147
-8263A147J5O9Ro2K5K75K21K12kk73r6J8J00O9L6O4j94m31j57l1n8m6l0j51o1N9oN4Q2K2r
-8232H70J42j22m40k43J02K03R8M7MJ15J5PM3j12k3M4K95K61J63J02j16j46j1J70J50j40l94
-8205A084k37m4J88J90r0O8L2l0R2K31K7j07q4j05J72K21J63p0r4m7r0j33k84m9J67J58J08
-8178A437jj7nk7m2Ko5L7k5j22K3r3L7K40Pl3ln8j45l9L5m8P0O2rN3P5q9k62MJ63P9q8M2K10
-8143A405P8Nr1p2R1K43O0m2k9Mk6J25m3k02j43k56k35j72l4J24K64J96j28l47p1J79l0K15
-8115A068L55J25r7k11k9J00k7n0J07J44K3m7o5J09jj99k27j90o6R9K90K01J36J0j00j66j37
-8088A155n9J92K6p9J15n9j57j39j88k09r6K1n3l9N8J99J86m4r8p7L12M46J43P8J9j90j98
-8061A265K2P5m3r2p3o7p3q9l1N1j95l2N9p1p8L1q1j45j34l5J8J70Q2R4J52J88k4k36k1J1
$$ plain form
-8263 1147 1162 1231 1240 1178 1203 1478 1699 1911 1909 1636 1540 1558 1658 1727 1763 1827 1633 1202 1045 1014 956 910 880 729 668 727 721 775 857 879 870
-8232 870 1012 890 450 207 309 512 610 657 661 776 791 798 841 729 706 750 1045 1306 1469 1571 1455 1309 1298 1468 1618 1478 1084
-8205 1084 847 803 991 1181 1091 1159 1191 1161 1253 1484 1511 1404 1320 1215 1387 1608 1771 1701 1607 1560 1470 1337 1053 1004 1171 1329 1437
-8178 1437 1436 1419 1414 1387 1345 1347 1282 1319 1294 1172 1195 1102 1139 1379 1386 1353 1350 1292 1147 1108 1143 1095 1165 1227 1218 1271 1346 1257 995 999 1162 1241 1153 1195 1405
-8143 1405 1483 1488 1397 1325 1416 1659 1719 1677 1648 1652 1626 1751 1708 1506 1363 1107 872 700 666 790 1054 1250 1122 775 704 883 853 1068
-8115 1068 1423 1548 1451 1240 1211 1311 1284 1234 1341 1485 1508 1461 1396 1505 1504 1305 1078 888 822 921 1211 1412 1548 1558 1458 1292 1155
-8088 1155 1096 1288 1314 1235 1350 1291 1134 995 807 598 502 523 470 431 489 688 874 830 732 655 967 1413 1556 1634 1653 1463 1265
-8061 1265 1287 1362 1319 1227 1154 1087 1014 925 894 945 750 718 777 706 628 659 578 433 299 264 282 452 534 628 780 968 944 708 687 698
-8031F98j50rJ92L7k27k9J36N1m6J29L4J06K43P8O8n0nj95l66j11K5J28J04P4J58J24J2j5
-8003A194P0J65J51j7K8O5j38m5K95J88K6j06j34k2k62j33J7k7K4J70J02j30k54j97j52l7
-7977H41Q7L0M5J45L68K57n0o0k76l83p6o5q8P5l6j09K49K89P4p1j05j71%Q4O4J24J15K7j15
-7948A269j36l3j45k8Q7Q2J13j24k60m4P6K89J88j27l79l00m6M02K27l9pJ58K93J24J98N1
-7922A889k51l45j74q1n3j18M1J21q0j86l30l78j63J63L44K46J37J13j32j06Q9nJ10J36q5
-7897I02k00OK98K01N1q2l4j46j48k21k54j27J07K58K84L09O8j03j20j43L9q6j5K69L11p3
-7871A351Pj4l93k89n3j2N2M3J03K8k92l03j19qJ9p5J9K08J27J17N2N0R1O2k0N4L2j4no7j64
-7840E87j38J21Q7J25K9J92kl66k84j04O1O1J02N1q5P7J53P2l4JJ57LO5P4J22Ol17j98J84
$$ plain form
-8031 698 548 539 731 768 541 512 648 699 653 782 816 922 1165 1243 1311 1261 1256 1061 695 584 609 737 841 915 1073 1197 1209 1194
-8003 1194 1264 1429 1580 1563 1591 1656 1518 1473 1768 1956 1982 1876 1742 1720 1458 1325 1342 1315 1339 1509 1611 1481 1227 1030 878 841
-7977 841 928 958 1003 1148 1516 1773 1723 1663 1387 1004 928 863 775 850 814 705 954 1243 1317 1246 1141 970 970 1054 1118 1242 1357 1384 1269
-7948 1269 1133 1100 955 927 1014 1096 1209 1085 825 781 857 1146 1334 1207 828 528 482 884 1111 1072 1065 1223 1516 1640 1838 1889
-7922 1889 1638 1293 1119 1038 985 867 908 1029 949 763 433 55 -108 55 399 645 782 895 763 657 746 741 851 987 902
-7897 902 702 708 1006 1207 1258 1176 1142 996 848 627 373 246 353 611 895 1204 1272 1169 1049 906 945 859 844 1113 1424 1351
-7871 1351 1358 1344 951 662 609 597 649 692 795 823 531 228 109 101 120 45 64 272 399 516 568 618 709 771 751 805 837 823 818 751 587
-7840 587 449 570 657 782 811 1003 1001 635 351 247 308 369 471 522 437 514 667 739 705 706 863 866 931 1005 1127 1133 816 618 802
-7811H02J53j05j0P1J7o0j55j18n4k5j28k0K93J43m5J13Q5K5K26O5l37l16J65K78P0Qj00p5
-7783I66L1J59J52j4k7r0j59j78q1j9NR3R9j71j21J52J69K82p5m67k58m1K14L65K91q3k32
-7756I62r8k08j73k4R0pj23n2j18J5J73L3k1J46J71J2r7j2Q5L01K52k9o5pk35n57m41r7J47
-7727B3L39J99K0O7P5o5q3L9K00M4QRL2R0l1n1m1J31J32p2k43j42r0J81J87o9j50J02J43j76
-7697H08j6L60P3j03kO2R2o7l5O7N6j49r3M9K08J7j40o7k67l93J6K57m0r5N5K49J18j01j33
-7668G86K39L12J34n6k11j55k06k10K9J84r4k41k06j5L82M03j7k96j45K53J18q7o9L4O7M2
-7642I75L3J48J06j04l34j63J00P7o1l9J03k2P5N8j43j30j42l8ml7P6k8%l1K5K19K58J80J06
-7613A263q5l38k12R3J30J40Lj3p2j48k26k78l6J27J20K16J32N0k9L8Q4P0m1k42l55j84J1
$$ plain form
-7811 802 955 850 840 911 928 868 713 595 541 516 388 368 661 804 759 872 957 982 1208 1273 936 620 785 1063 1133 1141 1041 966
-7783 966 997 1156 1308 1294 1267 1177 1018 840 759 740 745 838 937 766 645 797 966 1248 1173 706 448 407 621 986 1277 1194 962
-7756 962 864 656 483 459 549 542 419 367 249 264 437 470 449 595 766 778 681 669 754 1055 1307 1278 1213 1206 971 414 -27 -124 23
-7727 23 362 561 581 648 723 658 575 614 814 858 866 875 907 997 966 915 874 1005 1137 1065 822 680 590 771 958 889 739 841 984 808
-7697 808 792 1152 1225 1122 1120 1182 1274 1207 1172 1239 1295 1146 1053 1102 1310 1327 1187 1120 853 460 476 733 693 598 653 902 1020 919 786
-7668 786 1025 1337 1471 1415 1204 1049 843 633 662 846 752 511 305 290 672 1075 1058 762 617 870 988 901 832 866 933 975
-7642 975 1008 1156 1262 1158 824 661 761 838 777 738 841 819 894 952 809 679 537 499 495 458 534 506 506 475 500 719 977 1157 1263
-7613 1263 1178 840 628 721 851 991 994 981 909 761 535 257 221 348 468 684 816 866 837 875 959 1029 988 746 391 207 218
-7586B18p8n8K2J10K20R9K09J89j66k27J64K54j34j66J02K3l03k61j49J51L34J16P0Q1J3O6
-7560H99Kj67nL92K41k4j95l08j74j80k98j27J80K10J12N9j69n7L3QK61L97P9j81k34k45p8
-7533D31J34L29J74k5k12J1J69k34j81K4qp7n4j26j39j06J53L16M64K16j37q9Q6k5n8m8o0
-7506I28N1j22J44K43p7j9J20q0j76k7KJj67k36o2J1k5j12J6K45K17O7j70r0J26J84J40p3
-7478A059k26j25l04k80K7J45jp9o6J75N37M55K91l24m70j28J81J51K3j85k85k0J60N1PQ3
-7452H52J37J87K11o5j8k00k39L0n7r9q8j98k06Q7J43J91J37n0m6k06k45K7J60M2J52k1k9
-7425E89J28J59J97K14K6k83m10k47j46J1oJ38K47J45q9j91N9K60J26r6j86p1J4k10j96J17
-7399B99J95R6ok6K2P8K67K41K23Nj30k14j89R0J16r6m5K1N3j48j23J94L45Q5r3j74j17J71
$$ plain form
-7586 218 140 82 104 214 434 533 742 931 765 538 702 956 822 656 758 781 478 217 68 219 553 669 739 820 833 899
-7560 899 901 734 729 1121 1362 1338 1143 835 661 481 183 56 236 446 558 617 448 391 424 432 693 1090 1169 988 754 509 431
-7533 431 565 894 1068 1043 831 842 1011 777 596 620 612 535 481 355 216 110 263 579 1043 1259 1122 1033 1119 1094 1036 988 928
-7506 928 979 857 1001 1244 1167 1148 1268 1188 1012 985 987 988 821 585 523 534 509 397 413 658 875 942 772 682 808 992 1132 1059
-7478 1059 833 708 404 124 151 296 295 216 150 325 862 1317 1608 1284 814 686 867 1018 1041 856 571 551 711 762 769 852
-7452 852 989 1176 1387 1322 1304 1104 865 895 838 739 651 453 247 334 477 668 805 755 709 503 258 285 445 487 639 618 589
-7425 589 717 876 1073 1287 1313 1030 620 373 227 238 232 370 617 762 673 482 541 801 927 831 645 574 588 378 182 299
-7399 299 494 590 584 558 580 658 925 1166 1389 1394 1264 1050 861 951 1067 971 926 947 1000 852 729 923 1268 1353 1260 1086 969 1140
-7371A140J30q8j34l8J17k3N6N7q3j33n1J5j50j59m0J77O3r5k44nO7K14P3n0J28k9j85j17
-7343F13KJ42J46J48j26j94M4j7k3J4p2j72O0L53N1r4N6j8%J31J4n3k8N9j84k56n5jq6m5p7
-7312C32Q2J66J36J31O4qn0R4O4J60Rj68j92OJ46jk02k03m2q5k6P0J16J13k2K0O9r0j8K14
-7282H85Ro6J41Q9Mk01r5j02J3j2P9Q7K1p5j83r5j76k00j43K6J58K10Q3n0j10r7N6L03L00
-7253H59M9P3m1p0j9J52J99p4L4m5k83j57M5O9J66j1k13l25j11j62k42k56N8L89K82K21j3
-7226E74k92n6K08K46J32M8K02J23r3L7K41k0j50n9j9kL9j32k28l36k43r9J13K12J96K26%
-7199H68k35j80M5L37J63K2o3L6j21k96P3J09j55N1J87j33l13k75j19O3K35J89M5K0l4j55
-7173C64j50J41L44K27n8l7Q4K5p2n4M0k5q6k5J26K31J00M7q0k82k17p5N8q6Qk7m5J71J18
$$ plain form
-7371 1140 1270 1182 1048 1010 1127 1104 1160 1217 1134 1001 950 965 815 656 616 793 856 761 517 512 579 793 866 816 944 915 730 613
-7343 613 615 757 903 1051 925 731 775 758 735 749 677 505 565 918 969 875 931 913 913 1044 1058 1005 977 1036 852 596 541 540 454 409 332
-7312 332 414 580 716 847 911 903 853 947 1011 1171 1180 1012 820 826 972 971 769 566 524 439 413 483 599 712 690 710 779 689 671 885
-7282 885 894 828 969 1058 1062 861 766 664 677 665 744 831 852 777 594 499 323 123 -20 6 164 374 457 407 297 200 256 559 859
-7253 859 908 981 940 870 851 1003 1202 1128 1162 1117 834 677 722 791 957 946 733 408 297 135 -107 -363 -305 84 366 587 574
-7226 574 282 226 434 680 812 860 1062 1185 1092 1129 1370 1350 1200 1141 1122 1120 1159 1027 799 463 220 121 234 446 642 868 868
-7199 868 633 453 498 835 998 1020 957 993 872 576 649 758 603 654 841 708 395 120 1 64 299 488 533 553 519 364
-7173 364 214 355 699 926 868 831 915 940 868 814 854 829 743 718 844 1075 1175 1222 1142 860 643 568 626 540 548 521 476 647 765
-7144G65j51j95k08k0k4J72K37N7r9J05J43j5J28K35J07J28j0j51j7j50k50j1K49J71%J4m6
-7117A164k53j77r1L6n1j45L2M7R6j38j09J23J46p5j20J99M0k38j96K07K70K9j87o4n0K12
-7091G07M06K54J37k04j98j41k20k21J0O6O4j4k9j50p0JK1J44K06J25M5J10J50j05p3q7j01
-7064H33L5P1J26J59J02O8l8n6k29l22j34R7K49J70k24k16j00k0L0P8J4m4kn2l4j3K10K42
-7036A000k17j76J01K33K17J39j42l15j80j12m2j49k52L6J55J06NJ04P6j86NK78K77J06j94
-7011H73j20j30j26k9J59J28n3l0l7j38j38R8K62R6j02J08K17K8l4q4k03k76k34j29j49O6
-6985B3L58L09J97P2Q7K72j1m47j17L18j1k92k81o1J82m3r0J99K32r9m9J15j13j91m6J30L0
-6958F73j42l31k5K24K25O8k15k28o8L0M7q1l2M1J13J26J38K02J07j12j6Pj48j09j35K8O0
$$ plain form
-7144 765 614 419 211 191 167 339 576 633 534 639 782 767 895 1130 1237 1365 1355 1204 1187 1037 787 776 1025 1196 1196 1210 1164
-7117 1164 911 734 643 679 628 483 515 562 658 520 411 534 680 605 485 684 724 486 290 497 767 796 609 545 495 707
-7091 707 1113 1367 1504 1300 1102 961 741 520 530 596 660 646 617 467 397 398 419 563 769 894 939 1049 1199 1094 1021 934 833
-7064 833 868 939 1065 1224 1326 1394 1356 1300 1071 749 615 712 961 1131 907 691 591 571 601 679 693 649 647 595 561 548 758 1000
-7036 1000 783 607 708 941 1158 1297 1155 840 660 548 506 357 105 141 296 402 407 511 587 401 406 684 961 1067 873
-7011 873 753 623 497 468 627 755 702 672 635 497 359 457 719 815 713 821 1038 1066 1032 948 745 469 235 106 -43 23
-6985 23 381 690 887 959 1046 1318 1307 860 743 1061 1050 758 477 416 598 555 465 664 896 797 748 863 750 559 513 643 673
-6958 673 531 200 175 399 624 692 477 249 181 211 258 177 145 186 299 425 563 765 872 760 744 751 603 494 359 387 447
-6931D47J63J11k0j61n3J30M3k64k25j9R1J74K99K19o9j82L5K6j54P3K6k6L0L3r1m5k62l03
-6903B6J81k0j03J69M8J04O7n6P5K32J2j16j30J85J29k65k44r2J49J17J21L62j3l87k3K15
-6877G43J76J59R2k82k25oP2m8q5M8P7N1L39O8j37M6k30k87k66o0L8m1j55M5P7O8q0n3L47
-6848D91K37l6J7o4j24j34n1J03J00OL2j22j2L96K55j78m0L52J70O1O7m7j44o2J43j16k52
-6821A048O4j3j80j25Q1K30L2p2L5J03N0j58j57j06j0l7R8K06k86l17j04O8L50r3l43k20j29
-6794A5K26J72k98n8K86j5k3O7o5q0K93J72p4q3N5J21M5j00N8K29J20J28J25m7P8R2m0l09
-6766A090k94j36k10k0L0Q5J76J58j9P7R1n8J25M4Q3l6j85r6m0J25k9k76p5J09J65K4J1j65
-6738G54l82N5L68M57J79P1K32K14k14l37j96k67j39o7n6N9N8j20r1M1j02J50J36p3L9J31
$$ plain form
-6931 447 610 721 701 540 487 617 660 396 171 152 243 417 716 935 866 684 719 745 591 664 690 664 694 727 636 591 329 26
-6903 26 207 187 84 253 301 405 472 416 491 723 735 619 489 674 803 538 294 202 351 468 589 951 938 551 528 743
-6877 743 919 1078 1170 888 663 657 729 681 596 644 721 772 1111 1179 1042 1088 858 571 305 245 283 242 87 132 209 277 197 144 491
-6848 491 728 692 709 645 521 387 336 439 539 545 577 455 443 839 1094 916 876 1228 1398 1459 1526 1479 1335 1273 1416 1300 1048
-6821 1048 1112 1099 919 794 875 1105 1137 1065 1100 1203 1253 1095 938 832 822 785 883 1089 803 486 382 450 800 707 364 144 15
-6794 15 241 413 115 57 343 328 305 372 307 227 520 692 618 535 590 711 756 656 714 943 1063 1191 1316 1269 1347 1439 1399 1090
-6766 1090 796 660 450 430 460 545 721 879 860 937 1028 970 1095 1139 1222 1186 1001 905 865 990 961 685 610 719 884 908 919 754
-6738 754 372 427 795 1252 1431 1502 1734 1948 1734 1397 1201 934 795 728 672 731 789 669 578 619 517 667 803 730 769 900
-6712I00l9r4O8R0R5j14m5k10r4N9jj64j63JR6J61k9R3K3k6P3q2j64J41L12K84P1J5n6j34
-6682A067n1k83l46k3J30K31J46l1k2K13K16k65k14l5j50j38J59L75Q9k98m17o1K74J02q6
-6657E82j86j46lJ15L66K73N1j33j1J71J92O8j32J41J12k00k10j81k91J59M46J62l12l22J76
-6632H87J68k1Po9O1j48k61K21K78j2k25k1pj48j7j16j90n6j9r3m2O5J9j12Q6J54J17j93k57
-6603E6O6K85K34m2j15l5l5J50o1j57J09K87M8LK70l1k84j69J17L78n1l83k26k12j32J41J43
-6576C54Q9J87l5p7L16L35j23l22k13J12K26Q7qj60J0L93O1j96j10p1j38k93j70L9J15n5k23
-6549A30p8N5m3j55o3J62O3j9J93J43O5Ll4J00K72N7l14k53m3R5K84J89p1j82m3K14L18K41
-6521A286O0j43k92j81k00n6K53N1n0K7J04k5l79j36Q6Q1N5P1o2j17j29p0r3R7J80J09k6k08
$$ plain form
-6712 900 861 767 835 925 1020 906 861 651 557 616 615 451 288 289 385 546 517 610 633 607 680 598 434 575 887 1171 1242 1257 1201 1067
-6682 1067 1016 733 387 364 494 725 871 840 818 1031 1247 982 768 733 583 445 604 979 1068 770 353 292 566 668 582
-6657 582 396 250 247 362 728 1001 1052 919 908 1079 1271 1339 1207 1348 1460 1260 1050 869 578 737 1183 1345 1033 711 887
-6632 887 1055 1034 1041 972 1033 885 624 845 1123 1111 886 865 858 710 693 577 387 331 312 219 177 242 261 149 235 389 506 313 56
-6603 56 122 407 641 599 484 449 414 564 503 346 455 742 790 793 1063 1032 748 579 696 1074 1023 640 414 202 70 211 354
-6576 354 443 630 595 518 834 1169 1046 724 511 623 849 936 928 768 778 1171 1232 1036 926 855 717 424 254 293 408 353 130
-6549 130 52 107 64 -91 -154 8 71 52 245 388 453 456 422 522 794 851 537 284 241 336 620 809 738 556 513 727 1045 1286
-6521 1286 1346 1203 911 730 530 474 727 778 728 755 859 834 455 319 405 486 541 612 550 433 304 234 141 238 418 527 501 293
-6493B93QK35K03M8N9J6P3k9j8m9k13k24lJ95O2m8K23J96N1Mn3j14j48j58q9O4K8J09P2m9
-6463G44nM6l8j63j42j83J9K3J23J94K24J28jl05j76J64j9M0K00L16j6k93j07p1j89J63Q1
-6436G57j78J12K20j60J4K57Q1O8L7l06l03L9J79K41K36K97J14k91k96j07j47j84mJ25J91
-6411I92J31l9k45q6J04q5j34k5n2J1Q1N7J3p6j3K4l4m9m0Rk1q2k24k38J17M90M38K5o3lM2
-6380A025J86N2o1l4k06k77j28l1J65Q6j28j44P3p5q9r8j22oO9o6K46K47J35K0K2n9J7P3j32
-6351G60j39J43J92q6k19j85n3J73K50J28J02J53J81J20j35j28n3j51l23p7J71J17O3j48j21
-6326G35J1L89M56j20p37l77j84j84q5J39K82J51O1K9lJ63J5k78k08j33J23J70J29P6k16m9
-6300C55L2J23J57J43O7j24r9J3R8R1KJ9J52J88p0k85j89k05n2K88J32k29j33J56J32J85M4
$$ plain form
-6493 293 301 536 739 787 846 862 935 906 888 839 626 402 399 594 656 608 831 1027 1078 1082 1029 915 767 609 520 584 612 721 793 744
-6463 744 739 785 747 584 442 259 278 301 424 618 842 970 969 664 488 652 633 673 873 1189 1173 880 773 702 513 676 757
-6436 757 579 691 911 751 765 1022 1103 1171 1208 902 599 638 817 1058 1294 1591 1705 1414 1118 1011 864 680 676 801 992
-6411 992 1123 1084 839 753 857 772 638 613 561 572 653 710 723 647 634 658 624 575 535 544 523 441 217 -21 96 586 1024 1049 986 983 1025
-6380 1025 1211 1263 1202 1168 962 685 557 526 691 777 649 505 578 503 414 316 194 188 257 191 437 684 819 839 861 802 819 892 760
-6351 760 621 764 956 870 651 466 413 586 836 964 1066 1219 1400 1520 1385 1257 1204 1053 730 653 824 941 1004 856 735
-6326 735 746 1135 1591 1471 734 357 173 -11 -96 43 325 476 537 566 563 726 741 463 255 122 245 415 544 620 404 355
-6300 355 387 510 667 810 877 753 654 667 765 856 858 877 1029 1217 1147 862 673 468 416 704 836 607 474 630 762 947 991
-6273I91Q7K20j31n31j66M7j08l4M3J39Q1n5M5q1M0Q2o2p4k5N6J37K4J32o7l10m2M1k4j52
-6244C03k67J25J59P8Qo5J21K14Lk55r4J48J1Q4J61K5j30n2p6j29q1J62J78l3k58j32N9n8
-6216B09j01RK84J54n6K1Q5K74L42K08j59r4m2k8J01j81l04Oj28l28j27J05J43M6j38r9l7
-6189A65J36Q0k1Lr2K0k97q7L78L13J65P1j56pJ7n1j42k0q0N9J99Q9Pm3j61k0J08oP9m4qJ79
-6157H33J77J25M2r6j48j88k72l32j05L3q5OL0l9J56K32K55n8j82j01j12p7O4K73J78j87n4
-6130C68j1J67K10j18k58pJ79N9Op4k99j06J82J23MO0L22K15l43l29n7KJ16K71K47K8J00j2
-6102A045k77j36j85p3K74K33k74k44q8PQ8Q0J40J31J77J98j33l60j97o7m8r5K9L9O9n5j3
-6075B65R5J05K05K9q9n0J87K07r5j67j11j73N6K15Q2r2j61q9j28n7O7K62J88J48J27p3k92
$$ plain form
-6273 991 1078 1298 1167 636 470 517 409 375 418 557 638 583 628 547 587 669 607 533 508 564 701 725 857 790 480 438 479 455 303
-6244 303 36 161 320 398 406 341 462 676 679 424 330 478 489 573 734 759 629 577 501 372 291 453 631 598 340 208 267 209
-6216 209 108 117 401 555 499 520 605 879 1221 1429 1270 1176 1134 1106 1207 1026 722 728 600 272 145 250 393 439 301 202 165
-6189 165 301 381 360 363 271 291 -6 -93 285 598 763 834 678 671 688 637 495 475 395 454 653 742 749 706 545 525 633 627 706 662 654 833
-6157 833 1010 1135 1177 1081 933 745 473 141 36 69 -16 -10 20 -19 137 369 624 566 384 283 171 94 158 431 609 422 368
-6130 368 357 524 734 616 358 351 530 589 595 521 222 116 298 421 425 485 807 1022 679 350 293 295 411 682 929 957 1057 1045
-6102 1045 768 632 447 374 648 881 607 363 275 282 370 450 590 721 898 1096 963 603 406 339 291 196 225 264 333 278 265
-6075 265 360 465 670 699 610 560 747 954 859 692 581 408 464 679 761 669 508 419 291 234 301 563 751 899 1026 953 661
-6048F61p3l9j97R9P7q0J8K49M06J90j20j50O4Kj28k06k33j73j13O9P2J1K82m3k14MJ10mk03
-6019C38k06K30K89j9n1n8J56O0J8M9k13L2J66r7k94q4J18K09J15n0p6M1K08K0j43QM6Q1j11
-5990G82l89l46j53R7L46K93J27j5k32k20m9l3j02j50R1J63j16j58M8K59J52N4K0l1j09O5
-5964C94J22j53q0JLN3n5J9J04JN3J00j73j84K7j01q5J04K23J45K2o7j74k85K0J13J39J67
-5936D53K8K04Q5j02k48j63J29P8j08O2K53J09k14k33m9L8K53l3k18L2J80K0m2j1J39J16M6
-5909H04J1k19j50Q4J14O4l1M7K72K08q0k11j0n1j47j89j61J01M7J74J48j9P7O7j01j94j2
-5882F43J08m4j63L3L1m3K1o8m31l04L84L78J31k10k53j04K54L03P1J46n7k68o3J23L78L52
-5856A348N8o8j24k85k50j50L2P9Q8J31J98p1j17j49P2J99o6l33j21J04L4M4N5j8jk4l6q4
$$ plain form
-6048 661 588 549 352 451 528 448 466 715 1121 1311 1191 1041 1105 1107 979 773 540 367 254 323 395 406 688 645 431 435 545 541 338
-6019 338 132 362 651 632 581 523 679 739 757 806 593 625 791 694 400 316 434 643 758 708 632 673 881 901 758 766 812 893 782
-5990 782 393 47 -106 -9 337 630 757 742 510 290 241 208 106 -44 47 210 94 -64 -16 243 395 449 469 438 329 394
-5964 394 516 363 283 284 287 340 285 304 408 409 462 562 389 205 232 131 46 150 373 518 540 473 299 14 34 147 286 453
-5936 453 481 685 770 668 420 257 386 464 356 418 671 780 566 333 284 322 575 542 324 356 536 556 514 503 642 758 804
-5909 804 815 596 446 530 644 708 677 724 996 1204 1124 913 903 852 705 516 355 456 503 677 825 806 883 950 849 655 643
-5882 643 751 707 544 577 608 565 586 518 87 -217 167 545 676 466 213 109 363 666 737 883 826 558 495 618 996 1348
-5856 1348 1406 1338 1214 929 679 529 561 640 728 859 1057 986 869 720 792 991 925 592 471 575 609 653 708 690 689 665 629 545
-5828E45L7J09j18j96j05K13L20J98L1j10nJ5J10qj58k53j67J59M08K40l8J23j48j93O1k09
-5802H61n08j58J07J08j27r7J7J03L7J09o7l90j47K06K80K70R5k17k61j1m6o9R1J50K00J32
-5776F68r7j5J51J91K04k59l18k80m1J71q3Nn2q8J26J28J7K6ln9J8N8J15R2j06p5K25jl15
-5747D03j7J59J66j6p8P0M7P8K16K34M1j29j33l7j09j28J08k4m5O2J19j0k9p7k10j20m8L2
-5719E25K03j76j47n1O8K4j27j03N4K59K49J22r9l7Q1J17j72l14j91m0l4P7J31L78J68j83
-5693G82k97k14K12K98J55J46Pk03j77l2K3k43k21K1K05l7j69O1J96L7j47k35KJ68p8j97n2
-5666A1K46J52l16k1L62K22O4J3j41o9L3j30p6rj94l6J84j4N1K75K35q6j63j86k03J66J3j99
-5638A84j49m0K17L52K28p5j38L8p9K3P9M7R5P8k5j82k71j52j22%K39J94J27K18K05J6l1q7
$$ plain form
-5828 545 582 691 573 377 272 485 805 1003 1034 924 919 934 1044 1036 878 625 458 617 1025 1265 1227 1350 1202 1009 1070 861
-5802 861 353 195 302 410 283 186 203 306 343 452 385 -5 -152 54 334 604 699 482 221 210 164 95 186 336 536 668
-5776 668 571 556 707 898 1102 843 525 245 204 375 292 297 245 157 283 411 428 454 451 392 410 468 583 675 569 494 719 718 403
-5747 403 386 545 711 695 617 687 734 812 1028 1262 1303 1174 1041 1004 895 767 875 851 806 868 987 977 948 871 661 541 493 525
-5719 525 728 552 405 354 422 446 319 216 270 529 778 900 801 764 845 962 790 476 285 245 211 288 419 797 965 782
-5693 782 485 271 483 781 936 1082 1089 886 709 677 700 457 236 257 462 425 256 317 513 550 403 168 170 338 260 63 11
-5666 11 257 409 93 72 434 656 720 733 592 523 556 426 350 341 147 111 295 281 332 607 842 756 593 407 204 370 383 184
-5638 184 35 -5 212 564 792 717 579 617 538 561 640 687 782 860 835 653 382 230 108 108 347 541 668 886 1091 1107 1076 989
-5610I89j86qL5j05k20j47J12J92r0k05o0p5j33q4Q6r8j1K18K12Or6lj16j87M1R5P5N5K87
-5581E79M1k82k45l5Q4m5M2Q9L5j14J2O5k3p6MJ2r1j75J72K34k17q4l1O3J39L04K75k7K7J77
-5551I09L5M1J92j26l02j03J88J86J22J85l7l04m76l17n9J06O9J29K37K92K4k59m52k68j9
-5526gk77j31J49J61L91L56L0J08R6o5k90j58r7J05J96J02J28N6j72k31J13J66KJ27O8p0k63
-5499E93j66J13O8K51m5l20j47l1m0P9J74J26J83J14N0L1Jk71m58j42K02K80M2j45j01O0M2
-5472E43M2M1rk05p1J03lj1K31k6m08j30J03J46J68L3j68j68L3J70J81J50L17p2k18K4K7l9
-5444G84q4j10k30o5m6L2J21k26j19K19P2n8J07K00J08m5Q2o3k30o3J00J47J07nj36p1o7J58
-5416F19J28k6L6J39K11J4j58r4j10j60K09L76m8j92n1r6j58L1K1J27J24j84j16J03N7j37
$$ plain form
-5610 989 803 795 830 725 505 358 470 662 572 367 307 232 99 15 101 3 -8 210 422 428 332 329 213 26 67 162 237 292 579
-5581 579 620 338 93 58 142 97 139 228 263 149 161 226 203 127 131 143 52 -123 49 283 66 -18 -49 14 153 457 732 705 732 909
-5551 909 944 985 1177 1051 749 646 834 1020 1142 1327 1290 986 510 193 134 240 309 438 675 967 991 732 280 12 -7
-5526 -7 -284 -415 -266 -105 286 642 672 780 876 811 521 363 266 371 567 669 797 853 681 450 563 729 731 858 926 856 593
-5499 593 427 540 608 859 814 494 347 316 276 355 529 655 838 952 1002 1033 1034 763 305 163 365 645 687 542 441 501 543
-5472 543 585 626 617 412 341 444 441 430 661 635 227 97 200 346 514 547 379 211 244 414 595 745 1062 990 772 796 823 784
-5444 784 700 590 360 295 249 281 402 176 57 276 348 290 397 597 705 660 742 679 449 386 486 633 740 735 599 528 461 619
-5416 619 747 721 757 896 1107 1121 963 869 759 599 808 1184 1136 944 893 797 639 670 691 818 942 758 642 745 802 665
-5390F65J05M1O5N3j34k02j62o9p8jK45J89k52l24l8J79R9o1J11K14K3j03m2L5K9L02P4j50
-5362H13J26K42k8j82k42l24j1J69Pq0P6L4j16q3K9N3o1k59q4O3oJ21K62K98J48J3j25n9m2
-5333G52j88l06k56j2J76l8j75k31j46N4L00K08K1k19j24P9L02K63L9n0P6J28Rk00k05pM13
-5306F63L42R5lj63l53l05o9J39L07P3k68j69K90K19j26k40n8j2o1P4l1j20j7j03J5K56K01
-5279E76J66J68o7j04L4mk53k60P7J19j5kN1Q2q0P5O1j86O2J00p8k8l8j26k17J03J61l9k32
-5250A06k29j49O4L15K87K50R6j6j34j09j08j80kJ09J36L42O0j95k97j28L49L26Q1P2j10p1
-5224H65m8j07L0nK3J45O9M2K9J09Q6j47m02l46n9K01K55q6l00n3k4l09k67J44L95J73p8k78
-5196E7L3J27k2j08j93K18M43J10j89p4q9r2NR3M3J4j06k9J25J78K17K28K5o3J4r3K2J35l9
$$ plain form
-5390 665 770 811 876 929 795 593 431 362 284 283 528 717 465 141 103 282 381 320 431 645 668 565 523 558 587 889 963 813
-5362 813 939 1181 1153 971 729 405 394 563 570 490 566 600 484 401 430 483 422 163 79 142 136 257 519 817 965 978 853 794 752
-5333 752 564 258 2 -10 166 128 -47 -278 -424 -370 -70 138 159 -60 -184 -105 197 460 499 449 525 653 662 462 257 250 663
-5306 663 1005 1100 1097 934 581 276 207 346 653 726 458 289 579 798 672 432 374 362 301 375 344 224 207 104 119 375 576
-5279 576 742 910 843 739 773 769 516 256 333 452 437 435 486 568 488 563 624 438 500 600 522 494 456 330 113 216 377 338 106
-5250 106 -123 -272 -208 107 394 644 740 724 590 481 373 193 191 300 436 778 838 643 346 218 567 893 974 1046 936 865
-5224 865 817 710 740 735 758 903 972 1014 1043 1152 1238 1091 689 343 284 485 740 654 354 301 277 -32 -299 -155 240 413 335 57
-5196 57 90 217 195 87 -106 112 555 665 476 402 313 221 226 319 362 376 270 241 366 544 761 989 1014 951 965 872 894 1029 990
-5167I90k41j82j7K41L46J44kj06l14l60l03j53K28L73Q6k65j72J47R2j95O5rk81j58j37K86
-5141A03M16R7p2j74j66J09J53NN6P2j9k0k2j19j6M0K2Q8P3K21O5j50j58k29j78l0J99J05
-5113D71K5O2J7k4N5R9K4K94J15k47n01j73J74P4PR9j0k86l58K8K23L18K12j1o9p8n4L7J54
-5084F77K89J73n1n1o8k09k62n1l1j34k16L2M9M6J58K38J68p9o4J02l3j24kJ63j43j78M6J45
-5056E90p3j29J49L44M80K67j49k68j75j73k1Lj66O6p0j96M1K32q1k00L1K11K67J43J35p6
-5030A182n3k0j28j40P9J52j87q1J60n1j26l1j05K8J04Kj76l43k10j6J34J44KN0P1K13J60
-5003H14K17J79Q5M5j94k21j91j3LK04l6n0p0j18J5J90K73M4k0k33m65j0K44j51k64j9o2l4
-4975A62J05K4L9M3K3K1M8P6l9n6P0K12M8j6r9l54j67R1K27J12j92n1r6j22N2R7O0K9j56q2
$$ plain form
-5167 990 749 567 550 791 1137 1281 1279 1173 859 499 196 43 271 644 730 465 293 440 532 337 402 393 112 -46 -183 103
-5141 103 519 616 544 370 204 313 466 471 527 599 580 560 538 419 403 443 465 553 626 847 912 762 604 375 197 167 366 471
-5113 471 496 558 575 551 606 705 729 1023 1138 891 390 217 391 465 472 571 561 275 -83 -55 168 486 698 687 618 540 486 523 677
-5084 677 966 1139 1088 1037 969 760 498 447 416 282 66 98 147 193 351 589 757 678 614 716 683 559 557 720 577 399 445 590
-5056 590 517 388 537 881 1361 1628 1479 1211 1036 863 842 845 679 745 675 479 520 752 671 471 502 713 980 1123 1258 1182
-5030 1182 1129 1109 981 841 920 1072 885 804 964 913 787 756 651 679 783 785 609 266 56 40 174 318 320 370 441 654 814
-5003 814 1031 1210 1295 1340 1146 925 734 721 724 928 892 842 772 654 669 859 1132 1176 1156 923 458 448 692 541 277 258 196 162
-4975 162 267 291 330 373 396 417 465 541 502 446 516 728 776 760 661 307 140 231 458 570 378 327 231 109 161 258 318 347 191 109
-4945A09L09L80J27j14j8J10k21j92j08j30k68k9M60L14j3K0lj39K7j1n6j8k0K7k2J6j9l2
-4917D86o2r6k1%j02L6K49K39J13j8k3J52m7j79k28L0K08J96q0j15j3r9j89j01J73L53n2j41
-4889F69p8L7J42K9o6j50N7K32P6k7k17k26k42m09j54J17J84J63K10M0k0J28K38o6k96j19
-4863B52J28L36J56O0K04L3k00j94Mq9k15k34k8J12J45O6j13j00Q3K9l6m4j21lK53J04j44
-4836D44l4j06k11Q2J09rJ34J52k3K14J90j87j67J52M6j98ROm6n4n9K0j8J88K17p3j40j17
-4808E21n4j19l7K33J69j19o1j03OR8R5m7k20N6J25N1j1J8o4k7j33j27r6J3N5J26K24Q9mJ9
-4778F76j60m1J02Ol07k23P2K48L08K93J85J32OM1J6q9l4O3Mk15j53j26M2Q8m0J16K03J07
-4750A320p7k87k19l5J8O0O7j5q2k2q7k73j48Q6K4j7J14j26p3L69L54o9k36kqj66j3L26K45
$$ plain form
-4945 109 418 798 925 811 793 903 682 490 382 252 -16 -45 415 729 716 736 733 594 621 610 554 536 516 543 521 537 518 486
-4917 486 424 328 307 307 205 241 490 729 842 824 801 953 906 727 499 529 737 933 853 738 725 626 437 336 509 862 810 669
-4889 669 591 628 770 799 733 583 640 872 948 921 704 478 236 -173 -327 -210 -26 137 347 387 367 495 733 667 371 252
-4863 252 380 716 872 932 1136 1169 969 775 779 690 475 241 213 325 470 536 423 323 406 435 399 355 234 231 484 588 444
-4836 444 410 304 93 175 284 275 409 561 538 752 942 755 588 740 786 588 597 603 557 503 444 464 446 634 851 778 638 521
-4808 521 467 348 311 544 713 594 533 430 436 534 629 582 362 418 543 594 583 601 537 510 377 250 154 167 222 348 572 661 657 676
-4778 676 516 475 577 583 276 53 125 373 681 974 1159 1291 1297 1338 1354 1265 1231 1294 1298 1083 930 804 846 934 894 1010 1213 1320
-4750 1320 1243 956 737 702 720 780 847 832 750 728 641 368 220 306 330 313 427 301 228 597 951 882 646 644 636 470 457 783 1028
-4721A028k3l42l31P1L33J22k5J50L25K04r5j25N1P6k1m59n06j01%pr7j07P2K32J59J69P0
-4694H23l7j77r2o9k95l2K17J76K10L8k72j65J78K92k0j46j56j13O0K24o5p4q6J74J88j65
-4668F16Kj6r0m7K92J71k04k1K59J43j14l6j48j36o0R6L0r7k27k55J49N7L5J73J03m7j55j73
-4640C00R4J12r9p2K0O2O5l5rj0p5J48K94L18J39j57L6n2j14l6k67k46R5N2k7m0Q9K7j85q7
-4610C40L7nL0K41J90k0j15k40k25J38M8j67J07K52R8n0q7k69j27J58O8k55NJ35J36R6Q5J49
-4582G53k7K2K01R4k5n7m9j36j5j75j68k0Q3P2j12j13j60q3J62L45K17j99k53j37j17O4J49
-4555C16K0nJ09K03J56k9o8j26j78j48J3n7J8K43J04l8k50j45N1M7J2R0O3J14J64J10K2j55
-4527F56r2P0Q3M0o1j97j10k0K3J66O6k34j37o6l3k8J45j3j35m6j26j25NN3k3J41M00K37k8
$$ plain form
-4721 1028 1005 663 332 403 736 858 833 983 1308 1512 1417 1292 1343 1419 1398 939 433 332 332 325 228 121 193 425 584 753 823
-4694 823 786 609 517 448 153 121 338 514 724 762 490 325 503 795 775 629 473 360 420 644 579 505 419 593 781 616
-4668 616 618 602 512 465 757 928 724 703 962 1105 991 955 807 671 611 707 737 640 413 158 307 364 399 572 675 628 473 300
-4640 300 394 506 407 335 355 417 482 447 438 428 353 501 795 1113 1252 1095 1131 1079 965 929 662 416 511 563 536 496 585 612 427 340
-4610 340 377 372 402 643 833 813 698 458 233 371 419 252 359 611 709 659 572 303 176 334 402 147 152 287 423 519 604 753
-4582 753 726 748 949 1043 1018 961 912 776 761 586 418 398 481 553 441 328 168 85 247 592 809 610 357 220 103 167 316
-4555 316 336 331 440 643 799 770 702 576 398 250 263 206 224 467 571 533 283 138 189 236 248 338 401 515 679 789 811 656
-4527 656 564 634 717 757 696 499 389 369 392 558 624 390 253 187 154 126 271 258 123 77 -49 -174 -169 -116 -139 2 402 639 611
-4498F11m8Qp6no2N3J19j28j27KM10L72m7k70q9M3rn5m6J44N3k30l50m0P2NL8J37J68J1k97
-4467C67k04R9K53K15j20m0Q0j9L49L62k13l95l45k00J14J06K24P6j34j16M1K61K09o3k61
-4442F46k02j23P7m4j6OJ41O3j11j46n7L6R0O2J93J49k42k90o9J05J38K41Q8j4P7q4n5o4L6
-4413F31N3q9P9k5N0j25k63j99j7N6K9Q2N7k5M9J30p1l24j32K72J72j05k22l0J68J18J6J41
-4385D76K4p9L5J55J8j92k13o0J25J16J68J48j85k81J38J75nQj60n2J38K4R0R0l8j82l13j98
-4357c0J50J79N3NJ2J28m8j73j28k5L7p6l3J58M07K27j60k98j75Q8J12L5j54l86j23J02K3
-4330i3J65K46n8k07J68Q4q3mn0N8J41K14J82o1k28j10j94pJ63J82K03J06nJ49J31j2m5k54
-4302G81m69l02k63j06O7P1m2q3J60K60K01J03N2O2M5l03j00J72J39k1QK7Q7J68K07L6o0o3
$$ plain form
-4498 611 563 571 495 490 428 481 600 472 345 347 757 1129 1082 812 723 766 757 702 656 800 853 623 273 233 305 310 348 485 653 664 367
-4467 367 163 262 515 730 610 570 650 631 980 1342 1129 734 389 189 303 409 633 709 575 459 500 761 970 907 646
-4442 646 444 321 398 354 338 344 485 548 437 291 234 270 360 422 615 764 522 232 163 268 406 647 735 721 798 714 659 595 631
-4413 631 684 595 674 649 699 574 311 112 95 151 180 262 319 294 343 473 402 78 -54 218 390 285 63 33 201 319 335 476
-4385 476 500 421 456 611 629 437 224 164 289 405 573 721 536 255 393 568 563 571 411 359 497 521 611 701 663 481 168 -30
-4357 -30 120 299 352 357 369 497 449 276 148 123 160 84 51 209 616 843 683 385 210 298 410 445 291 -95 -218 -116 -93
-4330 -93 72 318 260 53 221 305 222 218 168 226 367 581 763 702 474 364 170 163 326 508 711 817 812 961 1092 1080 1035 781
-4302 781 312 10 -253 -359 -292 -221 -263 -346 -186 74 275 378 430 492 537 234 134 306 445 424 432 459 546 714 921 957 897 834
-4274H34M9J61j34j56J7L9rk09j99k02l25Q6L90Q3K7J43J43l5k44l19k27j84j53K98M06o7
-4248B13p4J16Q7N8N7O9K10K16Kk60n3J66o7j29N4l7k24j39j24r3k1p8n7J24R6J44J10J10
-4220D76J90L8P5K69K04J79j5j64k65k24k36k18k50k54J59K01J17R0Q4J2r1k23k28m9L03L88
-4194E68K26l1j86j92j27j7K1J50m8l28k36J49J98m1j66QL51K84j0M6L1m3l2K5J67k4k06J6
-4166E53R7N2J0m4o6M3J28M2k78k67q4J26Q2M0K1j92j18k7N5J28K12L64P8j82l58j52J11l2
-4138C42p9j21l00j40N0J10J82N6JN9J19L01K01K36J7j82k17k56p7j12r6K45K39l3oQ8J37
-4111G64L8N0P7J11K5R0N0k63k11j02j83k3J53K42k5j1o9k19j14q2j47j80k7J04J44K96J95
-4084F83r5n9mr2Q2K80N3k20j78o8m9r7k09J8K20K76j1k42r6j14k32J59O3o8J86K67K90J33
$$ plain form
-4274 834 883 1044 910 754 771 810 801 592 393 191 -134 -48 342 425 452 595 738 703 459 140 -87 -271 -424 -126 280 213
-4248 213 139 255 342 400 457 526 736 952 954 694 641 807 740 611 665 628 404 265 141 48 27 -51 -108 16 112 256 366 476
-4220 476 666 704 779 1048 1252 1431 1416 1252 987 763 527 309 59 -195 -36 165 282 372 456 468 377 154 -74 -123 180 568
-4194 568 794 763 577 385 258 241 262 412 364 36 -200 -51 147 106 -60 -52 299 583 573 619 650 607 575 600 767 743 537 553
-4166 553 650 702 712 668 602 645 773 815 537 270 186 312 394 434 455 263 145 118 173 301 513 877 955 773 415 263 374 342
-4138 342 263 142 -158 -298 -248 -138 44 100 101 160 279 580 781 1017 1034 852 635 379 302 190 94 339 578 545 539 627 764
-4111 764 802 852 929 1040 1065 1155 1205 942 731 629 446 423 576 818 793 782 713 494 380 298 151 -29 -56 48 192 488 683
-4084 683 588 529 525 433 515 795 848 628 450 382 333 236 27 45 265 541 530 288 192 78 -154 5 68 0 186 453 743 876
-4056H76j12j94j36o0j07j83n3QM8J61J27K21r7j46K12Q9l15k90j42O7K18Q7rk78j53m9MM7
-4028a59O6J76J9J8J50J69ln6lj02p5k3k04k31Q6K09K73Q4k52j60l2j01N0n8O7L4o4K70L42
-3999D90N4j27m7P9K2l1j25k21j95p1M4J38J71J40K32J41l0J8L2m9K3Oq7k64n5J94J87J24
-3971G93K4N0j26l57r2P9o9j17q2r0k9J7n6R0K82J83j58j76J29K00o2k29n8kM8J00j59j11
-3943B2Q3k9J44J01j18j80k37kJ42J79K37J37R8Lj51j88j37o3M7k3j64k12j18M7K88J92p9
-3916A9J62J22o3J26L8m4J48J45O0r0j8Q0J66J36j8J06k9j63p4K5L0Q2J48Q3j81k95n9k87
-3888C55k39k20k00j19O5N3K30M59J30m7p7o4K80O9O6L00K8k63j65Q4pj64L4K20K10K2j94
-3861H46k9R5k0J9l0j42j66L9K18j7l14oL41J24k35k76J3K04j08r8J15J80NOO3o9j47j41j7
$$ plain form
-4056 876 764 570 434 374 267 84 31 39 87 248 375 596 499 353 565 654 339 49 -93 -26 192 279 270 -8 -161 -210 -206 -159
-4028 -159 -93 83 102 120 270 439 436 380 377 275 200 177 -27 -258 -172 37 310 394 142 -18 -50 -151 -101 -159 -92 -58 -122 148 490
-3999 490 544 417 370 449 471 440 315 94 -101 -172 -128 10 181 321 553 694 664 682 714 665 688 694 607 343 288 482 669 793
-3971 793 817 867 741 384 292 371 302 185 103 13 -16 1 -55 35 317 500 342 166 295 495 433 204 146 144 192 292 133 22
-3943 22 105 76 220 321 203 23 -214 -216 -74 105 342 479 577 580 429 241 104 41 88 65 -99 -311 -429 -382 -94 98 19
-3916 19 181 303 240 366 404 360 508 653 713 623 605 685 851 987 969 1075 1046 883 809 834 864 946 1094 1177 996 701 642 355
-3888 355 116 -104 -304 -423 -358 -305 -75 384 514 467 390 326 606 675 741 1041 1069 806 641 725 718 554 588 808 1018 1040 846
-3861 846 817 912 892 911 881 739 573 612 830 813 499 493 834 958 723 447 460 664 556 458 573 753 758 764 827 758 611 470 453
-3832D53J58L51J54j06k41l19r6N2J45l7j49j2O5K18mj89j85j44j07O1K98J32k4J71J92j3
-3806H24j43P5R4N5k54k69L9J30o6j46J29J44q7k83k91m7Q5K13K17J38J53J52J8j57J1q4k11
-3779D39l04m0K55Q2J00p0j43j6%q2j50j16J45J42j36j48l9J91P6l8P5J75J42K9n6jJ19K26
-3751H57J68q7j35j1j87j39q2m4PR9K08J28K10K24n5m2j09k79l46r2Q5J3k44n7O7J52J88o
-3723D91j17l6p0k17j0K51L67K23r0k6k6k63nJ31k6n6Q6Q9K9j25k60j3O5K47J19k07k41j68
-3695A42KR8K4J9o1n5J55J33Q4Q4k2N5J21k0R7r8k57k81j24n4n7lm4l2J26R2J5K30J82j7r7
-3664D37R2K83K12r3q5p8k56j35l6O6r6r3L7l2K4PJ9K22Q8r5k32j57M5J48J81J2K3l0Q1P7
-3634F36j02l07j97J59N9m4J18J49O9p5R4K29K01O1k35j30o2J38J13r6j73j50k36j33K90N88
$$ plain form
-3832 453 611 962 1116 1010 769 450 354 406 551 514 365 353 418 636 632 443 258 114 7 68 366 498 474 645 837 824
-3806 824 681 756 850 905 651 382 421 551 485 339 468 612 525 242 -49 -96 -11 202 419 557 710 862 880 723 734 650 439
-3779 439 135 95 350 432 532 462 319 303 303 221 71 -45 100 242 106 -42 -81 110 186 148 223 398 540 569 513 512 631 857
-3751 857 1025 938 803 792 605 466 384 340 347 446 654 782 992 1216 1161 1119 1010 731 385 293 378 391 147 90 157 309 497 491
-3723 491 374 338 268 51 41 292 659 882 792 766 740 477 472 603 577 521 607 696 725 600 340 327 392 639 758 551 310 142
-3695 142 144 242 266 285 224 169 324 457 541 625 603 658 779 759 856 758 501 220 96 42 -15 -18 -62 -94 32 124 139 369 551 534 437
-3664 437 529 812 1024 931 846 768 512 377 341 407 311 218 255 223 247 254 273 495 583 488 256 99 144 292 473 485 508 478 559 636
-3634 636 534 227 30 189 248 204 322 471 540 465 559 788 989 1050 815 685 623 761 874 778 605 455 219 86 376 964
-3608I64J53o2j07l77k07r6j59r4R7K74L52K14j02k51k28l47l00m5K32K40J55p3l09k40k03
-3583e19J43J27J11P4J34P1j02k83m6K37J83m5q5l8qqK0j32k00Q5K27O3J16M75L62l0j79k03
-3555E50j33r0J95K99J43k50k12n3m4K31L75K65p0j50j83m53k53n3K22J52p4J03J86P3r1L3
-3529G18j05k71l1K37J67J65O0j96r0mm6k6r6po0j04O1K41J92q0j43J2o0o0p5n1o0Q5ol4J33
-3498D66J95J5j62r4J3J12K47K66j33j91%pL8J87J08j02j78j83k48j67N2N1L6Pm2k3J46J76
-3470E85R7j54j06Q8J5k65k48j94J0J51J04k7R3M27K54J32P6o6k1M1j36j03K9K5J8J32j31
-3443H26k68N4J49Q9J53Pl3j62j68j44p6lj40o6N9J04J68P4j8j04J5j74l26j96l6O0K06k0
-3415C0K3J40J96J89n1o0n4j4k6j64j41o9Q0J21r7L2K41L2M0P7J27M6k13k32LJ15J45J27o6
$$ plain form
-3608 964 1117 1055 948 571 364 268 109 15 112 386 738 952 850 599 371 24 -276 -321 -89 151 306 233 -76 -316 -519
-3583 -519 -376 -249 -138 -64 70 141 39 -244 -290 -53 130 85 0 -38 -46 -54 -34 -166 -366 -281 -54 9 125 600 962 932 753 550
-3555 550 417 327 522 821 964 714 502 449 405 636 1011 1276 1206 1056 873 420 167 114 336 488 414 517 703 776 685 718
-3529 718 613 342 311 548 715 880 940 744 654 650 604 578 482 475 415 311 372 613 805 725 582 594 534 474 399 348 288 373 367 333 466
-3498 466 661 676 514 420 433 545 792 1058 925 734 734 727 765 952 1060 958 780 597 349 182 234 285 321 328 286 263 409 585
-3470 585 682 528 422 510 525 260 12 -182 -172 -21 83 56 149 576 830 962 1038 972 951 992 856 753 782 807 825 957 826
-3443 826 558 612 761 850 1003 1010 977 815 647 503 427 424 284 218 277 381 549 623 605 501 516 342 16 -180 -216 -156 50 30
-3415 30 53 193 389 578 527 467 413 399 373 209 68 -1 79 200 103 135 376 408 448 525 652 698 485 253 256 371 516 643 577
-3386E77l78k65R6K81J15l0jn7k19n29l1L33rj46j89k27n9J81L61j5j95O0J84J27J71P2N3
-3359B61Q9J64r2r6O8k4J04K56J50k57l52j77R6K97P4n8L7j89k02pk8J33K83K11J18j13o5
-3332F81J0j39J4m6j22P1M3l23k63K54J77J42K14J47j1l20r0L5J42L78J9k07P2J27J07J14
-3306A226kp8j19k06k99l37r3K58K42J38R1R0K51K8k23k28k93k42m20k56O3K68K90J29n2r1
-3280A35j40j6J14J14J51J31K5j30q9L5n7j89j29j8%o4J37J31Mk9j89q0J69M1j16l5k6R1J57
-3251A28J24R1P8L2l68l75J98L69J35K77K7j52j40L0K27J61k35m06l77j52p7J33L01K29J98
-3226D56L2r0RJ05K2p5j30l65J00J68p1q8JP3K50O3k99m5K08P4j62K4J42J38j79R6K14R2j63
-3197F00k95j8Mj63j24L1M46O0m06KJ74J39K28J6k11k36PK45J25r9j19O7L1j35J5K2j09Q0
$$ plain form
-3386 577 199 -66 30 311 426 396 395 338 119 -410 -441 -108 -117 -263 -452 -679 -738 -557 -196 -211 -406 -346 -162 -35 136 208 261
-3359 261 350 514 422 326 394 370 474 730 880 623 271 94 190 487 561 503 540 351 149 142 114 247 530 741 859 746 681
-3332 681 691 552 566 520 398 469 512 189 -74 180 357 499 713 860 849 529 439 474 616 994 1013 806 878 1005 1112 1226
-3306 1226 1224 1146 1027 821 522 185 92 350 592 730 821 911 1162 1190 967 739 446 204 -216 -472 -409 -141 149 278 226 135
-3280 135 -5 -21 93 207 358 489 514 384 295 330 273 84 -45 -63 -63 -127 10 141 145 116 -73 -153 16 57 -59 -94 -120 -29 128
-3251 128 252 343 421 453 85 -290 -92 277 412 689 716 564 424 454 681 842 607 201 -176 -328 -405 -272 29 258 456
-3226 456 488 398 407 512 534 459 329 -36 64 232 161 73 74 147 397 460 161 116 324 398 236 260 402 540 361 457 671 763 600
-3197 600 305 287 291 128 4 35 481 541 135 137 311 450 678 694 483 247 254 499 624 525 406 473 504 369 384 406 297 377
-3169C77o7m03o7K86K70j50m17p4N1O1J91K55L22K45N5k9k65n87j97J36k5J91L48l8o9m6k20
-3142A34j26J34J08k20j81M9o2PJ66J98K69L47J24q9k5p6j86k42M5J46l3j50l4J00P6j69j37
-3115A73J39L49Q1j60q4O5P5p3j60l94k30n1k21n6K57K78J00J09L0N1J72k0jQ0J84P0k00r1
-3087D72q5j36l3M4p4J52J42o9J92P4k11k40Pm6L6r3j80j88K4Q8J52K36oJ0K22L11n0j13R0
-3058G28N4j24j35J87N5j8j06j95j58j67K25M12k2l90k64J0K23J56L4pJ3L4n6k40k25j18O8
-3031b6O1l8p3j42j13J19J11j09l3J29Q7O8j3J46K98K5j65J27J7qm8p5m2j53K0P5J08J19J54
-3002F26L5l41m12j82Q1J30m5J51K98J12r7r2J7J6Q2r9j13r2j63j1P4J1Pj0K6J53J96J00r0
-2973C68k0k6m7j15J55K91J9j35o1Q1N1L0o3p6j16j69k74j96Q1m7M6K15J65J30P3k7r9J1J73
$$ plain form
-3169 377 310 -93 -160 126 396 246 -171 -245 -194 -133 58 313 635 880 935 906 641 54 -143 -7 -32 159 507 469 400 354 134
-3142 134 8 142 250 30 -151 -102 -164 -157 9 207 476 823 947 858 833 757 571 329 374 520 487 337 303 403 479 310 173
-3115 173 312 661 742 582 498 563 638 565 405 11 -219 -270 -491 -547 -290 -12 88 197 227 278 450 430 429 509 693 763 563 472
-3087 472 387 251 218 262 188 340 482 413 605 679 468 228 235 189 225 132 -48 -236 -212 -124 28 264 258 268 490 801 751 638 728
-3058 728 782 658 523 710 765 747 641 446 288 121 346 758 736 346 82 92 315 471 505 498 511 545 489 249 24 -94 -26
-3031 -26 35 -3 -76 -218 -331 -212 -101 -210 -243 -114 -27 41 28 174 472 497 332 459 476 468 420 345 303 150 170 245 353 472 626
-3002 626 661 320 -92 -274 -193 -63 -108 43 341 453 356 264 281 297 379 280 167 75 -88 -99 -25 -14 -7 -17 9 162 358 458 368
-2973 368 348 322 275 160 315 606 625 490 429 510 561 591 528 452 336 167 -107 -303 -222 -269 -223 -8 157 287 360 333 234 245 418
-2944D18K43l9k38j29J04K04M7j43k13j68Op0L7K11K58K96J52j82k41o5Q8k5n6r3k02j23K4
-2917A01o0R8O4j9o2L2M4K1L2k12p9K94K02J00Lm3R2K14R9M2k7k24l62m41k61o1O8J51J75
-2888a9J66K31J46J3J50K3q2o9j1J80O3j1J05ql67l74j79lO7k8l3j14j24J30K69J27K03K24
-2860F75L32K42L3k67j96r6k30k38o3P1k9N0J30M5j61k41k83J98N67M24M5o0k15l09j49O7
-2834C42P3J47J31Q7k8j5J33k5j45P5J08r7j76j36j28j42n3J72Q3Ll1j03Lj68j35K20K55K1
-2806D71m5L0j8k6K06J13j65j82N9K39k4k13j67jQ4j41j24QK36K27J61j42j86P7k0J31L09
-2779H97j44j99PJ4J84L15j08k35l96k78L6RJ17J46j9j47J21K64K12J10k7j98OJ21j31k08
-2753D69J63R4m4k6Pl9j90k95m7r5K0L7Q5K23K87O9n8J04L9j30k5J14k70k82j52kJ10M1O6
$$ plain form
-2944 418 661 622 384 255 359 563 610 467 254 86 92 22 59 270 528 824 976 794 553 488 576 551 495 402 200 77 101
-2917 101 41 139 203 184 122 154 198 219 251 39 -40 254 456 556 559 516 608 822 921 963 936 712 350 -91 -352 -413 -345 -194 -19
-2888 -19 147 378 524 537 687 710 628 559 548 728 791 780 885 877 510 136 -43 -46 21 -7 -40 -154 -278 -148 121 248 451 675
-2860 675 1007 1249 1282 1015 819 723 493 255 192 263 234 284 414 459 298 57 -226 -28 539 963 1008 948 733 424 275 342
-2834 342 415 562 693 780 752 737 870 845 700 775 883 786 610 474 346 204 151 323 406 409 378 275 278 110 -25 195 450 471
-2806 471 426 456 438 412 618 731 566 384 443 682 658 445 278 277 361 220 96 104 340 567 728 586 400 477 457 588 897
-2779 897 753 554 561 575 759 1074 966 731 335 57 93 102 219 365 346 199 320 584 796 906 879 681 687 808 677 469
-2753 469 632 726 682 656 663 624 434 139 92 -3 17 54 139 362 649 718 660 764 803 673 648 762 492 210 58 56 166 207 273
-2724B73k8p7J08O4k56k43J03L32K70J52J50J13L2J7L8k74l28j28j78j27K3K40K70J20k03
-2699D63m73l39L8l6j35J4J25J51K55Lq9M8J35J63k4k85k07R3J56J52Q4j6j89j50j05J53P2
-2672E7m4J50K09J6o0j25k5K28Q6n9J61J74l2j97j99L9K32M8o9n8n8n4Q3K4j35K50L76J48
-2644A166q4l36l41N2j4k68j37n5j90n5J71K46J8o1m3J38K5j85PP9J29J39J20N1N2J26q9k44
-2616D17k71nK51J37R6qj62j74J16M8L0K27J08m5o4j8k1j94K8K04N2j79k87pN5K08J81j2n8
-2587F53k10k40M9J13Jr1j17J3J01j17P5K7Q0J70L5J4L4kL7J4n0M2P8N2k6j17k80j88o0J33
-2557B23K03k9j91J51K73L2n1j44l00k31J17L79J78K01J79n7oj51j69m4l23k70p4r5j12N9
-2531b52L05J59O7R1J1j98j00nJ51K57k5j52m9M5j25K7K10J47J61K01%j97k87j94k8J26K33
$$ plain form
-2724 273 245 168 276 340 84 -159 -56 276 546 698 848 961 993 1010 1048 774 446 318 140 13 36 276 546 666 463
-2699 463 -10 -349 -311 -347 -482 -468 -343 -192 63 66 -23 25 160 323 299 14 -193 -100 56 208 292 276 87 -63 -168 -15 57
-2672 57 13 163 372 388 328 203 178 406 492 433 594 768 736 539 340 379 611 659 590 532 474 420 503 527 392 642 1018 1166
-2644 1166 1082 746 405 457 443 175 38 -17 -207 -262 -91 155 173 112 69 207 232 47 54 133 262 401 521 572 624 750 661 417
-2616 417 146 141 392 529 625 617 455 281 397 445 475 702 810 765 701 683 662 468 496 700 752 573 286 279 334 542 723 711 653
-2587 653 443 203 252 365 366 275 158 171 272 155 230 257 337 507 542 556 590 588 625 639 589 631 709 761 735 618 338 150 90 223
-2557 223 426 397 206 357 630 662 611 467 167 -64 53 432 610 811 990 933 927 776 607 563 240 -30 -104 -199 -311 -252
-2531 -252 53 212 279 370 381 183 83 78 229 486 461 309 260 305 180 207 417 564 725 926 926 729 442 248 220 346 579
-2504E79p4k67n5K43J93J2j71p8J01J48R3m9j81j72j59k17j13L09L26j0o1MO5K8O0M4Q8Q0
-2476G66m2p0j49j34r7n4N0K1j21j29p5j91k45j3L02J54J81R6p0j4j28j03j6R5L63J78QP5
-2448F38m5J93p1k43r8j02j02L3M7K9j3MJ31L26J22NO0L1k05l00k24Q7J41O8J70J45m9j44
-2420F34k1J09j31m56r5K88J12O5Jj36lK29K94j64k56j26j59j7J8O5Q8m3q3j13M4J76j6p5
-2392B29P4J71J30j6j63K4J07J21q5k15l0j24J06J71J70J0k49k44j75l0P1K39L90j17l32k42
-2366im3M3R6K48N6j10j30j03k1oq2N8Jr1O2P4J25J67J8J7j77%K66j2l3n8j15k29j44L93J92
-2335D53j35j76l1J89J74J21r7k34n3k2j0O3q9J6J47N8J87J35r2k70k43n3m8J36J19K17K55
-2308G17k0k22j34NM9j02p6j42m3Q6j43j66J3L06K37K3Km5k7qoN5Q2j64k9J06j64l10m1J03
$$ plain form
-2504 579 505 238 183 426 619 631 460 382 483 631 724 675 494 322 163 -54 -167 142 468 458 397 401 466 494 554 598 686 766
-2476 766 724 654 505 371 274 220 270 291 170 41 -34 -225 -470 -483 -181 -27 154 250 180 166 38 -65 -81 14 377 555 563 638
-2448 638 593 786 715 472 374 272 170 203 250 279 266 270 401 727 849 854 914 945 740 440 216 303 444 512 682 827 778 634
-2420 634 613 722 591 135 40 328 440 505 506 370 367 596 890 726 470 344 185 168 186 251 339 296 213 100 144 320 304 229
-2392 229 303 474 604 588 425 449 556 677 592 377 347 223 329 500 670 680 431 187 12 -18 53 292 682 565 233 -9
-2366 -9 -52 -9 87 335 391 281 151 48 27 21 -61 -3 -2 -93 -31 43 168 335 353 370 193 193 459 447 414 356 241 12 -132 261 453
-2335 453 318 142 111 300 474 595 498 264 211 189 179 242 153 169 316 374 561 696 604 334 91 38 -10 126 245 462 717
-2308 717 697 475 341 346 395 293 217 75 32 118 -25 -191 -178 128 365 388 390 345 318 310 304 359 441 277 248 354 190 -120 -161 -58
-2278e8K41J97j23n7J34K83K95o2k8J3k47k46j43j22k22m0L34J47N3K05J57p9k78l74m1K98
-2252B37R2r3j04n7K2N7M1J43p4m07O9K31J22K14P4j08j02L5O7R4O6mN3Q3p0k26j0n2j30o4
-2222A99J52J79N3M8o2r6j18k9N8N1k9j22j33p0j93p1j54N1L23P7K25K42j00k35j80K16K55
-2195E37K0k18j65J55L39J97p4k3R6O5L9P4Q9m8j52j45k10oP6PO5K6k33k97J10L06J84K01
-2167A015J31j3r9N6r4l44k64k28l25k29J83J01J5J50N9j2J04K09K55%k29r4J2k3j71l8k3
-2140A04l6J07J08K19J0m3L35K61R6p9l08l20o4J08N1j07j13J15J54j08k43n2K45J33qJ69
-2114G34L4M2J66M0q3q1m0j32k37k60K5J28M8R9j2K6L8Ok03j99Q2K93K44O4o3o2O1N4k01l9
-2084E72k3o2J36j56j84j27L2K95J40j5k6KJ61J37N8r9oL4k29j94J03J4J10J88J43J62l3j90
$$ plain form
-2278 -58 183 380 257 200 334 617 912 850 822 835 588 342 199 77 -145 -185 149 296 349 554 711 632 354 -20 -61 237
-2252 237 329 236 132 75 97 154 195 338 264 -143 -74 157 279 493 567 459 357 392 459 553 619 615 668 751 681 455 445 393 263 199
-2222 199 351 530 583 631 569 473 355 326 384 435 406 284 151 81 -112 -183 -337 -286 37 114 339 581 481 246 66 282 537
-2195 537 557 339 174 329 668 865 791 768 864 929 968 1042 1131 1083 931 786 576 570 646 653 718 744 511 214 324 630 814 1015
-2167 1015 1146 1133 1034 1090 996 652 388 160 -165 -394 -211 -110 -95 55 114 102 206 415 670 670 441 347 359 336 165 127 104
-2140 104 68 175 283 502 512 469 804 1065 1161 1082 774 454 390 498 549 442 329 444 598 490 247 195 440 573 565 734
-2114 734 768 810 976 1016 933 852 812 680 443 183 208 336 384 483 471 497 535 541 338 139 221 514 758 822 759 697 758 812 611 572
-2084 572 549 487 623 467 283 156 188 483 623 608 582 584 745 882 940 841 835 869 640 446 549 563 673 861 1004 1166 1133 943
-2056I43k13j87O2O3j90k86j5L6n9Q1J96L2n7K7J09P7Oo6J3rj47j40K16L36J10R2n3j82m6
-2027G49N5Nj74l57j23n0lK71J87p4j41j42%J07n5q7k4j1j09r3N6K8J23O4j16j03J50K24K7
-1998C84L3K09n4k71j44K1L00K15j23k0N5M2j0j87k14J16R6o7j3k60k38J46L73K36l2L6J50
-1971G79J18m1k75k05K61K96j45k15K15L18lj37j25K0m6q0J66O3j81k51j07rM6L8l8m8j11
-1944C03k23m26j02L9N7J27J75J38JM1J67l8j78m6m0J37K21M3j31j9L5M8r3r6J44K48K26K96
-1916A054J01n4k30r5J7M3R7JO5K84N3j85j90p9r0j34n6j43k93k63j3J87J96Ql5n9j00R5J43
-1887C25L2Kp5l5k3J27J60N6n7J21k6k28OK55K52N0R5Q9j02r7rP1Kj30k59j09R6j15k60k34
-1857b0J70L45J28j69k78r9j25q9j55P1J09j16L6J01j7k7K28L24J52Mj03N1R8J49R3j15P0
$$ plain form
-2056 943 730 543 605 668 478 192 177 213 154 235 431 463 406 433 542 619 625 559 572 563 416 276 492 828 938 1030 977 795 749
-2027 749 804 809 635 278 155 105 102 373 560 486 345 203 203 310 255 168 144 133 24 -69 -13 15 138 202 86 -17 133 357 384
-1998 384 417 626 572 301 157 178 478 693 570 550 605 647 637 450 236 352 448 381 368 108 -130 16 389 625 593 629 779
-1971 779 897 856 581 376 637 933 788 573 788 1106 1103 966 841 861 815 735 901 964 783 532 425 416 462 500 462 414 303
-1944 303 80 -346 -448 -409 -352 -225 -50 88 89 130 297 259 81 35 -5 132 353 396 265 246 281 329 236 140 284 532 758 1054
-1916 1054 1155 1101 871 776 793 836 933 934 999 1283 1336 1151 961 882 792 658 602 459 166 -97 -110 77 273 281 246 187 87 182 325
-1887 325 357 359 284 249 226 353 513 569 512 633 607 379 385 640 892 942 1037 1126 1024 927 918 989 991 861 602 493 589 474 214 -20
-1857 -20 150 495 623 454 176 77 -48 -137 -292 -221 -112 -228 -192 -91 -108 -135 93 417 569 573 470 521 619 768 861 746 816
-1830H16L18P0j68l77J6K53q1J0K30J77P4j21l67k40j79j41q0j28q0N4N1P3J7J37J96J36j05
-1803E61l13l14j87K03K67K0j94k11O4O5J63J52p3r9J9K93J31r0k26l53k26J7J25R8j59o8
-1777c35K09K25K34P0J0J27J77P1j07o2J1l81j55J09r7j23L21J62k22r2P3p4k65j21J27J06
-1751bQ3J81K5j50j60J20N2K1l6jrJ0M5K2p8o8Q3P3p7L8K55J01q9k3K12K5l63l00j7j20k01
-1720c48kL49L16K88k8k40j55o4j68k06Pj14k19M8N01L39J00Kj01p7m5j20J5K5n3Q5j48n0
-1692f3L94K13M8Q9j31j65j2K22J54m9j04k53l97k02J68J62J84J33j75m8L30K98j6j32k0J6
-1666F44o7k39j37J65K4j64p2K6NJ23K64J54j72m01k14R5K3J23M17K01j7j09k51j38k74k02
-1640a93L0K12J21J24K39K06m7k72j40r4j23j25j32r7l1m4j0J65K53R7p5k64M0P7%J67K94
$$ plain form
-1830 816 1134 1204 1036 659 675 928 847 857 1087 1264 1338 1217 850 610 431 290 210 82 2 56 107 180 197 334 530 666 561
-1803 561 248 -66 -253 -50 217 237 43 -168 -104 -39 124 276 203 104 123 416 547 457 231 -122 -348 -331 -206 -108 -267 -335
-1777 -335 -126 99 333 403 413 540 717 788 681 619 630 249 94 203 106 -17 304 466 244 152 225 151 -114 -235 -108 -2
-1751 -2 81 262 287 137 -23 97 149 170 134 133 124 134 179 201 123 55 138 211 134 172 427 528 439 416 628 653 290 -10 -27 -147 -348
-1720 -348 -350 -1 315 603 575 335 180 116 -52 -258 -251 -365 -584 -536 -35 304 404 406 305 228 183 63 78 103 50 135 -13 -63
-1692 -63 331 544 592 681 550 385 373 595 749 700 596 343 -54 -256 -88 74 258 391 216 168 498 796 780 648 628 644
-1666 644 577 338 201 366 390 226 154 180 185 308 572 726 554 153 -61 34 57 180 597 798 781 672 421 283 9 -193
-1640 -193 -163 49 170 294 533 739 692 420 280 186 63 -62 -194 -291 -322 -366 -376 -211 42 139 64 -200 -160 -83 -83 84 378
-1613C78J65n6j34r0J61K80J04n0k63j76j12j45O3K59J41q6N9J77L0j17j14K7J77Nk17r4J69
-1586E41M5o6M6k2j35j40q6J71L16L34M3k03k94k49oK51K42m9k23j28R7K75J11k23P2J89j77
-1559G32L8K06N1p0j10j36k06n5j39m74l14l4P2L9J4L78O22Q3n6K2r8k34j17j99J1K18K26
-1532D70R9K2j96k58L1J60K32Q6j31j24m6j75l1J55Q5q2j84P4j02J8R6NL2kK7L7ol2j35o5
-1502F0J15J98mj41K28K42O6p5j29l11j28n4o7J57L54K0J7J88m4j34j5j3l6L0J24kj17o9N2
-1473E12K26J12P8j80l34j07o3j80p1L9Q1m6L0k2K4k0k27j17Q0J61J38R2J78J24P4K26j6o6
-1445G26r7K7J91K45J3o0j02m8m0j65l14k42j35J75N0j83r7m2KP6J58J77J52J86M2j84l92
-1418A19O4K32N4J43J9n1on0j36L7O4k68k29k6J48K98K12L3p9l5j50j57k78k24K69K95J17
$$ plain form
-1613 378 543 487 353 263 424 704 808 758 495 319 207 62 125 384 525 439 498 675 705 588 474 501 678 683 466 372 541
-1586 541 586 520 566 544 409 269 183 354 670 1004 1047 844 550 301 295 546 788 739 516 388 485 760 871 648 720 909 732
-1559 732 770 976 1027 957 847 711 505 450 311 -163 -477 -511 -439 -400 -386 -8 614 697 641 663 565 331 214 15 26 244 470
-1532 470 569 591 395 137 168 328 560 646 515 391 345 170 139 294 379 297 113 187 85 103 199 204 236 234 261 298 292 260 125 60
-1502 60 175 373 369 228 456 698 764 689 560 249 121 67 0 157 511 531 548 736 692 558 543 530 494 524 648 646 529 460 512
-1473 512 738 850 928 748 414 307 244 64 -7 32 113 67 97 75 99 79 -148 -265 -185 -24 114 206 384 508 582 808 792 726
-1445 726 629 656 847 1092 1105 1045 943 895 855 690 376 134 -1 174 224 41 -56 -98 -96 -20 138 315 467 653 695 511 119
-1418 119 183 415 469 612 631 580 574 524 388 425 489 221 -8 -34 114 412 624 657 578 543 393 236 -42 -266 3 298 415
-1391D15J24O3P1j2p1J3j1r1l9J18N6Q8j15K7N8j81k29l8J1J37j00j6K28O8j40k80K40K75
-1363F69L5j07k90j56m1m7pJ68p5k26l7J31J53K9j01p9J58J27R2K04Pj58j28k7J04Q7r6k52
-1335A37n7k3L5q4q5J52L39J60%j52q4P2J95J20M4k26j96l4j69j87J55L46N6k17p3n5k16J45
-1307I8J67n8Pn3O9K06J09K8k8k31l16j47L0J67r3r4J5L8J41N3j67Lp6j79N5L07J27L0J08
-1278C16m1j61Q4J94J17k6r1q1r9m3P8K11K73J04n4j78k00m5N9K2L8l8l4k09j63J1J11K29
-1250C84K75J17r0j34j31R4J43q4l00l49j03K72K28K1K4J51K28J15R9Rk69j77l2j51j92k00
$$ plain form
-1391 415 539 602 673 661 590 603 592 501 462 580 636 724 609 636 694 513 284 246 257 394 294 278 506 574 434 154 394 669
-1363 669 704 597 307 151 110 63 56 224 149 -77 -114 17 170 199 98 19 177 304 396 600 607 449 321 294 398 485 389 137
-1335 137 80 57 92 8 -77 75 414 574 574 422 338 410 605 725 769 543 347 313 144 -43 112 458 514 297 224 169 -47 98
-1307 98 265 207 214 161 230 436 545 573 545 314 -2 -149 -119 48 -45 -139 -124 -86 55 108 -59 -56 -132 -311 -256 51 178 208 316
-1278 316 275 114 198 392 509 483 392 311 212 169 247 458 731 835 781 603 403 358 417 439 477 439 405 196 33 44 155 384
-1250 384 659 776 686 552 421 515 658 574 274 -75 -178 94 322 343 367 518 746 861 960 969 700 523 491 340 148 -52
$$ [...]
2732d2
##ENDNTUPLES=	NMRSPECTRUM
##END=	

##TITLE=	20121203-jiatao-1
##JCAMPDX=	6.0	$$ NMR Plug-in 1.4 of MestReNova 6.1.1-6384
##BLOCKID=	2
##DATATYPE=	NMRPEAKTABLE
##DATACLASS=	PEAKTABLE
##.OBSERVEFREQUENCY=	100.61281585693359375
##.OBSERVENUCLEUS=	^13C
##NPOINTS=	16
##FIRSTX=	38.882042132867688622
##LASTX=	148.95242415536245062
##XFACTOR=	1
##YFACTOR=	1
##FIRSTY=	16.208767205927689048
##XUNITS=	PPM
##YUNITS=	ARBITRARY UNITS
##PEAKTABLE=	(XY..XY)
38.882042132867688622, 16.208767205927689048
39.089891531871522545, 50.674470309367308118
39.298677876008333953, 100.74160983593294816
39.507206567322420199, 118.9197767058315236
39.715916910543647589, 101.37809423790750429
39.924811192130988502, 51.610702978033934585
40.133173425722795002, 16.606067506540505008
48.040244292084054223, 5.7090401649475097656
110.13992950182058905, 5.1918424593891554508
118.27075449756878811, 4.2335437449656554421
126.85608966040175005, 6.5463243409239435522
130.91351224988744661, 7.2985812169012413975
132.27624435561918403, 2.2313714027404785156
141.75602473446872409, 4.635205792990359619
144.0177829817464783, 4.4854725657328797794
148.95242415536245062, 3.6603215371553674551
##END=	

##END=	
